{
  "library": {
    "name": "Central Library",
    "location": "123 Library Lane, Booktown",
    "books": [
      {
        "id": 1,
        "title": "The Great Gatsby",
        "author": "F. Scott Fitzgerald",
        "year": 1925,
        "genre": "Fiction",
        "price": 14.99,
        "array": [14.99,1.2,2.2]
      },
      {
        "id": 2,
        "title": "Dune",
        "author": "Frank Herbert",
        "year": 1965,
        "genre": "Science Fiction",
        "price": 9.99
      },
      {
        "id": 3,
        "title": "The Hobbit",
        "author": "J.R.R. Tolkien",
        "year": 1937,
        "genre": "Fantasy",
        "price": 12.99
      }
    ]
  }
}
