Revert "lalapps: pin python-ligo-lw <1.6.0 in conda"

This reverts commit f0e68b06.
32 jobs for reorganize_lalburst in 71 minutes and 36 seconds (queued for 4 seconds)
Status Job ID Name Coverage
  .Pre
passed #683985
make-dist

00:08:01

 
  Lal
passed #683988
lal:conda:fftw

00:13:38

passed #683989
lal:conda:mkl

00:14:13

passed #683987
lal:deb

00:34:28

passed #683986
lal:rpm

00:22:00

 
  Lal Frame
passed #683992
lalframe:conda

00:10:43

passed #683991
lalframe:deb

00:09:29

passed #683990
lalframe:rpm

00:08:52

 
  Lal Meta Io
passed #683995
lalmetaio:conda

00:09:09

passed #683994
lalmetaio:deb

00:09:30

passed #683993
lalmetaio:rpm

00:08:29

 
  Lal Simulation
passed #683998
lalsimulation:conda

00:11:47

passed #683997
lalsimulation:deb

00:21:52

passed #683996
lalsimulation:rpm

00:12:41

 
  Lal Burst
failed #684001
lalburst:conda

00:04:48

failed #684000
lalburst:deb

00:07:09

failed #683999
lalburst:rpm

00:07:49

 
  Lal Inspiral
skipped #684004
lalinspiral:conda
skipped #684003
lalinspiral:deb
skipped #684002
lalinspiral:rpm
 
  Lal Pulsar
passed #684007
lalpulsar:conda

00:14:26

passed #684006
lalpulsar:deb

00:21:08

passed #684005
lalpulsar:rpm

00:15:50

 
  Lal Inference
skipped #684010
lalinference:conda
skipped #684009
lalinference:deb
skipped #684008
lalinference:rpm
 
  Lal Apps
skipped #684013
lalapps:conda
skipped #684012
lalapps:deb
skipped #684011
lalapps:rpm
 
  Lint
passed #684014
lint:python

00:00:57

 
  Documentation
passed #684015
documentation

00:09:27

 
  Integration Tests
failed #684016
top-level

00:24:46

 
Name Stage Failure
failed
lalburst:deb Lal Burst
debian/lalsuite.mk:28: recipe for target 'build' failed
make: *** [build] Error 25
dpkg-buildpackage: error: debian/rules build gave error exit status 2
debuild: fatal error at line 1116:
dpkg-buildpackage -us -uc failed
Uploading artifacts...
WARNING: lalburst*/.pybuild/python*/build/test/python/junit*.xml: no matching files
ERROR: No files to upload
ERROR: Job failed: exit code 1
failed
lalburst:rpm Lal Burst
error: Bad exit status from /var/tmp/rpm-tmp.2M4PuM (%check)
Bad exit status from /var/tmp/rpm-tmp.2M4PuM (%check)


RPM build errors:
Uploading artifacts...
WARNING: rpmbuild/BUILD/*/test/python/junit*.xml: no matching files
ERROR: No files to upload
ERROR: Job failed: exit code 1
failed
lalburst:conda Lal Burst
WARNING: conda/bld/lalburst_*/work/test/test-suite.log: no matching files 
WARNING: conda/bld/lalburst_*/work/test/python/test-suite.log: no matching files
WARNING: conda/bld/lalburst_*/work/*/*/*/test-suite.log: no matching files
ERROR: No files to upload
Uploading artifacts...
WARNING: conda/bld/lalburst_*/work/test/python/junit*.xml: no matching files
WARNING: conda/bld/lalburst_*/test_tmp/junit*.xml: no matching files
ERROR: No files to upload
ERROR: Job failed: exit code 1
failed
top-level Integration Tests
make[2]: *** [check-recursive] Error 1
make[2]: Leaving directory `/builds/kipp.cannon/lalsuite/lalsuite-6.69.1/_build'
make[1]: *** [check] Error 2
make[1]: Leaving directory `/builds/kipp.cannon/lalsuite/lalsuite-6.69.1/_build'
make: *** [distcheck] Error 1
Uploading artifacts...
WARNING: */test/python/junit*.xml: no matching files
ERROR: No files to upload
ERROR: Job failed: exit code 1