3.000000000000000000e+00 7.738908230052529403e-41
3.023379074186677951e+00 9.160231804965658434e-41
3.046940342076630781e+00 1.177191516751381243e-40
3.070685223509894257e+00 1.713823888886976134e-40
3.094615149391351849e+00 3.101842873566619852e-40
3.118731561776963979e+00 9.205634628511327375e-40
3.143035913960669614e+00 4.905665164254870191e-38
3.167529670561962885e+00 1.188815731667211543e-39
3.192214307614152702e+00 2.159111826713283453e-40
3.217091312653314272e+00 7.810781778369913410e-41
3.242162184807927616e+00 3.681024391759039266e-41
3.267428434889215527e+00 1.999299737443767725e-41
3.292891585482193850e+00 1.187167324114271287e-41
3.318553171037419425e+00 7.496746209987549365e-42
3.344414737963458339e+00 4.953089102465701509e-42
3.370477844720079830e+00 3.388301627307414819e-42
3.396744061912168711e+00 2.382882476235712816e-42
3.423214972384368782e+00 1.714114895246499417e-42
3.449892171316475409e+00 1.256529912164684082e-42
3.476777266319557746e+00 9.359891305440887534e-43
3.503871877532837242e+00 7.069320128828313453e-43
3.531177637721321538e+00 5.404253662582134184e-43
3.558696192374196876e+00 4.175753545537655911e-43
3.586429199803984336e+00 3.257442906989263890e-43
3.614378331246479004e+00 2.563008030675628614e-43
3.642545270961456083e+00 2.032407744655921133e-43
3.670931716334169703e+00 1.623193695090125614e-43
3.699539377977637766e+00 1.304918452496354097e-43
3.728369979835728820e+00 1.055457516891896628e-43
3.757425259287050068e+00 8.585449174146535392e-44
3.786706967249639177e+00 7.020942094802049675e-44
3.816216868286484765e+00 5.770371880274542929e-44
3.845956740711859112e+00 4.765095993704337786e-44
3.875928376698477340e+00 3.952729812870636733e-44
3.906133582385504788e+00 3.292994271448670305e-44
3.936574177987393064e+00 2.754702026538656373e-44
3.967251997903568306e+00 2.313548604035171259e-44
3.998168890828979194e+00 1.950478877868335127e-44
4.029326719865498063e+00 1.650468890289613311e-44
4.060727362634198201e+00 1.401610316258406636e-44
4.092372711388496676e+00 1.194417371933784845e-44
4.124264673128191561e+00 1.021298549180876701e-44
4.156405169714378012e+00 8.761514093258839450e-45
4.188796137985258738e+00 7.540499083578230390e-45
4.221439529872867524e+00 6.510017635667354166e-45
4.254337312520692471e+00 5.637591721438156807e-45
4.287491468402215844e+00 4.896704095384672004e-45
4.320903995440390055e+00 4.265956263284522631e-45
4.354576907128027585e+00 3.727317447518826698e-45
4.388512232649141254e+00 3.265857775316728761e-45
4.422712017001222407e+00 2.869398737862926986e-45
4.457178321118484554e+00 2.527836937300497016e-45
4.491913221996044037e+00 2.232766440195960787e-45
4.526918812815098114e+00 1.977174116301288857e-45
4.562197203069056073e+00 1.755193033175387049e-45
4.597750518690657096e+00 1.561902197202296133e-45
4.633580902180091776e+00 1.393163431851396704e-45
4.669690512734105958e+00 1.245488108759932497e-45
4.706081526376117985e+00 1.115927957773076415e-45
4.742756136087351138e+00 1.001985360479042704e-45
4.779716551938987479e+00 9.015394528662598511e-46
4.816965001225343990e+00 8.127850948328968770e-46
4.854503728598102974e+00 7.341823414603342748e-46
4.892334996201570085e+00 6.644145071815358077e-46
4.930461083808994616e+00 6.023532807627933556e-46
4.968884288959960038e+00 5.470296374489402178e-46
5.007606927098831484e+00 4.976095333244268003e-46
5.046631331714285906e+00 4.533735505019281622e-46
5.085959854479939146e+00 4.136998140084680957e-46
5.125594865396055688e+00 3.780496258401578258e-46
5.165538752932373079e+00 3.459553592054022907e-46
5.205793924172026799e+00 3.170102364540472486e-46
5.246362804956618220e+00 2.908596811171972810e-46
5.287247840032386570e+00 2.671939868955190678e-46
5.328451493197543520e+00 2.457420920793848371e-46
5.369976247450735762e+00 2.262662818393888065e-46
5.411824605140684419e+00 2.085576726309017104e-46
5.453999088116976424e+00 1.924323551800923252e-46
5.496502237882029185e+00 1.777280944266178111e-46
5.539336615744256065e+00 1.643015016524912200e-46
5.582504802972412250e+00 1.520256054586579726e-46
5.626009400951136996e+00 1.407877627619789521e-46
5.669853031337731331e+00 1.304878585298156421e-46
5.714038336220133019e+00 1.210367517708231154e-46
5.758567978276136756e+00 1.123549317846256424e-46
5.803444640933850707e+00 1.043713542248563523e-46
5.848671028533408034e+00 9.702243098388138766e-47
5.894249866489925438e+00 9.023332230300473830e-47
5.940183901457753102e+00 8.392587439697425162e-47
5.986475901495984075e+00 7.810744842116035272e-47
6.033128656235260401e+00 7.273567384779009037e-47
6.080144977045891963e+00 6.777231675697218161e-47
6.127527697207263202e+00 6.318282614320352957e-47
6.175279672078572979e+00 5.893593524054721989e-47
6.223403779270908487e+00 5.500331066342496691e-47
6.271902918820651429e+00 5.135924323776542708e-47
6.320780013364233341e+00 4.798037496213805846e-47
6.370038008314270250e+00 4.484545755418731671e-47
6.419679872037050039e+00 4.193513872163225377e-47
6.469708596031408021e+00 3.923177237107249997e-47
6.520127195109008511e+00 3.671925015170241123e-47
6.570938707576019056e+00 3.438285150412780312e-47
6.622146195416195980e+00 3.220910992749252367e-47
6.673752744475415000e+00 3.017362278461786724e-47
6.725761464647628252e+00 2.827220938587374542e-47
6.778175490062257502e+00 2.650110360418190285e-47
6.830997979273086607e+00 2.485066273885458524e-47
6.884232115448578604e+00 2.331202224735834724e-47
6.937881106563702716e+00 2.187702626830991813e-47
6.991948185593272136e+00 2.053816511904317824e-47
7.046436610706736658e+00 1.928851880106691386e-47
7.101349665464545602e+00 1.812170612227357235e-47
7.156690659016025080e+00 1.703183871340966848e-47
7.212462926298772281e+00 1.601347929563231814e-47
7.268669828239636921e+00 1.506160397771664014e-47
7.325314751957265003e+00 1.417156797021186417e-47
7.382401110966188895e+00 1.333907448353797581e-47
7.439932345382551659e+00 1.256014644771156417e-47
7.497911922131407003e+00 1.183110071034430017e-47
7.556343335155633945e+00 1.114852463475344756e-47
7.615230105626504375e+00 1.050925458237896082e-47
7.674575782155860004e+00 9.910356441108118810e-48
7.734383941009959962e+00 9.349107667474138832e-48
7.794658186324999072e+00 8.822980979748022174e-48
7.855402150324295896e+00 8.329629348555914528e-48
7.916619493537168317e+00 7.866872252767978873e-48
7.978313905019535746e+00 7.432683105309814877e-48
8.040489102576222180e+00 7.025177627910334920e-48
8.103148832984988559e+00 6.642603269784093156e-48
8.166296872222336134e+00 6.283329421594207487e-48
8.229937025691045349e+00 5.945838385781379993e-48
8.294073128449483079e+00 5.628717104103302739e-48
8.358709045442731522e+00 5.330649542499625030e-48
8.423848671735486349e+00 5.050409613045190076e-48
8.489495932746768503e+00 4.786854713512683601e-48
8.555654784486495856e+00 4.538919690564355314e-48
8.622329213793868519e+00 4.305611338548304988e-48
8.689523238577617548e+00 4.086003258323611598e-48
8.757240908058138373e+00 3.879231121575490432e-48
8.825486303011505385e+00 3.684488291809935169e-48
8.894263536015376559e+00 3.501021792697789926e-48
8.963576751696830769e+00 3.328128526877758144e-48
9.033430126982132435e+00 3.165151808177593588e-48
9.103827871348423528e+00 3.011478153721602256e-48
9.174774227077424626e+00 2.866534279317152854e-48
9.246273469511047338e+00 2.729784341297813723e-48
9.318329907309045979e+00 2.600727365071521438e-48
9.390947882708687189e+00 2.478894860038604860e-48
9.464131771786378877e+00 2.363848601331293394e-48
9.537885984721404142e+00 2.255178585033268317e-48
9.612214966061698007e+00 2.152501114371978391e-48
9.687123194991649200e+00 2.055457012311674983e-48
9.762615185602044221e+00 1.963710003690276612e-48
9.838695487162103959e+00 1.876945150076207827e-48
9.915368684393603971e+00 1.794867441717725205e-48
9.992639397747167251e+00 1.717200467706491641e-48
1.007051228368071882e+01 1.646013988668359161e-48
1.014899203494005953e+01 1.578735299317821143e-48
1.022808338084167801e+01 1.514899552804467627e-48
1.030779108755775475e+01 1.454311585760182937e-48
1.038811995840335101e+01 1.396788166890567415e-48
1.046907483412588746e+01 1.342157236367705323e-48
1.055066059319685934e+01 1.290257171412761606e-48
1.063288215210579679e+01 1.240936114310038384e-48
1.071574446565655414e+01 1.194051346381803422e-48
1.079925252726591012e+01 1.149468701048788076e-48
1.088341136926445074e+01 1.107062015873642604e-48
1.096822606319983606e+01 1.066712625055324875e-48
1.105370172014243657e+01 1.028308883523337592e-48
1.113984349099330551e+01 9.917457220276165311e-49
1.122665656679461144e+01 9.569242338558052101e-49
1.131414617904242803e+01 9.237512888027837620e-49
1.140231760000200723e+01 8.921391743137513880e-49
1.149117614302551083e+01 8.620052545116006652e-49
1.158072716287217041e+01 8.332716526594753517e-49
1.167097605603098742e+01 8.058649678392528774e-49
1.176192826104595213e+01 7.797159888266172472e-49
1.185358925884374592e+01 7.547594423860938944e-49
1.194596457306404602e+01 7.309337516224143234e-49
1.203905977039241115e+01 7.081808111672999423e-49
1.213288046089569505e+01 6.864457764262434182e-49
1.222743229836014933e+01 6.656768682852295150e-49
1.232272098063213228e+01 6.458251877254313022e-49
1.241875224996144311e+01 6.268445417761455465e-49
1.251553189334737759e+01 6.086912862978430700e-49
1.261306574288748017e+01 5.913241719695156870e-49
1.271135967612895179e+01 5.747042013022630378e-49
1.281041961642286786e+01 5.587944999232726709e-49
1.291025153328114428e+01 5.435601877533311100e-49
1.301086144273622835e+01 5.289682664889759535e-49
1.311225540770366216e+01 5.149875076407890197e-49
1.321443953834745422e+01 5.015883507449555280e-49
1.331741999244825436e+01 4.887428071805445369e-49
1.342120297577444710e+01 4.764243704554366899e-49
1.352579474245614577e+01 4.646079302648882762e-49
1.363120159536203424e+01 4.532696938697381168e-49
1.373742988647920527e+01 4.423871113597180921e-49
1.384448601729596717e+01 4.319388056656888345e-49
1.395237643918756554e+01 4.219045058764126069e-49
1.406110765380496730e+01 4.122649852212253678e-49
1.417068621346669133e+01 4.030020053522681134e-49
1.428111872155361617e+01 3.940982578917049048e-49
1.439241183290693016e+01 3.855373149445635871e-49
1.450457225422918128e+01 3.773035810554612217e-49
1.461760674448840014e+01 3.693822469307390927e-49
1.473152211532542033e+01 3.617592462417209789e-49
1.484632523146438210e+01 3.544212164015857623e-49
1.496202301112636057e+01 3.473554587769648625e-49
1.507862242644633000e+01 3.405499048500161646e-49
1.519613050389326148e+01 3.339930811642378313e-49
1.531455432469357625e+01 3.276740776688459325e-49
1.543390102525788343e+01 3.215825187829863083e-49
1.555417779761100050e+01 3.157085331785529121e-49
1.567539188982537013e+01 3.100427292422642024e-49
1.579755060645786280e+01 3.045761686736655414e-49
1.592066130898992427e+01 2.993003426975328541e-49
1.604473141627120114e+01 2.942071505091504196e-49
1.616976840496664281e+01 2.892888773999326060e-49
1.629577981000701570e+01 2.845381749891843320e-49
1.642277322504298454e+01 2.799480427208570758e-49
1.655075630290274091e+01 2.755118093224058325e-49
1.667973675605313844e+01 2.712231166858944142e-49
1.680972235706447293e+01 2.670759035696451165e-49
1.694072093907889709e+01 2.630643906830277488e-49
1.707274039628241269e+01 2.591830662691064842e-49
1.720578868438059672e+01 2.554266730405911126e-49
1.733987382107807917e+01 2.517901949087705979e-49
1.747500388656161974e+01 2.482688454232915620e-49
1.761118702398708180e+01 2.448580561872593847e-49
1.774843143997016526e+01 2.415534659272058793e-49
1.788674540508091226e+01 2.383509104057048943e-49
1.802613725434210679e+01 2.352464128972568645e-49
1.816661538773160700e+01 2.322361743130965848e-49
1.830818827068848265e+01 2.293165656757945375e-49
1.845086443462317405e+01 2.264841187267080416e-49
1.859465247743164085e+01 2.237355189429310477e-49
1.873956106401342936e+01 2.210675975928687078e-49
1.888559892679387175e+01 2.184773249662835107e-49
1.903277486625032822e+01 2.159618036976706554e-49
1.918109775144246498e+01 2.135182624193723330e-49
1.933057652054675302e+01 2.111440497104991110e-49
1.948122018139512690e+01 2.088366283804732275e-49
1.963303781201774356e+01 2.065935703670657379e-49
1.978603856119007531e+01 2.044125510536303492e-49
1.994023164898425549e+01 2.022913449992812282e-49
2.009562636732463758e+01 2.002278208811075943e-49
2.025223208054777757e+01 1.982199372420436700e-49
2.041005822596676111e+01 1.962657384101907923e-49
2.056911431443985094e+01 1.943633503158187425e-49
2.072940993094369944e+01 1.925109769129684100e-49
2.089095473515089907e+01 1.907068964623074226e-49
2.105375846201209811e+01 1.889494582279593346e-49
2.121783092234269219e+01 1.872370791861577970e-49
2.138318200341397457e+01 1.855682409094071168e-49
2.154982166954898304e+01 1.839414866857362845e-49
2.171775996272300446e+01 1.823554186583674485e-49
2.188700700316866232e+01 1.808086952933859481e-49
2.205757298998579330e+01 1.793000287397654772e-49
2.222946820175610938e+01 1.778281824089972808e-49
2.240270299716252822e+01 1.763919688441309624e-49
2.257728781561344533e+01 1.749902473167814055e-49
2.275323317787184862e+01 1.736219219694128228e-49
2.293054968668926463e+01 1.722859396441185852e-49
2.310924802744472473e+01 1.709812881915999813e-49
2.328933896878871934e+01 1.697069944777875472e-49
2.347083336329205494e+01 1.684621228138005003e-49
2.365374214809989795e+01 1.672457733205580752e-49
2.383807634559089195e+01 1.660570802505524032e-49
2.402384706404131620e+01 1.648952106913803237e-49
2.421106549829451282e+01 1.637593630282431417e-49
2.439974293043556486e+01 1.626487655869186709e-49
2.458989073047107254e+01 1.615626754701548199e-49
2.478152035701439360e+01 1.605003771920608902e-49
2.497464335797616286e+01 1.594611816662077459e-49
2.516927137126014813e+01 1.584444249045760579e-49
2.536541612546457714e+01 1.574494671164879246e-49
2.556308944058897836e+01 1.564756916316776151e-49
2.576230322874638290e+01 1.555225039049593397e-49
2.596306949488122484e+01 1.545893306671632468e-49
2.616540033749279459e+01 1.536756189736351146e-49
2.636930794936425215e+01 1.527808353895911590e-49
2.657480461829742424e+01 1.519044651900204707e-49
2.678190272785330706e+01 1.510460116034085653e-49
2.699061475809826760e+01 1.502049950431986812e-49
2.720095328635613185e+01 1.493809524389655590e-49
2.741293098796615979e+01 1.485734365636741226e-49
2.762656063704679710e+01 1.477820153899334651e-49
2.784185510726555535e+01 1.470062714614800729e-49
2.805882737261472570e+01 1.462458013400240100e-49
2.827749050819322818e+01 1.455002150308193141e-49
2.849785769099460708e+01 1.447691354495358959e-49
2.871994220070099502e+01 1.440521979233966700e-49
2.894375742048341138e+01 1.433490496990809232e-49
2.916931683780831364e+01 1.426593494494145292e-49
2.939663404525025925e+01 1.419827668755018806e-49
2.962572274131109040e+01 1.413189822443881959e-49
2.985659673124544611e+01 1.406676859879841717e-49
3.008926992789260524e+01 1.400285783299234618e-49
3.032375635251500157e+01 1.394013688767176189e-49
3.056007013564306618e+01 1.387857763076077971e-49
3.079822551792681296e+01 1.381815279842767678e-49
3.103823685099403207e+01 1.375883596573603488e-49
3.128011859831505959e+01 1.370060151312911611e-49
3.152388533607441090e+01 1.364342459804666517e-49
3.176955175404921761e+01 1.358728112482937776e-49
3.201713265649436124e+01 1.353214771736580293e-49
3.226664296303464141e+01 1.347800169314765649e-49
3.251809770956392498e+01 1.342482103725344286e-49
3.277151204915110583e+01 1.337258437992870375e-49
3.302690125295332990e+01 1.332127096989428857e-49
3.328428071113629017e+01 1.327086065549234643e-49
3.354366593380158434e+01 1.322133386145306657e-49
3.380507255192139837e+01 1.317267156868536983e-49
3.406851631828053684e+01 1.312485529482454682e-49
3.433401310842558019e+01 1.307786707558108084e-49
3.460157892162165183e+01 1.303168944629701357e-49
3.487122988181658201e+01 1.298630542399523129e-49
3.514298223861248260e+01 1.294169849242344053e-49
3.541685236824501004e+01 1.289785258439809045e-49
3.569285677457028783e+01 1.285475206738289572e-49
3.597101209005933953e+01 1.281238172836230974e-49
3.625133507680045142e+01 1.277072675984441783e-49
3.653384262750932976e+01 1.272977274634308492e-49
3.681855176654698880e+01 1.268950565131025591e-49
3.710547965094568923e+01 1.264991180424202862e-49
3.739464357144293416e+01 1.261097788948604015e-49
3.768606095352331664e+01 1.257269093353067137e-49
3.797974935846865918e+01 1.253503829486428191e-49
3.827572648441636005e+01 1.249800765278176091e-49
3.857401016742574740e+01 1.246158699751258146e-49
3.887461838255303803e+01 1.242576461951616610e-49
3.917756924493453852e+01 1.239052910104645167e-49
3.948288101087822355e+01 1.235586930618095638e-49
3.979057207896390480e+01 1.232177437257702228e-49
4.010066099115206129e+01 1.228823370245552104e-49
4.041316643390103280e+01 1.225523695518727305e-49
4.072810723929327992e+01 1.222277403866151174e-49
4.104550238617008517e+01 1.219083510215354427e-49
4.136537100127531374e+01 1.215941052936253096e-49
4.168773236040807717e+01 1.212849093073585708e-49
4.201260588958419362e+01 1.209806713724278271e-49
4.234001116620692784e+01 1.206813019352106991e-49
4.266996792024676921e+01 1.203867135196264365e-49
4.300249603543031185e+01 1.200968206655960741e-49
4.333761555043851388e+01 1.198115398687600479e-49
4.367534666011432876e+01 1.195307895276871683e-49
4.401570971667955945e+01 1.192544898878950391e-49
4.435872523096138309e+01 1.189825629905193537e-49
4.470441387362842534e+01 1.187149326218836947e-49
4.505279647643626362e+01 1.184515242642561083e-49
4.540389403348287800e+01 1.181922650504970952e-49
4.575772770247383647e+01 1.179370837178775372e-49
4.611431880599715782e+01 1.176859105643236336e-49
4.647368883280831398e+01 1.174386774072925469e-49
4.683585943912525096e+01 1.171953175422081760e-49
4.720085244993330065e+01 1.169557657041074751e-49
4.756868986030042379e+01 1.167199580289115658e-49
4.793939383670277010e+01 1.164878320169261415e-49
4.831298671836032099e+01 1.162593264981568747e-49
4.868949101858314776e+01 1.160343815967295810e-49
4.906892942612816455e+01 1.158129386993326498e-49
4.945132480656627649e+01 1.155949404224780167e-49
4.983670020366032816e+01 1.153803305815858169e-49
5.022507884075386642e+01 1.151690541611096387e-49
5.061648412217044779e+01 1.149610572855050220e-49
5.101093963462410130e+01 1.147562871917655222e-49
5.140846914864078343e+01 1.145546922014334230e-49
5.180909661999065463e+01 1.143562216951142212e-49
5.221284619113180980e+01 1.141608260871083441e-49
5.261974219266517139e+01 1.139684568004839164e-49
5.302980914480057351e+01 1.137790662428517253e-49
5.344307175883443506e+01 1.135926077847321516e-49
5.385955493863902177e+01 1.134090357353614890e-49
5.427928378216299166e+01 1.132283053227579556e-49
5.470228358294394866e+01 1.130503726719078297e-49
5.512857983163273445e+01 1.128751947839077903e-49
5.555819821752935184e+01 1.127027295177046734e-49
5.599116463013128708e+01 1.125329355697793260e-49
5.642750516069339994e+01 1.123657724559493562e-49
5.686724610380037603e+01 1.122012004936898491e-49
5.731041395895132240e+01 1.120391807842809202e-49
5.775703543215650626e+01 1.118796751962076402e-49
5.820713743754681246e+01 1.117226463488417878e-49
5.866074709899567097e+01 1.115680575957680504e-49
5.911789175175346145e+01 1.114158730104825218e-49
5.957859894409484980e+01 1.112660573705036168e-49
6.004289643897896411e+01 1.111185761429382952e-49
6.051081221572227520e+01 1.109733954708504720e-49
6.098237447168475001e+01 1.108304821589415489e-49
6.145761162396918564e+01 1.106898036603556585e-49
6.193655231113346105e+01 1.105513280639028841e-49
6.241922539491645239e+01 1.104150240813446375e-49
6.290565996197736354e+01 1.102808610351309877e-49
6.339588532564837209e+01 1.101488088464717593e-49
6.388993102770116650e+01 1.100188380239244550e-49
6.438782684012728907e+01 1.098909196520072279e-49
6.488960276693207163e+01 1.097650253804085359e-49
6.539528904594276071e+01 1.096411274131069688e-49
6.590491615063088204e+01 1.095191984985379984e-49
6.641851479194833985e+01 1.093992119190136378e-49
6.693611592017829537e+01 1.092811414812936269e-49
6.745775072680027051e+01 1.091649615068741449e-49
6.798345064636970392e+01 1.090506468230439536e-49
6.851324735841228630e+01 1.089381727534797026e-49
6.904717278933314617e+01 1.088275151099474292e-49
6.958525911434054478e+01 1.087186501834547222e-49
7.012753875938497572e+01 1.086115547361233507e-49
7.067404440311324265e+01 1.085062059931002943e-49
7.122480897883757223e+01 1.084025816347476003e-49
7.177986567652027361e+01 1.083006597889542216e-49
7.233924794477398734e+01 1.082004190238358812e-49
7.290298949287712560e+01 1.081018383403137919e-49
7.347112429280528545e+01 1.080048971652655985e-49
7.404368658127866354e+01 1.079095753446463708e-49
7.462071086182491797e+01 1.078158531366774895e-49
7.520223190685867110e+01 1.077237112056013547e-49
7.578828475977674373e+01 1.076331306151933681e-49
7.637890473707000183e+01 1.075440928226785975e-49
7.697412743045173045e+01 1.074565796727744856e-49
7.757398870900217958e+01 1.073705733917673818e-49
7.817852472133024833e+01 1.072860565820842112e-49
7.878777189775192369e+01 1.072030122164923537e-49
7.940176695248545968e+01 1.071214236329850652e-49
8.002054688586392217e+01 1.070412745293941107e-49
8.064414898656497144e+01 1.069625489583885435e-49
8.127261083385778306e+01 1.068852313225350348e-49
8.190597029986767552e+01 1.068093063694739546e-49
8.254426555185850134e+01 1.067347591872085821e-49
8.318753505453241814e+01 1.066615751996926679e-49
8.383581757234797749e+01 1.065897401622425742e-49
8.448915217185621884e+01 1.065192401573266740e-49
8.514757822405468346e+01 1.064500615903745205e-49
8.581113540676001605e+01 1.063821911857111298e-49
8.647986370699926795e+01 1.063156159825916699e-49
8.715380342341917697e+01 1.062503233313977069e-49
8.783299516871490198e+01 1.061863008898670471e-49
8.851747987207740209e+01 1.061235366195074506e-49
8.920729878165977311e+01 1.060620187820421750e-49
8.990249346706292499e+01 1.060017359360439290e-49
9.060310582184085604e+01 1.059426769335746381e-49
9.130917806602495546e+01 1.058848309170256236e-49
9.202075274866830057e+01 1.058281873159479819e-49
9.273787275041000555e+01 1.057727358440461550e-49
9.346058128605885429e+01 1.057184664962662854e-49
9.418892190719775215e+01 1.056653695459353534e-49
9.492293850480828610e+01 1.056134355420444576e-49
9.566267531191542162e+01 1.055626553065445908e-49
9.640817690625316061e+01 1.055130199318205150e-49
9.715948821295106086e+01 1.054645207781710939e-49
9.791665450724114805e+01 1.054171494714425795e-49
9.867972141718647094e+01 1.053708979006516812e-49
9.944873492643085910e+01 1.053257582158021555e-49
1.002237413769696843e+02 1.052817228257110044e-49
1.010047874719425067e+02 1.052387843959109993e-49
1.017919202784478472e+02 1.051969358466610941e-49
1.025851872303792192e+02 1.051561703510279592e-49
1.033846361312837132e+02 1.051164813330275472e-49
1.041903151572423241e+02 1.050778624658467442e-49
1.050022728597737967e+02 1.050403076701590455e-49
1.058205581687600016e+02 1.050038111124754417e-49
1.066452203953943325e+02 1.049683672035929760e-49
1.074763092351537921e+02 1.049339705971178979e-49
1.083138747707935323e+02 1.049006161880438358e-49
1.091579674753644582e+02 1.048682991114056475e-49
1.100086382152555871e+02 1.048370147409832758e-49
1.108659382532589319e+02 1.048067586881260447e-49
1.117299192516584156e+02 1.047775268005810020e-49
1.126006332753437249e+02 1.047493151614234140e-49
1.134781327949475127e+02 1.047221200880490579e-49
1.143624706900070578e+02 1.046959381312161193e-49
1.152537002521514893e+02 1.046707660741836972e-49
1.161518751883129568e+02 1.046466009318731361e-49
1.170570496239626834e+02 1.046234399501228904e-49
1.179692781063733946e+02 1.046012806049979685e-49
1.188886156079060470e+02 1.045801206021614209e-49
1.198151175293222082e+02 1.045599578763086516e-49
1.207488397031233518e+02 1.045407905906492258e-49
1.216898383969149506e+02 1.045226171364866722e-49
1.226381703167970159e+02 1.045054361328151300e-49
1.235938926107819071e+02 1.044892464260173522e-49
1.245570628722379070e+02 1.044740470895798193e-49
1.255277391433594403e+02 1.044598374239165395e-49
1.265059799186655596e+02 1.044466169562057254e-49
1.274918441485245921e+02 1.044343854403249766e-49
1.284853912427061289e+02 1.044231428568241231e-49
1.294866810739619325e+02 1.044128894129585919e-49
1.304957739816336186e+02 1.044036255427843444e-49
1.315127307752884178e+02 1.043953519073222443e-49
1.325376127383843823e+02 1.043880693947669223e-49
1.335704816319631050e+02 1.043817791207588239e-49
1.346113996983710308e+02 1.043764824287097937e-49
1.356604296650112076e+02 1.043721808902107198e-49
1.367176347481229470e+02 1.043688763054584358e-49
1.377830786565907033e+02 1.043665707037786036e-49
1.388568255957844144e+02 1.043652663441847746e-49
1.399389402714279811e+02 1.043649657160031789e-49
1.410294878934981853e+02 1.043656715395548298e-49
1.421285341801552420e+02 1.043673867669004515e-49
1.432361453617025404e+02 1.043701145826314786e-49
1.443523881845774781e+02 1.043738584047424897e-49
1.454773299153745256e+02 1.043786218855347112e-49
1.466110383448984180e+02 1.043844089126067274e-49
1.477535817922487809e+02 1.043912236098781977e-49
1.489050291089381517e+02 1.043990703386924442e-49
1.500654496830406970e+02 1.044079536989693274e-49
1.512349134433729603e+02 1.044178785304175074e-49
1.524134908637090291e+02 1.044288499138198778e-49
1.536012529670268520e+02 1.044408731723538486e-49
1.547982713297877240e+02 1.044539538729907648e-49
1.560046180862505310e+02 1.044680978279676436e-49
1.572203659328182255e+02 1.044833110962781303e-49
1.584455881324181519e+02 1.044995999852763760e-49
1.596803585189179557e+02 1.045169710523012729e-49
1.609247515015744341e+02 1.045354311063838529e-49
1.621788420695170316e+02 1.045549872100160645e-49
1.634427057962678873e+02 1.045756466809747008e-49
1.647164188442954185e+02 1.045974170942150816e-49
1.660000579696035743e+02 1.046203062838207969e-49
1.672937005263582364e+02 1.046443223450326634e-49
1.685974244715482087e+02 1.046694736363222900e-49
1.699113083696825299e+02 1.046957687815495094e-49
1.712354313975259004e+02 1.047232166721628806e-49
1.725698733488695211e+02 1.047518264694983760e-49
1.739147146393390528e+02 1.047816076071194121e-49
1.752700363112416539e+02 1.048125697932175952e-49
1.766359200384491714e+02 1.048447230131161323e-49
1.780124481313194451e+02 1.048780775318068196e-49
1.793997035416574590e+02 1.049126438965731355e-49
1.807977698677136971e+02 1.049484329396759484e-49
1.822067313592213509e+02 1.049854557811183031e-49
1.836266729224743983e+02 1.050237238314688896e-49
1.850576801254436248e+02 1.050632487947688837e-49
1.864998392029326340e+02 1.051040426715004892e-49
1.879532370617755248e+02 1.051461177616441496e-49
1.894179612860732789e+02 1.051894866677775220e-49
1.908941001424721833e+02 1.052341622982949114e-49
1.923817425854821010e+02 1.052801578706620089e-49
1.938809782628381413e+02 1.053274869147709042e-49
1.953918975209024325e+02 1.053761632763560023e-49
1.969145914101080166e+02 1.054262011205004321e-49
1.984491516904466835e+02 1.054776149352094952e-49
1.999956708369982152e+02 1.055304195350824493e-49
2.015542420455023489e+02 1.055846300650399369e-49
2.031249592379760713e+02 1.056402620041445080e-49
2.047079170683730354e+02 1.056973311695224409e-49
2.063032109282868873e+02 1.057558537203184570e-49
2.079109369527008937e+02 1.058158461618041866e-49
2.095311920257806548e+02 1.058773253495048097e-49
2.111640737867118389e+02 1.059403084934617118e-49
2.128096806355852948e+02 1.060048131625447056e-49
2.144681117393262753e+02 1.060708572888888920e-49
2.161394670376696752e+02 1.061384591723964331e-49
2.178238472491838138e+02 1.062076374853401174e-49
2.195213538773393793e+02 1.062784112770404202e-49
2.212320892166253827e+02 1.063507999786743825e-49
2.229561563587150204e+02 1.064248234081346827e-49
2.246936591986774658e+02 1.065005017750255205e-49
2.264447024412380358e+02 1.065778556857156269e-49
2.282093916070892590e+02 1.066569061485252741e-49
2.299878330392489829e+02 1.067376745789928791e-49
2.317801339094681907e+02 1.068201828052495136e-49
2.335864022246906018e+02 1.069044530734929279e-49
2.354067468335608453e+02 1.069905080535767181e-49
2.372412774329828551e+02 1.070783708446874034e-49
2.390901045747320666e+02 1.071680649811494270e-49
2.409533396721166127e+02 1.072596144383280383e-49
2.428310950066905889e+02 1.073530436386488369e-49
2.447234837350216878e+02 1.074483774577214834e-49
2.466306198955096249e+02 1.075456412306064318e-49
2.485526184152573421e+02 1.076448607581631353e-49
2.504895951169983448e+02 1.077460623135608331e-49
2.524416667260755673e+02 1.078492726488692729e-49
2.544089508774746662e+02 1.079545190018315382e-49
2.563915661229143552e+02 1.080618291027187847e-49
2.583896319379898614e+02 1.081712311813666650e-49
2.604032687293719732e+02 1.082827539743378352e-49
2.624325978420643537e+02 1.083964267322369608e-49
2.644777415667152241e+02 1.085122792272155572e-49
2.665388231469862035e+02 1.086303417606233856e-49
2.686159667869804935e+02 1.087506451709171972e-49
2.707092976587269959e+02 1.088732208417448802e-49
2.728189419097225255e+02 1.089981007103547148e-49
2.749450266705351851e+02 1.091253172763233770e-49
2.770876800624648695e+02 1.092549036107109569e-49
2.792470312052630561e+02 1.093868933657922066e-49
2.814232102249154082e+02 1.095213207855760530e-49
2.836163482614826989e+02 1.096582207174449985e-49
2.858265774770025587e+02 1.097976286255187469e-49
2.880540310634554544e+02 1.099395806066560197e-49
2.902988432507903553e+02 1.100841134108325764e-49
2.925611493150125284e+02 1.102312644689726287e-49
2.948410855863375559e+02 1.103810719341337003e-49
2.971387894574056077e+02 1.105335747479878510e-49
2.994543993915602869e+02 1.106888127581206902e-49
3.017880549311942673e+02 1.108468269452758484e-49
3.041398967061576855e+02 1.110076599103657444e-49
3.065100664422314480e+02 1.111713570484524574e-49
3.088987069696701724e+02 1.113379698303883078e-49
3.113059622318079391e+02 1.115075670466632492e-49
3.137319772937320295e+02 1.116802874969326722e-49
3.161768983510263524e+02 1.118567837815991043e-49
3.186408727385806401e+02 1.120708833056343019e-49
3.211240489394681958e+02 1.122192672856884518e-49
3.236265765938954928e+02 1.124011822255969517e-49
3.261486065082187338e+02 1.125888686314886145e-49
3.286902906640310107e+02 1.127800862553317999e-49
3.312517822273226216e+02 1.129746811649420009e-49
3.338332355577101112e+02 1.131726586692289669e-49
3.364348062177374459e+02 1.133740549811132374e-49
3.390566509822522789e+02 1.135789156427787493e-49
3.416989278478527012e+02 1.137872900751379482e-49
3.443617960424069793e+02 1.139992298257087734e-49
3.470454160346512253e+02 1.142147879085780093e-49
3.497499495438582926e+02 1.144340185279757375e-49
3.524755595495823854e+02 1.146569769549731099e-49
3.552224103014823982e+02 1.148837194717273952e-49
3.579906673292189225e+02 1.151143033479900006e-49
3.607804974524281647e+02 1.153487868341302877e-49
3.635920687907769207e+02 1.155872291631319772e-49
3.664255507740929261e+02 1.158296905577139704e-49
3.692811141525733660e+02 1.160762322405612345e-49
3.721589310070772285e+02 1.163269164465397301e-49
3.750591747594938852e+02 1.165818064362173782e-49
3.779820201831925033e+02 1.168409665103651020e-49
3.809276434135567797e+02 1.171044620251542179e-49
3.838962219585976641e+02 1.173723594079146716e-49
3.868879347096493007e+02 1.176447261734042880e-49
3.899029619521515997e+02 1.179216309404846597e-49
3.929414853765134694e+02 1.182031434491601836e-49
3.960036880890602902e+02 1.184893345780265460e-49
3.990897546230708599e+02 1.187802763620272452e-49
4.021998709498963649e+02 1.190760420105695009e-49
4.053342244901661502e+02 1.193767059259641909e-49
4.084930041250843828e+02 1.196823437222082367e-49
4.116764002078110138e+02 1.199930322440898370e-49
4.148846045749318137e+02 1.203088495866348021e-49
4.181178105580209490e+02 1.206298751148914238e-49
4.213762129952903024e+02 1.209561894840450128e-49
4.246600082433295711e+02 1.212878746598904371e-49
4.279693941889414077e+02 1.216250139396501482e-49
4.313045702610652938e+02 1.219676919731440558e-49
4.346657374427940113e+02 1.223159947843236516e-49
4.380530982834878273e+02 1.226700097931596357e-49
4.414668569109793452e+02 1.230298258379326090e-49
4.449072190438729422e+02 1.233955331978514785e-49
4.483743920039445356e+02 1.237672236161068149e-49
4.518685847286337207e+02 1.241449903232784341e-49
4.553900077836335072e+02 1.245289280611621695e-49
4.589388733755817498e+02 1.249191331069857915e-49
4.625153953648480751e+02 1.253157032980413459e-49
4.661197892784197165e+02 1.257187380567343670e-49
4.697522723228924519e+02 1.261283384160703607e-49
4.734130633975585738e+02 1.265446070455461226e-49
4.771023831075963244e+02 1.269676482775070601e-49
4.808204537773672200e+02 1.273975681339490208e-49
4.845674994638119415e+02 1.278344743537596525e-49
4.883437459699508736e+02 1.282784764204361549e-49
4.921494208584945795e+02 1.287296855902853311e-49
4.959847534655552863e+02 1.291882149210795203e-49
4.998499749144658608e+02 1.296541793012208104e-49
5.037453181297104834e+02 1.301276954794016778e-49
5.076710178509595153e+02 1.306088820947660253e-49
5.116273106472139034e+02 1.310978597075828284e-49
5.156144349310642383e+02 1.315947508304752159e-49
5.196326309730563935e+02 1.320996799601393687e-49
5.236821409161686915e+02 1.326127736096473028e-49
5.277632087904075888e+02 1.331341603412886185e-49
5.318760805275113626e+02 1.336639707999797642e-49
5.360210039757685081e+02 1.342023377472621940e-49
5.401982289149573262e+02 1.347493960958742113e-49
5.444080070713953319e+02 1.353052829449340599e-49
5.486505921331101945e+02 1.358701376157502930e-49
5.529262397651248193e+02 1.364441016882314642e-49
5.572352076248678259e+02 1.370273190379832785e-49
5.615777553776983950e+02 1.376199358740449473e-49
5.659541447125526474e+02 1.382221007773400273e-49
5.703646393577165554e+02 1.388339647398565198e-49
5.748095050967175439e+02 1.394556812046052260e-49
5.792890097843385320e+02 1.400874061064646280e-49
5.838034233627633967e+02 1.407292979140292608e-49
5.883530178778419213e+02 1.413815176727330364e-49
5.929380674954823007e+02 1.420442290497571251e-49
5.975588485181762053e+02 1.427175983817309409e-49
6.022156394016473087e+02 1.434017947275767607e-49
6.069087207716299872e+02 1.440969899322108547e-49
6.116383754407836477e+02 1.448033587167562224e-49
6.164048884257337022e+02 1.455210788448492771e-49
6.212085469642455564e+02 1.462503315553544247e-49
6.260496405325370688e+02 1.469913032343267876e-49
6.309284608627218631e+02 1.477441964404050205e-49
6.358453019603869052e+02 1.485094871033860531e-49
6.408004601223141208e+02 1.492868187949787781e-49
6.457942339543335493e+02 1.500760967805291687e-49
6.508269243893156499e+02 1.508784534203370397e-49
6.558988347053104917e+02 1.516937108388568761e-49
6.610102705438212070e+02 1.525220562105222380e-49
6.661615399282209182e+02 1.533636947555873008e-49
6.713529532823184809e+02 1.542188374379778701e-49
6.765848234490631512e+02 1.550876992878918575e-49
6.818574657093947735e+02 1.559704990608247421e-49
6.871711978012478994e+02 1.568674591754747298e-49
6.925263399386961964e+02 1.577788057297436775e-49
6.979232148312477193e+02 1.587047685437327959e-49
7.033621477032955909e+02 1.596455812138005559e-49
7.088434663137147709e+02 1.606014811720634923e-49
7.143675009756112786e+02 1.615727097490370210e-49
7.199345845762311455e+02 1.625595122384722390e-49
7.255450525970192075e+02 1.635621379638995907e-49
7.311992431338331926e+02 1.645808403467137980e-49
7.368974969173224281e+02 1.656158769756680274e-49
7.426401573334585464e+02 1.666675096777718245e-49
7.484275704442266033e+02 1.677360045905103011e-49
7.542600850084832018e+02 1.688216322355094193e-49
7.601380525029715045e+02 1.699246675935181230e-49
7.660618271434990447e+02 1.710453901808173857e-49
7.720317659062886833e+02 1.721840841270949952e-49
7.780482285494875896e+02 1.733410382547155405e-49
7.841115776348444797e+02 1.745165461595222239e-49
7.902221785495635231e+02 1.757109062931157657e-49
7.963803995283201402e+02 1.769244220467020525e-49
8.025866116754493760e+02 1.781574018364910952e-49
8.088411889873140126e+02 1.794101591907285799e-49
8.151445083748395746e+02 1.806830128383457279e-49
8.214969496862253209e+02 1.819762867992858844e-49
8.278988957298396372e+02 1.832903104765677320e-49
8.343507322972856173e+02 1.846254187500625302e-49
8.408528481866477478e+02 1.859819520720817796e-49
8.474056352259257210e+02 1.873602565647873900e-49
8.540094882966449177e+02 1.887606841194822745e-49
8.606648053576492430e+02 1.901835924977950432e-49
8.673719874690885945e+02 1.916293454348651472e-49
8.741314388165844775e+02 1.930983127445375134e-49
8.809435667355842270e+02 1.945908704267019232e-49
8.878087817359131577e+02 1.961074007768502904e-49
8.947274975265096373e+02 1.976482924980715272e-49
9.017001310403536536e+02 1.992139408159049942e-49
9.087271024595964946e+02 2.008047475969402173e-49
9.158088352408796027e+02 2.024211214734551022e-49
9.229457561408497668e+02 2.040634779811420801e-49
9.301382952418814511e+02 2.057322397352757675e-49
9.373868859779920513e+02 2.074278367652068742e-49
9.446919651609578068e+02 2.091507078726463101e-49
9.520539730066429911e+02 2.109013189248069017e-49
9.594733531615247557e+02 2.126803864979355841e-49
9.669505527294256808e+02 2.144874239042755161e-49
9.744860222984621032e+02 2.163238859545727231e-49
9.820802159681948069e+02 2.181899238676811079e-49
9.897335913769907165e+02 2.200860152048580620e-49
9.974466097296069620e+02 2.220126504746701122e-49
1.005219735824979466e+03 2.239703291793860113e-49
1.013053438084235040e+03 2.259595594868473672e-49
1.020948188578914824e+03 2.279808582847182649e-49
1.028904463059428053e+03 2.300347513099366704e-49
1.036922740983718768e+03 2.321217733003874379e-49
1.045003505546155566e+03 2.342424681559659782e-49
1.053147243706655672e+03 2.363973891053974184e-49
1.061354446220027512e+03 2.385870988774912550e-49
1.069625607665539974e+03 2.408121698763547095e-49
1.077961226476733827e+03 2.430731843605640647e-49
1.086361804971455058e+03 2.453707346261216553e-49
1.094827849382121485e+03 2.477054231933342628e-49
1.103359869886236311e+03 2.500778629976966265e-49
1.111958380637128130e+03 2.524886775847340748e-49
1.120623899794932186e+03 2.549385013090712155e-49
1.129356949557821736e+03 2.574279795376697884e-49
1.138158056193473385e+03 2.599577688574505837e-49
1.147027750070777074e+03 2.625285372873204675e-49
1.155966565691804135e+03 2.651409644948006183e-49
1.164975041724014091e+03 2.677957420172883724e-49
1.174053721032711564e+03 2.704935734881521236e-49
1.183203150713767400e+03 2.732351748677656645e-49
1.192423882126584203e+03 2.760212746796704777e-49
1.201716470927318369e+03 2.788526142520905249e-49
1.211081477102371991e+03 2.817299479651697500e-49
1.220519465002135348e+03 2.846540435047717032e-49
1.230031003374991315e+03 2.876256821250169853e-49
1.239616665401596720e+03 2.906456589269551827e-49
1.249277028729419499e+03 2.937147831877133018e-49
1.259012675507545055e+03 2.968338789781189449e-49
1.268824192421763883e+03 3.000037900658433318e-49
1.278712170729924765e+03 3.032255427825443868e-49
1.288677206297558541e+03 3.064994466166963194e-49
1.298719899633795194e+03 3.098269536827504729e-49
1.308840855927546954e+03 3.132087771147859002e-49
1.319040685083974950e+03 3.166458307255756332e-49
1.329320001761249159e+03 3.201390465324672853e-49
1.339679425407587132e+03 3.236893735726706680e-49
1.350119580298576466e+03 3.272977780716940844e-49
1.360641095574804922e+03 3.309652437531627884e-49
1.371244605279767711e+03 3.346927721813631214e-49
1.381930748398072865e+03 3.384813831184873829e-49
1.392700168893955606e+03 3.423321148924038539e-49
1.403553515750080123e+03 3.462460247738574387e-49
1.414491443006643976e+03 3.502241893629872058e-49
1.425514609800801281e+03 3.542677049851979368e-49
1.436623680406377389e+03 3.583776880966295289e-49
1.447819324273896427e+03 3.625552756995049026e-49
1.459102216070931036e+03 3.668016257678811773e-49
1.470473035722754730e+03 3.711179176847889200e-49
1.481932468453311458e+03 3.755053526945084673e-49
1.493481204826516205e+03 3.799651543908064951e-49
1.505119940787866653e+03 3.844985694974501892e-49
1.516849377706375208e+03 3.891070896221853804e-49
1.528670222416845718e+03 3.937913395307391223e-49
1.540583187262463071e+03 3.985533049783885499e-49
1.552588990137714973e+03 4.033941068556287204e-49
1.564688354531663890e+03 4.083151123068892047e-49
1.576882009571540493e+03 4.133177151192201029e-49
1.589170690066676798e+03 4.184033411627378549e-49
1.601555136552796966e+03 4.235734291973188563e-49
1.614036095336638937e+03 4.288294369046920657e-49
1.626614318540922113e+03 4.341728969549615578e-49
1.639290564149681586e+03 4.396053294142066828e-49
1.652065596053941363e+03 4.451282945096319641e-49
1.664940184097741849e+03 4.507433829054527358e-49
1.677915104124541813e+03 4.564522160361129223e-49
1.690991138023968006e+03 4.622564467428685834e-49
1.704169073778926304e+03 4.681577599633486757e-49
1.717449705513098706e+03 4.741578734468380151e-49
1.730833833538792760e+03 4.802585384906796740e-49
1.744322264405163878e+03 4.864615406970462063e-49
1.757915810946830561e+03 4.927687007503135957e-49
1.771615292332851595e+03 4.991818752155188596e-49
1.785421534116085240e+03 5.057029573586238811e-49
1.799335368282948593e+03 5.123338779890697457e-49
1.813357633303549846e+03 5.190766063256284909e-49
1.827489174182209808e+03 5.259331508861869528e-49
1.841730842508394517e+03 5.329055604027171127e-49
1.856083496508025974e+03 5.399959247632992403e-49
1.870548001095203745e+03 5.472063759869622505e-49
1.885125227924318551e+03 5.545390892628650398e-49
1.899816055442591278e+03 5.619962844388229779e-49
1.914621368943003745e+03 5.695806900676730340e-49
1.929542060617641937e+03 5.772932207151738106e-49
1.944579029611473061e+03 5.851376301008662340e-49
1.959733182076522326e+03 5.931158613250291969e-49
1.975005431226475366e+03 6.012303698483919164e-49
1.990396697391719727e+03 6.094836627397742691e-49
2.005907908074800844e+03 6.178782992837552695e-49
2.021539998006308224e+03 6.264168922074101004e-49
2.037293909201216138e+03 6.351021089899798377e-49
2.053170591015644732e+03 6.439366732192836004e-49
2.069171000204064057e+03 6.529233659905841694e-49
2.085296100976960588e+03 6.620650273480337818e-49
2.101546865058938693e+03 6.713645577699317168e-49
2.117924271747268904e+03 6.808249196991374829e-49
2.134429307970916398e+03 6.904491391203593699e-49
2.151062968350008305e+03 7.002403071862831872e-49
2.167826255255764409e+03 7.102015818948427627e-49
2.184720178870914424e+03 7.203361898233037913e-49
2.201745757250567294e+03 7.306474279448972875e-49
2.218904016383554790e+03 7.411386658856238782e-49
2.236195990254269873e+03 7.518134416609287944e-49
2.253622720904973448e+03 7.626749864478440859e-49
2.271185258498579060e+03 7.737271861497750643e-49
2.288884661381954174e+03 7.849736225650150111e-49
2.306721996149688039e+03 7.964180550933161035e-49
2.324698337708362033e+03 8.080643279126730826e-49
2.342814769341337978e+03 8.199163720313020727e-49
2.361072382774031212e+03 8.319782076294127351e-49
2.379472278239693878e+03 8.442539464987305297e-49
2.398015564545729376e+03 8.567477945661343628e-49
2.416703359140505199e+03 8.694640545025241715e-49
2.435536788180683743e+03 8.824071284193572116e-49
2.454516986599102438e+03 8.955815206560709053e-49
2.473645098173158203e+03 9.089918406626810566e-49
2.492922275593724407e+03 9.226428059825785131e-49
2.512349680534632625e+03 9.365392453495397313e-49
2.531928483722665987e+03 9.506861020208047530e-49
2.551659865008103225e+03 9.650884747699803852e-49
2.571545013435832971e+03 9.797514301696469995e-49
2.591585127317000570e+03 9.946803894323407814e-49
2.611781414301211498e+03 1.009880749729277991e-48
2.632135091449321862e+03 1.025358077402946560e-48
2.652647385306774140e+03 1.041118075073926297e-48
2.673319531977500901e+03 1.057166585415919304e-48
2.694152777198432432e+03 1.073509595339005787e-48
2.715148376414555969e+03 1.090153240343723304e-48
2.736307594854566105e+03 1.107103809036259975e-48
2.757631707607123190e+03 1.124367747809653915e-48
2.779121999697685624e+03 1.141951665696799085e-48
2.800779766165938327e+03 1.159862339403709235e-48
2.822606312143850573e+03 1.178106718535487321e-48
2.844602952934317727e+03 1.196691931071367170e-48
2.866771014090414610e+03 1.215625292564289788e-48
2.889111831495292336e+03 1.234914293163920917e-48
2.911626751442673140e+03 1.254566640753584595e-48
2.934317130717970031e+03 1.274590232205664695e-48
2.957184336680067190e+03 1.294993175062378826e-48
2.980229747343711097e+03 1.315783792599021982e-48
3.003454751462540571e+03 1.336970630481671589e-48
3.026860748612797124e+03 1.358562464069013987e-48
3.050449149277652850e+03 1.380568306678324269e-48
3.074221374932201797e+03 1.402997413388870216e-48
3.098178858129137552e+03 1.425859297757516255e-48
3.122323042585072017e+03 1.449163731610309879e-48
3.146655383267527668e+03 1.472920758234917154e-48
3.171177346482633311e+03 1.497140700875639605e-48
3.195890409963478305e+03 1.521834183451640338e-48
3.220796062959153005e+03 1.547012081412007826e-48
3.245895806324512705e+03 1.572699723541697154e-48
3.271191152610610516e+03 1.598947915705242115e-48
3.296683626155838283e+03 1.625715707969958719e-48
3.322374763177804653e+03 1.653015319972922440e-48
3.348266111865900257e+03 1.680859326336971869e-48
3.374359232474582768e+03 1.709260669164009581e-48
3.400655697417423198e+03 1.738232671024710607e-48
3.427157091361845232e+03 1.767789048460028346e-48
3.453865011324629904e+03 1.797943926013719965e-48
3.480781066768138317e+03 1.828711850859306495e-48
3.507906879697322438e+03 1.860107818278529465e-48
3.535244084757458495e+03 1.892147234669841680e-48
3.562794329332642974e+03 1.924846039591047952e-48
3.590559273645089434e+03 1.958220617439327885e-48
3.618540590855162463e+03 1.992287866845553561e-48
3.646739967162196990e+03 2.027065208961375977e-48
3.675159101906131582e+03 2.062570606175013078e-48
3.703799707669903000e+03 2.098822581602460433e-48
3.732663510382638378e+03 2.135840239253488260e-48
3.761752249423684134e+03 2.173643284870373740e-48
3.791067677727412502e+03 2.212252047456491350e-48
3.820611561888846154e+03 2.251687502562627889e-48
3.850385682270137295e+03 2.291971289193531521e-48
3.880391833107845287e+03 2.333125744536106389e-48
3.910631822621046013e+03 2.375173918012801824e-48
3.941107473120324357e+03 2.418139599408223304e-48
3.971820621117577048e+03 2.462047344021360262e-48
4.002773117436670418e+03 2.506922497920050638e-48
4.033966827324999485e+03 2.552791223737206906e-48
4.065403630565878302e+03 2.599680526692500620e-48
4.097085421591806153e+03 2.647618280700789947e-48
4.129014109598654613e+03 2.696633254570421165e-48
4.161191618660706808e+03 2.746755137597666132e-48
4.193619887846588426e+03 2.798014561690846060e-48
4.226300871336150522e+03 2.850443134203614024e-48
4.259236538538216337e+03 2.904073451273323372e-48
4.292428874209245805e+03 2.958939124328525257e-48
4.325879878572969574e+03 3.015074798366370466e-48
4.359591567440910694e+03 3.072516168403075557e-48
4.393565972333847640e+03 3.131299992440557260e-48
4.427805140604265034e+03 3.191464100095698761e-48
4.462311135559713875e+03 3.253047398748208705e-48
4.497086036587142189e+03 3.316089854989726961e-48
4.532131939278221580e+03 3.380632513598989328e-48
4.567450955555624205e+03 3.446717446612811496e-48
4.603045213800271085e+03 3.514387734781637815e-48
4.638916858979625431e+03 3.583687418161830073e-48
4.675068052776933655e+03 3.654661432902610105e-48
4.711500973721477749e+03 3.727355527060086339e-48
4.748217817319889036e+03 3.801816153453976536e-48
4.785220796188435088e+03 3.878090349070194005e-48
4.822512140186340730e+03 3.956225488168686043e-48
4.860094096550195900e+03 4.036269227739930796e-48
4.897968930029359399e+03 4.118269095896630861e-48
4.936138923022424024e+03 4.202272255990548898e-48
4.974606375714784917e+03 4.288325112400923642e-48
5.013373606217240194e+03 4.376472853157866081e-48
5.052442950705666590e+03 4.466758900274353997e-48
5.091816763561832886e+03 4.559224251681020791e-48
5.131497417515263805e+03 4.653906691079586631e-48
5.171487303786206212e+03 4.750839854892571126e-48
5.211788832229764921e+03 4.850052111551525747e-48
5.252404431481100801e+03 4.951565236009836421e-48
5.293336549101775745e+03 5.055392838121694290e-48
5.334587651727275443e+03 5.161538501397660150e-48
5.376160225215634455e+03 5.269993583739011923e-48
5.418056774797226353e+03 5.380734625271527903e-48
5.460279825225763489e+03 5.493720278649645728e-48
5.502831920930424531e+03 5.608887743290607835e-48
5.545715626169172538e+03 5.726148523837215053e-48
5.588933525183312668e+03 5.845383509464458747e-48
5.632488222353206766e+03 5.966437213830165234e-48
5.676382342355199398e+03 6.089111076283208817e-48
5.720618530319820820e+03 6.213155699191877017e-48
5.765199451991168644e+03 6.338261892789405373e-48
5.810127793887530970e+03 6.464050405469066077e-48
5.855406263463321011e+03 6.590060231592291382e-48
5.901037589272206787e+03 6.715735401258254438e-48
5.947024521131527763e+03 6.840410236856169886e-48
5.993369830288033882e+03 6.963293112443500926e-48
6.040076309584871524e+03 7.083448891011615361e-48
6.087146773629861855e+03 7.199780384913502879e-48
6.134584058965156146e+03 7.311009440262093175e-48
6.182391024238146201e+03 7.415658575205756576e-48
6.230570550373715378e+03 7.512034534769577741e-48
6.279125540747884770e+03 7.598215692995131104e-48
6.328058921362751789e+03 7.672045869267453211e-48
6.377373641022825723e+03 7.731137884969031902e-48
6.427072671512701163e+03 7.772890876151827324e-48
6.477159007776187536e+03 7.794526269358745426e-48
6.527635668096761037e+03 7.793147247603077903e-48
6.578505694279438103e+03 7.765826944800521426e-48
6.629772151834115903e+03 7.709729118092852795e-48
6.681438130160286164e+03 7.622263016379477012e-48
6.733506742733188730e+03 7.501270328675887494e-48
6.785981127291471239e+03 7.345236775370275420e-48
6.838864446026256701e+03 7.153514252937461783e-48
6.892159885771680820e+03 6.926532484500550620e-48
6.945870658196978184e+03 6.665973234861718539e-48
7.000000000000001819e+03 6.374877347242020964e-48
