Laldetchar depends on glib >= 2.14

This version introduced the fuction `g_sequence_new`.
11 jobs for laldetchar-depends-glib-2.14 in 55 minutes and 35 seconds (queued for 1 second)
Status Job ID Name Coverage
  Nightly
passed #33978
macos
nightly:macos

00:41:36

passed #33975
nightly:mpi:jessie

00:32:55

passed #33976
nightly:openmp:jessie

00:32:58

passed #33977
nightly:python3:stretch

00:33:43

failed #33972
allowed to fail
nightly:top-level:artful

00:20:49

failed #33973
allowed to fail
nightly:top-level:buster

00:22:29

passed #33974
nightly:top-level:clang

00:33:33

passed #33968
nightly:top-level:el7

00:34:20

passed #33969
nightly:top-level:stretch

00:36:53

passed #33970
nightly:top-level:trusty

00:27:05

passed #33971
nightly:top-level:xenial

00:28:45

 
Name Stage Failure
failed
nightly:top-level:buster Nightly
Makefile:403: recipe for target 'check-recursive' failed
make[2]: *** [check-recursive] Error 1
make[2]: Leaving directory '/builds/leo-singer/lalsuite/lalsuite-6.48.1/_build/sub'
Makefile:677: recipe for target 'check' failed
make[1]: *** [check] Error 2
make[1]: Leaving directory '/builds/leo-singer/lalsuite/lalsuite-6.48.1/_build/sub'
make: *** [distcheck] Error 1
Makefile:594: recipe for target 'distcheck' failed
ERROR: Job failed: exit code 1
failed
nightly:top-level:artful Nightly
Makefile:403: recipe for target 'check-recursive' failed
make[2]: *** [check-recursive] Error 1
make[2]: Leaving directory '/builds/leo-singer/lalsuite/lalsuite-6.48.1/_build/sub'
Makefile:677: recipe for target 'check' failed
make[1]: *** [check] Error 2
make[1]: Leaving directory '/builds/leo-singer/lalsuite/lalsuite-6.48.1/_build/sub'
make: *** [distcheck] Error 1
Makefile:594: recipe for target 'distcheck' failed
ERROR: Job failed: exit code 1