Require a minimum version of Numpy

19 jobs for wheel in 90 minutes and 46 seconds (queued for 5 seconds)
Status Job ID Name Coverage
  Nightly
passed #35633
macos
nightly:macos

00:44:16

passed #35630
nightly:mpi:jessie

00:35:41

passed #35631
nightly:openmp:jessie

00:35:28

passed #35632
nightly:python3:stretch

00:35:22

failed #35627
allowed to fail
nightly:top-level:artful

00:21:50

failed #35628
allowed to fail
nightly:top-level:buster

00:24:07

passed #35629
nightly:top-level:clang

00:36:14

passed #35623
nightly:top-level:el7

00:34:29

passed #35624
nightly:top-level:stretch

00:37:17

passed #35625
nightly:top-level:trusty

00:27:41

passed #35626
nightly:top-level:xenial

00:30:10

passed #35639
macos
nightly:wheel:cp27-cp27m-macosx

00:28:44

passed #35634
nightly:wheel:cp27-cp27m-manylinux1

00:15:38

passed #35635
nightly:wheel:cp27-cp27mu-manylinux1

00:14:38

passed #35636
nightly:wheel:cp34-cp34m-manylinux1

00:14:55

passed #35640
macos
nightly:wheel:cp35-cp35m-macosx

00:30:54

passed #35637
nightly:wheel:cp35-cp35m-manylinux1

00:14:38

passed #35641
macos
nightly:wheel:cp36-cp36m-macosx

00:28:57

passed #35638
nightly:wheel:cp36-cp36m-manylinux1

00:14:28

 
Name Stage Failure
failed
nightly:top-level:buster Nightly
make[2]: *** [check-recursive] Error 1
Makefile:403: recipe for target 'check-recursive' failed
make[2]: Leaving directory '/builds/leo-singer/lalsuite/lalsuite-6.48.1/_build/sub'
make[1]: *** [check] Error 2
Makefile:677: recipe for target 'check' failed
make[1]: Leaving directory '/builds/leo-singer/lalsuite/lalsuite-6.48.1/_build/sub'
Makefile:594: recipe for target 'distcheck' failed
make: *** [distcheck] Error 1
ERROR: Job failed: exit code 1
failed
nightly:top-level:artful Nightly
Makefile:403: recipe for target 'check-recursive' failed
make[2]: Leaving directory '/builds/leo-singer/lalsuite/lalsuite-6.48.1/_build/sub'
make[2]: *** [check-recursive] Error 1
Makefile:677: recipe for target 'check' failed
make[1]: *** [check] Error 2
make[1]: Leaving directory '/builds/leo-singer/lalsuite/lalsuite-6.48.1/_build/sub'
make: *** [distcheck] Error 1
Makefile:594: recipe for target 'distcheck' failed
ERROR: Job failed: exit code 1