Make wheel building a lot simpler by integrating with autotools

Also, include installed Python scripts in the wheel.
18 jobs for wheel-in-automake in 102 minutes and 47 seconds (queued for 4 seconds)
Status Job ID Name Coverage
  Nightly
passed #41120
macos
nightly:macos

00:59:11

passed #41118
nightly:openmp:jessie

00:37:19

failed #41119
allowed to fail
nightly:python3:stretch

00:29:00

failed #41115
allowed to fail
nightly:top-level:artful

00:22:35

failed #41116
allowed to fail
nightly:top-level:buster

00:24:48

passed #41117
nightly:top-level:clang

00:38:04

passed #41111
nightly:top-level:el7

00:35:30

passed #41112
nightly:top-level:stretch

00:38:09

passed #41113
nightly:top-level:trusty

00:29:02

passed #41114
nightly:top-level:xenial

00:30:49

passed #41126
macos
nightly:wheel:cp27-cp27m-macosx

00:49:26

passed #41121
nightly:wheel:cp27-cp27m-manylinux1

00:16:22

passed #41122
nightly:wheel:cp27-cp27mu-manylinux1

00:14:21

passed #41123
nightly:wheel:cp34-cp34m-manylinux1

00:13:45

passed #41127
macos
nightly:wheel:cp35-cp35m-macosx

00:48:57

passed #41124
nightly:wheel:cp35-cp35m-manylinux1

00:13:45

passed #41128
macos
nightly:wheel:cp36-cp36m-macosx

00:43:35

passed #41125
nightly:wheel:cp36-cp36m-manylinux1

00:13:40

 
Name Stage Failure
failed
nightly:python3:stretch Nightly
Makefile:416: recipe for target 'check-recursive' failed
make[2]: *** [check-recursive] Error 1
make[2]: Leaving directory '/builds/leo-singer/lalsuite/lalsuite-6.48.1/_build/sub'
Makefile:690: recipe for target 'check' failed
make[1]: *** [check] Error 2
make[1]: Leaving directory '/builds/leo-singer/lalsuite/lalsuite-6.48.1/_build/sub'
make: *** [distcheck] Error 1
Makefile:607: recipe for target 'distcheck' failed
ERROR: Job failed: exit code 1
failed
nightly:top-level:buster Nightly
make[2]: *** [check-recursive] Error 1
Makefile:416: recipe for target 'check-recursive' failed
make[2]: Leaving directory '/builds/leo-singer/lalsuite/lalsuite-6.48.1/_build/sub'
Makefile:690: recipe for target 'check' failed
make[1]: Leaving directory '/builds/leo-singer/lalsuite/lalsuite-6.48.1/_build/sub'
make[1]: *** [check] Error 2
Makefile:607: recipe for target 'distcheck' failed
make: *** [distcheck] Error 1
ERROR: Job failed: exit code 1
failed
nightly:top-level:artful Nightly
Makefile:416: recipe for target 'check-recursive' failed
make[2]: *** [check-recursive] Error 1
make[2]: Leaving directory '/builds/leo-singer/lalsuite/lalsuite-6.48.1/_build/sub'
Makefile:690: recipe for target 'check' failed
make[1]: *** [check] Error 2
make[1]: Leaving directory '/builds/leo-singer/lalsuite/lalsuite-6.48.1/_build/sub'
Makefile:607: recipe for target 'distcheck' failed
make: *** [distcheck] Error 1
ERROR: Job failed: exit code 1