Fix UserDict import

24 jobs for userdict in 20 minutes and 21 seconds (queued for 5 seconds)
Status Job ID Name Coverage
  Level0
passed #190466
level0:el7:lal

00:06:36

passed #190465
level0:stretch:lal

00:04:21

 
  Level1
passed #190471
level1:el7:lalframe

00:02:57

passed #190472
level1:el7:lalmetaio

00:02:40

passed #190473
level1:el7:lalsimulation

00:04:59

passed #190474
level1:el7:lalxml

00:02:32

passed #190467
level1:stretch:lalframe

00:02:46

passed #190468
level1:stretch:lalmetaio

00:02:24

passed #190469
level1:stretch:lalsimulation

00:03:53

passed #190470
level1:stretch:lalxml

00:02:19

 
  Level2
failed #190479
level2:el7:lalburst

00:02:26

passed #190480
level2:el7:lalinspiral

00:06:12

passed #190481
level2:el7:lalpulsar

00:05:10

passed #190482
level2:el7:lalstochastic

00:02:34

failed #190475
level2:stretch:lalburst

00:02:10

passed #190476
level2:stretch:lalinspiral

00:05:29

passed #190477
level2:stretch:lalpulsar

00:04:39

passed #190478
level2:stretch:lalstochastic

00:02:54

 
  Level3
skipped #190485
level3:el7:laldetchar
skipped #190486
level3:el7:lalinference
skipped #190483
level3:stretch:laldetchar
skipped #190484
level3:stretch:lalinference
 
  Level4
skipped #190488
level4:el7:lalapps
skipped #190487
level4:stretch:lalapps
 
Name Stage Failure
failed
level2:el7:lalburst Level2
make[4]: Leaving directory `/builds/leo-singer/lalsuite/lalburst-1.5.0.1/subdir/test'
make[3]: *** [check-TESTS] Error 2
make[3]: Leaving directory `/builds/leo-singer/lalsuite/lalburst-1.5.0.1/subdir/test'
make[2]: *** [check-am] Error 2
make[2]: Leaving directory `/builds/leo-singer/lalsuite/lalburst-1.5.0.1/subdir/test'
make[1]: *** [check-recursive] Error 1
make[1]: Leaving directory `/builds/leo-singer/lalsuite/lalburst-1.5.0.1/subdir'
make: *** [check] Error 2
ERROR: Job failed: exit code 1
failed
level2:stretch:lalburst Level2
make[2]: *** [check-am] Error 2
Makefile:887: recipe for target 'check-am' failed
make[2]: Leaving directory '/builds/leo-singer/lalsuite/lalburst-1.5.0.1/subdir/test'
Makefile:616: recipe for target 'check-recursive' failed
make[1]: Leaving directory '/builds/leo-singer/lalsuite/lalburst-1.5.0.1/subdir'
make[1]: *** [check-recursive] Error 1
Makefile:904: recipe for target 'check' failed
make: *** [check] Error 2
ERROR: Job failed: exit code 1