Make lalinspiral._thinca compatible with Python 3

43 jobs for lalinspiral-thinca-python-3 in 155 minutes and 26 seconds (queued for 6 seconds)
Status Job ID Name Coverage
  Level0
passed #224008
level0:deb:lal

00:22:50

passed #224007
level0:rpm:lal

00:10:23

 
  Level1
passed #224012
level1:deb:lalframe

00:04:43

passed #224013
level1:deb:lalmetaio

00:05:14

passed #224014
level1:deb:lalsimulation

00:12:11

passed #224009
level1:rpm:lalframe

00:02:32

passed #224010
level1:rpm:lalmetaio

00:02:39

passed #224011
level1:rpm:lalsimulation

00:04:46

 
  Level2
passed #224018
level2:deb:lalburst

00:03:34

passed #224019
level2:deb:lalinspiral

00:18:33

passed #224020
level2:deb:lalpulsar

00:16:07

passed #224015
level2:rpm:lalburst

00:02:19

passed #224016
level2:rpm:lalinspiral

00:08:48

passed #224017
level2:rpm:lalpulsar

00:08:06

 
  Level3
passed #224022
level3:deb:lalinference

00:08:15

passed #224021
level3:rpm:lalinference

00:06:36

 
  Level4
passed #224024
level4:deb:lalapps

00:09:43

passed #224023
level4:rpm:lalapps

00:05:03

 
  Docker
passed #224025
docker:nightly:el7

00:09:32

passed #224026
docker:nightly:stretch

00:05:58

 
  Nightly
passed #224038
macos_elcapitan
nightly:macos:elcapitan

00:24:48

passed #224037
macos_highsierra
nightly:macos:highsierra

00:26:40

passed #224036
nightly:openmp:stretch

00:34:48

passed #224032
nightly:top-level:bionic

00:33:18

failed #224034
allowed to fail
nightly:top-level:buster

00:04:35

passed #224035
nightly:top-level:clang

00:35:22

failed #224033
allowed to fail
nightly:top-level:cosmic

00:04:23

passed #224028
nightly:top-level:el7-cr

00:33:05

passed #224027
nightly:top-level:jessie

00:34:35

passed #224029
nightly:top-level:sl7

00:32:59

failed #224030
allowed to fail
nightly:top-level:trusty

00:10:28

failed #224031
allowed to fail
nightly:top-level:xenial

00:11:16

 
  Wheels
passed #224045
macos_elcapitan
nightly:wheel:cp27-cp27m-macosx

00:19:37

passed #224039
nightly:wheel:cp27-cp27m-manylinux1

00:15:13

passed #224040
nightly:wheel:cp27-cp27mu-manylinux1

00:15:22

passed #224041
nightly:wheel:cp34-cp34m-manylinux1

00:15:59

passed #224046
macos_elcapitan
nightly:wheel:cp35-cp35m-macosx

00:18:00

passed #224042
nightly:wheel:cp35-cp35m-manylinux1

00:15:35

passed #224047
macos_elcapitan
nightly:wheel:cp36-cp36m-macosx

00:18:23

passed #224043
nightly:wheel:cp36-cp36m-manylinux1

00:15:41

passed #224048
macos_elcapitan
nightly:wheel:cp37-cp37m-macosx

00:18:26

passed #224044
nightly:wheel:cp37-cp37m-manylinux1

00:15:30

 
  Deploy
passed #224049
deploy:wheel

00:00:48

 
Name Stage Failure
failed
nightly:top-level:xenial Nightly
make[2]: *** [all-recursive] Error 1
Makefile:416: recipe for target 'all-recursive' failed
make[2]: Leaving directory '/builds/leo-singer/lalsuite/lalsuite-6.49.1/_build/sub'
Makefile:353: recipe for target 'all' failed
make[1]: Leaving directory '/builds/leo-singer/lalsuite/lalsuite-6.49.1/_build/sub'
make[1]: *** [all] Error 2
Makefile:607: recipe for target 'distcheck' failed
make: *** [distcheck] Error 1
ERROR: Job failed: exit code 1
failed
nightly:top-level:trusty Nightly
make[4]: Leaving directory `/builds/leo-singer/lalsuite/lalsuite-6.49.1/_build/lalinspiral'
make[3]: *** [all] Error 2
make[3]: Leaving directory `/builds/leo-singer/lalsuite/lalsuite-6.49.1/_build/lalinspiral'
make[2]: *** [all-recursive] Error 1
make[2]: Leaving directory `/builds/leo-singer/lalsuite/lalsuite-6.49.1/_build'
make[1]: *** [all] Error 2
make[1]: Leaving directory `/builds/leo-singer/lalsuite/lalsuite-6.49.1/_build'
make: *** [distcheck] Error 1
ERROR: Job failed: exit code 1
failed
nightly:top-level:buster Nightly
make[4]: Leaving directory '/builds/leo-singer/lalsuite/lalapps'
make[3]: *** [Makefile:744: distdir] Error 2
make[3]: Leaving directory '/builds/leo-singer/lalsuite/lalapps'
make[2]: Leaving directory '/builds/leo-singer/lalsuite'
make[2]: *** [Makefile:508: distdir-am] Error 1
make[1]: *** [Makefile:502: distdir] Error 2
make[1]: Leaving directory '/builds/leo-singer/lalsuite'
make: *** [Makefile:603: dist] Error 2
ERROR: Job failed: exit code 1
failed
nightly:top-level:cosmic Nightly
make[4]: Leaving directory '/builds/leo-singer/lalsuite/lalapps'
make[3]: *** [Makefile:744: distdir] Error 2
make[3]: Leaving directory '/builds/leo-singer/lalsuite/lalapps'
make[2]: *** [Makefile:508: distdir-am] Error 1
make[2]: Leaving directory '/builds/leo-singer/lalsuite'
make[1]: Leaving directory '/builds/leo-singer/lalsuite'
make[1]: *** [Makefile:502: distdir] Error 2
make: *** [Makefile:603: dist] Error 2
ERROR: Job failed: exit code 1