Remove dependency on ligo-common

Fixes #5.
14 jobs for remove-ligo-common in 1 minute and 31 seconds (queued for 3 seconds)
Status Name Job ID Coverage
  Test
passed doc #222113

00:00:33

failed test:2.7 #222109

00:01:15

failed test:3.4 #222110

00:01:27

failed test:3.5 #222111

00:01:27

failed test:3.6 #222112

00:01:30

 
  Build
skipped build:debian:jessie #222121
skipped build:debian:stretch #222122
skipped build:el7 #222120
skipped build:tarball #222114
skipped build:wheel:cp27-cp27m-manylinux1 #222115
skipped build:wheel:cp27-cp27mu-manylinux1 #222116
skipped build:wheel:cp34-cp34m-manylinux1 #222117
skipped build:wheel:cp35-cp35m-manylinux1 #222118
skipped build:wheel:cp36-cp36m-manylinux1 #222119
 
Name Stage Failure
failed
test:3.6 Test
    from ligo.segments import utils as segmentsUtils
File "/usr/local/lib/python3.6/site-packages/ligo/segments/utils.py", line 34, in <module>
from lal import LIGOTimeGPS
ModuleNotFoundError: No module named 'lal'
Fail
Makefile:13: recipe for target 'segments_utils_verify' failed
make: Leaving directory '/builds/leo-singer/ligo-segments/test'
make: *** [segments_utils_verify] Error 1
ERROR: Job failed: exit code 1
failed
test:3.5 Test
    from ligo.segments import utils as segmentsUtils
File "/usr/local/lib/python3.5/site-packages/ligo/segments/utils.py", line 34, in <module>
from lal import LIGOTimeGPS
ImportError: No module named 'lal'
Fail
Makefile:13: recipe for target 'segments_utils_verify' failed
make: *** [segments_utils_verify] Error 1
make: Leaving directory '/builds/leo-singer/ligo-segments/test'
ERROR: Job failed: exit code 1
failed
test:3.4 Test
    from ligo.segments import utils as segmentsUtils
File "/usr/local/lib/python3.4/site-packages/ligo/segments/utils.py", line 34, in <module>
from lal import LIGOTimeGPS
ImportError: No module named 'lal'
Fail
Makefile:13: recipe for target 'segments_utils_verify' failed
make: Leaving directory '/builds/leo-singer/ligo-segments/test'
make: *** [segments_utils_verify] Error 1
ERROR: Job failed: exit code 1
failed
test:2.7 Test
    from ligo.segments import utils as segmentsUtils
File "/usr/local/lib/python2.7/site-packages/ligo/segments/utils.py", line 34, in <module>
from lal import LIGOTimeGPS
ImportError: No module named lal
Fail
Makefile:13: recipe for target 'segments_utils_verify' failed
make: Leaving directory '/builds/leo-singer/ligo-segments/test'
make: *** [segments_utils_verify] Error 1
ERROR: Job failed: exit code 1