Run CI tests in parallel using pytest-xdist

17 jobs for xdist in 122 minutes and 19 seconds (queued for 3 seconds)
latest
Status Name Job ID Coverage
  Deps
passed requirements #900287

00:00:11

 
  Dist
passed dependencies/python3.6 #900295

00:02:09

passed dependencies/python3.7 #900296

00:02:04

passed dependencies/python3.8 #900297

00:02:09

passed sdist #900288

00:00:18

passed wheel/cp36-cp36m-macosx #900292
macos_sierra

00:00:38

passed wheel/cp36-cp36m-manylinux2014 #900289

00:00:34

passed wheel/cp37-cp37m-macosx #900293
macos_sierra

00:00:37

passed wheel/cp37-cp37m-manylinux2014 #900290

00:00:30

passed wheel/cp38-cp38-macosx #900294
macos_sierra

00:00:34

passed wheel/cp38-cp38-manylinux2014 #900291

00:00:35

 
  Test
passed docs #900299

00:04:00

passed lint #900298

00:00:23

failed test/coverage #900303

02:00:00

failed test/python3.6 #900300

00:06:36

failed test/python3.7 #900301

00:04:47

passed test/python3.8 #900302

00:06:41

 
Name Stage Failure
failed
test/coverage Test The script exceeded the maximum execution time set for the job
........................................................................ [ 90%]
........................................................................ [ 97%]
....
Running after_script
WARNING: Failed to inspect build container 8f1d77b3854035b32f2717b769708b228c5f98195da240442b1a7fbab580b989 context deadline exceeded (docker_command.go:78:0s)
Authenticating with credentials from job payload (GitLab Registry)
Pulling docker image containers.ligo.org/leo-singer/ligo.skymap/dependencies/python3.7:xdist ...
Uploading artifacts for failed job
Pulling docker image gitlab/gitlab-runner-helper:x86_64-6fbc7474 ...
ERROR: Job failed: execution took longer than 2h0m0s seconds
failed
test/python3.7 Test
FAILED ../../usr/local/lib/python3.7/site-packages/ligo/skymap/tool/tests/test_bayestar.py::test_bayestar
FAILED ../../usr/local/lib/python3.7/site-packages/ligo/skymap/postprocess/tests/test_crossmatch.py::test_crossmatch_cartesian_gaussian_distribution[0-2]
FAILED ../../usr/local/lib/python3.7/site-packages/ligo/skymap/postprocess/tests/test_crossmatch.py::test_crossmatch_cartesian_gaussian_distribution[2-1]
=========== 3 failed, 955 passed, 892 warnings in 261.92s (0:04:21) ============
Running after_script
Running after script...
$ cd "${CI_PROJECT_DIR}"
$ rm -rf "${WORKING_DIRECTORY}"
ERROR: Job failed: exit code 1
failed
test/python3.6 Test
29.10s call     postprocess/tests/test_crossmatch.py::test_crossmatch_cartesian_gaussian_distribution[1-None]
=========================== short test summary info ============================
FAILED ../../usr/local/lib/python3.6/site-packages/ligo/skymap/postprocess/tests/test_crossmatch.py::test_crossmatch_cartesian_gaussian_distribution[0-2]
=========== 1 failed, 957 passed, 893 warnings in 372.66s (0:06:12) ============
Running after_script
Running after script...
$ cd "${CI_PROJECT_DIR}"
$ rm -rf "${WORKING_DIRECTORY}"
ERROR: Job failed: exit code 1