WIP: bundle Scipy sources

14 jobs for net-snr-threshold in 13 minutes and 25 seconds (queued for 4 seconds)
latest
Status Name Job ID Coverage
  Deps
passed requirements #1432728

00:00:15

 
  Dist
passed dependencies/python3.7 #1432732

00:00:14

passed dependencies/python3.8 #1432733

00:00:10

passed dependencies/python3.9 #1432734

00:00:11

passed sdist #1432729

00:00:33

passed wheel/macosx #1432731
macos_sierra

00:00:49

passed wheel/manylinux #1432730

00:00:48

 
  Test
passed docs #1432735

00:08:25

passed lint #1432740

00:00:16

failed test/coverage #1432739

00:00:26

failed test/python3.7 #1432736

00:12:19

failed test/python3.8 #1432737

00:12:35

failed test/python3.9 #1432738

00:11:48

manual tests/review #1432741
allowed to fail manual
 
Name Stage Failure
failed
test/python3.7 Test
FAILED ../../usr/local/lib/python3.7/site-packages/ligo/skymap/bayestar/__init__.py::skymap.bayestar.test
ERROR ../../usr/local/lib/python3.7/site-packages/ligo/skymap/tool/tests/test_bayestar.py::test_bayestar
======= 1 failed, 965 passed, 33 warnings, 1 error in 702.81s (0:11:42) ========
Running after_script
Running after script...
$ cd "${CI_PROJECT_DIR}"
$ rm -rf "${WORKING_DIRECTORY}"
Cleaning up file based variables
ERROR: Job failed: exit code 1
failed
test/python3.8 Test
FAILED ../../usr/local/lib/python3.8/site-packages/ligo/skymap/bayestar/__init__.py::skymap.bayestar.test
ERROR ../../usr/local/lib/python3.8/site-packages/ligo/skymap/tool/tests/test_bayestar.py::test_bayestar
======= 1 failed, 965 passed, 33 warnings, 1 error in 739.43s (0:12:19) ========
Running after_script
Running after script...
$ cd "${CI_PROJECT_DIR}"
$ rm -rf "${WORKING_DIRECTORY}"
Cleaning up file based variables
ERROR: Job failed: exit code 1
failed
test/python3.9 Test
FAILED ../../usr/local/lib/python3.9/site-packages/ligo/skymap/bayestar/__init__.py::skymap.bayestar.test
ERROR ../../usr/local/lib/python3.9/site-packages/ligo/skymap/tool/tests/test_bayestar.py::test_bayestar
======= 1 failed, 965 passed, 33 warnings, 1 error in 684.81s (0:11:24) ========
Running after_script
Running after script...
$ cd "${CI_PROJECT_DIR}"
$ rm -rf "${WORKING_DIRECTORY}"
Cleaning up file based variables
ERROR: Job failed: exit code 1
failed
test/coverage Test
Uploading artifacts for failed job
Uploading artifacts...
WARNING: coverage.xml: no matching files
ERROR: No files to upload
Uploading artifacts...
WARNING: junit.xml: no matching files
ERROR: No files to upload
Cleaning up file based variables
ERROR: Job failed: exit code 1