Initial draft

7 jobs for 219-add-standardised-and-down-sampled-result-file in 1 minute and 36 seconds (queued for 6 seconds)
latest
Status Job ID Name Coverage
  Test
passed documentation #1440037

00:01:32

passed example-ini-file-builds #1440033

00:00:25

failed injection-regression-test #1440034

00:00:45

passed precommits-py3.7 #1440031

00:00:44

failed python-3.6 #1440036

00:01:35

failed python-3.7 #1440032

00:00:54

70.0%
passed review-test-build #1440035

00:00:18

 
Name Stage Failure
failed
python-3.6 Test
15:50 bilby_pipe INFO    : Setting segment trigger-times [1187529256.517903]
15:50 bilby_pipe INFO : DAG generation complete, to submit jobs run:
$ condor_submit_dag outdir_G298936/submit/dag_G298936.submit
15:50 bilby_pipe INFO : Overview page available at outdir_G298936/results_page/overview.html
=========================== short test summary info ============================
FAILED tests/gracedb_test.py::TestGraceDB::test_main - AssertionError: 11 != 10
======================== 1 failed, 214 passed in 18.57s ========================
Cleaning up file based variables
ERROR: Job failed: exit code 1
failed
python-3.7 Test
bilby_pipe/xml_converter.py                                54     18    67%
---------------------------------------------------------------------------
TOTAL 3718 1113 70%

=========================== short test summary info ============================
FAILED tests/gracedb_test.py::TestGraceDB::test_main - AssertionError: 11 != 10
======================== 1 failed, 214 passed in 24.51s ========================
Cleaning up file based variables
ERROR: Job failed: exit code 1
failed
injection-regression-test Test
  File "/opt/conda/envs/python37/lib/python3.7/site-packages/bilby_pipe/job_creation/nodes/final_result_node.py", line 22, in __init__
self.process_node()
File "/opt/conda/envs/python37/lib/python3.7/site-packages/bilby_pipe/job_creation/node.py", line 45, in process_node
subprocess.run([self.executable] + self.arguments.argument_list, check=True)
File "/opt/conda/envs/python37/lib/python3.7/subprocess.py", line 512, in run
output=stdout, stderr=stderr)
subprocess.CalledProcessError: Command '['/opt/conda/envs/python37/bin/bilby_result', '--result', 'test_gaussian_noise_simulation/result/label_data0_0_analysis_H1L1_dynesty_result.json', '--outdir', 'final_result', '--extension', 'json', '--max-samples', '10000', '--lightweight', '--save']' returned non-zero exit status 2.
Cleaning up file based variables
ERROR: Job failed: exit code 1