Improve long_description for PyPI

11 jobs for master in 5 minutes and 12 seconds (queued for 39 seconds)
Status Job ID Name Coverage
  Build
failed #452674
build:debian:jessie

00:03:45

failed #452675
build:debian:stretch

00:01:44

failed #452673
build:el7

00:00:58

passed #452672
build:tarball

00:00:27

 
  Test
skipped #452681
docs
skipped #452682
syntax
skipped #452676
test:python2.7
skipped #452677
test:python3.4
skipped #452678
test:python3.5
skipped #452679
test:python3.6
skipped #452680
test:python3.7
 
Name Stage Failure
failed
build:debian:jessie Build
make: *** [clean] Error 13
debian/rules:25: recipe for target 'clean' failed
dpkg-buildpackage: error: debian/rules clean gave error exit status 2
Running after script...
$ ls -l dist/
total 2204
drwxr-xr-x 5 root root 4096 Sep 11 16:40 ligo-gracedb-2.4.0
-rw-r--r-- 1 root root 2250955 Sep 11 16:40 ligo-gracedb-2.4.0.tar.gz
ERROR: Job failed: exit code 1
failed
build:debian:stretch Build
debian/rules:25: recipe for target 'clean' failed
make: *** [clean] Error 25
dpkg-buildpackage: error: debian/rules clean gave error exit status 2
Running after script...
$ ls -l dist/
total 2204
drwxr-xr-x 6 root root 4096 Sep 11 16:38 ligo-gracedb-2.4.0
-rw-r--r-- 1 root root 2250908 Sep 11 16:38 ligo-gracedb-2.4.0.tar.gz
ERROR: Job failed: exit code 1
failed
build:el7 Build
    Bad exit status from /var/tmp/rpm-tmp.ouimjw (%build)


RPM build errors:
Running after script...
$ ls -l dist/
total 2200
-rw-r--r-- 1 root root 2250940 Sep 11 16:36 ligo-gracedb-2.4.0.tar.gz
ERROR: Job failed: exit code 1