Merge branch 'gstlal-inspiral-1.6-branch' of git.ligo.org:lscsoft/gstlal into...

Merge branch 'gstlal-inspiral-1.6-branch' of git.ligo.org:lscsoft/gstlal into gstlal-inspiral-1.6-branch
14 jobs for gstlal-inspiral-1.6.6-v2 in 3 minutes and 15 seconds (queued for 1 second)
latest
Status Job ID Name Coverage
  Level0
passed #392446
level0:gstlal

00:00:55

failed #392445
allowed to fail
level0:rpm:gstlal

00:00:45

 
  Level1
passed #392448
level1:gstlal-ugly

00:01:12

failed #392447
allowed to fail
level1:rpm:gstlal-ugly

00:00:23

 
  Level2
passed #392454
level2:gstlal-burst

00:00:44

passed #392452
level2:gstlal-calibration

00:01:06

failed #392453
level2:gstlal-inspiral

00:00:34

failed #392451
allowed to fail
level2:rpm:gstlal-burst

00:00:28

failed #392450
allowed to fail
level2:rpm:gstlal-calibration

00:00:28

failed #392449
allowed to fail
level2:rpm:gstlal-inspiral

00:00:24

 
  Test Gstlal
skipped #392455
test:gstlal
 
  Test Inspiral
skipped #392456
allowed to fail
test:gstlal-inspiral
 
  Test Burst
skipped #392457
allowed to fail
test:gstlal-burst
 
  Test Offline
skipped #392458
allowed to fail
test:offline
 
Name Stage Failure
failed
level2:gstlal-inspiral Level2
./configure: line 2651: gstlal-discuss@ligo.org: No such file or directory
./configure: line 2652: _ACEOF: command not found
./configure: line 2654: syntax error near unexpected token `fi'
./configure: line 2654: `fi'
Daemon already running on PID 7
Uploading artifacts...
/builds/lscsoft/gstlal/opt/gstlal: found 1169 matching files
Uploading artifacts to coordinator... ok
id=392453 responseStatus=201 Created token=iK5hPVVi
ERROR: Job failed: exit code 1
failed
level2:rpm:gstlal-burst Level2

Consider adjusting the PKG_CONFIG_PATH environment variable if you
installed software in a non-standard prefix.

Alternatively, you may set the environment variables GSTLAL_CFLAGS
and GSTLAL_LIBS to avoid the need to call pkg-config.
See the pkg-config man page for more details.
Daemon already running on PID 7
ERROR: Job failed: exit code 1
failed
level2:rpm:gstlal-calibration Level2

Consider adjusting the PKG_CONFIG_PATH environment variable if you
installed software in a non-standard prefix.

Alternatively, you may set the environment variables GSTLAL_CFLAGS
and GSTLAL_LIBS to avoid the need to call pkg-config.
See the pkg-config man page for more details.
Daemon already running on PID 7
ERROR: Job failed: exit code 1
failed
level2:rpm:gstlal-inspiral Level2
running autoconf...
./00init.sh complete.
$ ./configure --enable-gtk-doc
./configure: line 2651: gstlal-discuss@ligo.org: No such file or directory
./configure: line 2652: _ACEOF: command not found
./configure: line 2654: syntax error near unexpected token `fi'
./configure: line 2654: `fi'
Daemon already running on PID 7
ERROR: Job failed: exit code 1
failed
level1:rpm:gstlal-ugly Level1

Consider adjusting the PKG_CONFIG_PATH environment variable if you
installed software in a non-standard prefix.

Alternatively, you may set the environment variables GSTLAL_CFLAGS
and GSTLAL_LIBS to avoid the need to call pkg-config.
See the pkg-config man page for more details.
Daemon already running on PID 7
ERROR: Job failed: exit code 1
failed
level0:rpm:gstlal Level0
collect2: error: ld returned 1 exit status
2019-07-18 17:13:26,861:scangobj.py:execute_command:1196:WARNING:Linking scanner failed: 1, command: /bin/sh ../../libtool --tag=CC --mode=link gcc -std=gnu99 -lgobject-2.0 -lglib-2.0 -Wall -Wextra -Wno-missing-field-initializers -Wno-unused-parameter -O3 -fPIC -DMKL_ILP64 -m64 -I/opt/intel/compilers_and_libraries_2018.3.222/linux/mkl/include -I/builds/lscsoft/gstlal/opt/gstlal/include -no-undefined -l:libfftw3.so -l:libfftw3f.so -l:libfftw3_threads.so -l:libfftw3f_threads.so -L/builds/lscsoft/gstlal/opt/gstlal/lib -L/opt/intel/compilers_and_libraries_2018.3.222/linux/mkl/lib/intel64 -Wl,--no-as-needed -lmkl_intel_ilp64 -lmkl_sequential -lmkl_core -lpthread -lm -ldl gstlal-scan.lo -no-undefined -static ../../lib/gstlal/libgstlal.la ../../lib/gstlal/libgstlaltags.la ../../lib/gstlal/libgstlaltypes.la ../../gst/lal/libgstgstlal.la ../../gst/gst/libgstlal_adder.la -lgsl -lgslcblas -lm -lfftw3 -lfftw3f -llal -llalmetaio -llalsupport -llalsimulation -llalburst -llalinspiral -lgstallocators-1.0 -lgstbase-1.0 -lgstcontroller-1.0 -lgstreamer-1.0 -lgobject-2.0 -lglib-2.0 -l:libfftw3.so -l:libfftw3f.so -l:libfftw3_threads.so -l:libfftw3f_threads.so -L/builds/lscsoft/gstlal/opt/gstlal/lib -L/opt/intel/compilers_and_libraries_2018.3.222/linux/mkl/lib/intel64 -Wl,--no-as-needed -lmkl_intel_ilp64 -lmkl_sequential -lmkl_core -lpthread -lm -ldl -o gstlal-scan
make[2]: Leaving directory `/builds/lscsoft/gstlal/gstlal/doc/gobject'
make[2]: *** [scan-build.stamp] Error 1
make[1]: *** [all-recursive] Error 1
make[1]: Leaving directory `/builds/lscsoft/gstlal/gstlal/doc'
make: *** [all-recursive] Error 1
Daemon already running on PID 7
ERROR: Job failed: exit code 1