inspiral_extrinsics.py, inspiral_lr.py: add glitch model rather than repurposing the signal model

14 jobs for O3a_offline in 4 minutes and 43 seconds (queued for 4 seconds)
Status Job ID Name Coverage
  Level0
failed #429269
level0:gstlal

00:04:38

failed #429268
allowed to fail
level0:rpm:gstlal

00:04:43

 
  Level1
skipped #429271
level1:gstlal-ugly
skipped #429270
allowed to fail
level1:rpm:gstlal-ugly
 
  Level2
skipped #429277
level2:gstlal-burst
skipped #429275
level2:gstlal-calibration
skipped #429276
level2:gstlal-inspiral
skipped #429274
allowed to fail
level2:rpm:gstlal-burst
skipped #429273
allowed to fail
level2:rpm:gstlal-calibration
skipped #429272
allowed to fail
level2:rpm:gstlal-inspiral
 
  Test Gstlal
skipped #429278
test:gstlal
 
  Test Inspiral
skipped #429279
allowed to fail
test:gstlal-inspiral
 
  Test Burst
skipped #429280
allowed to fail
test:gstlal-burst
 
  Test Offline
skipped #429281
allowed to fail
test:offline
 
Name Stage Failure
failed
level0:rpm:gstlal Level0
    element->simulation_series = XLALResizeREAL8TimeSeries(element->simulation_series, 0, element->simulation_series->data->length + ceil(DeltaT / element->simulation_series->deltaT));
^
make[2]: *** [libgstgstlal_la-gstlal_simulation.lo] Error 1
make[2]: Leaving directory `/builds/lscsoft/gstlal/gstlal/gst/lal'
make[1]: *** [all-recursive] Error 1
make[1]: Leaving directory `/builds/lscsoft/gstlal/gstlal/gst'
make: *** [all-recursive] Error 1
Daemon already running on PID 7
ERROR: Job failed: exit code 1
failed
level0:gstlal Level0
make[2]: Leaving directory `/builds/lscsoft/gstlal/gstlal/gst/lal'
make[1]: *** [all-recursive] Error 1
make[1]: Leaving directory `/builds/lscsoft/gstlal/gstlal/gst'
make: *** [all-recursive] Error 1
Daemon already running on PID 7
Uploading artifacts...
/builds/lscsoft/gstlal/opt/gstlal: found 1 matching files
Uploading artifacts to coordinator... ok
id=429269 responseStatus=201 Created token=NY52MyS4
ERROR: Job failed: exit code 1