fixing botched merge

14 jobs for gstlal-inspiral-1.6-branch in 23 minutes and 17 seconds (queued for 2 seconds)
Status Job ID Name Coverage
  Level0
passed #392504
level0:gstlal

00:00:54

failed #392503
allowed to fail
level0:rpm:gstlal

00:00:45

 
  Level1
passed #392506
level1:gstlal-ugly

00:01:10

failed #392505
allowed to fail
level1:rpm:gstlal-ugly

00:00:22

 
  Level2
passed #392512
level2:gstlal-burst

00:00:40

passed #392510
level2:gstlal-calibration

00:01:05

passed #392511
level2:gstlal-inspiral

00:01:19

failed #392509
allowed to fail
level2:rpm:gstlal-burst

00:00:26

failed #392508
allowed to fail
level2:rpm:gstlal-calibration

00:00:26

failed #392507
allowed to fail
level2:rpm:gstlal-inspiral

00:00:28

 
  Test Gstlal
passed #392513
test:gstlal

00:00:21

 
  Test Inspiral
failed #392514
allowed to fail
test:gstlal-inspiral

00:00:27

 
  Test Burst
passed #392515
allowed to fail
test:gstlal-burst

00:00:16

 
  Test Offline
failed #392516
allowed to fail
test:offline

00:18:45

 
Name Stage Failure
failed
test:offline Test Offline
user 0.16
sys 0.04
make: *** [H1L1-ALL_LLOID-1000000000-2048.sqlite] Error 1
Daemon already running on PID 7
Uploading artifacts...
gstlal-inspiral/tests: found 56 matching files
public: found 1 matching files

Uploading artifacts to coordinator... ok
id=392516 responseStatus=201 Created token=k9b4_AAz
ERROR: Job failed: exit code 1
failed
test:gstlal-inspiral Test Inspiral
    +		100 102
+ 120 110
+ </Stream>
</Array>

/builds/lscsoft/gstlal/gstlal-inspiral/python/stats/horizonhistory.py:114: DocTestFailure
===================== 3 failed, 13 passed in 12.85 seconds =====================
Daemon already running on PID 7
ERROR: Job failed: exit code 1
failed
level2:rpm:gstlal-inspiral Level2

Consider adjusting the PKG_CONFIG_PATH environment variable if you
installed software in a non-standard prefix.

Alternatively, you may set the environment variables GSTLAL_CFLAGS
and GSTLAL_LIBS to avoid the need to call pkg-config.
See the pkg-config man page for more details.
Daemon already running on PID 8
ERROR: Job failed: exit code 1
failed
level2:rpm:gstlal-burst Level2

Consider adjusting the PKG_CONFIG_PATH environment variable if you
installed software in a non-standard prefix.

Alternatively, you may set the environment variables GSTLAL_CFLAGS
and GSTLAL_LIBS to avoid the need to call pkg-config.
See the pkg-config man page for more details.
Daemon already running on PID 7
ERROR: Job failed: exit code 1
failed
level2:rpm:gstlal-calibration Level2

Consider adjusting the PKG_CONFIG_PATH environment variable if you
installed software in a non-standard prefix.

Alternatively, you may set the environment variables GSTLAL_CFLAGS
and GSTLAL_LIBS to avoid the need to call pkg-config.
See the pkg-config man page for more details.
Daemon already running on PID 7
ERROR: Job failed: exit code 1
failed
level1:rpm:gstlal-ugly Level1

Consider adjusting the PKG_CONFIG_PATH environment variable if you
installed software in a non-standard prefix.

Alternatively, you may set the environment variables GSTLAL_CFLAGS
and GSTLAL_LIBS to avoid the need to call pkg-config.
See the pkg-config man page for more details.
Daemon already running on PID 7
ERROR: Job failed: exit code 1
failed
level0:rpm:gstlal Level0
collect2: error: ld returned 1 exit status
2019-07-18 17:30:14,790:scangobj.py:execute_command:1196:WARNING:Linking scanner failed: 1, command: /bin/sh ../../libtool --tag=CC --mode=link gcc -std=gnu99 -lgobject-2.0 -lglib-2.0 -Wall -Wextra -Wno-missing-field-initializers -Wno-unused-parameter -O3 -fPIC -DMKL_ILP64 -m64 -I/opt/intel/compilers_and_libraries_2018.3.222/linux/mkl/include -I/builds/lscsoft/gstlal/opt/gstlal/include -no-undefined -l:libfftw3.so -l:libfftw3f.so -l:libfftw3_threads.so -l:libfftw3f_threads.so -L/builds/lscsoft/gstlal/opt/gstlal/lib -L/opt/intel/compilers_and_libraries_2018.3.222/linux/mkl/lib/intel64 -Wl,--no-as-needed -lmkl_intel_ilp64 -lmkl_sequential -lmkl_core -lpthread -lm -ldl gstlal-scan.lo -no-undefined -static ../../lib/gstlal/libgstlal.la ../../lib/gstlal/libgstlaltags.la ../../lib/gstlal/libgstlaltypes.la ../../gst/lal/libgstgstlal.la ../../gst/gst/libgstlal_adder.la -lgsl -lgslcblas -lm -lfftw3 -lfftw3f -llal -llalmetaio -llalsupport -llalsimulation -llalburst -llalinspiral -lgstallocators-1.0 -lgstbase-1.0 -lgstcontroller-1.0 -lgstreamer-1.0 -lgobject-2.0 -lglib-2.0 -l:libfftw3.so -l:libfftw3f.so -l:libfftw3_threads.so -l:libfftw3f_threads.so -L/builds/lscsoft/gstlal/opt/gstlal/lib -L/opt/intel/compilers_and_libraries_2018.3.222/linux/mkl/lib/intel64 -Wl,--no-as-needed -lmkl_intel_ilp64 -lmkl_sequential -lmkl_core -lpthread -lm -ldl -o gstlal-scan
make[2]: *** [scan-build.stamp] Error 1
make[2]: Leaving directory `/builds/lscsoft/gstlal/gstlal/doc/gobject'
make[1]: *** [all-recursive] Error 1
make[1]: Leaving directory `/builds/lscsoft/gstlal/gstlal/doc'
make: *** [all-recursive] Error 1
Daemon already running on PID 7
ERROR: Job failed: exit code 1