Fix import of another script

10 jobs for 23-job-failed-28908 in 35 minutes and 37 seconds (queued for 2 seconds)
Status Job ID Name Coverage
  Nightly
passed #29321
macos
nightly:macos

00:32:40

passed #29318
nightly:mpi:jessie

00:29:52

passed #29319
nightly:openmp:jessie

00:34:33

passed #29320
nightly:python3:stretch

00:35:35

failed #29316
allowed to fail
nightly:top-level:buster

00:20:26

passed #29317
nightly:top-level:clang

00:30:13

passed #29312
nightly:top-level:el7

00:32:42

passed #29313
nightly:top-level:stretch

00:35:25

passed #29314
nightly:top-level:trusty

00:27:06

passed #29315
nightly:top-level:xenial

00:29:00

 
Name Stage Failure
failed
nightly:top-level:buster Nightly
Makefile:403: recipe for target 'check-recursive' failed
make[2]: Leaving directory '/builds/lscsoft/lalsuite/lalsuite-6.48.1/_build/sub'
make[2]: *** [check-recursive] Error 1
make[1]: *** [check] Error 2
Makefile:677: recipe for target 'check' failed
make[1]: Leaving directory '/builds/lscsoft/lalsuite/lalsuite-6.48.1/_build/sub'
Makefile:594: recipe for target 'distcheck' failed
make: *** [distcheck] Error 1
ERROR: Job failed: exit code 1