Merge branch 'add-gcc-7-nightly-build-back' into 'master'

Revert "remove nightly build using gcc-7"

See merge request !1450
59 jobs for master in 122 minutes and 41 seconds (queued for 9 seconds)
Status Job ID Name Coverage
  .Pre
passed #1042830
make-dist

00:06:13

 
  Lal
passed #1042833
lal:conda:fftw

00:19:50

passed #1042834
lal:conda:mkl

00:21:17

passed #1042832
lal:deb

00:26:25

failed #1042831
lal:rpm

00:01:16

 
  Lal Frame
passed #1042837
lalframe:conda

00:14:26

passed #1042836
lalframe:deb

00:06:36

skipped #1042835
lalframe:rpm
 
  Lal Meta Io
passed #1042840
lalmetaio:conda

00:13:47

passed #1042839
lalmetaio:deb

00:06:57

skipped #1042838
lalmetaio:rpm
 
  Lal Simulation
passed #1042843
lalsimulation:conda

00:18:29

passed #1042842
lalsimulation:deb

00:17:25

skipped #1042841
lalsimulation:rpm
 
  Lal Burst
passed #1042846
lalburst:conda

00:18:27

passed #1042845
lalburst:deb

00:16:10

skipped #1042844
lalburst:rpm
 
  Lal Inspiral
passed #1042849
lalinspiral:conda

00:19:07

passed #1042848
lalinspiral:deb

00:13:35

skipped #1042847
lalinspiral:rpm
 
  Lal Pulsar
passed #1042852
lalpulsar:conda

00:18:31

passed #1042851
lalpulsar:deb

00:16:14

skipped #1042850
lalpulsar:rpm
 
  Lal Inference
passed #1042855
lalinference:conda

00:26:11

passed #1042854
lalinference:deb

00:14:23

skipped #1042853
lalinference:rpm
 
  Lal Apps
passed #1042858
lalapps:conda

00:14:10

passed #1042857
lalapps:deb

00:12:19

skipped #1042856
lalapps:rpm
 
  Lint
passed #1042860
lint:coala

00:01:48

passed #1042859
lint:python

00:01:10

 
  Integration Tests
passed #1042863
coverage

00:44:50

19.33%
skipped #1042861
lalinference_testjob
passed #1042862
top-level

00:34:55

 
  Compiler Tests
passed #1042864
clang:10

00:30:13

passed #1042865
clang:11

00:30:43

passed #1042866
clang:dev

00:28:34

passed #1042871
cuda

00:15:12

failed #1042870
allowed to fail
gcc:10

00:18:24

passed #1042867
gcc:7

00:26:29

passed #1042868
gcc:8

00:26:53

passed #1042869
gcc:9

00:27:58

 
  Platform Tests
failed #1042875
allowed to fail
platform:conda:linux

00:14:27

passed #1042872
platform:debian:buster

00:29:30

passed #1042873
macos_highsierra
platform:macos:highsierra

00:27:29

passed #1042874
macos_sierra
platform:macos:sierra

00:24:05

 
  Docker
skipped #1042876
docker:nightly:el7
passed #1042877
docker:nightly:stretch

00:05:18

 
  Wheels
passed #1042882
macos_sierra
wheel:cp36-cp36m-macosx

00:18:26

passed #1042878
wheel:cp36-cp36m-manylinux2014

00:16:04

passed #1042883
macos_sierra
wheel:cp37-cp37m-macosx

00:18:03

passed #1042879
wheel:cp37-cp37m-manylinux2014

00:16:07

passed #1042884
macos_sierra
wheel:cp38-cp38-macosx

00:17:55

passed #1042880
wheel:cp38-cp38-manylinux2014

00:13:46

failed #1042885
macos_sierra
wheel:cp39-cp39-macosx

00:21:32

failed #1042881
wheel:cp39-cp39-manylinux2014

00:21:32

 
  Deploy
skipped #1042887
deploy:wheel
passed #1042886
pages

00:05:49

passed pages:deploy

00:00:58

 
Name Stage Failure
failed
wheel:cp39-cp39-macosx Wheels
      File "/Users/gitlab/builds/62144ec5/0/lscsoft/lalsuite/test/lib/python3.9/site-packages/setuptools/installer.py", line 130, in fetch_build_egg
raise DistutilsError(str(e)) from e
distutils.errors.DistutilsError: Command '['/Users/gitlab/builds/62144ec5/0/lscsoft/lalsuite/test/bin/python', '-m', 'pip', '--disable-pip-version-check', 'wheel', '--no-deps', '-w', '/var/folders/jr/qn6jjc495d56nchhjm4lq8_00000gt/T/tmpp1dp4t69', '--quiet', 'cppy>=1.1.0']' returned non-zero exit status 1.
----------------------------------------
ERROR: Command errored out with exit status 1: python setup.py egg_info Check the logs for full command output.
WARNING: You are using pip version 20.2.3; however, version 20.2.4 is available.
You should consider upgrading via the '/Users/gitlab/builds/62144ec5/0/lscsoft/lalsuite/test/bin/python -m pip install --upgrade pip' command.
Cleaning up file based variables
ERROR: Job failed: exit status 1
failed
wheel:cp39-cp39-manylinux2014 Wheels
      File "/tmp/pip-build-env-bdv6ex6m/overlay/lib/python3.9/site-packages/numpy/distutils/core.py", line 137, in setup
config = configuration()
File "setup.py", line 477, in configuration
raise NotFoundError(msg)
numpy.distutils.system_info.NotFoundError: No lapack/blas resources found.
----------------------------------------
ERROR: Command errored out with exit status 1: /builds/lscsoft/lalsuite/test/bin/python /builds/lscsoft/lalsuite/test/lib/python3.9/site-packages/pip/_vendor/pep517/_in_process.py prepare_metadata_for_build_wheel /tmp/tmp273drpk8 Check the logs for full command output.
Cleaning up file based variables
ERROR: Job failed: exit code 1
failed
gcc:10 Compiler Tests
make[1]: *** [Makefile:693: check] Error 2
make[1]: Leaving directory '/builds/lscsoft/lalsuite/lalsuite-6.78.1/_build/sub'
make: *** [Makefile:615: distcheck] Error 1
Uploading artifacts for failed job
Uploading artifacts...
WARNING: */test/python/junit*.xml: no matching files
ERROR: No files to upload
Cleaning up file based variables
ERROR: Job failed: exit code 1
failed
platform:conda:linux Platform Tests
make[1]: *** [Makefile:415: check-recursive] Error 1
make[1]: Leaving directory '/builds/lscsoft/lalsuite'
make: *** [Makefile:689: check] Error 2
Uploading artifacts for failed job
Uploading artifacts...
*/test/python/junit*.xml: found 5 matching files and directories

Uploading artifacts as "junit" to coordinator... ok
id=1042875 responseStatus=201 Created token=dJkZAZ-L
Cleaning up file based variables
ERROR: Job failed: exit code 1
failed
lal:rpm Lal
WARNING: rpmbuild/BUILD/*/test/python/test-suite.log: no matching files 
WARNING: rpmbuild/RPMS/x86_64/lal-*.rpm: no matching files
WARNING: rpmbuild/RPMS/x86_64/python*-lal-*.rpm: no matching files
ERROR: No files to upload
Uploading artifacts...
WARNING: rpmbuild/BUILD/*/test/python/junit*.xml: no matching files
ERROR: No files to upload
Cleaning up file based variables
ERROR: Job failed: exit code 1