Merge branch 'doxygen' into 'master'

Various Doxygen fixes

See merge request !512
51 jobs for master in 52 minutes and 36 seconds (queued for 4 seconds)
Status Job ID Name Coverage
  Level0
passed #192715
level0:deb:lal

00:22:30

passed #192714
level0:rpm:lal

00:09:38

 
  Level1
passed #192720
level1:deb:lalframe

00:04:37

passed #192721
level1:deb:lalmetaio

00:05:04

passed #192722
level1:deb:lalsimulation

00:11:36

passed #192723
level1:deb:lalxml

00:02:44

passed #192716
level1:rpm:lalframe

00:02:12

passed #192717
level1:rpm:lalmetaio

00:02:22

passed #192718
level1:rpm:lalsimulation

00:04:27

passed #192719
level1:rpm:lalxml

00:01:36

 
  Level2
failed #192728
level2:deb:lalburst

00:02:35

passed #192729
level2:deb:lalinspiral

00:18:25

passed #192730
level2:deb:lalpulsar

00:15:31

passed #192731
level2:deb:lalstochastic

00:04:05

passed #192724
level2:rpm:lalburst

00:01:44

passed #192725
level2:rpm:lalinspiral

00:07:50

passed #192726
level2:rpm:lalpulsar

00:06:59

passed #192727
level2:rpm:lalstochastic

00:01:51

 
  Level3
skipped #192734
level3:deb:laldetchar
skipped #192735
level3:deb:lalinference
skipped #192732
level3:rpm:laldetchar
skipped #192733
level3:rpm:lalinference
 
  Level4
skipped #192737
level4:deb:lalapps
skipped #192736
level4:rpm:lalapps
 
  Docker
skipped #192738
docker:nightly:el7
skipped #192739
docker:nightly:stretch
 
  Nightly
skipped #192752
macos_elcapitan
nightly:macos:elcapitan
skipped #192751
macos_highsierra
nightly:macos:highsierra
skipped #192749
nightly:openmp:stretch
skipped #192750
nightly:python3:stretch
skipped #192745
nightly:top-level:bionic
skipped #192747
nightly:top-level:buster
skipped #192748
nightly:top-level:clang
skipped #192746
nightly:top-level:cosmic
skipped #192741
nightly:top-level:el7-cr
skipped #192740
nightly:top-level:jessie
skipped #192742
nightly:top-level:sl7
skipped #192743
nightly:top-level:trusty
skipped #192744
nightly:top-level:xenial
skipped #192753
pages
 
  Wheels
skipped #192760
macos_elcapitan
nightly:wheel:cp27-cp27m-macosx
skipped #192754
nightly:wheel:cp27-cp27m-manylinux1
skipped #192755
nightly:wheel:cp27-cp27mu-manylinux1
skipped #192756
nightly:wheel:cp34-cp34m-manylinux1
skipped #192761
macos_elcapitan
nightly:wheel:cp35-cp35m-macosx
skipped #192757
nightly:wheel:cp35-cp35m-manylinux1
skipped #192762
macos_elcapitan
nightly:wheel:cp36-cp36m-macosx
skipped #192758
nightly:wheel:cp36-cp36m-manylinux1
skipped #192763
macos_elcapitan
nightly:wheel:cp37-cp37m-macosx
skipped #192759
nightly:wheel:cp37-cp37m-manylinux1
 
  Deploy
skipped #192764
deploy:wheel
 
Name Stage Failure
failed
level2:deb:lalburst Level2
make[1]: Leaving directory '/builds/lscsoft/lalsuite/lalburst-1.5.0.1-dev20181022/.pybuild/pythonX.Y_3.5/build'
E: pybuild pybuild:283: test: plugin custom failed with: exit code=2: /usr/bin/make -C /builds/lscsoft/lalsuite/lalburst-1.5.0.1-dev20181022/.pybuild/pythonX.Y_3.5/build V=1 pythondir=/usr/lib/python3.5/dist-packages pyexecdir=/usr/lib/python3.5/dist-packages pkgpythondir=/usr/lib/python3.5/dist-packages/lalburst pkgpyexecdir=/usr/lib/python3.5/dist-packages/lalburst VERBOSE=1 check
dh_auto_test: pybuild --test -i python{version} -p 3.5 returned exit code 13
debian/lalsuite.mk:28: recipe for target 'build' failed
make: *** [build] Error 25
dpkg-buildpackage: error: debian/rules build gave error exit status 2
debuild: fatal error at line 1116:
dpkg-buildpackage -us -uc failed
ERROR: Job failed: exit code 1