Merge branch 'Weave-test-zero-peak-mem' into 'master'

Weave/TestSimulateSearch: skip memory test if peak memory not recorded

See merge request !760
46 jobs for master in 165 minutes and 28 seconds (queued for 4 seconds)
Status Job ID Name Coverage
  Level0
passed level0:deb:lal #315963

00:23:13

passed level0:rpm:lal #315962

00:09:50

 
  Level1
passed level1:deb:lalframe #315967

00:03:59

passed level1:deb:lalmetaio #315968

00:04:34

passed level1:deb:lalsimulation #315969

00:12:00

passed level1:rpm:lalframe #315964

00:01:50

passed level1:rpm:lalmetaio #315965

00:02:00

passed level1:rpm:lalsimulation #315966

00:04:10

 
  Level2
passed level2:deb:lalburst #315973

00:02:36

passed level2:deb:lalinspiral #315974

00:17:29

passed level2:deb:lalpulsar #315975

00:15:21

passed level2:rpm:lalburst #315970

00:01:26

passed level2:rpm:lalinspiral #315971

00:07:39

passed level2:rpm:lalpulsar #315972

00:07:14

 
  Level3
passed level3:deb:lalinference #315977

00:07:06

passed level3:rpm:lalinference #315976

00:05:42

 
  Level4
passed level4:deb:lalapps #315979

00:11:13

passed level4:rpm:lalapps #315978

00:06:15

 
  Docker
passed docker:nightly:el7 #315980

00:09:43

passed docker:nightly:stretch #315981

00:05:37

 
  Nightly
passed nightly:clang:7 #315982

00:41:18

passed nightly:clang:8 #315983

00:41:17

passed nightly:clang:9 #315984

00:41:19

failed nightly:debian:buster #315987
allowed to fail

00:03:35

passed nightly:gcc:7 #315985

00:36:37

passed nightly:gcc:8 #315986

00:37:26

passed nightly:macos:highsierra #315990
macos_highsierra

00:23:53

passed nightly:macos:sierra #315991
macos_sierra

00:26:27

passed nightly:rhel:el7-cr #315988

00:38:16

passed nightly:rhel:sl7 #315989

00:38:44

passed nightly:ubuntu:bionic #315993

00:39:04

failed nightly:ubuntu:cosmic #315994
allowed to fail

00:04:25

failed nightly:ubuntu:xenial #315992
allowed to fail

00:12:01

passed pages #315995

00:06:47

 
  Wheels
passed nightly:wheel:cp27-cp27m-macosx #316002
macos_sierra

00:21:01

passed nightly:wheel:cp27-cp27m-manylinux1 #315996

00:15:59

passed nightly:wheel:cp27-cp27mu-manylinux1 #315997

00:16:07

passed nightly:wheel:cp34-cp34m-manylinux1 #315998

00:18:11

passed nightly:wheel:cp35-cp35m-macosx #316003
macos_sierra

00:17:24

passed nightly:wheel:cp35-cp35m-manylinux1 #315999

00:16:32

passed nightly:wheel:cp36-cp36m-macosx #316004
macos_sierra

00:17:17

passed nightly:wheel:cp36-cp36m-manylinux1 #316000

00:16:40

passed nightly:wheel:cp37-cp37m-macosx #316005
macos_sierra

00:20:31

passed nightly:wheel:cp37-cp37m-manylinux1 #316001

00:16:35

 
  Deploy
passed deploy:wheel #316006

00:01:44

passed pages:deploy

00:00:22

 
Name Stage Failure
failed
nightly:ubuntu:xenial Nightly
make[2]: *** [all-recursive] Error 1
Makefile:416: recipe for target 'all-recursive' failed
make[2]: Leaving directory '/builds/lscsoft/lalsuite/lalsuite-6.53.1/_build/sub'
Makefile:353: recipe for target 'all' failed
make[1]: Leaving directory '/builds/lscsoft/lalsuite/lalsuite-6.53.1/_build/sub'
make[1]: *** [all] Error 2
Makefile:607: recipe for target 'distcheck' failed
make: *** [distcheck] Error 1
ERROR: Job failed: exit code 1
failed
nightly:ubuntu:cosmic Nightly
make[4]: Leaving directory '/builds/lscsoft/lalsuite/lalapps'
make[3]: *** [Makefile:744: distdir] Error 2
make[3]: Leaving directory '/builds/lscsoft/lalsuite/lalapps'
make[2]: *** [Makefile:508: distdir-am] Error 1
make[2]: Leaving directory '/builds/lscsoft/lalsuite'
make[1]: *** [Makefile:502: distdir] Error 2
make[1]: Leaving directory '/builds/lscsoft/lalsuite'
make: *** [Makefile:603: dist] Error 2
ERROR: Job failed: exit code 1
failed
nightly:debian:buster Nightly
make[4]: Leaving directory '/builds/lscsoft/lalsuite/lalapps'
make[3]: *** [Makefile:744: distdir] Error 2
make[3]: Leaving directory '/builds/lscsoft/lalsuite/lalapps'
make[2]: *** [Makefile:508: distdir-am] Error 1
make[2]: Leaving directory '/builds/lscsoft/lalsuite'
make[1]: *** [Makefile:502: distdir] Error 2
make[1]: Leaving directory '/builds/lscsoft/lalsuite'
make: *** [Makefile:603: dist] Error 2
ERROR: Job failed: exit code 1