Merge branch 'add-to-codeowners' into 'master'

Add to codeowners

See merge request !842
49 jobs for master in 185 minutes and 3 seconds (queued for 4 seconds)
Status Job ID Name Coverage
  Level0
passed #375123
level0:deb:lal

00:22:55

passed #375122
level0:rpm:lal

00:09:00

 
  Level1
passed #375127
level1:deb:lalframe

00:03:57

passed #375128
level1:deb:lalmetaio

00:04:32

passed #375129
level1:deb:lalsimulation

00:11:40

passed #375124
level1:rpm:lalframe

00:01:52

passed #375125
level1:rpm:lalmetaio

00:01:58

passed #375126
level1:rpm:lalsimulation

00:04:10

 
  Level2
passed #375133
level2:deb:lalburst

00:02:38

passed #375134
level2:deb:lalinspiral

00:15:31

passed #375135
level2:deb:lalpulsar

00:14:57

passed #375130
level2:rpm:lalburst

00:01:29

passed #375131
level2:rpm:lalinspiral

00:06:33

passed #375132
level2:rpm:lalpulsar

00:06:50

 
  Level3
passed #375137
level3:deb:lalinference

00:07:17

passed #375136
level3:rpm:lalinference

00:05:45

 
  Level4
passed #375139
level4:deb:lalapps

00:11:24

passed #375138
level4:rpm:lalapps

00:06:00

 
  Docker
passed #375140
docker:nightly:el7

00:08:52

passed #375141
docker:nightly:stretch

00:05:16

 
  Nightly
failed #375148
allowed to fail
conda:python27

00:29:02

failed #375149
allowed to fail
conda:python36

00:28:31

failed #375150
allowed to fail
conda:python37

00:25:41

passed #375142
nightly:clang:7

00:37:15

passed #375143
nightly:clang:8

00:37:22

passed #375144
nightly:clang:9

00:37:21

failed #375151
allowed to fail
nightly:debian:buster

00:05:13

passed #375145
nightly:gcc:7

00:33:26

passed #375146
nightly:gcc:8

00:34:33

failed #375147
allowed to fail
nightly:gcc:9

00:23:43

passed #375153
macos_highsierra
nightly:macos:highsierra

00:23:13

passed #375154
macos_sierra
nightly:macos:sierra

00:23:20

passed #375152
nightly:rhel:el7-cr

00:34:56

passed #375156
nightly:ubuntu:bionic

00:35:58

failed #375157
allowed to fail
nightly:ubuntu:cosmic

00:06:00

failed #375155
allowed to fail
nightly:ubuntu:xenial

00:12:51

passed #375158
pages

00:07:45

 
  Wheels
passed #375165
macos_sierra
nightly:wheel:cp27-cp27m-macosx

00:17:12

passed #375159
nightly:wheel:cp27-cp27m-manylinux1

00:14:45

passed #375160
nightly:wheel:cp27-cp27mu-manylinux1

00:15:06

passed #375161
nightly:wheel:cp34-cp34m-manylinux1

00:16:30

passed #375166
macos_sierra
nightly:wheel:cp35-cp35m-macosx

00:17:00

passed #375162
nightly:wheel:cp35-cp35m-manylinux1

00:15:11

passed #375167
macos_sierra
nightly:wheel:cp36-cp36m-macosx

00:16:59

passed #375163
nightly:wheel:cp36-cp36m-manylinux1

00:14:56

passed #375168
macos_sierra
nightly:wheel:cp37-cp37m-macosx

00:16:46

passed #375164
nightly:wheel:cp37-cp37m-manylinux1

00:15:17

 
  Deploy
passed #375169
deploy:wheel

00:01:56

passed pages:deploy

00:00:23

 
Name Stage Failure
failed
conda:python27 Nightly
make[1]: Leaving directory '/builds/lscsoft/lalsuite/lalsuite-6.57.1/_build/sub'
make: *** [Makefile:611: distcheck] Error 1
Uploading artifacts...
config.log: found 1 matching files
*/config.log: found 9 matching files

WARNING: */test/test-suite.log: no matching files
*/*/*/*/test/test-suite.log: found 6 matching files

Uploading artifacts to coordinator... ok
id=375148 responseStatus=201 Created token=-df6RhVx
ERROR: Job failed: exit code 1
failed
conda:python36 Nightly
make[1]: Leaving directory '/builds/lscsoft/lalsuite/lalsuite-6.57.1/_build/sub'
make: *** [Makefile:611: distcheck] Error 1
Uploading artifacts...
config.log: found 1 matching files
*/config.log: found 9 matching files

WARNING: */test/test-suite.log: no matching files
*/*/*/*/test/test-suite.log: found 6 matching files

Uploading artifacts to coordinator... ok
id=375149 responseStatus=201 Created token=kTaMyENV
ERROR: Job failed: exit code 1
failed
conda:python37 Nightly
make[1]: Leaving directory '/builds/lscsoft/lalsuite/lalsuite-6.57.1/_build/sub'
make: *** [Makefile:611: distcheck] Error 1
Uploading artifacts...
config.log: found 1 matching files
*/config.log: found 9 matching files

WARNING: */test/test-suite.log: no matching files
*/*/*/*/test/test-suite.log: found 6 matching files

Uploading artifacts to coordinator... ok
id=375150 responseStatus=201 Created token=1wCPK5ez
ERROR: Job failed: exit code 1
failed
nightly:gcc:9 Nightly
make[2]: *** [check-recursive] Error 1
Makefile:416: recipe for target 'check-recursive' failed
make[2]: Leaving directory '/builds/lscsoft/lalsuite/lalsuite-6.57.1/_build/sub'
Makefile:690: recipe for target 'check' failed
make[1]: Leaving directory '/builds/lscsoft/lalsuite/lalsuite-6.57.1/_build/sub'
make[1]: *** [check] Error 2
make: *** [distcheck] Error 1
Makefile:607: recipe for target 'distcheck' failed
ERROR: Job failed: exit code 1
failed
nightly:ubuntu:xenial Nightly
Makefile:416: recipe for target 'all-recursive' failed
make[2]: Leaving directory '/builds/lscsoft/lalsuite/lalsuite-6.57.1/_build/sub'
make[2]: *** [all-recursive] Error 1
make[1]: *** [all] Error 2
Makefile:353: recipe for target 'all' failed
make[1]: Leaving directory '/builds/lscsoft/lalsuite/lalsuite-6.57.1/_build/sub'
Makefile:607: recipe for target 'distcheck' failed
make: *** [distcheck] Error 1
ERROR: Job failed: exit code 1
failed
nightly:ubuntu:cosmic Nightly
make[4]: *** [Makefile:750: distdir-am] Error 1
make[3]: *** [Makefile:744: distdir] Error 2
make[3]: Leaving directory '/builds/lscsoft/lalsuite/lalapps'
make[2]: Leaving directory '/builds/lscsoft/lalsuite'
make[2]: *** [Makefile:508: distdir-am] Error 1
make[1]: *** [Makefile:502: distdir] Error 2
make[1]: Leaving directory '/builds/lscsoft/lalsuite'
make: *** [Makefile:603: dist] Error 2
ERROR: Job failed: exit code 1
failed
nightly:debian:buster Nightly
make[4]: Leaving directory '/builds/lscsoft/lalsuite/lalapps'
make[3]: *** [Makefile:744: distdir] Error 2
make[3]: Leaving directory '/builds/lscsoft/lalsuite/lalapps'
make[2]: Leaving directory '/builds/lscsoft/lalsuite'
make[2]: *** [Makefile:508: distdir-am] Error 1
make[1]: *** [Makefile:502: distdir] Error 2
make[1]: Leaving directory '/builds/lscsoft/lalsuite'
make: *** [Makefile:603: dist] Error 2
ERROR: Job failed: exit code 1