Maintenance will be performed on git.ligo.org, chat.ligo.org, containers.ligo.org, and docs.ligo.org on Tuesday 22nd September 2020 starting at approximately 9am MST.It is expected to take around 15 minutes and there will be a short period of downtime towards the end of the maintenance window. Please address any comments, questions, or concerns to computing-help@igwn.org.

Merge branch 'merge-release-branch' into 'master'

Merge release branch

See merge request !841
49 jobs for master in 115 minutes and 5 seconds (queued for 4 seconds)
Status Job ID Name Coverage
  Level0
passed #376127
level0:deb:lal

00:22:19

passed #376126
level0:rpm:lal

00:09:17

 
  Level1
passed #376131
level1:deb:lalframe

00:03:57

passed #376132
level1:deb:lalmetaio

00:04:32

passed #376133
level1:deb:lalsimulation

00:11:41

passed #376128
level1:rpm:lalframe

00:01:51

passed #376129
level1:rpm:lalmetaio

00:02:00

passed #376130
level1:rpm:lalsimulation

00:04:12

 
  Level2
passed #376137
level2:deb:lalburst

00:02:38

passed #376138
level2:deb:lalinspiral

00:15:23

passed #376139
level2:deb:lalpulsar

00:14:55

passed #376134
level2:rpm:lalburst

00:01:29

passed #376135
level2:rpm:lalinspiral

00:06:31

passed #376136
level2:rpm:lalpulsar

00:06:55

 
  Level3
passed #376141
level3:deb:lalinference

00:07:51

passed #376140
level3:rpm:lalinference

00:06:23

 
  Level4
passed #376143
level4:deb:lalapps

00:11:34

passed #376142
level4:rpm:lalapps

00:06:08

 
  Docker
passed #376144
docker:nightly:el7

00:09:01

passed #376145
docker:nightly:stretch

00:05:23

 
  Nightly
failed #376152
allowed to fail
conda:python27

00:29:41

failed #376153
allowed to fail
conda:python36

00:30:36

failed #376154
allowed to fail
conda:python37

00:25:16

failed #376146
nightly:clang:7

00:26:11

passed #376147
nightly:clang:8

00:37:07

passed #376148
nightly:clang:9

00:36:49

failed #376155
allowed to fail
nightly:debian:buster

00:05:08

passed #376149
nightly:gcc:7

00:33:26

passed #376150
nightly:gcc:8

00:34:08

failed #376151
allowed to fail
nightly:gcc:9

00:23:35

passed #376157
macos_highsierra
nightly:macos:highsierra

00:23:29

passed #376158
macos_sierra
nightly:macos:sierra

00:23:25

passed #376156
nightly:rhel:el7-cr

00:34:45

passed #376160
nightly:ubuntu:bionic

00:35:44

failed #376161
allowed to fail
nightly:ubuntu:cosmic

00:06:19

failed #376159
allowed to fail
nightly:ubuntu:xenial

00:14:35

passed #376162
pages

00:07:35

 
  Wheels
skipped #376169
macos_sierra
nightly:wheel:cp27-cp27m-macosx
skipped #376163
nightly:wheel:cp27-cp27m-manylinux1
skipped #376164
nightly:wheel:cp27-cp27mu-manylinux1
skipped #376165
nightly:wheel:cp34-cp34m-manylinux1
skipped #376170
macos_sierra
nightly:wheel:cp35-cp35m-macosx
skipped #376166
nightly:wheel:cp35-cp35m-manylinux1
skipped #376171
macos_sierra
nightly:wheel:cp36-cp36m-macosx
skipped #376167
nightly:wheel:cp36-cp36m-manylinux1
skipped #376172
macos_sierra
nightly:wheel:cp37-cp37m-macosx
skipped #376168
nightly:wheel:cp37-cp37m-manylinux1
 
  Deploy
skipped #376173
deploy:wheel
passed pages:deploy

00:00:18

 
Name Stage Failure
failed
conda:python36 Nightly
make[1]: Leaving directory '/builds/lscsoft/lalsuite/lalsuite-6.58.1/_build/sub'
make: *** [Makefile:611: distcheck] Error 1
Uploading artifacts...
config.log: found 1 matching files
*/config.log: found 9 matching files

WARNING: */test/test-suite.log: no matching files
*/*/*/*/test/test-suite.log: found 6 matching files

Uploading artifacts to coordinator... ok
id=376153 responseStatus=201 Created token=su8YdByr
ERROR: Job failed: exit code 1
failed
conda:python27 Nightly
make[1]: Leaving directory '/builds/lscsoft/lalsuite/lalsuite-6.58.1/_build/sub'
make: *** [Makefile:611: distcheck] Error 1
Uploading artifacts...
config.log: found 1 matching files
*/config.log: found 9 matching files

WARNING: */test/test-suite.log: no matching files
*/*/*/*/test/test-suite.log: found 6 matching files

Uploading artifacts to coordinator... ok
id=376152 responseStatus=201 Created token=shp1eiVB
ERROR: Job failed: exit code 1
failed
nightly:clang:7 Nightly
Makefile:416: recipe for target 'check-recursive' failed
make[2]: Leaving directory '/builds/lscsoft/lalsuite/lalsuite-6.58.1/_build/sub'
make[2]: *** [check-recursive] Error 1
Makefile:690: recipe for target 'check' failed
make[1]: Leaving directory '/builds/lscsoft/lalsuite/lalsuite-6.58.1/_build/sub'
make[1]: *** [check] Error 2
make: *** [distcheck] Error 1
Makefile:607: recipe for target 'distcheck' failed
ERROR: Job failed: exit code 1
failed
conda:python37 Nightly
make[1]: Leaving directory '/builds/lscsoft/lalsuite/lalsuite-6.58.1/_build/sub'
make: *** [Makefile:611: distcheck] Error 1
Uploading artifacts...
config.log: found 1 matching files
*/config.log: found 9 matching files

WARNING: */test/test-suite.log: no matching files
*/*/*/*/test/test-suite.log: found 6 matching files

Uploading artifacts to coordinator... ok
id=376154 responseStatus=201 Created token=3Ur5pA_t
ERROR: Job failed: exit code 1
failed
nightly:gcc:9 Nightly
make[2]: *** [check-recursive] Error 1
Makefile:416: recipe for target 'check-recursive' failed
make[2]: Leaving directory '/builds/lscsoft/lalsuite/lalsuite-6.58.1/_build/sub'
Makefile:690: recipe for target 'check' failed
make[1]: Leaving directory '/builds/lscsoft/lalsuite/lalsuite-6.58.1/_build/sub'
make[1]: *** [check] Error 2
Makefile:607: recipe for target 'distcheck' failed
make: *** [distcheck] Error 1
ERROR: Job failed: exit code 1
failed
nightly:ubuntu:xenial Nightly
Makefile:416: recipe for target 'all-recursive' failed
make[2]: Leaving directory '/builds/lscsoft/lalsuite/lalsuite-6.58.1/_build/sub'
make[2]: *** [all-recursive] Error 1
Makefile:353: recipe for target 'all' failed
make[1]: Leaving directory '/builds/lscsoft/lalsuite/lalsuite-6.58.1/_build/sub'
make[1]: *** [all] Error 2
Makefile:607: recipe for target 'distcheck' failed
make: *** [distcheck] Error 1
ERROR: Job failed: exit code 1
failed
nightly:ubuntu:cosmic Nightly
make[4]: Leaving directory '/builds/lscsoft/lalsuite/lalapps'
make[3]: *** [Makefile:744: distdir] Error 2
make[3]: Leaving directory '/builds/lscsoft/lalsuite/lalapps'
make[2]: *** [Makefile:508: distdir-am] Error 1
make[2]: Leaving directory '/builds/lscsoft/lalsuite'
make[1]: *** [Makefile:502: distdir] Error 2
make[1]: Leaving directory '/builds/lscsoft/lalsuite'
make: *** [Makefile:603: dist] Error 2
ERROR: Job failed: exit code 1
failed
nightly:debian:buster Nightly
make[4]: *** [Makefile:750: distdir-am] Error 1
make[3]: *** [Makefile:744: distdir] Error 2
make[3]: Leaving directory '/builds/lscsoft/lalsuite/lalapps'
make[2]: *** [Makefile:508: distdir-am] Error 1
make[2]: Leaving directory '/builds/lscsoft/lalsuite'
make[1]: *** [Makefile:502: distdir] Error 2
make[1]: Leaving directory '/builds/lscsoft/lalsuite'
make: *** [Makefile:603: dist] Error 2
ERROR: Job failed: exit code 1