Merge branch 'merge-release-branch' into 'master'

Merge release branch

See merge request !852
49 jobs for master in 183 minutes and 41 seconds (queued for 5 seconds)
Status Job ID Name Coverage
  Level0
passed #376904
level0:deb:lal

00:22:22

passed #376903
level0:rpm:lal

00:09:41

 
  Level1
passed #376908
level1:deb:lalframe

00:03:59

passed #376909
level1:deb:lalmetaio

00:04:33

passed #376910
level1:deb:lalsimulation

00:11:42

passed #376905
level1:rpm:lalframe

00:01:52

passed #376906
level1:rpm:lalmetaio

00:02:00

passed #376907
level1:rpm:lalsimulation

00:04:11

 
  Level2
passed #376914
level2:deb:lalburst

00:02:38

passed #376915
level2:deb:lalinspiral

00:15:07

passed #376916
level2:deb:lalpulsar

00:14:55

passed #376911
level2:rpm:lalburst

00:01:29

passed #376912
level2:rpm:lalinspiral

00:06:28

passed #376913
level2:rpm:lalpulsar

00:06:54

 
  Level3
passed #376918
level3:deb:lalinference

00:07:06

passed #376917
level3:rpm:lalinference

00:05:45

 
  Level4
passed #376920
level4:deb:lalapps

00:11:28

passed #376919
level4:rpm:lalapps

00:06:06

 
  Docker
passed #376921
docker:nightly:el7

00:08:47

passed #376922
docker:nightly:stretch

00:05:06

 
  Nightly
failed #376929
allowed to fail
conda:python27

00:29:22

failed #376930
allowed to fail
conda:python36

00:29:41

failed #376931
allowed to fail
conda:python37

00:25:09

passed #376923
nightly:clang:7

00:37:11

passed #376924
nightly:clang:8

00:37:04

passed #376925
nightly:clang:9

00:37:25

failed #376932
allowed to fail
nightly:debian:buster

00:05:22

passed #376926
nightly:gcc:7

00:33:46

passed #376927
nightly:gcc:8

00:34:07

failed #376928
allowed to fail
nightly:gcc:9

00:23:40

passed #376934
macos_highsierra
nightly:macos:highsierra

00:23:01

passed #376935
macos_sierra
nightly:macos:sierra

00:23:22

passed #376933
nightly:rhel:el7-cr

00:35:13

passed #376937
nightly:ubuntu:bionic

00:34:43

failed #376938
allowed to fail
nightly:ubuntu:cosmic

00:05:29

failed #376936
allowed to fail
nightly:ubuntu:xenial

00:12:31

passed #376939
pages

00:06:37

 
  Wheels
passed #376946
macos_sierra
nightly:wheel:cp27-cp27m-macosx

00:17:16

passed #376940
nightly:wheel:cp27-cp27m-manylinux1

00:14:59

passed #376941
nightly:wheel:cp27-cp27mu-manylinux1

00:15:06

passed #376942
nightly:wheel:cp34-cp34m-manylinux1

00:16:32

passed #376947
macos_sierra
nightly:wheel:cp35-cp35m-macosx

00:16:54

passed #376943
nightly:wheel:cp35-cp35m-manylinux1

00:14:59

passed #376948
macos_sierra
nightly:wheel:cp36-cp36m-macosx

00:17:10

passed #376944
nightly:wheel:cp36-cp36m-manylinux1

00:14:55

passed #376949
macos_sierra
nightly:wheel:cp37-cp37m-macosx

00:16:51

passed #376945
nightly:wheel:cp37-cp37m-manylinux1

00:15:05

 
  Deploy
passed #376950
deploy:wheel

00:01:23

passed pages:deploy

00:00:17

 
Name Stage Failure
failed
conda:python36 Nightly
make[1]: Leaving directory '/builds/lscsoft/lalsuite/lalsuite-6.59.1/_build/sub'
make: *** [Makefile:611: distcheck] Error 1
Uploading artifacts...
config.log: found 1 matching files
*/config.log: found 9 matching files

WARNING: */test/test-suite.log: no matching files
*/*/*/*/test/test-suite.log: found 6 matching files

Uploading artifacts to coordinator... ok
id=376930 responseStatus=201 Created token=GEyUNUjZ
ERROR: Job failed: exit code 1
failed
conda:python27 Nightly
make[1]: Leaving directory '/builds/lscsoft/lalsuite/lalsuite-6.59.1/_build/sub'
make: *** [Makefile:611: distcheck] Error 1
Uploading artifacts...
config.log: found 1 matching files
*/config.log: found 9 matching files

WARNING: */test/test-suite.log: no matching files
*/*/*/*/test/test-suite.log: found 6 matching files

Uploading artifacts to coordinator... ok
id=376929 responseStatus=201 Created token=_3pzoXkB
ERROR: Job failed: exit code 1
failed
conda:python37 Nightly
make[1]: Leaving directory '/builds/lscsoft/lalsuite/lalsuite-6.59.1/_build/sub'
make: *** [Makefile:611: distcheck] Error 1
Uploading artifacts...
config.log: found 1 matching files
*/config.log: found 9 matching files

WARNING: */test/test-suite.log: no matching files
*/*/*/*/test/test-suite.log: found 6 matching files

Uploading artifacts to coordinator... ok
id=376931 responseStatus=201 Created token=-J22s2HA
ERROR: Job failed: exit code 1
failed
nightly:gcc:9 Nightly
make[2]: *** [check-recursive] Error 1
Makefile:416: recipe for target 'check-recursive' failed
make[2]: Leaving directory '/builds/lscsoft/lalsuite/lalsuite-6.59.1/_build/sub'
make[1]: *** [check] Error 2
Makefile:690: recipe for target 'check' failed
make[1]: Leaving directory '/builds/lscsoft/lalsuite/lalsuite-6.59.1/_build/sub'
Makefile:607: recipe for target 'distcheck' failed
make: *** [distcheck] Error 1
ERROR: Job failed: exit code 1
failed
nightly:ubuntu:xenial Nightly
Makefile:416: recipe for target 'all-recursive' failed
make[2]: *** [all-recursive] Error 1
make[2]: Leaving directory '/builds/lscsoft/lalsuite/lalsuite-6.59.1/_build/sub'
Makefile:353: recipe for target 'all' failed
make[1]: *** [all] Error 2
make[1]: Leaving directory '/builds/lscsoft/lalsuite/lalsuite-6.59.1/_build/sub'
make: *** [distcheck] Error 1
Makefile:607: recipe for target 'distcheck' failed
ERROR: Job failed: exit code 1
failed
nightly:ubuntu:cosmic Nightly
make[4]: *** [Makefile:750: distdir-am] Error 1
make[3]: *** [Makefile:744: distdir] Error 2
make[3]: Leaving directory '/builds/lscsoft/lalsuite/lalapps'
make[2]: *** [Makefile:508: distdir-am] Error 1
make[2]: Leaving directory '/builds/lscsoft/lalsuite'
make[1]: *** [Makefile:502: distdir] Error 2
make[1]: Leaving directory '/builds/lscsoft/lalsuite'
make: *** [Makefile:603: dist] Error 2
ERROR: Job failed: exit code 1
failed
nightly:debian:buster Nightly
make[4]: Leaving directory '/builds/lscsoft/lalsuite/lalapps'
make[3]: *** [Makefile:744: distdir] Error 2
make[3]: Leaving directory '/builds/lscsoft/lalsuite/lalapps'
make[2]: *** [Makefile:508: distdir-am] Error 1
make[2]: Leaving directory '/builds/lscsoft/lalsuite'
make[1]: *** [Makefile:502: distdir] Error 2
make[1]: Leaving directory '/builds/lscsoft/lalsuite'
make: *** [Makefile:603: dist] Error 2
ERROR: Job failed: exit code 1