Merge branch 'BinarySSBTimesTest-relax-tolerance' into 'master'

BinarySSBTimesTest: relax tolerance to 1e-9

Closes #175

See merge request !853
49 jobs for master in 184 minutes and 35 seconds (queued for 7 seconds)
Status Job ID Name Coverage
  Level0
passed #380439
level0:deb:lal

00:22:33

passed #380438
level0:rpm:lal

00:09:32

 
  Level1
passed #380443
level1:deb:lalframe

00:04:04

passed #380444
level1:deb:lalmetaio

00:04:38

passed #380445
level1:deb:lalsimulation

00:11:55

passed #380440
level1:rpm:lalframe

00:01:53

passed #380441
level1:rpm:lalmetaio

00:02:00

passed #380442
level1:rpm:lalsimulation

00:04:13

 
  Level2
passed #380449
level2:deb:lalburst

00:02:40

passed #380450
level2:deb:lalinspiral

00:15:12

passed #380451
level2:deb:lalpulsar

00:14:58

passed #380446
level2:rpm:lalburst

00:01:28

passed #380447
level2:rpm:lalinspiral

00:06:29

passed #380448
level2:rpm:lalpulsar

00:06:56

 
  Level3
passed #380453
level3:deb:lalinference

00:07:09

passed #380452
level3:rpm:lalinference

00:05:45

 
  Level4
passed #380455
level4:deb:lalapps

00:11:39

passed #380454
level4:rpm:lalapps

00:06:11

 
  Docker
passed #380456
docker:nightly:el7

00:09:06

passed #380457
docker:nightly:stretch

00:05:14

 
  Nightly
failed #380464
allowed to fail
conda:python27

00:28:48

failed #380465
allowed to fail
conda:python36

00:28:03

failed #380466
allowed to fail
conda:python37

00:22:54

passed #380458
nightly:clang:7

00:36:40

passed #380459
nightly:clang:8

00:36:50

passed #380460
nightly:clang:9

00:36:48

failed #380467
allowed to fail
nightly:debian:buster

00:06:50

passed #380461
nightly:gcc:7

00:33:31

passed #380462
nightly:gcc:8

00:34:08

failed #380463
allowed to fail
nightly:gcc:9

00:23:15

passed #380469
macos_highsierra
nightly:macos:highsierra

00:23:07

passed #380470
macos_sierra
nightly:macos:sierra

00:23:24

passed #380468
nightly:rhel:el7-cr

00:35:57

passed #380472
nightly:ubuntu:bionic

00:36:00

failed #380473
allowed to fail
nightly:ubuntu:cosmic

00:06:07

failed #380471
allowed to fail
nightly:ubuntu:xenial

00:13:11

passed #380474
pages

00:08:04

 
  Wheels
passed #380481
macos_sierra
nightly:wheel:cp27-cp27m-macosx

00:17:15

passed #380475
nightly:wheel:cp27-cp27m-manylinux1

00:14:53

passed #380476
nightly:wheel:cp27-cp27mu-manylinux1

00:15:19

passed #380477
nightly:wheel:cp34-cp34m-manylinux1

00:16:44

passed #380482
macos_sierra
nightly:wheel:cp35-cp35m-macosx

00:16:52

passed #380478
nightly:wheel:cp35-cp35m-manylinux1

00:15:15

passed #380483
macos_sierra
nightly:wheel:cp36-cp36m-macosx

00:17:26

passed #380479
nightly:wheel:cp36-cp36m-manylinux1

00:15:15

passed #380484
macos_sierra
nightly:wheel:cp37-cp37m-macosx

00:16:56

passed #380480
nightly:wheel:cp37-cp37m-manylinux1

00:15:39

 
  Deploy
passed #380485
deploy:wheel

00:01:34

passed pages:deploy

00:00:19

 
Name Stage Failure
failed
conda:python27 Nightly
make[1]: *** [Makefile:689: check] Error 2
make: *** [Makefile:611: distcheck] Error 1
Uploading artifacts...
config.log: found 1 matching files
*/config.log: found 9 matching files

WARNING: */test/test-suite.log: no matching files
WARNING: */*/*/*/test/test-suite.log: no matching files
Uploading artifacts to coordinator... ok
id=380464 responseStatus=201 Created token=oiyRHp3q
ERROR: Job failed: exit code 1
failed
conda:python36 Nightly
make[1]: Leaving directory '/builds/lscsoft/lalsuite/lalsuite-6.59.1/_build/sub'
make: *** [Makefile:611: distcheck] Error 1
Uploading artifacts...
config.log: found 1 matching files
*/config.log: found 9 matching files

WARNING: */test/test-suite.log: no matching files
WARNING: */*/*/*/test/test-suite.log: no matching files
Uploading artifacts to coordinator... ok
id=380465 responseStatus=201 Created token=ktsy23T_
ERROR: Job failed: exit code 1
failed
nightly:gcc:9 Nightly
Makefile:416: recipe for target 'check-recursive' failed
make[2]: Leaving directory '/builds/lscsoft/lalsuite/lalsuite-6.59.1/_build/sub'
make[2]: *** [check-recursive] Error 1
Makefile:690: recipe for target 'check' failed
make[1]: Leaving directory '/builds/lscsoft/lalsuite/lalsuite-6.59.1/_build/sub'
make[1]: *** [check] Error 2
make: *** [distcheck] Error 1
Makefile:607: recipe for target 'distcheck' failed
ERROR: Job failed: exit code 1
failed
conda:python37 Nightly
make[1]: Leaving directory '/builds/lscsoft/lalsuite/lalsuite-6.59.1/_build/sub'
make: *** [Makefile:611: distcheck] Error 1
Uploading artifacts...
config.log: found 1 matching files
*/config.log: found 9 matching files

WARNING: */test/test-suite.log: no matching files
WARNING: */*/*/*/test/test-suite.log: no matching files
Uploading artifacts to coordinator... ok
id=380466 responseStatus=201 Created token=yNiknuze
ERROR: Job failed: exit code 1
failed
nightly:ubuntu:xenial Nightly
make[2]: *** [all-recursive] Error 1
Makefile:416: recipe for target 'all-recursive' failed
make[2]: Leaving directory '/builds/lscsoft/lalsuite/lalsuite-6.59.1/_build/sub'
Makefile:353: recipe for target 'all' failed
make[1]: *** [all] Error 2
make[1]: Leaving directory '/builds/lscsoft/lalsuite/lalsuite-6.59.1/_build/sub'
make: *** [distcheck] Error 1
Makefile:607: recipe for target 'distcheck' failed
ERROR: Job failed: exit code 1
failed
nightly:debian:buster Nightly
make[4]: Leaving directory '/builds/lscsoft/lalsuite/lalapps'
make[3]: *** [Makefile:744: distdir] Error 2
make[3]: Leaving directory '/builds/lscsoft/lalsuite/lalapps'
make[2]: *** [Makefile:508: distdir-am] Error 1
make[2]: Leaving directory '/builds/lscsoft/lalsuite'
make[1]: *** [Makefile:502: distdir] Error 2
make[1]: Leaving directory '/builds/lscsoft/lalsuite'
make: *** [Makefile:603: dist] Error 2
ERROR: Job failed: exit code 1
failed
nightly:ubuntu:cosmic Nightly
make[4]: Leaving directory '/builds/lscsoft/lalsuite/lalapps'
make[3]: *** [Makefile:744: distdir] Error 2
make[3]: Leaving directory '/builds/lscsoft/lalsuite/lalapps'
make[2]: Leaving directory '/builds/lscsoft/lalsuite'
make[2]: *** [Makefile:508: distdir-am] Error 1
make[1]: Leaving directory '/builds/lscsoft/lalsuite'
make[1]: *** [Makefile:502: distdir] Error 2
make: *** [Makefile:603: dist] Error 2
ERROR: Job failed: exit code 1