Merge branch 'import_numpy' into 'master'

lalinference_pipe.py: import numpy necessary for roq bin selection

See merge request !859
49 jobs for master in 188 minutes and 50 seconds (queued for 7 seconds)
Status Job ID Name Coverage
  Level0
passed #381931
level0:deb:lal

00:23:47

passed #381930
level0:rpm:lal

00:09:52

 
  Level1
passed #381935
level1:deb:lalframe

00:04:11

passed #381936
level1:deb:lalmetaio

00:04:47

passed #381937
level1:deb:lalsimulation

00:12:13

passed #381932
level1:rpm:lalframe

00:01:59

passed #381933
level1:rpm:lalmetaio

00:02:04

passed #381934
level1:rpm:lalsimulation

00:04:31

 
  Level2
passed #381941
level2:deb:lalburst

00:02:48

passed #381942
level2:deb:lalinspiral

00:15:35

passed #381943
level2:deb:lalpulsar

00:15:17

passed #381938
level2:rpm:lalburst

00:01:33

passed #381939
level2:rpm:lalinspiral

00:06:52

passed #381940
level2:rpm:lalpulsar

00:07:25

 
  Level3
passed #381945
level3:deb:lalinference

00:07:03

passed #381944
level3:rpm:lalinference

00:05:45

 
  Level4
passed #381947
level4:deb:lalapps

00:11:13

passed #381946
level4:rpm:lalapps

00:06:01

 
  Docker
passed #381948
docker:nightly:el7

00:08:49

passed #381949
docker:nightly:stretch

00:05:14

 
  Nightly
failed #381956
allowed to fail
conda:python27

00:29:00

failed #381957
allowed to fail
conda:python36

00:26:44

failed #381958
allowed to fail
conda:python37

00:23:26

passed #381950
nightly:clang:7

00:39:25

passed #381951
nightly:clang:8

00:39:18

passed #381952
nightly:clang:9

00:39:16

failed #381959
allowed to fail
nightly:debian:buster

00:05:21

passed #381953
nightly:gcc:7

00:35:32

passed #381954
nightly:gcc:8

00:36:36

failed #381955
allowed to fail
nightly:gcc:9

00:24:46

passed #381961
macos_highsierra
nightly:macos:highsierra

00:23:13

passed #381962
macos_sierra
nightly:macos:sierra

00:23:27

passed #381960
nightly:rhel:el7-cr

00:37:49

passed #381964
nightly:ubuntu:bionic

00:37:52

failed #381965
allowed to fail
nightly:ubuntu:cosmic

00:08:20

failed #381963
allowed to fail
nightly:ubuntu:xenial

00:15:08

passed #381966
pages

00:08:34

 
  Wheels
passed #381973
macos_sierra
nightly:wheel:cp27-cp27m-macosx

00:17:31

passed #381967
nightly:wheel:cp27-cp27m-manylinux1

00:14:56

passed #381968
nightly:wheel:cp27-cp27mu-manylinux1

00:15:01

passed #381969
nightly:wheel:cp34-cp34m-manylinux1

00:16:38

passed #381974
macos_sierra
nightly:wheel:cp35-cp35m-macosx

00:17:06

passed #381970
nightly:wheel:cp35-cp35m-manylinux1

00:15:01

passed #381975
macos_sierra
nightly:wheel:cp36-cp36m-macosx

00:17:09

passed #381971
nightly:wheel:cp36-cp36m-manylinux1

00:15:15

passed #381976
macos_sierra
nightly:wheel:cp37-cp37m-macosx

00:17:13

passed #381972
nightly:wheel:cp37-cp37m-manylinux1

00:16:53

 
  Deploy
passed #381977
deploy:wheel

00:01:36

passed pages:deploy

00:00:21

 
Name Stage Failure
failed
conda:python27 Nightly
make[1]: Leaving directory '/builds/lscsoft/lalsuite/lalsuite-6.59.1/_build/sub'
make: *** [Makefile:611: distcheck] Error 1
Uploading artifacts...
config.log: found 1 matching files
*/config.log: found 9 matching files

WARNING: */test/test-suite.log: no matching files
WARNING: */*/*/*/test/test-suite.log: no matching files
Uploading artifacts to coordinator... ok
id=381956 responseStatus=201 Created token=RvzqEzCS
ERROR: Job failed: exit code 1
failed
conda:python36 Nightly
make[1]: Leaving directory '/builds/lscsoft/lalsuite/lalsuite-6.59.1/_build/sub'
make: *** [Makefile:611: distcheck] Error 1
Uploading artifacts...
config.log: found 1 matching files
*/config.log: found 9 matching files

WARNING: */test/test-suite.log: no matching files
WARNING: */*/*/*/test/test-suite.log: no matching files
Uploading artifacts to coordinator... ok
id=381957 responseStatus=201 Created token=zWn6sEiG
ERROR: Job failed: exit code 1
failed
nightly:gcc:9 Nightly
Makefile:416: recipe for target 'check-recursive' failed
make[2]: Leaving directory '/builds/lscsoft/lalsuite/lalsuite-6.59.1/_build/sub'
make[2]: *** [check-recursive] Error 1
make[1]: *** [check] Error 2
Makefile:690: recipe for target 'check' failed
make[1]: Leaving directory '/builds/lscsoft/lalsuite/lalsuite-6.59.1/_build/sub'
Makefile:607: recipe for target 'distcheck' failed
make: *** [distcheck] Error 1
ERROR: Job failed: exit code 1
failed
conda:python37 Nightly
make[1]: Leaving directory '/builds/lscsoft/lalsuite/lalsuite-6.59.1/_build/sub'
make: *** [Makefile:611: distcheck] Error 1
Uploading artifacts...
config.log: found 1 matching files
*/config.log: found 9 matching files

WARNING: */test/test-suite.log: no matching files
WARNING: */*/*/*/test/test-suite.log: no matching files
Uploading artifacts to coordinator... ok
id=381958 responseStatus=201 Created token=RsVqcN4y
ERROR: Job failed: exit code 1
failed
nightly:ubuntu:xenial Nightly
make[2]: *** [all-recursive] Error 1
Makefile:416: recipe for target 'all-recursive' failed
make[2]: Leaving directory '/builds/lscsoft/lalsuite/lalsuite-6.59.1/_build/sub'
make[1]: *** [all] Error 2
Makefile:353: recipe for target 'all' failed
make[1]: Leaving directory '/builds/lscsoft/lalsuite/lalsuite-6.59.1/_build/sub'
Makefile:607: recipe for target 'distcheck' failed
make: *** [distcheck] Error 1
ERROR: Job failed: exit code 1
failed
nightly:ubuntu:cosmic Nightly
make[4]: Leaving directory '/builds/lscsoft/lalsuite/lalapps'
make[3]: Leaving directory '/builds/lscsoft/lalsuite/lalapps'
make[3]: *** [Makefile:744: distdir] Error 2
make[2]: *** [Makefile:508: distdir-am] Error 1
make[2]: Leaving directory '/builds/lscsoft/lalsuite'
make[1]: *** [Makefile:502: distdir] Error 2
make[1]: Leaving directory '/builds/lscsoft/lalsuite'
make: *** [Makefile:603: dist] Error 2
ERROR: Job failed: exit code 1
failed
nightly:debian:buster Nightly
make[4]: Leaving directory '/builds/lscsoft/lalsuite/lalapps'
make[3]: *** [Makefile:744: distdir] Error 2
make[3]: Leaving directory '/builds/lscsoft/lalsuite/lalapps'
make[2]: *** [Makefile:508: distdir-am] Error 1
make[2]: Leaving directory '/builds/lscsoft/lalsuite'
make[1]: *** [Makefile:502: distdir] Error 2
make[1]: Leaving directory '/builds/lscsoft/lalsuite'
make: *** [Makefile:603: dist] Error 2
ERROR: Job failed: exit code 1