Merge branch 'pesummary_v0.1.7' into 'master'

Update code for PESummary v0.1.7

See merge request !834
49 jobs for master in 186 minutes and 49 seconds (queued for 5 seconds)
Status Job ID Name Coverage
  Level0
passed #384824
level0:deb:lal

00:23:36

passed #384823
level0:rpm:lal

00:10:01

 
  Level1
passed #384828
level1:deb:lalframe

00:04:05

passed #384829
level1:deb:lalmetaio

00:04:43

passed #384830
level1:deb:lalsimulation

00:12:05

passed #384825
level1:rpm:lalframe

00:01:58

passed #384826
level1:rpm:lalmetaio

00:02:05

passed #384827
level1:rpm:lalsimulation

00:04:24

 
  Level2
passed #384834
level2:deb:lalburst

00:02:47

passed #384835
level2:deb:lalinspiral

00:15:31

passed #384836
level2:deb:lalpulsar

00:15:03

passed #384831
level2:rpm:lalburst

00:01:29

passed #384832
level2:rpm:lalinspiral

00:06:34

passed #384833
level2:rpm:lalpulsar

00:07:04

 
  Level3
passed #384838
level3:deb:lalinference

00:07:08

passed #384837
level3:rpm:lalinference

00:05:44

 
  Level4
passed #384840
level4:deb:lalapps

00:10:57

passed #384839
level4:rpm:lalapps

00:06:01

 
  Docker
passed #384841
docker:nightly:el7

00:09:00

passed #384842
docker:nightly:stretch

00:05:12

 
  Nightly
failed #384849
allowed to fail
conda:python27

00:34:11

failed #384850
allowed to fail
conda:python36

00:34:17

failed #384851
allowed to fail
conda:python37

00:29:28

passed #384843
nightly:clang:7

00:37:36

passed #384844
nightly:clang:8

00:37:42

passed #384845
nightly:clang:9

00:37:54

failed #384852
allowed to fail
nightly:debian:buster

00:06:07

passed #384846
nightly:gcc:7

00:33:49

passed #384847
nightly:gcc:8

00:34:32

failed #384848
allowed to fail
nightly:gcc:9

00:23:50

passed #384854
macos_highsierra
nightly:macos:highsierra

00:23:09

passed #384855
macos_sierra
nightly:macos:sierra

00:23:26

passed #384853
nightly:rhel:el7-cr

00:36:35

passed #384857
nightly:ubuntu:bionic

00:36:30

failed #384858
allowed to fail
nightly:ubuntu:cosmic

00:07:02

failed #384856
allowed to fail
nightly:ubuntu:xenial

00:14:23

passed #384859
pages

00:07:56

 
  Wheels
passed #384866
macos_sierra
nightly:wheel:cp27-cp27m-macosx

00:17:24

passed #384860
nightly:wheel:cp27-cp27m-manylinux1

00:14:54

passed #384861
nightly:wheel:cp27-cp27mu-manylinux1

00:16:56

passed #384862
nightly:wheel:cp34-cp34m-manylinux1

00:16:44

passed #384867
macos_sierra
nightly:wheel:cp35-cp35m-macosx

00:17:19

passed #384863
nightly:wheel:cp35-cp35m-manylinux1

00:14:55

passed #384868
macos_sierra
nightly:wheel:cp36-cp36m-macosx

00:17:09

passed #384864
nightly:wheel:cp36-cp36m-manylinux1

00:15:05

passed #384869
macos_sierra
nightly:wheel:cp37-cp37m-macosx

00:17:14

passed #384865
nightly:wheel:cp37-cp37m-manylinux1

00:15:01

 
  Deploy
passed #384870
deploy:wheel

00:01:25

passed pages:deploy

00:00:19

 
Name Stage Failure
failed
conda:python36 Nightly
make[1]: Leaving directory '/builds/lscsoft/lalsuite/lalsuite-6.59.1/_build/sub'
make: *** [Makefile:611: distcheck] Error 1
Uploading artifacts...
config.log: found 1 matching files
*/config.log: found 9 matching files

WARNING: */test/test-suite.log: no matching files
*/*/*/*/test/test-suite.log: found 7 matching files

Uploading artifacts to coordinator... ok
id=384850 responseStatus=201 Created token=hrs7foTv
ERROR: Job failed: exit code 1
failed
conda:python27 Nightly
make[1]: Leaving directory '/builds/lscsoft/lalsuite/lalsuite-6.59.1/_build/sub'
make: *** [Makefile:611: distcheck] Error 1
Uploading artifacts...
config.log: found 1 matching files
*/config.log: found 9 matching files

WARNING: */test/test-suite.log: no matching files
*/*/*/*/test/test-suite.log: found 7 matching files

Uploading artifacts to coordinator... ok
id=384849 responseStatus=201 Created token=99bZnEDj
ERROR: Job failed: exit code 1
failed
conda:python37 Nightly
make[1]: Leaving directory '/builds/lscsoft/lalsuite/lalsuite-6.59.1/_build/sub'
make: *** [Makefile:611: distcheck] Error 1
Uploading artifacts...
config.log: found 1 matching files
*/config.log: found 9 matching files

WARNING: */test/test-suite.log: no matching files
*/*/*/*/test/test-suite.log: found 7 matching files

Uploading artifacts to coordinator... ok
id=384851 responseStatus=201 Created token=4K-VzxM7
ERROR: Job failed: exit code 1
failed
nightly:gcc:9 Nightly
Makefile:416: recipe for target 'check-recursive' failed
make[2]: Leaving directory '/builds/lscsoft/lalsuite/lalsuite-6.59.1/_build/sub'
make[2]: *** [check-recursive] Error 1
make[1]: *** [check] Error 2
Makefile:690: recipe for target 'check' failed
make[1]: Leaving directory '/builds/lscsoft/lalsuite/lalsuite-6.59.1/_build/sub'
make: *** [distcheck] Error 1
Makefile:607: recipe for target 'distcheck' failed
ERROR: Job failed: exit code 1
failed
nightly:ubuntu:xenial Nightly
make[2]: *** [all-recursive] Error 1
Makefile:416: recipe for target 'all-recursive' failed
make[2]: Leaving directory '/builds/lscsoft/lalsuite/lalsuite-6.59.1/_build/sub'
Makefile:353: recipe for target 'all' failed
make[1]: Leaving directory '/builds/lscsoft/lalsuite/lalsuite-6.59.1/_build/sub'
make[1]: *** [all] Error 2
Makefile:607: recipe for target 'distcheck' failed
make: *** [distcheck] Error 1
ERROR: Job failed: exit code 1
failed
nightly:ubuntu:cosmic Nightly
make[4]: Leaving directory '/builds/lscsoft/lalsuite/lalapps'
make[3]: Leaving directory '/builds/lscsoft/lalsuite/lalapps'
make[3]: *** [Makefile:744: distdir] Error 2
make[2]: *** [Makefile:508: distdir-am] Error 1
make[2]: Leaving directory '/builds/lscsoft/lalsuite'
make[1]: *** [Makefile:502: distdir] Error 2
make[1]: Leaving directory '/builds/lscsoft/lalsuite'
make: *** [Makefile:603: dist] Error 2
ERROR: Job failed: exit code 1
failed
nightly:debian:buster Nightly
make[4]: Leaving directory '/builds/lscsoft/lalsuite/lalapps'
make[3]: *** [Makefile:744: distdir] Error 2
make[3]: Leaving directory '/builds/lscsoft/lalsuite/lalapps'
make[2]: *** [Makefile:508: distdir-am] Error 1
make[2]: Leaving directory '/builds/lscsoft/lalsuite'
make[1]: Leaving directory '/builds/lscsoft/lalsuite'
make[1]: *** [Makefile:502: distdir] Error 2
make: *** [Makefile:603: dist] Error 2
ERROR: Job failed: exit code 1