Merge branch 'roq_from_selected_params' into 'master'

lalinference_pipe_utils.py and lalinference_compute_roq_weights.py: enable...

See merge request !858
49 jobs for master in 189 minutes and 37 seconds (queued for 5 seconds)
Status Job ID Name Coverage
  Level0
passed #385711
level0:deb:lal

00:23:21

passed #385710
level0:rpm:lal

00:08:57

 
  Level1
passed #385715
level1:deb:lalframe

00:04:05

passed #385716
level1:deb:lalmetaio

00:04:43

passed #385717
level1:deb:lalsimulation

00:12:00

passed #385712
level1:rpm:lalframe

00:01:57

passed #385713
level1:rpm:lalmetaio

00:02:02

passed #385714
level1:rpm:lalsimulation

00:04:19

 
  Level2
passed #385721
level2:deb:lalburst

00:02:43

passed #385722
level2:deb:lalinspiral

00:15:21

passed #385723
level2:deb:lalpulsar

00:15:00

passed #385718
level2:rpm:lalburst

00:01:30

passed #385719
level2:rpm:lalinspiral

00:06:37

passed #385720
level2:rpm:lalpulsar

00:07:04

 
  Level3
passed #385725
level3:deb:lalinference

00:07:06

passed #385724
level3:rpm:lalinference

00:05:46

 
  Level4
passed #385727
level4:deb:lalapps

00:11:29

passed #385726
level4:rpm:lalapps

00:06:20

 
  Docker
passed #385728
docker:nightly:el7

00:08:50

passed #385729
docker:nightly:stretch

00:05:17

 
  Nightly
failed #385736
allowed to fail
conda:python27

00:36:40

failed #385737
allowed to fail
conda:python36

00:38:50

failed #385738
allowed to fail
conda:python37

00:29:47

passed #385730
nightly:clang:7

00:40:00

passed #385731
nightly:clang:8

00:40:30

passed #385732
nightly:clang:9

00:40:51

failed #385739
allowed to fail
nightly:debian:buster

00:03:56

passed #385733
nightly:gcc:7

00:36:08

passed #385734
nightly:gcc:8

00:36:08

failed #385735
allowed to fail
nightly:gcc:9

00:25:25

passed #385741
macos_highsierra
nightly:macos:highsierra

00:23:12

passed #385742
macos_sierra
nightly:macos:sierra

00:23:28

passed #385740
nightly:rhel:el7-cr

00:37:50

passed #385744
nightly:ubuntu:bionic

00:36:41

failed #385745
allowed to fail
nightly:ubuntu:cosmic

00:05:05

failed #385743
allowed to fail
nightly:ubuntu:xenial

00:11:20

passed #385746
pages

00:07:56

 
  Wheels
passed #385753
macos_sierra
nightly:wheel:cp27-cp27m-macosx

00:17:28

passed #385747
nightly:wheel:cp27-cp27m-manylinux1

00:16:23

passed #385748
nightly:wheel:cp27-cp27mu-manylinux1

00:16:40

passed #385749
nightly:wheel:cp34-cp34m-manylinux1

00:17:51

passed #385754
macos_sierra
nightly:wheel:cp35-cp35m-macosx

00:17:15

passed #385750
nightly:wheel:cp35-cp35m-manylinux1

00:16:16

passed #385755
macos_sierra
nightly:wheel:cp36-cp36m-macosx

00:17:03

passed #385751
nightly:wheel:cp36-cp36m-manylinux1

00:18:47

passed #385756
macos_sierra
nightly:wheel:cp37-cp37m-macosx

00:17:14

passed #385752
nightly:wheel:cp37-cp37m-manylinux1

00:16:42

 
  Deploy
passed #385757
deploy:wheel

00:01:30

passed pages:deploy

00:00:21

 
Name Stage Failure
failed
conda:python36 Nightly
make[1]: Leaving directory '/builds/lscsoft/lalsuite/lalsuite-6.59.1/_build/sub'
make: *** [Makefile:611: distcheck] Error 1
Uploading artifacts...
config.log: found 1 matching files
*/config.log: found 9 matching files

WARNING: */test/test-suite.log: no matching files
*/*/*/*/test/test-suite.log: found 7 matching files

Uploading artifacts to coordinator... ok
id=385737 responseStatus=201 Created token=2SxxSgGy
ERROR: Job failed: exit code 1
failed
conda:python27 Nightly
make[1]: Leaving directory '/builds/lscsoft/lalsuite/lalsuite-6.59.1/_build/sub'
make: *** [Makefile:611: distcheck] Error 1
Uploading artifacts...
config.log: found 1 matching files
*/config.log: found 9 matching files

WARNING: */test/test-suite.log: no matching files
*/*/*/*/test/test-suite.log: found 7 matching files

Uploading artifacts to coordinator... ok
id=385736 responseStatus=201 Created token=a-Aajz7K
ERROR: Job failed: exit code 1
failed
conda:python37 Nightly
make[1]: Leaving directory '/builds/lscsoft/lalsuite/lalsuite-6.59.1/_build/sub'
make: *** [Makefile:611: distcheck] Error 1
Uploading artifacts...
config.log: found 1 matching files
*/config.log: found 9 matching files

WARNING: */test/test-suite.log: no matching files
*/*/*/*/test/test-suite.log: found 7 matching files

Uploading artifacts to coordinator... ok
id=385738 responseStatus=201 Created token=MpVyzVVf
ERROR: Job failed: exit code 1
failed
nightly:gcc:9 Nightly
make[2]: *** [check-recursive] Error 1
Makefile:416: recipe for target 'check-recursive' failed
make[2]: Leaving directory '/builds/lscsoft/lalsuite/lalsuite-6.59.1/_build/sub'
make[1]: *** [check] Error 2
Makefile:690: recipe for target 'check' failed
make[1]: Leaving directory '/builds/lscsoft/lalsuite/lalsuite-6.59.1/_build/sub'
Makefile:607: recipe for target 'distcheck' failed
make: *** [distcheck] Error 1
ERROR: Job failed: exit code 1
failed
nightly:ubuntu:xenial Nightly
make[2]: *** [all-recursive] Error 1
Makefile:416: recipe for target 'all-recursive' failed
make[2]: Leaving directory '/builds/lscsoft/lalsuite/lalsuite-6.59.1/_build/sub'
Makefile:353: recipe for target 'all' failed
make[1]: *** [all] Error 2
make[1]: Leaving directory '/builds/lscsoft/lalsuite/lalsuite-6.59.1/_build/sub'
Makefile:607: recipe for target 'distcheck' failed
make: *** [distcheck] Error 1
ERROR: Job failed: exit code 1
failed
nightly:ubuntu:cosmic Nightly
make[4]: Leaving directory '/builds/lscsoft/lalsuite/lalapps'
make[3]: *** [Makefile:744: distdir] Error 2
make[3]: Leaving directory '/builds/lscsoft/lalsuite/lalapps'
make[2]: *** [Makefile:508: distdir-am] Error 1
make[2]: Leaving directory '/builds/lscsoft/lalsuite'
make[1]: *** [Makefile:502: distdir] Error 2
make[1]: Leaving directory '/builds/lscsoft/lalsuite'
make: *** [Makefile:603: dist] Error 2
ERROR: Job failed: exit code 1
failed
nightly:debian:buster Nightly
make[4]: Leaving directory '/builds/lscsoft/lalsuite/lalapps'
make[3]: *** [Makefile:744: distdir] Error 2
make[3]: Leaving directory '/builds/lscsoft/lalsuite/lalapps'
make[2]: Leaving directory '/builds/lscsoft/lalsuite'
make[2]: *** [Makefile:508: distdir-am] Error 1
make[1]: *** [Makefile:502: distdir] Error 2
make[1]: Leaving directory '/builds/lscsoft/lalsuite'
make: *** [Makefile:603: dist] Error 2
ERROR: Job failed: exit code 1