Merge branch 'bump-scipy-version-dep' into 'master'

lalinference: bump scipy version dep to 0.9.0

See merge request !861
49 jobs for master in 193 minutes (queued for 6 seconds)
Status Job ID Name Coverage
  Level0
passed #386940
level0:deb:lal

00:22:37

passed #386939
level0:rpm:lal

00:09:18

 
  Level1
passed #386944
level1:deb:lalframe

00:04:04

passed #386945
level1:deb:lalmetaio

00:04:39

passed #386946
level1:deb:lalsimulation

00:11:50

passed #386941
level1:rpm:lalframe

00:01:50

passed #386942
level1:rpm:lalmetaio

00:01:59

passed #386943
level1:rpm:lalsimulation

00:04:18

 
  Level2
passed #386950
level2:deb:lalburst

00:02:41

passed #386951
level2:deb:lalinspiral

00:16:00

passed #386952
level2:deb:lalpulsar

00:15:26

passed #386947
level2:rpm:lalburst

00:01:30

passed #386948
level2:rpm:lalinspiral

00:06:36

passed #386949
level2:rpm:lalpulsar

00:06:54

 
  Level3
passed #386954
level3:deb:lalinference

00:07:48

passed #386953
level3:rpm:lalinference

00:06:21

 
  Level4
passed #386956
level4:deb:lalapps

00:11:25

passed #386955
level4:rpm:lalapps

00:06:13

 
  Docker
passed #386957
docker:nightly:el7

00:09:46

passed #386958
docker:nightly:stretch

00:06:02

 
  Nightly
failed #386965
allowed to fail
conda:python27

00:40:30

failed #386966
allowed to fail
conda:python36

00:40:05

failed #386967
allowed to fail
conda:python37

00:33:32

passed #386959
nightly:clang:7

00:42:00

passed #386960
nightly:clang:8

00:42:14

passed #386961
nightly:clang:9

00:42:26

failed #386968
allowed to fail
nightly:debian:buster

00:05:34

passed #386962
nightly:gcc:7

00:37:39

passed #386963
nightly:gcc:8

00:38:27

failed #386964
allowed to fail
nightly:gcc:9

00:27:26

passed #386970
macos_highsierra
nightly:macos:highsierra

00:23:10

passed #386971
macos_sierra
nightly:macos:sierra

00:23:27

passed #386969
nightly:rhel:el7-cr

00:41:34

passed #386973
nightly:ubuntu:bionic

00:40:34

failed #386974
allowed to fail
nightly:ubuntu:cosmic

00:05:31

failed #386972
allowed to fail
nightly:ubuntu:xenial

00:13:56

passed #386975
pages

00:08:18

 
  Wheels
passed #386982
macos_sierra
nightly:wheel:cp27-cp27m-macosx

00:17:29

passed #386976
nightly:wheel:cp27-cp27m-manylinux1

00:17:06

passed #386977
nightly:wheel:cp27-cp27mu-manylinux1

00:17:37

passed #386978
nightly:wheel:cp34-cp34m-manylinux1

00:18:32

passed #386983
macos_sierra
nightly:wheel:cp35-cp35m-macosx

00:17:10

passed #386979
nightly:wheel:cp35-cp35m-manylinux1

00:16:53

passed #386984
macos_sierra
nightly:wheel:cp36-cp36m-macosx

00:17:09

passed #386980
nightly:wheel:cp36-cp36m-manylinux1

00:17:04

passed #386985
macos_sierra
nightly:wheel:cp37-cp37m-macosx

00:17:12

passed #386981
nightly:wheel:cp37-cp37m-manylinux1

00:16:59

 
  Deploy
passed #386986
deploy:wheel

00:01:57

passed pages:deploy

00:00:24

 
Name Stage Failure
failed
conda:python27 Nightly
make[1]: Leaving directory '/builds/lscsoft/lalsuite/lalsuite-6.59.1/_build/sub'
make: *** [Makefile:611: distcheck] Error 1
Uploading artifacts...
config.log: found 1 matching files
*/config.log: found 9 matching files

WARNING: */test/test-suite.log: no matching files
*/*/*/*/test/test-suite.log: found 7 matching files

Uploading artifacts to coordinator... ok
id=386965 responseStatus=201 Created token=GyR5g79C
ERROR: Job failed: exit code 1
failed
conda:python36 Nightly
make[1]: Leaving directory '/builds/lscsoft/lalsuite/lalsuite-6.59.1/_build/sub'
make: *** [Makefile:611: distcheck] Error 1
Uploading artifacts...
config.log: found 1 matching files
*/config.log: found 9 matching files

WARNING: */test/test-suite.log: no matching files
*/*/*/*/test/test-suite.log: found 7 matching files

Uploading artifacts to coordinator... ok
id=386966 responseStatus=201 Created token=Jzkg6zJV
ERROR: Job failed: exit code 1
failed
conda:python37 Nightly
make[1]: Leaving directory '/builds/lscsoft/lalsuite/lalsuite-6.59.1/_build/sub'
make: *** [Makefile:611: distcheck] Error 1
Uploading artifacts...
config.log: found 1 matching files
*/config.log: found 9 matching files

WARNING: */test/test-suite.log: no matching files
*/*/*/*/test/test-suite.log: found 7 matching files

Uploading artifacts to coordinator... ok
id=386967 responseStatus=201 Created token=9D6ydakz
ERROR: Job failed: exit code 1
failed
nightly:gcc:9 Nightly
Makefile:416: recipe for target 'check-recursive' failed
make[2]: Leaving directory '/builds/lscsoft/lalsuite/lalsuite-6.59.1/_build/sub'
make[2]: *** [check-recursive] Error 1
make[1]: *** [check] Error 2
Makefile:690: recipe for target 'check' failed
make[1]: Leaving directory '/builds/lscsoft/lalsuite/lalsuite-6.59.1/_build/sub'
make: *** [distcheck] Error 1
Makefile:607: recipe for target 'distcheck' failed
ERROR: Job failed: exit code 1
failed
nightly:ubuntu:xenial Nightly
make[2]: *** [all-recursive] Error 1
Makefile:416: recipe for target 'all-recursive' failed
make[2]: Leaving directory '/builds/lscsoft/lalsuite/lalsuite-6.59.1/_build/sub'
Makefile:353: recipe for target 'all' failed
make[1]: *** [all] Error 2
make[1]: Leaving directory '/builds/lscsoft/lalsuite/lalsuite-6.59.1/_build/sub'
Makefile:607: recipe for target 'distcheck' failed
make: *** [distcheck] Error 1
ERROR: Job failed: exit code 1
failed
nightly:debian:buster Nightly
make[4]: Leaving directory '/builds/lscsoft/lalsuite/lalapps'
make[3]: *** [Makefile:744: distdir] Error 2
make[3]: Leaving directory '/builds/lscsoft/lalsuite/lalapps'
make[2]: *** [Makefile:508: distdir-am] Error 1
make[2]: Leaving directory '/builds/lscsoft/lalsuite'
make[1]: *** [Makefile:502: distdir] Error 2
make[1]: Leaving directory '/builds/lscsoft/lalsuite'
make: *** [Makefile:603: dist] Error 2
ERROR: Job failed: exit code 1
failed
nightly:ubuntu:cosmic Nightly
make[4]: Leaving directory '/builds/lscsoft/lalsuite/lalapps'
make[3]: *** [Makefile:744: distdir] Error 2
make[3]: Leaving directory '/builds/lscsoft/lalsuite/lalapps'
make[2]: *** [Makefile:508: distdir-am] Error 1
make[2]: Leaving directory '/builds/lscsoft/lalsuite'
make[1]: *** [Makefile:502: distdir] Error 2
make[1]: Leaving directory '/builds/lscsoft/lalsuite'
make: *** [Makefile:603: dist] Error 2
ERROR: Job failed: exit code 1