Merge branch 'inspiral_header_cleanup' into 'master'

lalinspiral:  clean up #include's

See merge request !862
50 jobs for master in 193 minutes and 9 seconds (queued for 5 seconds)
Status Job ID Name Coverage
  Level0
passed #388951
level0:deb:lal

00:22:14

passed #388950
level0:rpm:lal

00:09:53

 
  Level1
passed #388955
level1:deb:lalframe

00:04:05

passed #388956
level1:deb:lalmetaio

00:04:36

passed #388957
level1:deb:lalsimulation

00:11:52

passed #388952
level1:rpm:lalframe

00:01:52

passed #388953
level1:rpm:lalmetaio

00:02:02

passed #388954
level1:rpm:lalsimulation

00:04:15

 
  Level2
passed #388961
level2:deb:lalburst

00:02:46

passed #388962
level2:deb:lalinspiral

00:15:33

passed #388963
level2:deb:lalpulsar

00:15:02

passed #388958
level2:rpm:lalburst

00:01:30

passed #388959
level2:rpm:lalinspiral

00:06:36

passed #388960
level2:rpm:lalpulsar

00:06:57

 
  Level3
passed #388965
level3:deb:lalinference

00:07:08

passed #388964
level3:rpm:lalinference

00:05:48

 
  Level4
passed #388967
level4:deb:lalapps

00:10:51

passed #388966
level4:rpm:lalapps

00:05:52

 
  Docker
passed #389021
docker:nightly:el7

00:09:16

passed #388969
docker:nightly:stretch

00:05:02

failed #388968
docker:nightly:el7

00:05:32

 
  Nightly
failed #388976
allowed to fail
conda:python27

00:35:41

failed #388977
allowed to fail
conda:python36

00:38:11

failed #388978
allowed to fail
conda:python37

00:30:02

passed #388970
nightly:clang:7

00:39:30

passed #388971
nightly:clang:8

00:39:21

passed #388972
nightly:clang:9

00:39:44

failed #388979
allowed to fail
nightly:debian:buster

00:07:44

passed #388973
nightly:gcc:7

00:35:58

passed #388974
nightly:gcc:8

00:37:06

failed #388975
allowed to fail
nightly:gcc:9

00:26:04

passed #388981
macos_highsierra
nightly:macos:highsierra

00:23:07

passed #388982
macos_sierra
nightly:macos:sierra

00:24:07

passed #388980
nightly:rhel:el7-cr

00:35:58

passed #388984
nightly:ubuntu:bionic

00:37:56

failed #388985
allowed to fail
nightly:ubuntu:cosmic

00:07:50

failed #388983
allowed to fail
nightly:ubuntu:xenial

00:14:41

passed #388986
pages

00:09:14

 
  Wheels
passed #388993
macos_sierra
nightly:wheel:cp27-cp27m-macosx

00:17:28

passed #388987
nightly:wheel:cp27-cp27m-manylinux1

00:14:06

passed #388988
nightly:wheel:cp27-cp27mu-manylinux1

00:14:07

passed #388989
nightly:wheel:cp34-cp34m-manylinux1

00:15:37

passed #388994
macos_sierra
nightly:wheel:cp35-cp35m-macosx

00:17:06

passed #388990
nightly:wheel:cp35-cp35m-manylinux1

00:14:04

passed #388995
macos_sierra
nightly:wheel:cp36-cp36m-macosx

00:16:57

passed #388991
nightly:wheel:cp36-cp36m-manylinux1

00:14:02

passed #388996
macos_sierra
nightly:wheel:cp37-cp37m-macosx

00:17:06

passed #388992
nightly:wheel:cp37-cp37m-manylinux1

00:13:55

 
  Deploy
passed #388997
deploy:wheel

00:02:38

passed pages:deploy

00:00:24

 
Name Stage Failure
failed
conda:python36 Nightly
make[1]: Leaving directory '/builds/lscsoft/lalsuite/lalsuite-6.59.1/_build/sub'
make: *** [Makefile:611: distcheck] Error 1
Uploading artifacts...
config.log: found 1 matching files
*/config.log: found 9 matching files

WARNING: */test/test-suite.log: no matching files
*/*/*/*/test/test-suite.log: found 7 matching files

Uploading artifacts to coordinator... ok
id=388977 responseStatus=201 Created token=XunNvKsg
ERROR: Job failed: exit code 1
failed
conda:python27 Nightly
make[1]: Leaving directory '/builds/lscsoft/lalsuite/lalsuite-6.59.1/_build/sub'
make: *** [Makefile:611: distcheck] Error 1
Uploading artifacts...
config.log: found 1 matching files
*/config.log: found 9 matching files

WARNING: */test/test-suite.log: no matching files
*/*/*/*/test/test-suite.log: found 7 matching files

Uploading artifacts to coordinator... ok
id=388976 responseStatus=201 Created token=9F4JwA_v
ERROR: Job failed: exit code 1
failed
conda:python37 Nightly
make[1]: Leaving directory '/builds/lscsoft/lalsuite/lalsuite-6.59.1/_build/sub'
make: *** [Makefile:611: distcheck] Error 1
Uploading artifacts...
config.log: found 1 matching files
*/config.log: found 9 matching files

WARNING: */test/test-suite.log: no matching files
*/*/*/*/test/test-suite.log: found 7 matching files

Uploading artifacts to coordinator... ok
id=388978 responseStatus=201 Created token=pHM_JGM2
ERROR: Job failed: exit code 1
failed
nightly:gcc:9 Nightly
make[2]: *** [check-recursive] Error 1
Makefile:416: recipe for target 'check-recursive' failed
make[2]: Leaving directory '/builds/lscsoft/lalsuite/lalsuite-6.59.1/_build/sub'
Makefile:690: recipe for target 'check' failed
make[1]: Leaving directory '/builds/lscsoft/lalsuite/lalsuite-6.59.1/_build/sub'
make[1]: *** [check] Error 2
Makefile:607: recipe for target 'distcheck' failed
make: *** [distcheck] Error 1
ERROR: Job failed: exit code 1
failed
nightly:ubuntu:xenial Nightly
make[2]: *** [all-recursive] Error 1
Makefile:416: recipe for target 'all-recursive' failed
make[2]: Leaving directory '/builds/lscsoft/lalsuite/lalsuite-6.59.1/_build/sub'
Makefile:353: recipe for target 'all' failed
make[1]: Leaving directory '/builds/lscsoft/lalsuite/lalsuite-6.59.1/_build/sub'
make[1]: *** [all] Error 2
make: *** [distcheck] Error 1
Makefile:607: recipe for target 'distcheck' failed
ERROR: Job failed: exit code 1
failed
nightly:ubuntu:cosmic Nightly
make[4]: Leaving directory '/builds/lscsoft/lalsuite/lalapps'
make[3]: *** [Makefile:744: distdir] Error 2
make[3]: Leaving directory '/builds/lscsoft/lalsuite/lalapps'
make[2]: *** [Makefile:508: distdir-am] Error 1
make[2]: Leaving directory '/builds/lscsoft/lalsuite'
make[1]: *** [Makefile:502: distdir] Error 2
make[1]: Leaving directory '/builds/lscsoft/lalsuite'
make: *** [Makefile:603: dist] Error 2
ERROR: Job failed: exit code 1
failed
nightly:debian:buster Nightly
make[4]: Leaving directory '/builds/lscsoft/lalsuite/lalapps'
make[3]: *** [Makefile:744: distdir] Error 2
make[3]: Leaving directory '/builds/lscsoft/lalsuite/lalapps'
make[2]: *** [Makefile:508: distdir-am] Error 1
make[2]: Leaving directory '/builds/lscsoft/lalsuite'
make[1]: *** [Makefile:502: distdir] Error 2
make[1]: Leaving directory '/builds/lscsoft/lalsuite'
make: *** [Makefile:603: dist] Error 2
ERROR: Job failed: exit code 1