Maintenance will be performed on git.ligo.org, chat.ligo.org, containers.ligo.org, and docs.ligo.org on Tuesday 19th January 2021 starting at approximately 8am MST. It is expected to take around 15 minutes and there will be a short period of downtime towards the end of the maintenance window. Please direct and comments, questions, or concerns to computing-help@igwn.org.

remove six.h from build

15 jobs for ligo-segments-1.2.0-v1 in 1 minute and 32 seconds (queued for 1 second)
latest
Status Job ID Name Coverage
  Test
passed #924192
doc

00:00:19

failed #924188
test:2.7

00:01:04

failed #924189
test:3.4

00:01:32

failed #924190
test:3.5

00:01:13

failed #924191
test:3.6

00:01:13

 
  Build
skipped #924200
build:debian:jessie
skipped #924201
build:debian:stretch
skipped #924199
build:el7
skipped #924193
build:tarball
skipped #924194
build:wheel:cp27-cp27m-manylinux1
skipped #924195
build:wheel:cp27-cp27mu-manylinux1
skipped #924196
build:wheel:cp34-cp34m-manylinux1
skipped #924197
build:wheel:cp35-cp35m-manylinux1
skipped #924198
build:wheel:cp36-cp36m-manylinux1
 
  Deploy
skipped #924202
pages
 
Name Stage Failure
failed
test:3.4 Test
    from ligo.segments import utils as segmentsUtils
File "/usr/local/lib/python3.4/site-packages/ligo/segments/utils.py", line 34, in <module>
from lal import LIGOTimeGPS
ImportError: No module named 'lal'
Fail
Makefile:13: recipe for target 'segments_utils_verify' failed
make: Leaving directory '/builds/lscsoft/ligo-segments/test'
make: *** [segments_utils_verify] Error 1
ERROR: Job failed: exit code 1
failed
test:3.6 Test
  File "segments_utils_verify.py", line 12, in <module>
from ligo.segments import utils as segmentsUtils
File "/usr/local/lib/python3.6/site-packages/ligo/segments/utils.py", line 34, in <module>
from lal import LIGOTimeGPS
ModuleNotFoundError: No module named 'lal'
Fail
make: *** [Makefile:14: segments_utils_verify] Error 1
make: Leaving directory '/builds/lscsoft/ligo-segments/test'
ERROR: Job failed: exit code 1
failed
test:3.5 Test
  File "segments_utils_verify.py", line 12, in <module>
from ligo.segments import utils as segmentsUtils
File "/usr/local/lib/python3.5/site-packages/ligo/segments/utils.py", line 34, in <module>
from lal import LIGOTimeGPS
ImportError: No module named 'lal'
Fail
make: *** [Makefile:14: segments_utils_verify] Error 1
make: Leaving directory '/builds/lscsoft/ligo-segments/test'
ERROR: Job failed: exit code 1
failed
test:2.7 Test
  File "segments_utils_verify.py", line 12, in <module>
from ligo.segments import utils as segmentsUtils
File "/usr/local/lib/python2.7/site-packages/ligo/segments/utils.py", line 34, in <module>
from lal import LIGOTimeGPS
ImportError: No module named lal
Fail
make: *** [Makefile:14: segments_utils_verify] Error 1
make: Leaving directory '/builds/lscsoft/ligo-segments/test'
ERROR: Job failed: exit code 1