six.h: remove inline keyword

14 jobs for master in 1 minute and 40 seconds (queued for 1 second)
Status Job ID Name Coverage
  Test
passed #236365
doc

00:00:39

failed #236361
test:2.7

00:01:24

failed #236362
test:3.4

00:01:35

failed #236363
test:3.5

00:01:34

failed #236364
test:3.6

00:01:39

 
  Build
skipped #236373
build:debian:jessie
skipped #236374
build:debian:stretch
skipped #236372
build:el7
skipped #236366
build:tarball
skipped #236367
build:wheel:cp27-cp27m-manylinux1
skipped #236368
build:wheel:cp27-cp27mu-manylinux1
skipped #236369
build:wheel:cp34-cp34m-manylinux1
skipped #236370
build:wheel:cp35-cp35m-manylinux1
skipped #236371
build:wheel:cp36-cp36m-manylinux1
 
Name Stage Failure
failed
test:3.6 Test
    from ligo.segments import utils as segmentsUtils
File "/usr/local/lib/python3.6/site-packages/ligo/segments/utils.py", line 34, in <module>
from lal import LIGOTimeGPS
ModuleNotFoundError: No module named 'lal'
Fail
make: *** [segments_utils_verify] Error 1
Makefile:13: recipe for target 'segments_utils_verify' failed
make: Leaving directory '/builds/lscsoft/ligo-segments/test'
ERROR: Job failed: exit code 1
failed
test:3.4 Test
    from ligo.segments import utils as segmentsUtils
File "/usr/local/lib/python3.4/site-packages/ligo/segments/utils.py", line 34, in <module>
from lal import LIGOTimeGPS
ImportError: No module named 'lal'
Fail
Makefile:13: recipe for target 'segments_utils_verify' failed
make: *** [segments_utils_verify] Error 1
make: Leaving directory '/builds/lscsoft/ligo-segments/test'
ERROR: Job failed: exit code 1
failed
test:3.5 Test
    from ligo.segments import utils as segmentsUtils
File "/usr/local/lib/python3.5/site-packages/ligo/segments/utils.py", line 34, in <module>
from lal import LIGOTimeGPS
ImportError: No module named 'lal'
Fail
Makefile:13: recipe for target 'segments_utils_verify' failed
make: Leaving directory '/builds/lscsoft/ligo-segments/test'
make: *** [segments_utils_verify] Error 1
ERROR: Job failed: exit code 1
failed
test:2.7 Test
    from ligo.segments import utils as segmentsUtils
File "/usr/local/lib/python2.7/site-packages/ligo/segments/utils.py", line 34, in <module>
from lal import LIGOTimeGPS
ImportError: No module named lal
Fail
Makefile:13: recipe for target 'segments_utils_verify' failed
make: Leaving directory '/builds/lscsoft/ligo-segments/test'
make: *** [segments_utils_verify] Error 1
ERROR: Job failed: exit code 1