bump version to 1.1.0

15 jobs for ligo-segments-1.1.0-v1 in 1 minute and 56 seconds (queued for 3 seconds)
latest
Status Job ID Name Coverage
  Test
passed #188593
doc

00:00:51

failed #188589
test:2.7

00:01:47

failed #188590
test:3.4

00:01:53

failed #188591
test:3.5

00:01:55

failed #188592
test:3.6

00:01:55

 
  Build
skipped #188601
build:debian:jessie
skipped #188602
build:debian:stretch
skipped #188600
build:el7
skipped #188594
build:tarball
skipped #188595
build:wheel:cp27-cp27m-manylinux1
skipped #188596
build:wheel:cp27-cp27mu-manylinux1
skipped #188597
build:wheel:cp34-cp34m-manylinux1
skipped #188598
build:wheel:cp35-cp35m-manylinux1
skipped #188599
build:wheel:cp36-cp36m-manylinux1
 
  Deploy
skipped #188603
pages
 
Name Stage Failure
failed
test:3.6 Test
    from ligo.segments import utils as segmentsUtils
File "/usr/local/lib/python3.6/site-packages/ligo/segments/utils.py", line 34, in <module>
from lal import LIGOTimeGPS
ModuleNotFoundError: No module named 'lal'
Fail
Makefile:13: recipe for target 'segments_utils_verify' failed
make: *** [segments_utils_verify] Error 1
make: Leaving directory '/builds/lscsoft/ligo-segments/test'
ERROR: Job failed: exit code 1
failed
test:3.5 Test
    from ligo.segments import utils as segmentsUtils
File "/usr/local/lib/python3.5/site-packages/ligo/segments/utils.py", line 34, in <module>
from lal import LIGOTimeGPS
ImportError: No module named 'lal'
Fail
Makefile:13: recipe for target 'segments_utils_verify' failed
make: Leaving directory '/builds/lscsoft/ligo-segments/test'
make: *** [segments_utils_verify] Error 1
ERROR: Job failed: exit code 1
failed
test:3.4 Test
    from ligo.segments import utils as segmentsUtils
File "/usr/local/lib/python3.4/site-packages/ligo/segments/utils.py", line 34, in <module>
from lal import LIGOTimeGPS
ImportError: No module named 'lal'
Fail
Makefile:13: recipe for target 'segments_utils_verify' failed
make: Leaving directory '/builds/lscsoft/ligo-segments/test'
make: *** [segments_utils_verify] Error 1
ERROR: Job failed: exit code 1
failed
test:2.7 Test
    from ligo.segments import utils as segmentsUtils
File "/usr/local/lib/python2.7/site-packages/ligo/segments/utils.py", line 34, in <module>
from lal import LIGOTimeGPS
ImportError: No module named lal
Fail
Makefile:13: recipe for target 'segments_utils_verify' failed
make: Leaving directory '/builds/lscsoft/ligo-segments/test'
make: *** [segments_utils_verify] Error 1
ERROR: Job failed: exit code 1