bump version to 1.1.1

15 jobs for ligo-segments-1.1.1-v1 in 1 minute and 40 seconds (queued for 2 seconds)
latest
Status Job ID Name Coverage
  Test
passed #189646
doc

00:00:40

failed #189642
test:2.7

00:01:26

failed #189643
test:3.4

00:01:34

failed #189644
test:3.5

00:01:37

failed #189645
test:3.6

00:01:40

 
  Build
skipped #189654
build:debian:jessie
skipped #189655
build:debian:stretch
skipped #189653
build:el7
skipped #189647
build:tarball
skipped #189648
build:wheel:cp27-cp27m-manylinux1
skipped #189649
build:wheel:cp27-cp27mu-manylinux1
skipped #189650
build:wheel:cp34-cp34m-manylinux1
skipped #189651
build:wheel:cp35-cp35m-manylinux1
skipped #189652
build:wheel:cp36-cp36m-manylinux1
 
  Deploy
skipped #189656
pages
 
Name Stage Failure
failed
test:3.6 Test
    from ligo.segments import utils as segmentsUtils
File "/usr/local/lib/python3.6/site-packages/ligo/segments/utils.py", line 34, in <module>
from lal import LIGOTimeGPS
ModuleNotFoundError: No module named 'lal'
Fail
Makefile:13: recipe for target 'segments_utils_verify' failed
make: *** [segments_utils_verify] Error 1
make: Leaving directory '/builds/lscsoft/ligo-segments/test'
ERROR: Job failed: exit code 1
failed
test:3.5 Test
    from ligo.segments import utils as segmentsUtils
File "/usr/local/lib/python3.5/site-packages/ligo/segments/utils.py", line 34, in <module>
from lal import LIGOTimeGPS
ImportError: No module named 'lal'
Fail
Makefile:13: recipe for target 'segments_utils_verify' failed
make: Leaving directory '/builds/lscsoft/ligo-segments/test'
make: *** [segments_utils_verify] Error 1
ERROR: Job failed: exit code 1
failed
test:3.4 Test
    from ligo.segments import utils as segmentsUtils
File "/usr/local/lib/python3.4/site-packages/ligo/segments/utils.py", line 34, in <module>
from lal import LIGOTimeGPS
ImportError: No module named 'lal'
Fail
Makefile:13: recipe for target 'segments_utils_verify' failed
make: *** [segments_utils_verify] Error 1
make: Leaving directory '/builds/lscsoft/ligo-segments/test'
ERROR: Job failed: exit code 1
failed
test:2.7 Test
    from ligo.segments import utils as segmentsUtils
File "/usr/local/lib/python2.7/site-packages/ligo/segments/utils.py", line 34, in <module>
from lal import LIGOTimeGPS
ImportError: No module named lal
Fail
Makefile:13: recipe for target 'segments_utils_verify' failed
make: *** [segments_utils_verify] Error 1
make: Leaving directory '/builds/lscsoft/ligo-segments/test'
ERROR: Job failed: exit code 1