debian/rules: try again to disable tests

- seems you need to leave the target override in place, but empty, or it
  does something all by itself
14 jobs for master in 1 minute and 27 seconds (queued for 2 seconds)
Status Job ID Name Coverage
  Test
passed #190963
doc

00:00:30

failed #190959
test:2.7

00:01:13

failed #190960
test:3.4

00:01:23

failed #190961
test:3.5

00:01:24

failed #190962
test:3.6

00:01:26

 
  Build
skipped #190971
build:debian:jessie
skipped #190972
build:debian:stretch
skipped #190970
build:el7
skipped #190964
build:tarball
skipped #190965
build:wheel:cp27-cp27m-manylinux1
skipped #190966
build:wheel:cp27-cp27mu-manylinux1
skipped #190967
build:wheel:cp34-cp34m-manylinux1
skipped #190968
build:wheel:cp35-cp35m-manylinux1
skipped #190969
build:wheel:cp36-cp36m-manylinux1
 
Name Stage Failure
failed
test:3.6 Test
    from ligo.segments import utils as segmentsUtils
File "/usr/local/lib/python3.6/site-packages/ligo/segments/utils.py", line 34, in <module>
from lal import LIGOTimeGPS
ModuleNotFoundError: No module named 'lal'
Fail
Makefile:13: recipe for target 'segments_utils_verify' failed
make: *** [segments_utils_verify] Error 1
make: Leaving directory '/builds/lscsoft/ligo-segments/test'
ERROR: Job failed: exit code 1
failed
test:3.5 Test
    from ligo.segments import utils as segmentsUtils
File "/usr/local/lib/python3.5/site-packages/ligo/segments/utils.py", line 34, in <module>
from lal import LIGOTimeGPS
ImportError: No module named 'lal'
Fail
Makefile:13: recipe for target 'segments_utils_verify' failed
make: Leaving directory '/builds/lscsoft/ligo-segments/test'
make: *** [segments_utils_verify] Error 1
ERROR: Job failed: exit code 1
failed
test:3.4 Test
    from ligo.segments import utils as segmentsUtils
File "/usr/local/lib/python3.4/site-packages/ligo/segments/utils.py", line 34, in <module>
from lal import LIGOTimeGPS
ImportError: No module named 'lal'
Fail
Makefile:13: recipe for target 'segments_utils_verify' failed
make: Leaving directory '/builds/lscsoft/ligo-segments/test'
make: *** [segments_utils_verify] Error 1
ERROR: Job failed: exit code 1
failed
test:2.7 Test
    from ligo.segments import utils as segmentsUtils
File "/usr/local/lib/python2.7/site-packages/ligo/segments/utils.py", line 34, in <module>
from lal import LIGOTimeGPS
ImportError: No module named lal
Fail
Makefile:13: recipe for target 'segments_utils_verify' failed
make: Leaving directory '/builds/lscsoft/ligo-segments/test'
make: *** [segments_utils_verify] Error 1
ERROR: Job failed: exit code 1