Maintenance will be performed on git.ligo.org, chat.ligo.org, containers.ligo.org, and docs.ligo.org on Tuesday 7th July 2020 starting at approximately 10am PDT and lasting for around 15 minutes. There will be a short period of downtime towards the end of the maintenance window. Please direct any comments, questions, or concerns to uwm-help@cgca.uwm.edu.

remove six.h from build

14 jobs for master in 1 minute and 37 seconds (queued for 2 seconds)
Status Job ID Name Coverage
  Test
passed #236432
doc

00:00:38

failed #236428
test:2.7

00:01:23

failed #236429
test:3.4

00:01:31

failed #236430
test:3.5

00:01:32

failed #236431
test:3.6

00:01:36

 
  Build
skipped #236440
build:debian:jessie
skipped #236441
build:debian:stretch
skipped #236439
build:el7
skipped #236433
build:tarball
skipped #236434
build:wheel:cp27-cp27m-manylinux1
skipped #236435
build:wheel:cp27-cp27mu-manylinux1
skipped #236436
build:wheel:cp34-cp34m-manylinux1
skipped #236437
build:wheel:cp35-cp35m-manylinux1
skipped #236438
build:wheel:cp36-cp36m-manylinux1
 
Name Stage Failure
failed
test:3.6 Test
    from ligo.segments import utils as segmentsUtils
File "/usr/local/lib/python3.6/site-packages/ligo/segments/utils.py", line 34, in <module>
from lal import LIGOTimeGPS
ModuleNotFoundError: No module named 'lal'
Fail
Makefile:13: recipe for target 'segments_utils_verify' failed
make: Leaving directory '/builds/lscsoft/ligo-segments/test'
make: *** [segments_utils_verify] Error 1
ERROR: Job failed: exit code 1
failed
test:3.5 Test
    from ligo.segments import utils as segmentsUtils
File "/usr/local/lib/python3.5/site-packages/ligo/segments/utils.py", line 34, in <module>
from lal import LIGOTimeGPS
ImportError: No module named 'lal'
Fail
Makefile:13: recipe for target 'segments_utils_verify' failed
make: Leaving directory '/builds/lscsoft/ligo-segments/test'
make: *** [segments_utils_verify] Error 1
ERROR: Job failed: exit code 1
failed
test:3.4 Test
    from ligo.segments import utils as segmentsUtils
File "/usr/local/lib/python3.4/site-packages/ligo/segments/utils.py", line 34, in <module>
from lal import LIGOTimeGPS
ImportError: No module named 'lal'
Fail
Makefile:13: recipe for target 'segments_utils_verify' failed
make: Leaving directory '/builds/lscsoft/ligo-segments/test'
make: *** [segments_utils_verify] Error 1
ERROR: Job failed: exit code 1
failed
test:2.7 Test
    from ligo.segments import utils as segmentsUtils
File "/usr/local/lib/python2.7/site-packages/ligo/segments/utils.py", line 34, in <module>
from lal import LIGOTimeGPS
ImportError: No module named lal
Fail
make: *** [segments_utils_verify] Error 1
Makefile:13: recipe for target 'segments_utils_verify' failed
make: Leaving directory '/builds/lscsoft/ligo-segments/test'
ERROR: Job failed: exit code 1