begin 1.3.0 changelog

16 jobs for master in 2 minutes and 14 seconds (queued for 3 seconds)
Status Job ID Name Coverage
  Test
passed #249300
doc

00:00:36

failed #249295
test:2.7

00:02:12

failed #249296
test:3.4

00:01:59

failed #249297
test:3.5

00:01:56

failed #249298
test:3.6

00:01:56

failed #249299
test:3.7

00:01:44

 
  Build
skipped #249309
build:debian:jessie
skipped #249310
build:debian:stretch
skipped #249308
build:el7
skipped #249301
build:tarball
skipped #249302
build:wheel:cp27-cp27m-manylinux1
skipped #249303
build:wheel:cp27-cp27mu-manylinux1
skipped #249304
build:wheel:cp34-cp34m-manylinux1
skipped #249305
build:wheel:cp35-cp35m-manylinux1
skipped #249306
build:wheel:cp36-cp36m-manylinux1
skipped #249307
build:wheel:cp37-cp37m-manylinux1
 
Name Stage Failure
failed
test:2.7 Test
----------------------------------------------------------------------
Ran 27 tests in 26.026s

FAILED (errors=1)
Fail
Makefile:13: recipe for target 'segments_verify' failed
make: Leaving directory '/builds/lscsoft/ligo-segments/test'
make: *** [segments_verify] Error 1
ERROR: Job failed: exit code 1
failed
test:3.4 Test
----------------------------------------------------------------------
Ran 27 tests in 88.028s

OK (skipped=1)
Fail
Makefile:13: recipe for target 'segments_verify' failed
make: *** [segments_verify] Error 1
make: Leaving directory '/builds/lscsoft/ligo-segments/test'
ERROR: Job failed: exit code 1
failed
test:3.5 Test
**********************************************************************
1 items had failures:
1 of 20 in ligo.segments.segment
***Test Failed*** 1 failures.
Fail
Makefile:13: recipe for target 'segments_verify' failed
make: Leaving directory '/builds/lscsoft/ligo-segments/test'
make: *** [segments_verify] Error 1
ERROR: Job failed: exit code 1
failed
test:3.6 Test
----------------------------------------------------------------------
Ran 27 tests in 87.063s

OK (skipped=1)
Fail
Makefile:13: recipe for target 'segments_verify' failed
make: Leaving directory '/builds/lscsoft/ligo-segments/test'
make: *** [segments_verify] Error 1
ERROR: Job failed: exit code 1
failed
test:3.7 Test
**********************************************************************
1 items had failures:
1 of 20 in ligo.segments.segment
***Test Failed*** 1 failures.
Fail
make: *** [segments_verify] Error 1
Makefile:13: recipe for target 'segments_verify' failed
make: Leaving directory '/builds/lscsoft/ligo-segments/test'
ERROR: Job failed: exit code 1