typo

Status Name Job ID Coverage
  Build
passed conda #1640025

00:08:37

passed docker #1640026

00:03:44

passed tarball #1640024

00:00:26

 
  Basic
passed documentation #1640030

00:46:28

failed examples #1640031
allowed to fail

02:00:02

passed executables #1640027

00:03:00

passed imports #1640028

00:06:09

passed style #1640029

00:00:19

 
  Test:Base
failed python-3.7-base #1640032

00:36:21

63.0%
failed python-3.8-base #1640033

00:30:51

failed python-3.9-base #1640034

00:29:29

 
  Test:Executables
failed python-3.7-exe #1640035

02:00:03

failed python-3.8-exe #1640036

00:32:01

failed python-3.9-exe #1640037

00:35:45

 
  End To End
passed python-3.7-core #1640038

00:13:57

failed python-3.7-gw #1640041

00:31:04

passed python-3.8-core #1640039

00:13:32

failed python-3.8-gw #1640042

00:30:53

passed python-3.9-core #1640040

00:13:01

failed python-3.9-gw #1640043

00:36:33

 
  Compatibility
passed GWTC1 #1640048

00:13:13

passed GWTC2 #1640049

00:10:45

passed bilby #1640046

00:08:54

passed lalinference #1640045

00:06:04

passed ligo_skymap #1640044

00:02:45

2.0%
passed pycbc #1640047

00:04:02

 
  Coverage
skipped coverage #1640050
 
Name Stage Failure
failed
python-3.7-exe Test:Executables The script exceeded the maximum execution time set for the job
2021-10-27  11:25:05 PESummary INFO    : Command line arguments: Namespace(coverage=True, expression=None, ignore=[], mark='executabletest and not ligoskymaptest and not workflowtest', output='/builds/lscsoft/pesummary', pytest_config='/builds/lscsoft/pesummary/setup.cfg', repository='./pesummary', type='tests')
2021-10-27 11:25:05 PESummary INFO : Launching subprocess to run: 'pytest --pyargs pesummary.tests -c /builds/lscsoft/pesummary/setup.cfg --cov=pesummary --cov-report html:/builds/lscsoft/pesummary/htmlcov --cov-report term:skip-covered --cov-append -m 'executabletest and not ligoskymaptest and not workflowtest' '
============================= test session starts ==============================
platform linux -- Python 3.7.12, pytest-6.2.5, py-1.10.0, pluggy-1.0.0
rootdir: /builds/lscsoft/pesummary/_testing, configfile: ../setup.cfg
plugins: cov-3.0.0, ligo.skymap-0.5.3
collected 566 items / 504 deselected / 62 selected

executable_test.py ..............F...............FFF....F...
ERROR: Job failed: execution took longer than 2h0m0s seconds

failed
examples Basic The script exceeded the maximum execution time set for the job
2021-10-27  13:09:07 PESummary WARNING : Could not find delta_f in input file and one was not passed from the command line. Using 0.00390625Hz as default
2021-10-27 13:09:07 PESummary WARNING : Could not find minimum frequency in input file and one was not passed from the command line. Using 20.0Hz as default
2021-10-27 13:09:07 PESummary WARNING : The redshift is being approximated using interpolation. Bear in mind that this does introduce a small error.
2021-10-27 13:09:07 PESummary WARNING : Could not find reference_frequency in input file. Using 20Hz as default
2021-10-27 13:09:10 PESummary INFO : Averaging the final spin from the following fits: function bbh_final_spin_precessing_projected_UIB2016 at 0x7f7cd69c5f80, function bbh_final_spin_precessing_projected_Healyetal at 0x7f7cd69c5dd0, function bbh_final_spin_precessing_HBR2016 at 0x7f7cd69c8170
2021-10-27 13:09:10 PESummary INFO : Averaging the peak luminosity from the following fits: function bbh_peak_luminosity_non_precessing_UIB2016 at 0x7f7cd69c8200, function bbh_peak_luminosity_non_precessing_Healyetal at 0x7f7cd69c8290
2021-10-27 13:09:12 PESummary INFO : Averaging the final mass from the following fits: function bbh_final_mass_non_precessing_UIB2016 at 0x7f7cd69c5710, function bbh_final_mass_non_precessing_Healyetal at 0x7f7cd6ce33b0
2021-10-27 13:09:12 PESummary WARNING : Removing ./GWTC-1_sample_release/GW170817_GWTC-1.hdf5 from 2d contour plot because the parameters luminosity_distance and chirp_mass are not in the result file
ERROR: Job failed: execution took longer than 2h0m0s seconds

failed
python-3.9-gw End To End

Traceback (most recent call last):
File "/usr/local/bin/summarytest", line 8, in <module>
sys.exit(main())
File "/usr/local/lib/python3.9/site-packages/pesummary/cli/summarytest.py", line 304, in main
raise ValueError(
ValueError: The workflow test failed with error Command 'pytest --pyargs pesummary.tests.workflow_test -c /builds/lscsoft/pesummary/setup.cfg -k 'GW or gw' ' returned non-zero exit status 1.
Cleaning up project directory and file based variables
ERROR: Job failed: exit code 1

failed
python-3.7-base Test:Base

Traceback (most recent call last):
File "/usr/local/bin/summarytest", line 8, in <module>
sys.exit(main())
File "/usr/local/lib/python3.7/site-packages/pesummary/cli/summarytest.py", line 305, in main
"The {} test failed with error {}".format(opts.type, e)
ValueError: The tests test failed with error Command 'pytest --pyargs pesummary.tests -c /builds/lscsoft/pesummary/setup.cfg --cov=pesummary --cov-report html:/builds/lscsoft/pesummary/htmlcov --cov-report term:skip-covered --cov-append -m 'not executabletest and not ligoskymaptest and not workflowtest' ' returned non-zero exit status 1.
Cleaning up project directory and file based variables
ERROR: Job failed: exit code 1

failed
python-3.9-exe Test:Executables

Traceback (most recent call last):
File "/usr/local/bin/summarytest", line 8, in <module>
sys.exit(main())
File "/usr/local/lib/python3.9/site-packages/pesummary/cli/summarytest.py", line 304, in main
raise ValueError(
ValueError: The tests test failed with error Command 'pytest --pyargs pesummary.tests -c /builds/lscsoft/pesummary/setup.cfg -m 'executabletest and not ligoskymaptest and not workflowtest' ' returned non-zero exit status 1.
Cleaning up project directory and file based variables
ERROR: Job failed: exit code 1

failed
python-3.8-exe Test:Executables

Traceback (most recent call last):
File "/usr/local/bin/summarytest", line 8, in <module>
sys.exit(main())
File "/usr/local/lib/python3.8/site-packages/pesummary/cli/summarytest.py", line 304, in main
raise ValueError(
ValueError: The tests test failed with error Command 'pytest --pyargs pesummary.tests -c /builds/lscsoft/pesummary/setup.cfg -m 'executabletest and not ligoskymaptest and not workflowtest' ' returned non-zero exit status 1.
Cleaning up project directory and file based variables
ERROR: Job failed: exit code 1

failed
python-3.7-gw End To End

Traceback (most recent call last):
File "/usr/local/bin/summarytest", line 8, in <module>
sys.exit(main())
File "/usr/local/lib/python3.7/site-packages/pesummary/cli/summarytest.py", line 305, in main
"The {} test failed with error {}".format(opts.type, e)
ValueError: The workflow test failed with error Command 'pytest --pyargs pesummary.tests.workflow_test -c /builds/lscsoft/pesummary/setup.cfg -k 'GW or gw' ' returned non-zero exit status 1.
Cleaning up project directory and file based variables
ERROR: Job failed: exit code 1

failed
python-3.8-gw End To End

Traceback (most recent call last):
File "/usr/local/bin/summarytest", line 8, in <module>
sys.exit(main())
File "/usr/local/lib/python3.8/site-packages/pesummary/cli/summarytest.py", line 304, in main
raise ValueError(
ValueError: The workflow test failed with error Command 'pytest --pyargs pesummary.tests.workflow_test -c /builds/lscsoft/pesummary/setup.cfg -k 'GW or gw' ' returned non-zero exit status 1.
Cleaning up project directory and file based variables
ERROR: Job failed: exit code 1

failed
python-3.8-base Test:Base

Traceback (most recent call last):
File "/usr/local/bin/summarytest", line 8, in <module>
sys.exit(main())
File "/usr/local/lib/python3.8/site-packages/pesummary/cli/summarytest.py", line 304, in main
raise ValueError(
ValueError: The tests test failed with error Command 'pytest --pyargs pesummary.tests -c /builds/lscsoft/pesummary/setup.cfg -m 'not executabletest and not ligoskymaptest and not workflowtest' ' returned non-zero exit status 1.
Cleaning up project directory and file based variables
ERROR: Job failed: exit code 1

failed
python-3.9-base Test:Base

Traceback (most recent call last):
File "/usr/local/bin/summarytest", line 8, in <module>
sys.exit(main())
File "/usr/local/lib/python3.9/site-packages/pesummary/cli/summarytest.py", line 304, in main
raise ValueError(
ValueError: The tests test failed with error Command 'pytest --pyargs pesummary.tests -c /builds/lscsoft/pesummary/setup.cfg -m 'not executabletest and not ligoskymaptest and not workflowtest' ' returned non-zero exit status 1.
Cleaning up project directory and file based variables
ERROR: Job failed: exit code 1