\relax 
\providecommand\hyper@newdestlabel[2]{}
\@writefile{toc}{\contentsline {section}{\numberline {3}Use Cases}{6}{section.3}\protected@file@percent }
\newlabel{sec:use_cases}{{3}{6}{Use Cases}{section.3}{}}
\@writefile{toc}{\contentsline {subsection}{\numberline {3.1}Bank generation}{6}{subsection.3.1}\protected@file@percent }
\newlabel{sec:bank_generation}{{3.1}{6}{Bank generation}{subsection.3.1}{}}
\@writefile{toc}{\contentsline {subsubsection}{\numberline {3.1.1}submit\_30.sh}{6}{subsubsection.3.1.1}\protected@file@percent }
\newlabel{sec:submit_30}{{3.1.1}{6}{submit\_30.sh}{subsubsection.3.1.1}{}}
\@writefile{lol}{\contentsline {lstlisting}{example\textunderscore code\textunderscore use/submit\textunderscore 30.sh}{6}{lstlisting.-1}\protected@file@percent }
\@writefile{toc}{\contentsline {subsubsection}{\numberline {3.1.2}bank\_postprocessing example}{6}{subsubsection.3.1.2}\protected@file@percent }
\@writefile{lol}{\contentsline {lstlisting}{example\textunderscore code\textunderscore use/bank\textunderscore postprocessing\textunderscore \textunderscore test.py}{6}{lstlisting.-2}\protected@file@percent }
\@writefile{toc}{\contentsline {subsubsection}{\numberline {3.1.3}TO DO items}{7}{subsubsection.3.1.3}\protected@file@percent }
\newlabel{sec:bank_utils_todo}{{3.1.3}{7}{TO DO items}{subsubsection.3.1.3}{}}
\@writefile{toc}{\contentsline {subsection}{\numberline {3.2}Injection run follow-up}{8}{subsection.3.2}\protected@file@percent }
\newlabel{sec:injection_examples}{{3.2}{8}{Injection run follow-up}{subsection.3.2}{}}
\@writefile{toc}{\contentsline {subsubsection}{\numberline {3.2.1}combined\_dataframe\_from\_xml\_files\_\_test.py}{8}{subsubsection.3.2.1}\protected@file@percent }
\newlabel{sec:combined_dataframe_example}{{3.2.1}{8}{combined\_dataframe\_from\_xml\_files\_\_test.py}{subsubsection.3.2.1}{}}
\@writefile{lol}{\contentsline {lstlisting}{example\textunderscore code\textunderscore use/create\textunderscore combined\textunderscore dataframe\textunderscore from\textunderscore xml\textunderscore files\textunderscore \textunderscore test.py}{8}{lstlisting.-3}\protected@file@percent }
\@writefile{toc}{\contentsline {subsubsection}{\numberline {3.2.2}create\_scatter\_plot\_\_test.py}{9}{subsubsection.3.2.2}\protected@file@percent }
\newlabel{sec:create_scatter_plot}{{3.2.2}{9}{create\_scatter\_plot\_\_test.py}{subsubsection.3.2.2}{}}
\@writefile{lol}{\contentsline {lstlisting}{example\textunderscore code\textunderscore use/create\textunderscore scatter\textunderscore plot\textunderscore \textunderscore test.py}{9}{lstlisting.-4}\protected@file@percent }
\@writefile{toc}{\contentsline {subsection}{\numberline {3.3}Interacting with databases}{9}{subsection.3.3}\protected@file@percent }
\newlabel{sec:database_interaction}{{3.3}{9}{Interacting with databases}{subsection.3.3}{}}
\@writefile{toc}{\contentsline {subsubsection}{\numberline {3.3.1}Gracedb}{9}{subsubsection.3.3.1}\protected@file@percent }
\newlabel{sec:gracedb}{{3.3.1}{9}{Gracedb}{subsubsection.3.3.1}{}}
\@writefile{toc}{\contentsline {subsubsection}{\numberline {3.3.2}GwdcDb}{9}{subsubsection.3.3.2}\protected@file@percent }
\newlabel{sec:gwdcdb}{{3.3.2}{9}{GwdcDb}{subsubsection.3.3.2}{}}
\@writefile{toc}{\contentsline {paragraph}{Test Connection:}{9}{section*.2}\protected@file@percent }
\@writefile{lol}{\contentsline {lstlisting}{../testConnection.py}{10}{lstlisting.-5}\protected@file@percent }
\@writefile{toc}{\contentsline {paragraph}{Working with Pandas:}{11}{section*.3}\protected@file@percent }
\@writefile{lol}{\contentsline {lstlisting}{../samples/db/pandasDataframe.py}{11}{lstlisting.-6}\protected@file@percent }
\@setckpt{sections/usecase}{
\setcounter{page}{12}
\setcounter{equation}{0}
\setcounter{enumi}{4}
\setcounter{enumii}{15}
\setcounter{enumiii}{0}
\setcounter{enumiv}{0}
\setcounter{footnote}{5}
\setcounter{mpfootnote}{0}
\setcounter{part}{0}
\setcounter{section}{3}
\setcounter{subsection}{3}
\setcounter{subsubsection}{2}
\setcounter{paragraph}{0}
\setcounter{subparagraph}{0}
\setcounter{figure}{0}
\setcounter{table}{0}
\setcounter{blindtext}{1}
\setcounter{Blindtext}{5}
\setcounter{blind@countparstart}{0}
\setcounter{blindlist}{0}
\setcounter{blindlistlevel}{0}
\setcounter{blindlist@level}{0}
\setcounter{blind@listcount}{0}
\setcounter{blind@levelcount}{0}
\setcounter{blind@randomcount}{0}
\setcounter{blind@randommax}{0}
\setcounter{blind@pangramcount}{0}
\setcounter{blind@pangrammax}{0}
\setcounter{lstnumber}{38}
\setcounter{Item}{36}
\setcounter{Hfootnote}{5}
\setcounter{bookmark@seq@number}{13}
\setcounter{LT@tables}{0}
\setcounter{LT@chunks}{0}
\setcounter{tcbbreakpart}{0}
\setcounter{tcblayer}{0}
\setcounter{tcbrastercolumn}{0}
\setcounter{tcbrasterrow}{0}
\setcounter{tcbraster}{0}
\setcounter{parentequation}{0}
\setcounter{tcblisting}{0}
\setcounter{lstlisting}{0}
\setcounter{section@level}{4}
}
