\relax 
\providecommand\hyper@newdestlabel[2]{}
\@writefile{toc}{\contentsline {section}{\numberline {D}Connect PyCharm to job allocation resources}{20}{appendix.D}\protected@file@percent }
\newlabel{sec:connect_to_job}{{D}{20}{Connect PyCharm to job allocation resources}{appendix.D}{}}
\@writefile{toc}{\contentsline {subsection}{\numberline {D.1}Get a remote job allocation}{20}{subsection.D.1}\protected@file@percent }
\newlabel{sec:get_remote_job}{{D.1}{20}{Get a remote job allocation}{subsection.D.1}{}}
\@writefile{toc}{\contentsline {subsection}{\numberline {D.2}Connect an assigned resource to the login node}{20}{subsection.D.2}\protected@file@percent }
\@writefile{toc}{\contentsline {subsection}{\numberline {D.3}Connect local interpreter to assigned resource}{21}{subsection.D.3}\protected@file@percent }
\@setckpt{appendix/connect_to_job_allocation}{
\setcounter{page}{22}
\setcounter{equation}{0}
\setcounter{enumi}{8}
\setcounter{enumii}{8}
\setcounter{enumiii}{5}
\setcounter{enumiv}{0}
\setcounter{footnote}{30}
\setcounter{mpfootnote}{0}
\setcounter{part}{0}
\setcounter{section}{4}
\setcounter{subsection}{3}
\setcounter{subsubsection}{0}
\setcounter{paragraph}{0}
\setcounter{subparagraph}{0}
\setcounter{figure}{2}
\setcounter{table}{0}
\setcounter{blindtext}{1}
\setcounter{Blindtext}{5}
\setcounter{blind@countparstart}{0}
\setcounter{blindlist}{0}
\setcounter{blindlistlevel}{0}
\setcounter{blindlist@level}{0}
\setcounter{blind@listcount}{0}
\setcounter{blind@levelcount}{0}
\setcounter{blind@randomcount}{0}
\setcounter{blind@randommax}{0}
\setcounter{blind@pangramcount}{0}
\setcounter{blind@pangrammax}{0}
\setcounter{lstnumber}{37}
\setcounter{Item}{72}
\setcounter{Hfootnote}{34}
\setcounter{bookmark@seq@number}{24}
\setcounter{LT@tables}{0}
\setcounter{LT@chunks}{0}
\setcounter{tcbbreakpart}{1}
\setcounter{tcblayer}{0}
\setcounter{tcbrastercolumn}{0}
\setcounter{tcbrasterrow}{0}
\setcounter{tcbraster}{0}
\setcounter{parentequation}{0}
\setcounter{tcblisting}{0}
\setcounter{lstlisting}{0}
\setcounter{section@level}{2}
}
