\BOOKMARK [1][-]{section.1}{Introduction}{}% 1
\BOOKMARK [1][-]{section.2}{Code Style Guide}{}% 2
\BOOKMARK [1][-]{section.3}{Use Cases}{}% 3
\BOOKMARK [2][-]{subsection.3.1}{Bank generation}{section.3}% 4
\BOOKMARK [3][-]{subsubsection.3.1.1}{submit\13730.sh}{subsection.3.1}% 5
\BOOKMARK [3][-]{subsubsection.3.1.2}{bank\137postprocessing example}{subsection.3.1}% 6
\BOOKMARK [3][-]{subsubsection.3.1.3}{TO DO items}{subsection.3.1}% 7
\BOOKMARK [2][-]{subsection.3.2}{Injection run follow-up}{section.3}% 8
\BOOKMARK [3][-]{subsubsection.3.2.1}{combined\137dataframe\137from\137xml\137files\137\137test.py}{subsection.3.2}% 9
\BOOKMARK [3][-]{subsubsection.3.2.2}{create\137scatter\137plot\137\137test.py}{subsection.3.2}% 10
\BOOKMARK [2][-]{subsection.3.3}{Interacting with databases}{section.3}% 11
\BOOKMARK [3][-]{subsubsection.3.3.1}{Gracedb}{subsection.3.3}% 12
\BOOKMARK [3][-]{subsubsection.3.3.2}{GwdcDb}{subsection.3.3}% 13
\BOOKMARK [1][-]{section.4}{Regression tests}{}% 14
\BOOKMARK [2][-]{subsection.4.1}{Source detection:unit\137testing.create.trigger\137comparison\(\)}{section.4}% 15
\BOOKMARK [2][-]{subsection.4.2}{Source localisation:unit\137testing.create.skymap\137comparison\(\)}{section.4}% 16
\BOOKMARK [2][-]{subsection.4.3}{Template bank generation: unit\137testing.create.bank\137generation\137comparison\(\)}{section.4}% 17
\BOOKMARK [1][-]{appendix.A}{bank\137utils}{}% 18
\BOOKMARK [2][-]{subsection.A.1}{create.py}{appendix.A}% 19
\BOOKMARK [3][-]{subsubsection.A.1.1}{err\137file\137information\137report}{subsection.A.1}% 20
\BOOKMARK [3][-]{subsubsection.A.1.2}{select\137templates\137from\137full\137banks}{subsection.A.1}% 21
\BOOKMARK [2][-]{subsection.A.2}{base.py}{appendix.A}% 22
\BOOKMARK [3][-]{subsubsection.A.2.1}{get\137approximant}{subsection.A.2}% 23
\BOOKMARK [3][-]{subsubsection.A.2.2}{get\137num\137jobs}{subsection.A.2}% 24
\BOOKMARK [3][-]{subsubsection.A.2.3}{extract\137job\137parameters\137from\137directory\137name}{subsection.A.2}% 25
\BOOKMARK [3][-]{subsubsection.A.2.4}{write\137header\137for\137error\137status\137file}{subsection.A.2}% 26
\BOOKMARK [3][-]{subsubsection.A.2.5}{parse\137relevant\137err\137file\137line}{subsection.A.2}% 27
\BOOKMARK [3][-]{subsubsection.A.2.6}{create\137err\137status\137file}{subsection.A.2}% 28
\BOOKMARK [3][-]{subsubsection.A.2.7}{create\137single\137bank\137report\137file}{subsection.A.2}% 29
\BOOKMARK [3][-]{subsubsection.A.2.8}{get\137bank\137object}{subsection.A.2}% 30
\BOOKMARK [3][-]{subsubsection.A.2.9}{get\137single\137template\137parameters\137from\137bank\137object}{subsection.A.2}% 31
\BOOKMARK [3][-]{subsubsection.A.2.10}{compare\137template\137parameters}{subsection.A.2}% 32
\BOOKMARK [3][-]{subsubsection.A.2.11}{get\137reference\137bank\137object}{subsection.A.2}% 33
\BOOKMARK [3][-]{subsubsection.A.2.12}{make\137dictionary}{subsection.A.2}% 34
\BOOKMARK [1][-]{appendix.B}{postprocess\137utils}{}% 35
\BOOKMARK [2][-]{subsection.B.1}{create.py}{appendix.B}% 36
\BOOKMARK [3][-]{subsubsection.B.1.1}{combined\137dataframe\137from\137xml\137files}{subsection.B.1}% 37
\BOOKMARK [3][-]{subsubsection.B.1.2}{csv\137file\137from\137parsed\137command\137line\137arguments}{subsection.B.1}% 38
\BOOKMARK [2][-]{subsection.B.2}{base.py}{appendix.B}% 39
\BOOKMARK [3][-]{subsubsection.B.2.1}{use\137ligolw\137to\137extract\137parameters}{subsection.B.2}% 40
\BOOKMARK [3][-]{subsubsection.B.2.2}{get\137line\137elements}{subsection.B.2}% 41
\BOOKMARK [3][-]{subsubsection.B.2.3}{get\137all\137variable\137flags}{subsection.B.2}% 42
\BOOKMARK [3][-]{subsubsection.B.2.4}{get\137output\137string}{subsection.B.2}% 43
\BOOKMARK [1][-]{appendix.C}{db\137utils}{}% 44
\BOOKMARK [2][-]{subsection.C.1}{base.py}{appendix.C}% 45
\BOOKMARK [3][-]{subsubsection.C.1.1}{get\137current\137time\137string}{subsection.C.1}% 46
\BOOKMARK [3][-]{subsubsection.C.1.2}{get\137GraceDB\137client}{subsection.C.1}% 47
\BOOKMARK [3][-]{subsubsection.C.1.3}{clean\137gracedb\137row}{subsection.C.1}% 48
\BOOKMARK [3][-]{subsubsection.C.1.4}{get\137event\137df}{subsection.C.1}% 49
\BOOKMARK [3][-]{subsubsection.C.1.5}{get\137autocorr\137and\137latency}{subsection.C.1}% 50
\BOOKMARK [2][-]{subsection.C.2}{GwdcDb.py}{appendix.C}% 51
\BOOKMARK [1][-]{appendix.D}{plot\137utils}{}% 52
\BOOKMARK [2][-]{subsection.D.1}{create.py}{appendix.D}% 53
\BOOKMARK [3][-]{subsubsection.D.1.1}{heatmap\137plot}{subsection.D.1}% 54
\BOOKMARK [3][-]{subsubsection.D.1.2}{scatter\137plot\1372hist}{subsection.D.1}% 55
\BOOKMARK [3][-]{subsubsection.D.1.3}{scatter\137plot}{subsection.D.1}% 56
\BOOKMARK [2][-]{subsection.D.2}{base.py}{appendix.D}% 57
\BOOKMARK [1][-]{appendix.E}{unit\137testing}{}% 58
\BOOKMARK [2][-]{subsection.E.1}{create.py}{appendix.E}% 59
\BOOKMARK [3][-]{subsubsection.E.1.1}{trigger\137comparison}{subsection.E.1}% 60
\BOOKMARK [3][-]{subsubsection.E.1.2}{skymap\137comparison}{subsection.E.1}% 61
\BOOKMARK [3][-]{subsubsection.E.1.3}{bank\137generation\137comparison}{subsection.E.1}% 62
\BOOKMARK [2][-]{subsection.E.2}{base.py}{appendix.E}% 63
\BOOKMARK [3][-]{subsubsection.E.2.1}{append\137line\137to\137file}{subsection.E.2}% 64
\BOOKMARK [3][-]{subsubsection.E.2.2}{append\137line\137to\137fh}{subsection.E.2}% 65
\BOOKMARK [3][-]{subsubsection.E.2.3}{record\137machine\137info\137to\137fh}{subsection.E.2}% 66
\BOOKMARK [3][-]{subsubsection.E.2.4}{images\137similar}{subsection.E.2}% 67
\BOOKMARK [3][-]{subsubsection.E.2.5}{get\137uid}{subsection.E.2}% 68
\BOOKMARK [3][-]{subsubsection.E.2.6}{get\137gid}{subsection.E.2}% 69
\BOOKMARK [3][-]{subsubsection.E.2.7}{get\137user}{subsection.E.2}% 70
\BOOKMARK [3][-]{subsubsection.E.2.8}{get\137group}{subsection.E.2}% 71
\BOOKMARK [3][-]{subsubsection.E.2.9}{get\137current\137time\137string}{subsection.E.2}% 72
\BOOKMARK [3][-]{subsubsection.E.2.10}{compare\137zerolag\137trigger\137files}{subsection.E.2}% 73
\BOOKMARK [3][-]{subsubsection.E.2.11}{write\137submission\137script}{subsection.E.2}% 74
\BOOKMARK [3][-]{subsubsection.E.2.12}{compare\137bank\137template}{subsection.E.2}% 75
\BOOKMARK [3][-]{subsubsection.E.2.13}{compare\137full\137banks}{subsection.E.2}% 76
\BOOKMARK [3][-]{subsubsection.E.2.14}{write\137output\137file\137for\137bank\137comparison}{subsection.E.2}% 77
\BOOKMARK [1][-]{appendix.F}{banks.sh}{}% 78
\BOOKMARK [2][-]{subsubsection.F.0.1}{verbose output of create.err\137file\137information\137report}{appendix.F}% 79
\BOOKMARK [1][-]{appendix.G}{create\137docs.py}{}% 80
