\relax 
\providecommand\hyper@newdestlabel[2]{}
\@writefile{toc}{\contentsline {section}{\numberline {A}Bash tips}{12}{appendix.A}\protected@file@percent }
\newlabel{sec:bash_tips}{{A}{12}{Bash tips}{appendix.A}{}}
\@writefile{toc}{\contentsline {subsection}{\numberline {A.1}for your local machine}{12}{subsection.A.1}\protected@file@percent }
\newlabel{sec:local_machine}{{A.1}{12}{for your local machine}{subsection.A.1}{}}
\@writefile{lol}{\contentsline {lstlisting}{appendix/example\textunderscore local\textunderscore bash\textunderscore aliases\textunderscore functions.sh}{12}{lstlisting.-1}\protected@file@percent }
\@writefile{toc}{\contentsline {subsection}{\numberline {A.2}for your remote OzStar environment}{12}{subsection.A.2}\protected@file@percent }
\newlabel{sec:remote_machine}{{A.2}{12}{for your remote OzStar environment}{subsection.A.2}{}}
\@writefile{lol}{\contentsline {lstlisting}{appendix/example\textunderscore remote\textunderscore bash\textunderscore aliases\textunderscore functions.sh}{12}{lstlisting.-2}\protected@file@percent }
\@setckpt{appendix/bash_tips}{
\setcounter{page}{14}
\setcounter{equation}{0}
\setcounter{enumi}{0}
\setcounter{enumii}{0}
\setcounter{enumiii}{0}
\setcounter{enumiv}{0}
\setcounter{footnote}{14}
\setcounter{mpfootnote}{0}
\setcounter{part}{0}
\setcounter{section}{1}
\setcounter{subsection}{2}
\setcounter{subsubsection}{0}
\setcounter{paragraph}{0}
\setcounter{subparagraph}{0}
\setcounter{figure}{2}
\setcounter{table}{0}
\setcounter{blindtext}{1}
\setcounter{Blindtext}{5}
\setcounter{blind@countparstart}{0}
\setcounter{blindlist}{0}
\setcounter{blindlistlevel}{0}
\setcounter{blindlist@level}{0}
\setcounter{blind@listcount}{0}
\setcounter{blind@levelcount}{0}
\setcounter{blind@randomcount}{0}
\setcounter{blind@randommax}{0}
\setcounter{blind@pangramcount}{0}
\setcounter{blind@pangrammax}{0}
\setcounter{lstnumber}{37}
\setcounter{Item}{0}
\setcounter{Hfootnote}{17}
\setcounter{bookmark@seq@number}{10}
\setcounter{LT@tables}{0}
\setcounter{LT@chunks}{0}
\setcounter{tcbbreakpart}{1}
\setcounter{tcblayer}{0}
\setcounter{tcbrastercolumn}{0}
\setcounter{tcbrasterrow}{0}
\setcounter{tcbraster}{0}
\setcounter{parentequation}{0}
\setcounter{tcblisting}{0}
\setcounter{lstlisting}{0}
\setcounter{section@level}{2}
}
