  0.000000e+00   2.552875e-03   0.000000e+00   2.552875e-03   0.000000e+00 
  2.500000e-01   2.952689e-03   0.000000e+00   2.952689e-03   0.000000e+00 
  5.000000e-01   2.789190e-03   0.000000e+00   2.789190e-03   0.000000e+00 
  7.500000e-01   2.415576e-03   0.000000e+00   2.415576e-03   0.000000e+00 
  1.000000e+00   2.188867e-03   0.000000e+00   2.188867e-03   0.000000e+00 
  1.250000e+00   1.887253e-03   0.000000e+00   1.887253e-03   0.000000e+00 
  1.500000e+00   1.372554e-03   0.000000e+00   1.372554e-03   0.000000e+00 
  1.750000e+00   1.606159e-03   0.000000e+00   1.606159e-03   0.000000e+00 
  2.000000e+00   1.418073e-03   0.000000e+00   1.418073e-03   0.000000e+00 
  2.250000e+00   1.119305e-03   0.000000e+00   1.119305e-03   0.000000e+00 
  2.500000e+00   1.198531e-03   0.000000e+00   1.198531e-03   0.000000e+00 
  2.750000e+00   1.328241e-03   0.000000e+00   1.328241e-03   0.000000e+00 
  3.000000e+00   1.198674e-03   0.000000e+00   1.198674e-03   0.000000e+00 
  3.250000e+00   8.312018e-04   0.000000e+00   8.312018e-04   0.000000e+00 
  3.500000e+00   8.594800e-04   0.000000e+00   8.594800e-04   0.000000e+00 
  3.750000e+00   1.115706e-03   0.000000e+00   1.115706e-03   0.000000e+00 
  4.000000e+00   1.161942e-03   0.000000e+00   1.161942e-03   0.000000e+00 
  4.250000e+00   9.193430e-04   0.000000e+00   9.193430e-04   0.000000e+00 
  4.500000e+00   7.251425e-04   0.000000e+00   7.251425e-04   0.000000e+00 
  4.750000e+00   7.981139e-04   0.000000e+00   7.981139e-04   0.000000e+00 
  5.000000e+00   7.088488e-04   0.000000e+00   7.088488e-04   0.000000e+00 
  5.250000e+00   7.077668e-04   0.000000e+00   7.077668e-04   0.000000e+00 
  5.500000e+00   7.180690e-04   0.000000e+00   7.180690e-04   0.000000e+00 
  5.750000e+00   6.702379e-04   0.000000e+00   6.702379e-04   0.000000e+00 
  6.000000e+00   7.699271e-04   0.000000e+00   7.699271e-04   0.000000e+00 
  6.250000e+00   9.061426e-04   0.000000e+00   9.061426e-04   0.000000e+00 
  6.500000e+00   8.374453e-04   0.000000e+00   8.374453e-04   0.000000e+00 
  6.750000e+00   6.435848e-04   0.000000e+00   6.435848e-04   0.000000e+00 
  7.000000e+00   7.783631e-04   0.000000e+00   7.783631e-04   0.000000e+00 
  7.250000e+00   6.351590e-04   0.000000e+00   6.351590e-04   0.000000e+00 
  7.500000e+00   7.222435e-04   0.000000e+00   7.222435e-04   0.000000e+00 
  7.750000e+00   6.595389e-04   0.000000e+00   6.595389e-04   0.000000e+00 
  8.000000e+00   5.093637e-04   0.000000e+00   5.093637e-04   0.000000e+00 
  8.250000e+00   7.549261e-04   0.000000e+00   7.549261e-04   0.000000e+00 
  8.500000e+00   7.707167e-04   0.000000e+00   7.707167e-04   0.000000e+00 
  8.750000e+00   7.305599e-04   0.000000e+00   7.305599e-04   0.000000e+00 
  9.000000e+00   5.993164e-04   0.000000e+00   5.993164e-04   0.000000e+00 
  9.250000e+00   5.463580e-04   0.000000e+00   5.463580e-04   0.000000e+00 
  9.500000e+00   5.339617e-04   0.000000e+00   5.339617e-04   0.000000e+00 
  9.750000e+00   5.061193e-04   0.000000e+00   5.061193e-04   0.000000e+00 
  1.000000e+01   4.955321e-04   0.000000e+00   4.955321e-04   0.000000e+00 
  1.025000e+01   4.812826e-04   0.000000e+00   4.812826e-04   0.000000e+00 
  1.050000e+01   5.652498e-04   0.000000e+00   5.652498e-04   0.000000e+00 
  1.075000e+01   5.987905e-04   0.000000e+00   5.987905e-04   0.000000e+00 
  1.100000e+01   5.308637e-04   0.000000e+00   5.308637e-04   0.000000e+00 
  1.125000e+01   4.699031e-04   0.000000e+00   4.699031e-04   0.000000e+00 
  1.150000e+01   5.035507e-04   0.000000e+00   5.035507e-04   0.000000e+00 
  1.175000e+01   4.195813e-04   0.000000e+00   4.195813e-04   0.000000e+00 
  1.200000e+01   4.906388e-04   0.000000e+00   4.906388e-04   0.000000e+00 
  1.225000e+01   5.002935e-04   0.000000e+00   5.002935e-04   0.000000e+00 
  1.250000e+01   4.705617e-04   0.000000e+00   4.705617e-04   0.000000e+00 
  1.275000e+01   3.274372e-04   0.000000e+00   3.274372e-04   0.000000e+00 
  1.300000e+01   2.348623e-04   0.000000e+00   2.348623e-04   0.000000e+00 
  1.325000e+01   3.272522e-04   0.000000e+00   3.272522e-04   0.000000e+00 
  1.350000e+01   4.236057e-04   0.000000e+00   4.236057e-04   0.000000e+00 
  1.375000e+01   4.495021e-04   0.000000e+00   4.495021e-04   0.000000e+00 
  1.400000e+01   3.738255e-04   0.000000e+00   3.738255e-04   0.000000e+00 
  1.425000e+01   3.312576e-04   0.000000e+00   3.312576e-04   0.000000e+00 
  1.450000e+01   2.939496e-04   0.000000e+00   2.939496e-04   0.000000e+00 
  1.475000e+01   2.916265e-04   0.000000e+00   2.916265e-04   0.000000e+00 
  1.500000e+01   4.014377e-04   0.000000e+00   4.014377e-04   0.000000e+00 
  1.525000e+01   3.584916e-04   0.000000e+00   3.584916e-04   0.000000e+00 
  1.550000e+01   3.139305e-04   0.000000e+00   3.139305e-04   0.000000e+00 
  1.575000e+01   3.397720e-04   0.000000e+00   3.397720e-04   0.000000e+00 
  1.600000e+01   3.270123e-04   0.000000e+00   3.270123e-04   0.000000e+00 
  1.625000e+01   3.007531e-04   0.000000e+00   3.007531e-04   0.000000e+00 
  1.650000e+01   2.703779e-04   0.000000e+00   2.703779e-04   0.000000e+00 
  1.675000e+01   2.162529e-04   0.000000e+00   2.162529e-04   0.000000e+00 
  1.700000e+01   2.812910e-04   0.000000e+00   2.812910e-04   0.000000e+00 
  1.725000e+01   2.617853e-04   0.000000e+00   2.617853e-04   0.000000e+00 
  1.750000e+01   2.652733e-04   0.000000e+00   2.652733e-04   0.000000e+00 
  1.775000e+01   2.680344e-04   0.000000e+00   2.680344e-04   0.000000e+00 
  1.800000e+01   2.426686e-04   0.000000e+00   2.426686e-04   0.000000e+00 
  1.825000e+01   2.635610e-04   0.000000e+00   2.635610e-04   0.000000e+00 
  1.850000e+01   3.237881e-04   0.000000e+00   3.237881e-04   0.000000e+00 
  1.875000e+01   3.517191e-04   0.000000e+00   3.517191e-04   0.000000e+00 
  1.900000e+01   2.889540e-04   0.000000e+00   2.889540e-04   0.000000e+00 
  1.925000e+01   2.564536e-04   0.000000e+00   2.564536e-04   0.000000e+00 
  1.950000e+01   2.428338e-04   0.000000e+00   2.428338e-04   0.000000e+00 
  1.975000e+01   2.456014e-04   0.000000e+00   2.456014e-04   0.000000e+00 
  2.000000e+01   2.554381e-04   0.000000e+00   2.554381e-04   0.000000e+00 
  2.025000e+01   2.062586e-04   0.000000e+00   2.062586e-04   0.000000e+00 
  2.050000e+01   1.949978e-04   0.000000e+00   1.949978e-04   0.000000e+00 
  2.075000e+01   2.299113e-04   0.000000e+00   2.299113e-04   0.000000e+00 
  2.100000e+01   2.827142e-04   0.000000e+00   2.827142e-04   0.000000e+00 
  2.125000e+01   2.377543e-04   0.000000e+00   2.377543e-04   0.000000e+00 
  2.150000e+01   2.156936e-04   0.000000e+00   2.156936e-04   0.000000e+00 
  2.175000e+01   2.197075e-04   0.000000e+00   2.197075e-04   0.000000e+00 
  2.200000e+01   1.868733e-04   0.000000e+00   1.868733e-04   0.000000e+00 
  2.225000e+01   1.450696e-04   0.000000e+00   1.450696e-04   0.000000e+00 
  2.250000e+01   1.928115e-04   0.000000e+00   1.928115e-04   0.000000e+00 
  2.275000e+01   2.303907e-04   0.000000e+00   2.303907e-04   0.000000e+00 
  2.300000e+01   2.214651e-04   0.000000e+00   2.214651e-04   0.000000e+00 
  2.325000e+01   1.422845e-04   0.000000e+00   1.422845e-04   0.000000e+00 
  2.350000e+01   1.631929e-04   0.000000e+00   1.631929e-04   0.000000e+00 
  2.375000e+01   2.019127e-04   0.000000e+00   2.019127e-04   0.000000e+00 
  2.400000e+01   2.247794e-04   0.000000e+00   2.247794e-04   0.000000e+00 
  2.425000e+01   2.183723e-04   0.000000e+00   2.183723e-04   0.000000e+00 
  2.450000e+01   1.824404e-04   0.000000e+00   1.824404e-04   0.000000e+00 
  2.475000e+01   1.179524e-04   0.000000e+00   1.179524e-04   0.000000e+00 
  2.500000e+01   1.262216e-04   0.000000e+00   1.262216e-04   0.000000e+00 
  2.525000e+01   1.460058e-04   0.000000e+00   1.460058e-04   0.000000e+00 
  2.550000e+01   1.326584e-04   0.000000e+00   1.326584e-04   0.000000e+00 
  2.575000e+01   1.268034e-04   0.000000e+00   1.268034e-04   0.000000e+00 
  2.600000e+01   1.405018e-04   0.000000e+00   1.405018e-04   0.000000e+00 
  2.625000e+01   1.222591e-04   0.000000e+00   1.222591e-04   0.000000e+00 
  2.650000e+01   1.498290e-04   0.000000e+00   1.498290e-04   0.000000e+00 
  2.675000e+01   1.190205e-04   0.000000e+00   1.190205e-04   0.000000e+00 
  2.700000e+01   1.110861e-04   0.000000e+00   1.110861e-04   0.000000e+00 
  2.725000e+01   1.375644e-04   0.000000e+00   1.375644e-04   0.000000e+00 
  2.750000e+01   1.453150e-04   0.000000e+00   1.453150e-04   0.000000e+00 
  2.775000e+01   9.392941e-05   0.000000e+00   9.392941e-05   0.000000e+00 
  2.800000e+01   1.343070e-04   0.000000e+00   1.343070e-04   0.000000e+00 
  2.825000e+01   1.682225e-04   0.000000e+00   1.682225e-04   0.000000e+00 
  2.850000e+01   1.413168e-04   0.000000e+00   1.413168e-04   0.000000e+00 
  2.875000e+01   1.314260e-04   0.000000e+00   1.314260e-04   0.000000e+00 
  2.900000e+01   1.250430e-04   0.000000e+00   1.250430e-04   0.000000e+00 
  2.925000e+01   1.300040e-04   0.000000e+00   1.300040e-04   0.000000e+00 
  2.950000e+01   1.050467e-04   0.000000e+00   1.050467e-04   0.000000e+00 
  2.975000e+01   1.087703e-04   0.000000e+00   1.087703e-04   0.000000e+00 
  3.000000e+01   1.185895e-04   0.000000e+00   1.185895e-04   0.000000e+00 
  3.025000e+01   1.032031e-04   0.000000e+00   1.032031e-04   0.000000e+00 
  3.050000e+01   1.205766e-04   0.000000e+00   1.205766e-04   0.000000e+00 
  3.075000e+01   1.383527e-04   0.000000e+00   1.383527e-04   0.000000e+00 
  3.100000e+01   1.284078e-04   0.000000e+00   1.284078e-04   0.000000e+00 
  3.125000e+01   1.302423e-04   0.000000e+00   1.302423e-04   0.000000e+00 
  3.150000e+01   8.923736e-05   0.000000e+00   8.923736e-05   0.000000e+00 
  3.175000e+01   8.113888e-05   0.000000e+00   8.113888e-05   0.000000e+00 
  3.200000e+01   8.850615e-05   0.000000e+00   8.850615e-05   0.000000e+00 
  3.225000e+01   8.445823e-05   0.000000e+00   8.445823e-05   0.000000e+00 
  3.250000e+01   9.839395e-05   0.000000e+00   9.839395e-05   0.000000e+00 
  3.275000e+01   9.590482e-05   0.000000e+00   9.590482e-05   0.000000e+00 
  3.300000e+01   1.068604e-04   0.000000e+00   1.068604e-04   0.000000e+00 
  3.325000e+01   1.264285e-04   0.000000e+00   1.264285e-04   0.000000e+00 
  3.350000e+01   1.309276e-04   0.000000e+00   1.309276e-04   0.000000e+00 
  3.375000e+01   1.327316e-04   0.000000e+00   1.327316e-04   0.000000e+00 
  3.400000e+01   1.027507e-04   0.000000e+00   1.027507e-04   0.000000e+00 
  3.425000e+01   8.151596e-05   0.000000e+00   8.151596e-05   0.000000e+00 
  3.450000e+01   7.284852e-05   0.000000e+00   7.284852e-05   0.000000e+00 
  3.475000e+01   8.627905e-05   0.000000e+00   8.627905e-05   0.000000e+00 
  3.500000e+01   1.015486e-04   0.000000e+00   1.015486e-04   0.000000e+00 
  3.525000e+01   1.044252e-04   0.000000e+00   1.044252e-04   0.000000e+00 
  3.550000e+01   8.594423e-05   0.000000e+00   8.594423e-05   0.000000e+00 
  3.575000e+01   8.899473e-05   0.000000e+00   8.899473e-05   0.000000e+00 
  3.600000e+01   9.334956e-05   0.000000e+00   9.334956e-05   0.000000e+00 
  3.625000e+01   8.706493e-05   0.000000e+00   8.706493e-05   0.000000e+00 
  3.650000e+01   8.853489e-05   0.000000e+00   8.853489e-05   0.000000e+00 
  3.675000e+01   9.467034e-05   0.000000e+00   9.467034e-05   0.000000e+00 
  3.700000e+01   8.713596e-05   0.000000e+00   8.713596e-05   0.000000e+00 
  3.725000e+01   9.279231e-05   0.000000e+00   9.279231e-05   0.000000e+00 
  3.750000e+01   8.293444e-05   0.000000e+00   8.293444e-05   0.000000e+00 
  3.775000e+01   7.999670e-05   0.000000e+00   7.999670e-05   0.000000e+00 
  3.800000e+01   6.931023e-05   0.000000e+00   6.931023e-05   0.000000e+00 
  3.825000e+01   9.055138e-05   0.000000e+00   9.055138e-05   0.000000e+00 
  3.850000e+01   7.995340e-05   0.000000e+00   7.995340e-05   0.000000e+00 
  3.875000e+01   6.952022e-05   0.000000e+00   6.952022e-05   0.000000e+00 
  3.900000e+01   7.402916e-05   0.000000e+00   7.402916e-05   0.000000e+00 
  3.925000e+01   7.089537e-05   0.000000e+00   7.089537e-05   0.000000e+00 
  3.950000e+01   8.665100e-05   0.000000e+00   8.665100e-05   0.000000e+00 
  3.975000e+01   9.403768e-05   0.000000e+00   9.403768e-05   0.000000e+00 
  4.000000e+01   7.775697e-05   0.000000e+00   7.775697e-05   0.000000e+00 
  4.025000e+01   5.948627e-05   0.000000e+00   5.948627e-05   0.000000e+00 
  4.050000e+01   6.788589e-05   0.000000e+00   6.788589e-05   0.000000e+00 
  4.075000e+01   7.360362e-05   0.000000e+00   7.360362e-05   0.000000e+00 
  4.100000e+01   7.307138e-05   0.000000e+00   7.307138e-05   0.000000e+00 
  4.125000e+01   5.913448e-05   0.000000e+00   5.913448e-05   0.000000e+00 
  4.150000e+01   5.041308e-05   0.000000e+00   5.041308e-05   0.000000e+00 
  4.175000e+01   5.535075e-05   0.000000e+00   5.535075e-05   0.000000e+00 
  4.200000e+01   5.849665e-05   0.000000e+00   5.849665e-05   0.000000e+00 
  4.225000e+01   7.067717e-05   0.000000e+00   7.067717e-05   0.000000e+00 
  4.250000e+01   7.939315e-05   0.000000e+00   7.939315e-05   0.000000e+00 
  4.275000e+01   7.129138e-05   0.000000e+00   7.129138e-05   0.000000e+00 
  4.300000e+01   5.845687e-05   0.000000e+00   5.845687e-05   0.000000e+00 
  4.325000e+01   5.587419e-05   0.000000e+00   5.587419e-05   0.000000e+00 
  4.350000e+01   6.341714e-05   0.000000e+00   6.341714e-05   0.000000e+00 
  4.375000e+01   6.450807e-05   0.000000e+00   6.450807e-05   0.000000e+00 
  4.400000e+01   6.021931e-05   0.000000e+00   6.021931e-05   0.000000e+00 
  4.425000e+01   5.089348e-05   0.000000e+00   5.089348e-05   0.000000e+00 
  4.450000e+01   3.906485e-05   0.000000e+00   3.906485e-05   0.000000e+00 
  4.475000e+01   6.280000e-05   0.000000e+00   6.280000e-05   0.000000e+00 
  4.500000e+01   6.678383e-05   0.000000e+00   6.678383e-05   0.000000e+00 
  4.525000e+01   4.718487e-05   0.000000e+00   4.718487e-05   0.000000e+00 
  4.550000e+01   4.287071e-05   0.000000e+00   4.287071e-05   0.000000e+00 
  4.575000e+01   6.404394e-05   0.000000e+00   6.404394e-05   0.000000e+00 
  4.600000e+01   5.484895e-05   0.000000e+00   5.484895e-05   0.000000e+00 
  4.625000e+01   5.719495e-05   0.000000e+00   5.719495e-05   0.000000e+00 
  4.650000e+01   5.426561e-05   0.000000e+00   5.426561e-05   0.000000e+00 
  4.675000e+01   4.376865e-05   0.000000e+00   4.376865e-05   0.000000e+00 
  4.700000e+01   3.557620e-05   0.000000e+00   3.557620e-05   0.000000e+00 
  4.725000e+01   5.800868e-05   0.000000e+00   5.800868e-05   0.000000e+00 
  4.750000e+01   5.669860e-05   0.000000e+00   5.669860e-05   0.000000e+00 
  4.775000e+01   6.144703e-05   0.000000e+00   6.144703e-05   0.000000e+00 
  4.800000e+01   5.916136e-05   0.000000e+00   5.916136e-05   0.000000e+00 
  4.825000e+01   4.555387e-05   0.000000e+00   4.555387e-05   0.000000e+00 
  4.850000e+01   5.530767e-05   0.000000e+00   5.530767e-05   0.000000e+00 
  4.875000e+01   6.022886e-05   0.000000e+00   6.022886e-05   0.000000e+00 
  4.900000e+01   5.573517e-05   0.000000e+00   5.573517e-05   0.000000e+00 
  4.925000e+01   5.240337e-05   0.000000e+00   5.240337e-05   0.000000e+00 
  4.950000e+01   4.497014e-05   0.000000e+00   4.497014e-05   0.000000e+00 
  4.975000e+01   4.926697e-05   0.000000e+00   4.926697e-05   0.000000e+00 
  5.000000e+01   4.733683e-05   0.000000e+00   4.733683e-05   0.000000e+00 
  5.025000e+01   3.198365e-05   0.000000e+00   3.198365e-05   0.000000e+00 
  5.050000e+01   3.444263e-05   0.000000e+00   3.444263e-05   0.000000e+00 
  5.075000e+01   3.525998e-05   0.000000e+00   3.525998e-05   0.000000e+00 
  5.100000e+01   4.036637e-05   0.000000e+00   4.036637e-05   0.000000e+00 
  5.125000e+01   3.470551e-05   0.000000e+00   3.470551e-05   0.000000e+00 
  5.150000e+01   3.586000e-05   0.000000e+00   3.586000e-05   0.000000e+00 
  5.175000e+01   4.356518e-05   0.000000e+00   4.356518e-05   0.000000e+00 
  5.200000e+01   5.649734e-05   0.000000e+00   5.649734e-05   0.000000e+00 
  5.225000e+01   4.487657e-05   0.000000e+00   4.487657e-05   0.000000e+00 
  5.250000e+01   4.404038e-05   0.000000e+00   4.404038e-05   0.000000e+00 
  5.275000e+01   4.295983e-05   0.000000e+00   4.295983e-05   0.000000e+00 
  5.300000e+01   4.586561e-05   0.000000e+00   4.586561e-05   0.000000e+00 
  5.325000e+01   5.299167e-05   0.000000e+00   5.299167e-05   0.000000e+00 
  5.350000e+01   4.242784e-05   0.000000e+00   4.242784e-05   0.000000e+00 
  5.375000e+01   3.728841e-05   0.000000e+00   3.728841e-05   0.000000e+00 
  5.400000e+01   4.369893e-05   0.000000e+00   4.369893e-05   0.000000e+00 
  5.425000e+01   3.599548e-05   0.000000e+00   3.599548e-05   0.000000e+00 
  5.450000e+01   2.642821e-05   0.000000e+00   2.642821e-05   0.000000e+00 
  5.475000e+01   3.945189e-05   0.000000e+00   3.945189e-05   0.000000e+00 
  5.500000e+01   4.570768e-05   0.000000e+00   4.570768e-05   0.000000e+00 
  5.525000e+01   4.841156e-05   0.000000e+00   4.841156e-05   0.000000e+00 
  5.550000e+01   4.701971e-05   0.000000e+00   4.701971e-05   0.000000e+00 
  5.575000e+01   3.794281e-05   0.000000e+00   3.794281e-05   0.000000e+00 
  5.600000e+01   3.118210e-05   0.000000e+00   3.118210e-05   0.000000e+00 
  5.625000e+01   3.056831e-05   0.000000e+00   3.056831e-05   0.000000e+00 
  5.650000e+01   3.259548e-05   0.000000e+00   3.259548e-05   0.000000e+00 
  5.675000e+01   3.257741e-05   0.000000e+00   3.257741e-05   0.000000e+00 
  5.700000e+01   3.921729e-05   0.000000e+00   3.921729e-05   0.000000e+00 
  5.725000e+01   4.850503e-05   0.000000e+00   4.850503e-05   0.000000e+00 
  5.750000e+01   4.447206e-05   0.000000e+00   4.447206e-05   0.000000e+00 
  5.775000e+01   2.940710e-05   0.000000e+00   2.940710e-05   0.000000e+00 
  5.800000e+01   2.884771e-05   0.000000e+00   2.884771e-05   0.000000e+00 
  5.825000e+01   3.721847e-05   0.000000e+00   3.721847e-05   0.000000e+00 
  5.850000e+01   3.833922e-05   0.000000e+00   3.833922e-05   0.000000e+00 
  5.875000e+01   3.356630e-05   0.000000e+00   3.356630e-05   0.000000e+00 
  5.900000e+01   2.903329e-05   0.000000e+00   2.903329e-05   0.000000e+00 
  5.925000e+01   3.352531e-05   0.000000e+00   3.352531e-05   0.000000e+00 
  5.950000e+01   2.360781e-05   0.000000e+00   2.360781e-05   0.000000e+00 
  5.975000e+01   3.979275e-05   0.000000e+00   3.979275e-05   0.000000e+00 
  6.000000e+01   4.781955e-05   0.000000e+00   4.781955e-05   0.000000e+00 
  6.025000e+01   2.827664e-05   0.000000e+00   2.827664e-05   0.000000e+00 
  6.050000e+01   2.731468e-05   0.000000e+00   2.731468e-05   0.000000e+00 
  6.075000e+01   2.467110e-05   0.000000e+00   2.467110e-05   0.000000e+00 
  6.100000e+01   2.634762e-05   0.000000e+00   2.634762e-05   0.000000e+00 
  6.125000e+01   2.294822e-05   0.000000e+00   2.294822e-05   0.000000e+00 
  6.150000e+01   2.458839e-05   0.000000e+00   2.458839e-05   0.000000e+00 
  6.175000e+01   2.385062e-05   0.000000e+00   2.385062e-05   0.000000e+00 
  6.200000e+01   2.494490e-05   0.000000e+00   2.494490e-05   0.000000e+00 
  6.225000e+01   2.432135e-05   0.000000e+00   2.432135e-05   0.000000e+00 
  6.250000e+01   2.623869e-05   0.000000e+00   2.623869e-05   0.000000e+00 
  6.275000e+01   2.799962e-05   0.000000e+00   2.799962e-05   0.000000e+00 
  6.300000e+01   2.354586e-05   0.000000e+00   2.354586e-05   0.000000e+00 
  6.325000e+01   2.201239e-05   0.000000e+00   2.201239e-05   0.000000e+00 
  6.350000e+01   2.673467e-05   0.000000e+00   2.673467e-05   0.000000e+00 
  6.375000e+01   3.948870e-05   0.000000e+00   3.948870e-05   0.000000e+00 
  6.400000e+01   4.188937e-05   0.000000e+00   4.188937e-05   0.000000e+00 
  6.425000e+01   2.837686e-05   0.000000e+00   2.837686e-05   0.000000e+00 
  6.450000e+01   2.372177e-05   0.000000e+00   2.372177e-05   0.000000e+00 
  6.475000e+01   2.777518e-05   0.000000e+00   2.777518e-05   0.000000e+00 
  6.500000e+01   3.454776e-05   0.000000e+00   3.454776e-05   0.000000e+00 
  6.525000e+01   1.992665e-05   0.000000e+00   1.992665e-05   0.000000e+00 
  6.550000e+01   2.469564e-05   0.000000e+00   2.469564e-05   0.000000e+00 
  6.575000e+01   2.156048e-05   0.000000e+00   2.156048e-05   0.000000e+00 
  6.600000e+01   2.630528e-05   0.000000e+00   2.630528e-05   0.000000e+00 
  6.625000e+01   3.338136e-05   0.000000e+00   3.338136e-05   0.000000e+00 
  6.650000e+01   2.814544e-05   0.000000e+00   2.814544e-05   0.000000e+00 
  6.675000e+01   2.226121e-05   0.000000e+00   2.226121e-05   0.000000e+00 
  6.700000e+01   1.900508e-05   0.000000e+00   1.900508e-05   0.000000e+00 
  6.725000e+01   2.335489e-05   0.000000e+00   2.335489e-05   0.000000e+00 
  6.750000e+01   2.526342e-05   0.000000e+00   2.526342e-05   0.000000e+00 
  6.775000e+01   2.016261e-05   0.000000e+00   2.016261e-05   0.000000e+00 
  6.800000e+01   2.065030e-05   0.000000e+00   2.065030e-05   0.000000e+00 
  6.825000e+01   2.623768e-05   0.000000e+00   2.623768e-05   0.000000e+00 
  6.850000e+01   2.643562e-05   0.000000e+00   2.643562e-05   0.000000e+00 
  6.875000e+01   2.132107e-05   0.000000e+00   2.132107e-05   0.000000e+00 
  6.900000e+01   2.158319e-05   0.000000e+00   2.158319e-05   0.000000e+00 
  6.925000e+01   2.088993e-05   0.000000e+00   2.088993e-05   0.000000e+00 
  6.950000e+01   2.421727e-05   0.000000e+00   2.421727e-05   0.000000e+00 
  6.975000e+01   3.000632e-05   0.000000e+00   3.000632e-05   0.000000e+00 
  7.000000e+01   3.146281e-05   0.000000e+00   3.146281e-05   0.000000e+00 
  7.025000e+01   2.270761e-05   0.000000e+00   2.270761e-05   0.000000e+00 
  7.050000e+01   1.769923e-05   0.000000e+00   1.769923e-05   0.000000e+00 
  7.075000e+01   2.209798e-05   0.000000e+00   2.209798e-05   0.000000e+00 
  7.100000e+01   1.637067e-05   0.000000e+00   1.637067e-05   0.000000e+00 
  7.125000e+01   2.037617e-05   0.000000e+00   2.037617e-05   0.000000e+00 
  7.150000e+01   2.067420e-05   0.000000e+00   2.067420e-05   0.000000e+00 
  7.175000e+01   1.931475e-05   0.000000e+00   1.931475e-05   0.000000e+00 
  7.200000e+01   1.177747e-05   0.000000e+00   1.177747e-05   0.000000e+00 
  7.225000e+01   1.386006e-05   0.000000e+00   1.386006e-05   0.000000e+00 
  7.250000e+01   1.858316e-05   0.000000e+00   1.858316e-05   0.000000e+00 
  7.275000e+01   2.165800e-05   0.000000e+00   2.165800e-05   0.000000e+00 
  7.300000e+01   2.054124e-05   0.000000e+00   2.054124e-05   0.000000e+00 
  7.325000e+01   1.459850e-05   0.000000e+00   1.459850e-05   0.000000e+00 
  7.350000e+01   1.418580e-05   0.000000e+00   1.418580e-05   0.000000e+00 
  7.375000e+01   1.409780e-05   0.000000e+00   1.409780e-05   0.000000e+00 
  7.400000e+01   1.567180e-05   0.000000e+00   1.567180e-05   0.000000e+00 
  7.425000e+01   1.399802e-05   0.000000e+00   1.399802e-05   0.000000e+00 
  7.450000e+01   1.443783e-05   0.000000e+00   1.443783e-05   0.000000e+00 
  7.475000e+01   1.587565e-05   0.000000e+00   1.587565e-05   0.000000e+00 
  7.500000e+01   2.118922e-05   0.000000e+00   2.118922e-05   0.000000e+00 
  7.525000e+01   1.250953e-05   0.000000e+00   1.250953e-05   0.000000e+00 
  7.550000e+01   1.404496e-05   0.000000e+00   1.404496e-05   0.000000e+00 
  7.575000e+01   1.724668e-05   0.000000e+00   1.724668e-05   0.000000e+00 
  7.600000e+01   1.610761e-05   0.000000e+00   1.610761e-05   0.000000e+00 
  7.625000e+01   1.670544e-05   0.000000e+00   1.670544e-05   0.000000e+00 
  7.650000e+01   1.285541e-05   0.000000e+00   1.285541e-05   0.000000e+00 
  7.675000e+01   1.557143e-05   0.000000e+00   1.557143e-05   0.000000e+00 
  7.700000e+01   2.114270e-05   0.000000e+00   2.114270e-05   0.000000e+00 
  7.725000e+01   1.822303e-05   0.000000e+00   1.822303e-05   0.000000e+00 
  7.750000e+01   2.136601e-05   0.000000e+00   2.136601e-05   0.000000e+00 
  7.775000e+01   2.921641e-05   0.000000e+00   2.921641e-05   0.000000e+00 
  7.800000e+01   2.601231e-05   0.000000e+00   2.601231e-05   0.000000e+00 
  7.825000e+01   1.811767e-05   0.000000e+00   1.811767e-05   0.000000e+00 
  7.850000e+01   1.540617e-05   0.000000e+00   1.540617e-05   0.000000e+00 
  7.875000e+01   1.406039e-05   0.000000e+00   1.406039e-05   0.000000e+00 
  7.900000e+01   1.018966e-05   0.000000e+00   1.018966e-05   0.000000e+00 
  7.925000e+01   1.288427e-05   0.000000e+00   1.288427e-05   0.000000e+00 
  7.950000e+01   1.521344e-05   0.000000e+00   1.521344e-05   0.000000e+00 
  7.975000e+01   1.898499e-05   0.000000e+00   1.898499e-05   0.000000e+00 
  8.000000e+01   2.750952e-05   0.000000e+00   2.750952e-05   0.000000e+00 
  8.025000e+01   1.591878e-05   0.000000e+00   1.591878e-05   0.000000e+00 
  8.050000e+01   1.315848e-05   0.000000e+00   1.315848e-05   0.000000e+00 
  8.075000e+01   1.173551e-05   0.000000e+00   1.173551e-05   0.000000e+00 
  8.100000e+01   1.006049e-05   0.000000e+00   1.006049e-05   0.000000e+00 
  8.125000e+01   1.113716e-05   0.000000e+00   1.113716e-05   0.000000e+00 
  8.150000e+01   1.327230e-05   0.000000e+00   1.327230e-05   0.000000e+00 
  8.175000e+01   1.650096e-05   0.000000e+00   1.650096e-05   0.000000e+00 
  8.200000e+01   1.811055e-05   0.000000e+00   1.811055e-05   0.000000e+00 
  8.225000e+01   1.346681e-05   0.000000e+00   1.346681e-05   0.000000e+00 
  8.250000e+01   9.434486e-06   0.000000e+00   9.434486e-06   0.000000e+00 
  8.275000e+01   9.848917e-06   0.000000e+00   9.848917e-06   0.000000e+00 
  8.300000e+01   1.329903e-05   0.000000e+00   1.329903e-05   0.000000e+00 
  8.325000e+01   1.393693e-05   0.000000e+00   1.393693e-05   0.000000e+00 
  8.350000e+01   1.202838e-05   0.000000e+00   1.202838e-05   0.000000e+00 
  8.375000e+01   1.178545e-05   0.000000e+00   1.178545e-05   0.000000e+00 
  8.400000e+01   1.296089e-05   0.000000e+00   1.296089e-05   0.000000e+00 
  8.425000e+01   1.509525e-05   0.000000e+00   1.509525e-05   0.000000e+00 
  8.450000e+01   1.428021e-05   0.000000e+00   1.428021e-05   0.000000e+00 
  8.475000e+01   1.485540e-05   0.000000e+00   1.485540e-05   0.000000e+00 
  8.500000e+01   2.081602e-05   0.000000e+00   2.081602e-05   0.000000e+00 
  8.525000e+01   1.527354e-05   0.000000e+00   1.527354e-05   0.000000e+00 
  8.550000e+01   1.231431e-05   0.000000e+00   1.231431e-05   0.000000e+00 
  8.575000e+01   1.345583e-05   0.000000e+00   1.345583e-05   0.000000e+00 
  8.600000e+01   1.323164e-05   0.000000e+00   1.323164e-05   0.000000e+00 
  8.625000e+01   1.159948e-05   0.000000e+00   1.159948e-05   0.000000e+00 
  8.650000e+01   8.957249e-06   0.000000e+00   8.957249e-06   0.000000e+00 
  8.675000e+01   9.149025e-06   0.000000e+00   9.149025e-06   0.000000e+00 
  8.700000e+01   1.251305e-05   0.000000e+00   1.251305e-05   0.000000e+00 
  8.725000e+01   1.593230e-05   0.000000e+00   1.593230e-05   0.000000e+00 
  8.750000e+01   2.069471e-05   0.000000e+00   2.069471e-05   0.000000e+00 
  8.775000e+01   2.043387e-05   0.000000e+00   2.043387e-05   0.000000e+00 
  8.800000e+01   1.313400e-05   0.000000e+00   1.313400e-05   0.000000e+00 
  8.825000e+01   1.172106e-05   0.000000e+00   1.172106e-05   0.000000e+00 
  8.850000e+01   1.033913e-05   0.000000e+00   1.033913e-05   0.000000e+00 
  8.875000e+01   8.762521e-06   0.000000e+00   8.762521e-06   0.000000e+00 
  8.900000e+01   8.889861e-06   0.000000e+00   8.889861e-06   0.000000e+00 
  8.925000e+01   9.603097e-06   0.000000e+00   9.603097e-06   0.000000e+00 
  8.950000e+01   1.088875e-05   0.000000e+00   1.088875e-05   0.000000e+00 
  8.975000e+01   1.507911e-05   0.000000e+00   1.507911e-05   0.000000e+00 
  9.000000e+01   1.903977e-05   0.000000e+00   1.903977e-05   0.000000e+00 
  9.025000e+01   1.511110e-05   0.000000e+00   1.511110e-05   0.000000e+00 
  9.050000e+01   1.266431e-05   0.000000e+00   1.266431e-05   0.000000e+00 
  9.075000e+01   1.166958e-05   0.000000e+00   1.166958e-05   0.000000e+00 
  9.100000e+01   7.403821e-06   0.000000e+00   7.403821e-06   0.000000e+00 
  9.125000e+01   8.966877e-06   0.000000e+00   8.966877e-06   0.000000e+00 
  9.150000e+01   1.185532e-05   0.000000e+00   1.185532e-05   0.000000e+00 
  9.175000e+01   1.638153e-05   0.000000e+00   1.638153e-05   0.000000e+00 
  9.200000e+01   1.255629e-05   0.000000e+00   1.255629e-05   0.000000e+00 
  9.225000e+01   1.305276e-05   0.000000e+00   1.305276e-05   0.000000e+00 
  9.250000e+01   1.070831e-05   0.000000e+00   1.070831e-05   0.000000e+00 
  9.275000e+01   7.075495e-06   0.000000e+00   7.075495e-06   0.000000e+00 
  9.300000e+01   1.024074e-05   0.000000e+00   1.024074e-05   0.000000e+00 
  9.325000e+01   9.005309e-06   0.000000e+00   9.005309e-06   0.000000e+00 
  9.350000e+01   1.011356e-05   0.000000e+00   1.011356e-05   0.000000e+00 
  9.375000e+01   9.380454e-06   0.000000e+00   9.380454e-06   0.000000e+00 
  9.400000e+01   1.365893e-05   0.000000e+00   1.365893e-05   0.000000e+00 
  9.425000e+01   1.526658e-05   0.000000e+00   1.526658e-05   0.000000e+00 
  9.450000e+01   1.205708e-05   0.000000e+00   1.205708e-05   0.000000e+00 
  9.475000e+01   1.574084e-05   0.000000e+00   1.574084e-05   0.000000e+00 
  9.500000e+01   1.917945e-05   0.000000e+00   1.917945e-05   0.000000e+00 
  9.525000e+01   1.120704e-05   0.000000e+00   1.120704e-05   0.000000e+00 
  9.550000e+01   9.314055e-06   0.000000e+00   9.314055e-06   0.000000e+00 
  9.575000e+01   1.711544e-05   0.000000e+00   1.711544e-05   0.000000e+00 
  9.600000e+01   1.451463e-05   0.000000e+00   1.451463e-05   0.000000e+00 
  9.625000e+01   6.464391e-06   0.000000e+00   6.464391e-06   0.000000e+00 
  9.650000e+01   6.868741e-06   0.000000e+00   6.868741e-06   0.000000e+00 
  9.675000e+01   6.740059e-06   0.000000e+00   6.740059e-06   0.000000e+00 
  9.700000e+01   1.016119e-05   0.000000e+00   1.016119e-05   0.000000e+00 
  9.725000e+01   9.329670e-06   0.000000e+00   9.329670e-06   0.000000e+00 
  9.750000e+01   8.461229e-06   0.000000e+00   8.461229e-06   0.000000e+00 
  9.775000e+01   6.610327e-06   0.000000e+00   6.610327e-06   0.000000e+00 
  9.800000e+01   8.421549e-06   0.000000e+00   8.421549e-06   0.000000e+00 
  9.825000e+01   1.148650e-05   0.000000e+00   1.148650e-05   0.000000e+00 
  9.850000e+01   1.189771e-05   0.000000e+00   1.189771e-05   0.000000e+00 
  9.875000e+01   8.568862e-06   0.000000e+00   8.568862e-06   0.000000e+00 
  9.900000e+01   8.564728e-06   0.000000e+00   8.564728e-06   0.000000e+00 
  9.925000e+01   9.677844e-06   0.000000e+00   9.677844e-06   0.000000e+00 
  9.950000e+01   9.314889e-06   0.000000e+00   9.314889e-06   0.000000e+00 
  9.975000e+01   9.999573e-05   0.000000e+00   9.999573e-05   0.000000e+00 
  1.000000e+02   1.890202e-04   0.000000e+00   1.890202e-04   0.000000e+00 
  1.002500e+02   8.988487e-05   0.000000e+00   8.988487e-05   0.000000e+00 
  1.005000e+02   8.672874e-06   0.000000e+00   8.672874e-06   0.000000e+00 
  1.007500e+02   6.698171e-06   0.000000e+00   6.698171e-06   0.000000e+00 
  1.010000e+02   7.593348e-06   0.000000e+00   7.593348e-06   0.000000e+00 
  1.012500e+02   7.570164e-06   0.000000e+00   7.570164e-06   0.000000e+00 
  1.015000e+02   5.848599e-06   0.000000e+00   5.848599e-06   0.000000e+00 
  1.017500e+02   5.074475e-06   0.000000e+00   5.074475e-06   0.000000e+00 
  1.020000e+02   8.090174e-06   0.000000e+00   8.090174e-06   0.000000e+00 
  1.022500e+02   9.706128e-06   0.000000e+00   9.706128e-06   0.000000e+00 
  1.025000e+02   1.263904e-05   0.000000e+00   1.263904e-05   0.000000e+00 
  1.027500e+02   1.235536e-05   0.000000e+00   1.235536e-05   0.000000e+00 
  1.030000e+02   7.591765e-06   0.000000e+00   7.591765e-06   0.000000e+00 
  1.032500e+02   7.582219e-06   0.000000e+00   7.582219e-06   0.000000e+00 
  1.035000e+02   5.640082e-06   0.000000e+00   5.640082e-06   0.000000e+00 
  1.037500e+02   7.119319e-06   0.000000e+00   7.119319e-06   0.000000e+00 
  1.040000e+02   1.534695e-05   0.000000e+00   1.534695e-05   0.000000e+00 
  1.042500e+02   1.498265e-05   0.000000e+00   1.498265e-05   0.000000e+00 
  1.045000e+02   6.360739e-06   0.000000e+00   6.360739e-06   0.000000e+00 
  1.047500e+02   9.679053e-06   0.000000e+00   9.679053e-06   0.000000e+00 
  1.050000e+02   1.628784e-05   0.000000e+00   1.628784e-05   0.000000e+00 
  1.052500e+02   1.133321e-05   0.000000e+00   1.133321e-05   0.000000e+00 
  1.055000e+02   7.197177e-06   0.000000e+00   7.197177e-06   0.000000e+00 
  1.057500e+02   6.518426e-06   0.000000e+00   6.518426e-06   0.000000e+00 
  1.060000e+02   7.336882e-06   0.000000e+00   7.336882e-06   0.000000e+00 
  1.062500e+02   7.762588e-06   0.000000e+00   7.762588e-06   0.000000e+00 
  1.065000e+02   1.003839e-05   0.000000e+00   1.003839e-05   0.000000e+00 
  1.067500e+02   1.034794e-05   0.000000e+00   1.034794e-05   0.000000e+00 
  1.070000e+02   7.269480e-06   0.000000e+00   7.269480e-06   0.000000e+00 
  1.072500e+02   8.792588e-06   0.000000e+00   8.792588e-06   0.000000e+00 
  1.075000e+02   7.735338e-06   0.000000e+00   7.735338e-06   0.000000e+00 
  1.077500e+02   7.484194e-06   0.000000e+00   7.484194e-06   0.000000e+00 
  1.080000e+02   1.246854e-05   0.000000e+00   1.246854e-05   0.000000e+00 
  1.082500e+02   1.750267e-05   0.000000e+00   1.750267e-05   0.000000e+00 
  1.085000e+02   9.977476e-06   0.000000e+00   9.977476e-06   0.000000e+00 
  1.087500e+02   7.144293e-06   0.000000e+00   7.144293e-06   0.000000e+00 
  1.090000e+02   7.650099e-06   0.000000e+00   7.650099e-06   0.000000e+00 
  1.092500e+02   8.049276e-06   0.000000e+00   8.049276e-06   0.000000e+00 
  1.095000e+02   5.443000e-06   0.000000e+00   5.443000e-06   0.000000e+00 
  1.097500e+02   9.063784e-06   0.000000e+00   9.063784e-06   0.000000e+00 
  1.100000e+02   1.094455e-05   0.000000e+00   1.094455e-05   0.000000e+00 
  1.102500e+02   7.136722e-06   0.000000e+00   7.136722e-06   0.000000e+00 
  1.105000e+02   6.296173e-06   0.000000e+00   6.296173e-06   0.000000e+00 
  1.107500e+02   6.608219e-06   0.000000e+00   6.608219e-06   0.000000e+00 
  1.110000e+02   6.693415e-06   0.000000e+00   6.693415e-06   0.000000e+00 
  1.112500e+02   8.744440e-06   0.000000e+00   8.744440e-06   0.000000e+00 
  1.115000e+02   8.225598e-06   0.000000e+00   8.225598e-06   0.000000e+00 
  1.117500e+02   6.676225e-06   0.000000e+00   6.676225e-06   0.000000e+00 
  1.120000e+02   8.094851e-06   0.000000e+00   8.094851e-06   0.000000e+00 
  1.122500e+02   1.502838e-05   0.000000e+00   1.502838e-05   0.000000e+00 
  1.125000e+02   1.439847e-05   0.000000e+00   1.439847e-05   0.000000e+00 
  1.127500e+02   8.103996e-06   0.000000e+00   8.103996e-06   0.000000e+00 
  1.130000e+02   3.915594e-06   0.000000e+00   3.915594e-06   0.000000e+00 
  1.132500e+02   7.372678e-06   0.000000e+00   7.372678e-06   0.000000e+00 
  1.135000e+02   7.059852e-06   0.000000e+00   7.059852e-06   0.000000e+00 
  1.137500e+02   7.002689e-06   0.000000e+00   7.002689e-06   0.000000e+00 
  1.140000e+02   6.883427e-06   0.000000e+00   6.883427e-06   0.000000e+00 
  1.142500e+02   5.420896e-06   0.000000e+00   5.420896e-06   0.000000e+00 
  1.145000e+02   7.430027e-06   0.000000e+00   7.430027e-06   0.000000e+00 
  1.147500e+02   1.031575e-05   0.000000e+00   1.031575e-05   0.000000e+00 
  1.150000e+02   1.228118e-05   0.000000e+00   1.228118e-05   0.000000e+00 
  1.152500e+02   7.729550e-06   0.000000e+00   7.729550e-06   0.000000e+00 
  1.155000e+02   5.794217e-06   0.000000e+00   5.794217e-06   0.000000e+00 
  1.157500e+02   6.029230e-06   0.000000e+00   6.029230e-06   0.000000e+00 
  1.160000e+02   7.417764e-06   0.000000e+00   7.417764e-06   0.000000e+00 
  1.162500e+02   8.110170e-06   0.000000e+00   8.110170e-06   0.000000e+00 
  1.165000e+02   1.073580e-05   0.000000e+00   1.073580e-05   0.000000e+00 
  1.167500e+02   1.094622e-05   0.000000e+00   1.094622e-05   0.000000e+00 
  1.170000e+02   8.208947e-06   0.000000e+00   8.208947e-06   0.000000e+00 
  1.172500e+02   6.863655e-06   0.000000e+00   6.863655e-06   0.000000e+00 
  1.175000e+02   5.638760e-06   0.000000e+00   5.638760e-06   0.000000e+00 
  1.177500e+02   5.437125e-06   0.000000e+00   5.437125e-06   0.000000e+00 
  1.180000e+02   5.792149e-06   0.000000e+00   5.792149e-06   0.000000e+00 
  1.182500e+02   6.309378e-06   0.000000e+00   6.309378e-06   0.000000e+00 
  1.185000e+02   4.730912e-06   0.000000e+00   4.730912e-06   0.000000e+00 
  1.187500e+02   8.708307e-06   0.000000e+00   8.708307e-06   0.000000e+00 
  1.190000e+02   1.517820e-05   0.000000e+00   1.517820e-05   0.000000e+00 
  1.192500e+02   1.068861e-05   0.000000e+00   1.068861e-05   0.000000e+00 
  1.195000e+02   5.824559e-06   0.000000e+00   5.824559e-06   0.000000e+00 
  1.197500e+02   1.653253e-05   0.000000e+00   1.653253e-05   0.000000e+00 
  1.200000e+02   2.977339e-05   0.000000e+00   2.977339e-05   0.000000e+00 
  1.202500e+02   1.814621e-05   0.000000e+00   1.814621e-05   0.000000e+00 
  1.205000e+02   9.782252e-06   0.000000e+00   9.782252e-06   0.000000e+00 
  1.207500e+02   7.883974e-06   0.000000e+00   7.883974e-06   0.000000e+00 
  1.210000e+02   8.341846e-06   0.000000e+00   8.341846e-06   0.000000e+00 
  1.212500e+02   5.098228e-06   0.000000e+00   5.098228e-06   0.000000e+00 
  1.215000e+02   5.810473e-06   0.000000e+00   5.810473e-06   0.000000e+00 
  1.217500e+02   5.619298e-06   0.000000e+00   5.619298e-06   0.000000e+00 
  1.220000e+02   5.394199e-06   0.000000e+00   5.394199e-06   0.000000e+00 
  1.222500e+02   4.980598e-06   0.000000e+00   4.980598e-06   0.000000e+00 
  1.225000e+02   4.971200e-06   0.000000e+00   4.971200e-06   0.000000e+00 
  1.227500e+02   6.850487e-06   0.000000e+00   6.850487e-06   0.000000e+00 
  1.230000e+02   7.466346e-06   0.000000e+00   7.466346e-06   0.000000e+00 
  1.232500e+02   8.022104e-06   0.000000e+00   8.022104e-06   0.000000e+00 
  1.235000e+02   7.851362e-06   0.000000e+00   7.851362e-06   0.000000e+00 
  1.237500e+02   6.569987e-06   0.000000e+00   6.569987e-06   0.000000e+00 
  1.240000e+02   6.724415e-06   0.000000e+00   6.724415e-06   0.000000e+00 
  1.242500e+02   7.113942e-06   0.000000e+00   7.113942e-06   0.000000e+00 
  1.245000e+02   8.322828e-06   0.000000e+00   8.322828e-06   0.000000e+00 
  1.247500e+02   7.745150e-06   0.000000e+00   7.745150e-06   0.000000e+00 
  1.250000e+02   9.454792e-06   0.000000e+00   9.454792e-06   0.000000e+00 
  1.252500e+02   5.937869e-06   0.000000e+00   5.937869e-06   0.000000e+00 
  1.255000e+02   5.362366e-06   0.000000e+00   5.362366e-06   0.000000e+00 
  1.257500e+02   6.585279e-06   0.000000e+00   6.585279e-06   0.000000e+00 
  1.260000e+02   5.224361e-06   0.000000e+00   5.224361e-06   0.000000e+00 
  1.262500e+02   5.448164e-06   0.000000e+00   5.448164e-06   0.000000e+00 
  1.265000e+02   4.618758e-06   0.000000e+00   4.618758e-06   0.000000e+00 
  1.267500e+02   4.999053e-06   0.000000e+00   4.999053e-06   0.000000e+00 
  1.270000e+02   5.592806e-06   0.000000e+00   5.592806e-06   0.000000e+00 
  1.272500e+02   6.861822e-06   0.000000e+00   6.861822e-06   0.000000e+00 
  1.275000e+02   5.494882e-06   0.000000e+00   5.494882e-06   0.000000e+00 
  1.277500e+02   5.014601e-06   0.000000e+00   5.014601e-06   0.000000e+00 
  1.280000e+02   5.084772e-06   0.000000e+00   5.084772e-06   0.000000e+00 
  1.282500e+02   5.699747e-06   0.000000e+00   5.699747e-06   0.000000e+00 
  1.285000e+02   5.643805e-06   0.000000e+00   5.643805e-06   0.000000e+00 
  1.287500e+02   5.473813e-06   0.000000e+00   5.473813e-06   0.000000e+00 
  1.290000e+02   6.994662e-06   0.000000e+00   6.994662e-06   0.000000e+00 
  1.292500e+02   5.623953e-06   0.000000e+00   5.623953e-06   0.000000e+00 
  1.295000e+02   3.749208e-06   0.000000e+00   3.749208e-06   0.000000e+00 
  1.297500e+02   6.149982e-06   0.000000e+00   6.149982e-06   0.000000e+00 
  1.300000e+02   9.639745e-06   0.000000e+00   9.639745e-06   0.000000e+00 
  1.302500e+02   7.103336e-06   0.000000e+00   7.103336e-06   0.000000e+00 
  1.305000e+02   5.078246e-06   0.000000e+00   5.078246e-06   0.000000e+00 
  1.307500e+02   5.706114e-06   0.000000e+00   5.706114e-06   0.000000e+00 
  1.310000e+02   4.978395e-06   0.000000e+00   4.978395e-06   0.000000e+00 
  1.312500e+02   4.087441e-06   0.000000e+00   4.087441e-06   0.000000e+00 
  1.315000e+02   4.774938e-06   0.000000e+00   4.774938e-06   0.000000e+00 
  1.317500e+02   5.235564e-06   0.000000e+00   5.235564e-06   0.000000e+00 
  1.320000e+02   4.571000e-06   0.000000e+00   4.571000e-06   0.000000e+00 
  1.322500e+02   4.486245e-06   0.000000e+00   4.486245e-06   0.000000e+00 
  1.325000e+02   4.928111e-06   0.000000e+00   4.928111e-06   0.000000e+00 
  1.327500e+02   4.258229e-06   0.000000e+00   4.258229e-06   0.000000e+00 
  1.330000e+02   4.884076e-06   0.000000e+00   4.884076e-06   0.000000e+00 
  1.332500e+02   5.915108e-06   0.000000e+00   5.915108e-06   0.000000e+00 
  1.335000e+02   4.435410e-06   0.000000e+00   4.435410e-06   0.000000e+00 
  1.337500e+02   4.050474e-06   0.000000e+00   4.050474e-06   0.000000e+00 
  1.340000e+02   6.119168e-06   0.000000e+00   6.119168e-06   0.000000e+00 
  1.342500e+02   6.443614e-06   0.000000e+00   6.443614e-06   0.000000e+00 
  1.345000e+02   5.996992e-06   0.000000e+00   5.996992e-06   0.000000e+00 
  1.347500e+02   6.607785e-06   0.000000e+00   6.607785e-06   0.000000e+00 
  1.350000e+02   7.051085e-06   0.000000e+00   7.051085e-06   0.000000e+00 
  1.352500e+02   5.062593e-06   0.000000e+00   5.062593e-06   0.000000e+00 
  1.355000e+02   3.787333e-06   0.000000e+00   3.787333e-06   0.000000e+00 
  1.357500e+02   4.773800e-06   0.000000e+00   4.773800e-06   0.000000e+00 
  1.360000e+02   3.430670e-06   0.000000e+00   3.430670e-06   0.000000e+00 
  1.362500e+02   3.902420e-06   0.000000e+00   3.902420e-06   0.000000e+00 
  1.365000e+02   5.629497e-06   0.000000e+00   5.629497e-06   0.000000e+00 
  1.367500e+02   4.793138e-06   0.000000e+00   4.793138e-06   0.000000e+00 
  1.370000e+02   4.182619e-06   0.000000e+00   4.182619e-06   0.000000e+00 
  1.372500e+02   4.778164e-06   0.000000e+00   4.778164e-06   0.000000e+00 
  1.375000e+02   5.742698e-06   0.000000e+00   5.742698e-06   0.000000e+00 
  1.377500e+02   5.689569e-06   0.000000e+00   5.689569e-06   0.000000e+00 
  1.380000e+02   5.331711e-06   0.000000e+00   5.331711e-06   0.000000e+00 
  1.382500e+02   5.195767e-06   0.000000e+00   5.195767e-06   0.000000e+00 
  1.385000e+02   4.977397e-06   0.000000e+00   4.977397e-06   0.000000e+00 
  1.387500e+02   4.328215e-06   0.000000e+00   4.328215e-06   0.000000e+00 
  1.390000e+02   4.375870e-06   0.000000e+00   4.375870e-06   0.000000e+00 
  1.392500e+02   6.367235e-06   0.000000e+00   6.367235e-06   0.000000e+00 
  1.395000e+02   6.698907e-06   0.000000e+00   6.698907e-06   0.000000e+00 
  1.397500e+02   6.159762e-06   0.000000e+00   6.159762e-06   0.000000e+00 
  1.400000e+02   6.502681e-06   0.000000e+00   6.502681e-06   0.000000e+00 
  1.402500e+02   5.421696e-06   0.000000e+00   5.421696e-06   0.000000e+00 
  1.405000e+02   4.863133e-06   0.000000e+00   4.863133e-06   0.000000e+00 
  1.407500e+02   4.029391e-06   0.000000e+00   4.029391e-06   0.000000e+00 
  1.410000e+02   4.767917e-06   0.000000e+00   4.767917e-06   0.000000e+00 
  1.412500e+02   4.328471e-06   0.000000e+00   4.328471e-06   0.000000e+00 
  1.415000e+02   4.557399e-06   0.000000e+00   4.557399e-06   0.000000e+00 
  1.417500e+02   4.025756e-06   0.000000e+00   4.025756e-06   0.000000e+00 
  1.420000e+02   5.330121e-06   0.000000e+00   5.330121e-06   0.000000e+00 
  1.422500e+02   6.206573e-06   0.000000e+00   6.206573e-06   0.000000e+00 
  1.425000e+02   5.233671e-06   0.000000e+00   5.233671e-06   0.000000e+00 
  1.427500e+02   6.330241e-06   0.000000e+00   6.330241e-06   0.000000e+00 
  1.430000e+02   6.978390e-06   0.000000e+00   6.978390e-06   0.000000e+00 
  1.432500e+02   5.472891e-06   0.000000e+00   5.472891e-06   0.000000e+00 
  1.435000e+02   4.169051e-06   0.000000e+00   4.169051e-06   0.000000e+00 
  1.437500e+02   5.408043e-06   0.000000e+00   5.408043e-06   0.000000e+00 
  1.440000e+02   6.308887e-06   0.000000e+00   6.308887e-06   0.000000e+00 
  1.442500e+02   5.085336e-06   0.000000e+00   5.085336e-06   0.000000e+00 
  1.445000e+02   6.006475e-06   0.000000e+00   6.006475e-06   0.000000e+00 
  1.447500e+02   6.367429e-06   0.000000e+00   6.367429e-06   0.000000e+00 
  1.450000e+02   9.066652e-06   0.000000e+00   9.066652e-06   0.000000e+00 
  1.452500e+02   6.439501e-06   0.000000e+00   6.439501e-06   0.000000e+00 
  1.455000e+02   3.464569e-06   0.000000e+00   3.464569e-06   0.000000e+00 
  1.457500e+02   3.574881e-06   0.000000e+00   3.574881e-06   0.000000e+00 
  1.460000e+02   5.469265e-06   0.000000e+00   5.469265e-06   0.000000e+00 
  1.462500e+02   4.658761e-06   0.000000e+00   4.658761e-06   0.000000e+00 
  1.465000e+02   4.436318e-06   0.000000e+00   4.436318e-06   0.000000e+00 
  1.467500e+02   5.505612e-06   0.000000e+00   5.505612e-06   0.000000e+00 
  1.470000e+02   5.186788e-06   0.000000e+00   5.186788e-06   0.000000e+00 
  1.472500e+02   4.185813e-06   0.000000e+00   4.185813e-06   0.000000e+00 
  1.475000e+02   4.970068e-06   0.000000e+00   4.970068e-06   0.000000e+00 
  1.477500e+02   5.032553e-06   0.000000e+00   5.032553e-06   0.000000e+00 
  1.480000e+02   4.902340e-06   0.000000e+00   4.902340e-06   0.000000e+00 
  1.482500e+02   4.671312e-06   0.000000e+00   4.671312e-06   0.000000e+00 
  1.485000e+02   6.054900e-06   0.000000e+00   6.054900e-06   0.000000e+00 
  1.487500e+02   4.667211e-06   0.000000e+00   4.667211e-06   0.000000e+00 
  1.490000e+02   4.515738e-06   0.000000e+00   4.515738e-06   0.000000e+00 
  1.492500e+02   4.306515e-06   0.000000e+00   4.306515e-06   0.000000e+00 
  1.495000e+02   4.222888e-06   0.000000e+00   4.222888e-06   0.000000e+00 
  1.497500e+02   5.166004e-06   0.000000e+00   5.166004e-06   0.000000e+00 
  1.500000e+02   7.263426e-06   0.000000e+00   7.263426e-06   0.000000e+00 
  1.502500e+02   6.179862e-06   0.000000e+00   6.179862e-06   0.000000e+00 
  1.505000e+02   4.424178e-06   0.000000e+00   4.424178e-06   0.000000e+00 
  1.507500e+02   4.468393e-06   0.000000e+00   4.468393e-06   0.000000e+00 
  1.510000e+02   4.867637e-06   0.000000e+00   4.867637e-06   0.000000e+00 
  1.512500e+02   5.675696e-06   0.000000e+00   5.675696e-06   0.000000e+00 
  1.515000e+02   4.736294e-06   0.000000e+00   4.736294e-06   0.000000e+00 
  1.517500e+02   3.511417e-06   0.000000e+00   3.511417e-06   0.000000e+00 
  1.520000e+02   4.302451e-06   0.000000e+00   4.302451e-06   0.000000e+00 
  1.522500e+02   5.082567e-06   0.000000e+00   5.082567e-06   0.000000e+00 
  1.525000e+02   5.463624e-06   0.000000e+00   5.463624e-06   0.000000e+00 
  1.527500e+02   5.462467e-06   0.000000e+00   5.462467e-06   0.000000e+00 
  1.530000e+02   4.642910e-06   0.000000e+00   4.642910e-06   0.000000e+00 
  1.532500e+02   6.492206e-06   0.000000e+00   6.492206e-06   0.000000e+00 
  1.535000e+02   6.794100e-06   0.000000e+00   6.794100e-06   0.000000e+00 
  1.537500e+02   4.849195e-06   0.000000e+00   4.849195e-06   0.000000e+00 
  1.540000e+02   5.158702e-06   0.000000e+00   5.158702e-06   0.000000e+00 
  1.542500e+02   6.573061e-06   0.000000e+00   6.573061e-06   0.000000e+00 
  1.545000e+02   6.194156e-06   0.000000e+00   6.194156e-06   0.000000e+00 
  1.547500e+02   7.068639e-06   0.000000e+00   7.068639e-06   0.000000e+00 
  1.550000e+02   6.879721e-06   0.000000e+00   6.879721e-06   0.000000e+00 
  1.552500e+02   6.258442e-06   0.000000e+00   6.258442e-06   0.000000e+00 
  1.555000e+02   5.644325e-06   0.000000e+00   5.644325e-06   0.000000e+00 
  1.557500e+02   5.381858e-06   0.000000e+00   5.381858e-06   0.000000e+00 
  1.560000e+02   7.665852e-06   0.000000e+00   7.665852e-06   0.000000e+00 
  1.562500e+02   7.494177e-06   0.000000e+00   7.494177e-06   0.000000e+00 
  1.565000e+02   5.611757e-06   0.000000e+00   5.611757e-06   0.000000e+00 
  1.567500e+02   4.463070e-06   0.000000e+00   4.463070e-06   0.000000e+00 
  1.570000e+02   5.320107e-06   0.000000e+00   5.320107e-06   0.000000e+00 
  1.572500e+02   5.366411e-06   0.000000e+00   5.366411e-06   0.000000e+00 
  1.575000e+02   5.281788e-06   0.000000e+00   5.281788e-06   0.000000e+00 
  1.577500e+02   6.213641e-06   0.000000e+00   6.213641e-06   0.000000e+00 
  1.580000e+02   6.306470e-06   0.000000e+00   6.306470e-06   0.000000e+00 
  1.582500e+02   6.756934e-06   0.000000e+00   6.756934e-06   0.000000e+00 
  1.585000e+02   4.887977e-06   0.000000e+00   4.887977e-06   0.000000e+00 
  1.587500e+02   6.236378e-06   0.000000e+00   6.236378e-06   0.000000e+00 
  1.590000e+02   7.077888e-06   0.000000e+00   7.077888e-06   0.000000e+00 
  1.592500e+02   6.328319e-06   0.000000e+00   6.328319e-06   0.000000e+00 
  1.595000e+02   5.351504e-06   0.000000e+00   5.351504e-06   0.000000e+00 
  1.597500e+02   6.182218e-06   0.000000e+00   6.182218e-06   0.000000e+00 
  1.600000e+02   7.373385e-06   0.000000e+00   7.373385e-06   0.000000e+00 
  1.602500e+02   6.983589e-06   0.000000e+00   6.983589e-06   0.000000e+00 
  1.605000e+02   5.041643e-06   0.000000e+00   5.041643e-06   0.000000e+00 
  1.607500e+02   5.526190e-06   0.000000e+00   5.526190e-06   0.000000e+00 
  1.610000e+02   6.555631e-06   0.000000e+00   6.555631e-06   0.000000e+00 
  1.612500e+02   5.639611e-06   0.000000e+00   5.639611e-06   0.000000e+00 
  1.615000e+02   5.163025e-06   0.000000e+00   5.163025e-06   0.000000e+00 
  1.617500e+02   5.391418e-06   0.000000e+00   5.391418e-06   0.000000e+00 
  1.620000e+02   7.871799e-06   0.000000e+00   7.871799e-06   0.000000e+00 
  1.622500e+02   6.889793e-06   0.000000e+00   6.889793e-06   0.000000e+00 
  1.625000e+02   5.079396e-06   0.000000e+00   5.079396e-06   0.000000e+00 
  1.627500e+02   4.963711e-06   0.000000e+00   4.963711e-06   0.000000e+00 
  1.630000e+02   6.253966e-06   0.000000e+00   6.253966e-06   0.000000e+00 
  1.632500e+02   7.644195e-06   0.000000e+00   7.644195e-06   0.000000e+00 
  1.635000e+02   7.500876e-06   0.000000e+00   7.500876e-06   0.000000e+00 
  1.637500e+02   4.620958e-06   0.000000e+00   4.620958e-06   0.000000e+00 
  1.640000e+02   5.954282e-06   0.000000e+00   5.954282e-06   0.000000e+00 
  1.642500e+02   6.518910e-06   0.000000e+00   6.518910e-06   0.000000e+00 
  1.645000e+02   7.020292e-06   0.000000e+00   7.020292e-06   0.000000e+00 
  1.647500e+02   7.228224e-06   0.000000e+00   7.228224e-06   0.000000e+00 
  1.650000e+02   6.203437e-06   0.000000e+00   6.203437e-06   0.000000e+00 
  1.652500e+02   4.946453e-06   0.000000e+00   4.946453e-06   0.000000e+00 
  1.655000e+02   4.995759e-06   0.000000e+00   4.995759e-06   0.000000e+00 
  1.657500e+02   5.368901e-06   0.000000e+00   5.368901e-06   0.000000e+00 
  1.660000e+02   6.258876e-06   0.000000e+00   6.258876e-06   0.000000e+00 
  1.662500e+02   6.561644e-06   0.000000e+00   6.561644e-06   0.000000e+00 
  1.665000e+02   6.703687e-06   0.000000e+00   6.703687e-06   0.000000e+00 
  1.667500e+02   5.331100e-06   0.000000e+00   5.331100e-06   0.000000e+00 
  1.670000e+02   4.858409e-06   0.000000e+00   4.858409e-06   0.000000e+00 
  1.672500e+02   4.686171e-06   0.000000e+00   4.686171e-06   0.000000e+00 
  1.675000e+02   5.633380e-06   0.000000e+00   5.633380e-06   0.000000e+00 
  1.677500e+02   4.964380e-06   0.000000e+00   4.964380e-06   0.000000e+00 
  1.680000e+02   5.007824e-06   0.000000e+00   5.007824e-06   0.000000e+00 
  1.682500e+02   4.990472e-06   0.000000e+00   4.990472e-06   0.000000e+00 
  1.685000e+02   7.494375e-06   0.000000e+00   7.494375e-06   0.000000e+00 
  1.687500e+02   7.027556e-06   0.000000e+00   7.027556e-06   0.000000e+00 
  1.690000e+02   5.862239e-06   0.000000e+00   5.862239e-06   0.000000e+00 
  1.692500e+02   5.689107e-06   0.000000e+00   5.689107e-06   0.000000e+00 
  1.695000e+02   5.413225e-06   0.000000e+00   5.413225e-06   0.000000e+00 
  1.697500e+02   5.781556e-06   0.000000e+00   5.781556e-06   0.000000e+00 
  1.700000e+02   7.135683e-06   0.000000e+00   7.135683e-06   0.000000e+00 
  1.702500e+02   6.797383e-06   0.000000e+00   6.797383e-06   0.000000e+00 
  1.705000e+02   6.458145e-06   0.000000e+00   6.458145e-06   0.000000e+00 
  1.707500e+02   7.992939e-06   0.000000e+00   7.992939e-06   0.000000e+00 
  1.710000e+02   9.095818e-06   0.000000e+00   9.095818e-06   0.000000e+00 
  1.712500e+02   6.410838e-06   0.000000e+00   6.410838e-06   0.000000e+00 
  1.715000e+02   5.204153e-06   0.000000e+00   5.204153e-06   0.000000e+00 
  1.717500e+02   5.296461e-06   0.000000e+00   5.296461e-06   0.000000e+00 
  1.720000e+02   5.115658e-06   0.000000e+00   5.115658e-06   0.000000e+00 
  1.722500e+02   8.312101e-06   0.000000e+00   8.312101e-06   0.000000e+00 
  1.725000e+02   1.232963e-05   0.000000e+00   1.232963e-05   0.000000e+00 
  1.727500e+02   1.020743e-05   0.000000e+00   1.020743e-05   0.000000e+00 
  1.730000e+02   5.243996e-06   0.000000e+00   5.243996e-06   0.000000e+00 
  1.732500e+02   4.203889e-06   0.000000e+00   4.203889e-06   0.000000e+00 
  1.735000e+02   5.106082e-06   0.000000e+00   5.106082e-06   0.000000e+00 
  1.737500e+02   5.407998e-06   0.000000e+00   5.407998e-06   0.000000e+00 
  1.740000e+02   5.597874e-06   0.000000e+00   5.597874e-06   0.000000e+00 
  1.742500e+02   5.876186e-06   0.000000e+00   5.876186e-06   0.000000e+00 
  1.745000e+02   5.003445e-06   0.000000e+00   5.003445e-06   0.000000e+00 
  1.747500e+02   4.894209e-06   0.000000e+00   4.894209e-06   0.000000e+00 
  1.750000e+02   4.948477e-06   0.000000e+00   4.948477e-06   0.000000e+00 
  1.752500e+02   5.114285e-06   0.000000e+00   5.114285e-06   0.000000e+00 
  1.755000e+02   5.774648e-06   0.000000e+00   5.774648e-06   0.000000e+00 
  1.757500e+02   7.185054e-06   0.000000e+00   7.185054e-06   0.000000e+00 
  1.760000e+02   7.498467e-06   0.000000e+00   7.498467e-06   0.000000e+00 
  1.762500e+02   6.598336e-06   0.000000e+00   6.598336e-06   0.000000e+00 
  1.765000e+02   6.216658e-06   0.000000e+00   6.216658e-06   0.000000e+00 
  1.767500e+02   5.157407e-06   0.000000e+00   5.157407e-06   0.000000e+00 
  1.770000e+02   4.156385e-06   0.000000e+00   4.156385e-06   0.000000e+00 
  1.772500e+02   4.247865e-06   0.000000e+00   4.247865e-06   0.000000e+00 
  1.775000e+02   5.792183e-06   0.000000e+00   5.792183e-06   0.000000e+00 
  1.777500e+02   5.938802e-06   0.000000e+00   5.938802e-06   0.000000e+00 
  1.780000e+02   4.904286e-06   0.000000e+00   4.904286e-06   0.000000e+00 
  1.782500e+02   6.061648e-06   0.000000e+00   6.061648e-06   0.000000e+00 
  1.785000e+02   1.071496e-05   0.000000e+00   1.071496e-05   0.000000e+00 
  1.787500e+02   9.860330e-06   0.000000e+00   9.860330e-06   0.000000e+00 
  1.790000e+02   5.043916e-06   0.000000e+00   5.043916e-06   0.000000e+00 
  1.792500e+02   4.642343e-06   0.000000e+00   4.642343e-06   0.000000e+00 
  1.795000e+02   4.602360e-06   0.000000e+00   4.602360e-06   0.000000e+00 
  1.797500e+02   7.019159e-06   0.000000e+00   7.019159e-06   0.000000e+00 
  1.800000e+02   1.186091e-05   0.000000e+00   1.186091e-05   0.000000e+00 
  1.802500e+02   6.585086e-06   0.000000e+00   6.585086e-06   0.000000e+00 
  1.805000e+02   5.631989e-06   0.000000e+00   5.631989e-06   0.000000e+00 
  1.807500e+02   6.568366e-06   0.000000e+00   6.568366e-06   0.000000e+00 
  1.810000e+02   5.816948e-06   0.000000e+00   5.816948e-06   0.000000e+00 
  1.812500e+02   5.071259e-06   0.000000e+00   5.071259e-06   0.000000e+00 
  1.815000e+02   4.377403e-06   0.000000e+00   4.377403e-06   0.000000e+00 
  1.817500e+02   4.139461e-06   0.000000e+00   4.139461e-06   0.000000e+00 
  1.820000e+02   4.416913e-06   0.000000e+00   4.416913e-06   0.000000e+00 
  1.822500e+02   3.992368e-06   0.000000e+00   3.992368e-06   0.000000e+00 
  1.825000e+02   4.752997e-06   0.000000e+00   4.752997e-06   0.000000e+00 
  1.827500e+02   4.826605e-06   0.000000e+00   4.826605e-06   0.000000e+00 
  1.830000e+02   4.419155e-06   0.000000e+00   4.419155e-06   0.000000e+00 
  1.832500e+02   5.472389e-06   0.000000e+00   5.472389e-06   0.000000e+00 
  1.835000e+02   6.449134e-06   0.000000e+00   6.449134e-06   0.000000e+00 
  1.837500e+02   6.286643e-06   0.000000e+00   6.286643e-06   0.000000e+00 
  1.840000e+02   4.515765e-06   0.000000e+00   4.515765e-06   0.000000e+00 
  1.842500e+02   4.692421e-06   0.000000e+00   4.692421e-06   0.000000e+00 
  1.845000e+02   3.672695e-06   0.000000e+00   3.672695e-06   0.000000e+00 
  1.847500e+02   4.866668e-06   0.000000e+00   4.866668e-06   0.000000e+00 
  1.850000e+02   4.822605e-06   0.000000e+00   4.822605e-06   0.000000e+00 
  1.852500e+02   4.492629e-06   0.000000e+00   4.492629e-06   0.000000e+00 
  1.855000e+02   4.767103e-06   0.000000e+00   4.767103e-06   0.000000e+00 
  1.857500e+02   4.318490e-06   0.000000e+00   4.318490e-06   0.000000e+00 
  1.860000e+02   4.458655e-06   0.000000e+00   4.458655e-06   0.000000e+00 
  1.862500e+02   5.272527e-06   0.000000e+00   5.272527e-06   0.000000e+00 
  1.865000e+02   5.922402e-06   0.000000e+00   5.922402e-06   0.000000e+00 
  1.867500e+02   5.499187e-06   0.000000e+00   5.499187e-06   0.000000e+00 
  1.870000e+02   5.148248e-06   0.000000e+00   5.148248e-06   0.000000e+00 
  1.872500e+02   6.896076e-06   0.000000e+00   6.896076e-06   0.000000e+00 
  1.875000e+02   9.157028e-06   0.000000e+00   9.157028e-06   0.000000e+00 
  1.877500e+02   8.442437e-06   0.000000e+00   8.442437e-06   0.000000e+00 
  1.880000e+02   5.045474e-06   0.000000e+00   5.045474e-06   0.000000e+00 
  1.882500e+02   3.803101e-06   0.000000e+00   3.803101e-06   0.000000e+00 
  1.885000e+02   3.722436e-06   0.000000e+00   3.722436e-06   0.000000e+00 
  1.887500e+02   4.010595e-06   0.000000e+00   4.010595e-06   0.000000e+00 
  1.890000e+02   4.769799e-06   0.000000e+00   4.769799e-06   0.000000e+00 
  1.892500e+02   6.285242e-06   0.000000e+00   6.285242e-06   0.000000e+00 
  1.895000e+02   5.387135e-06   0.000000e+00   5.387135e-06   0.000000e+00 
  1.897500e+02   4.265706e-06   0.000000e+00   4.265706e-06   0.000000e+00 
  1.900000e+02   6.677296e-06   0.000000e+00   6.677296e-06   0.000000e+00 
  1.902500e+02   5.936146e-06   0.000000e+00   5.936146e-06   0.000000e+00 
  1.905000e+02   3.859369e-06   0.000000e+00   3.859369e-06   0.000000e+00 
  1.907500e+02   4.943895e-06   0.000000e+00   4.943895e-06   0.000000e+00 
  1.910000e+02   5.112470e-06   0.000000e+00   5.112470e-06   0.000000e+00 
  1.912500e+02   4.753650e-06   0.000000e+00   4.753650e-06   0.000000e+00 
  1.915000e+02   6.980677e-06   0.000000e+00   6.980677e-06   0.000000e+00 
  1.917500e+02   9.615626e-06   0.000000e+00   9.615626e-06   0.000000e+00 
  1.920000e+02   5.557913e-06   0.000000e+00   5.557913e-06   0.000000e+00 
  1.922500e+02   4.431306e-06   0.000000e+00   4.431306e-06   0.000000e+00 
  1.925000e+02   4.590680e-06   0.000000e+00   4.590680e-06   0.000000e+00 
  1.927500e+02   4.322244e-06   0.000000e+00   4.322244e-06   0.000000e+00 
  1.930000e+02   4.602484e-06   0.000000e+00   4.602484e-06   0.000000e+00 
  1.932500e+02   4.039396e-06   0.000000e+00   4.039396e-06   0.000000e+00 
  1.935000e+02   5.641362e-06   0.000000e+00   5.641362e-06   0.000000e+00 
  1.937500e+02   4.209819e-06   0.000000e+00   4.209819e-06   0.000000e+00 
  1.940000e+02   4.686117e-06   0.000000e+00   4.686117e-06   0.000000e+00 
  1.942500e+02   5.806834e-06   0.000000e+00   5.806834e-06   0.000000e+00 
  1.945000e+02   6.305678e-06   0.000000e+00   6.305678e-06   0.000000e+00 
  1.947500e+02   4.900848e-06   0.000000e+00   4.900848e-06   0.000000e+00 
  1.950000e+02   5.358788e-06   0.000000e+00   5.358788e-06   0.000000e+00 
  1.952500e+02   7.020733e-06   0.000000e+00   7.020733e-06   0.000000e+00 
  1.955000e+02   5.617582e-06   0.000000e+00   5.617582e-06   0.000000e+00 
  1.957500e+02   1.105983e-05   0.000000e+00   1.105983e-05   0.000000e+00 
  1.960000e+02   1.079887e-05   0.000000e+00   1.079887e-05   0.000000e+00 
  1.962500e+02   6.559794e-06   0.000000e+00   6.559794e-06   0.000000e+00 
  1.965000e+02   7.131842e-06   0.000000e+00   7.131842e-06   0.000000e+00 
  1.967500e+02   6.390040e-06   0.000000e+00   6.390040e-06   0.000000e+00 
  1.970000e+02   5.784143e-06   0.000000e+00   5.784143e-06   0.000000e+00 
  1.972500e+02   5.442374e-06   0.000000e+00   5.442374e-06   0.000000e+00 
  1.975000e+02   4.815140e-06   0.000000e+00   4.815140e-06   0.000000e+00 
  1.977500e+02   5.323370e-06   0.000000e+00   5.323370e-06   0.000000e+00 
  1.980000e+02   4.790108e-06   0.000000e+00   4.790108e-06   0.000000e+00 
  1.982500e+02   4.580516e-06   0.000000e+00   4.580516e-06   0.000000e+00 
  1.985000e+02   5.552540e-06   0.000000e+00   5.552540e-06   0.000000e+00 
  1.987500e+02   5.551810e-06   0.000000e+00   5.551810e-06   0.000000e+00 
  1.990000e+02   4.913784e-06   0.000000e+00   4.913784e-06   0.000000e+00 
  1.992500e+02   4.979443e-06   0.000000e+00   4.979443e-06   0.000000e+00 
  1.995000e+02   5.431835e-06   0.000000e+00   5.431835e-06   0.000000e+00 
  1.997500e+02   3.579696e-05   0.000000e+00   3.579696e-05   0.000000e+00 
  2.000000e+02   5.914223e-05   0.000000e+00   5.914223e-05   0.000000e+00 
