  1.000000e+02   8.824278e-01  -8.260352e-02  -1.048526e+00  -5.347838e+00 
  1.035445e+02   8.817486e-01  -8.545422e-02  -1.052504e+00  -5.535504e+00 
  1.072147e+02   8.810272e-01  -8.838305e-02  -1.056726e+00  -5.728642e+00 
  1.110149e+02   8.802472e-01  -9.142516e-02  -1.061308e+00  -5.929653e+00 
  1.149499e+02   8.794129e-01  -9.453746e-02  -1.066242e+00  -6.135769e+00 
  1.190243e+02   8.785076e-01  -9.777697e-02  -1.071622e+00  -6.350822e+00 
  1.232432e+02   8.775834e-01  -1.011112e-01  -1.076960e+00  -6.572384e+00 
  1.276115e+02   8.765600e-01  -1.045454e-01  -1.083025e+00  -6.801415e+00 
  1.321348e+02   8.754857e-01  -1.080495e-01  -1.089368e+00  -7.035677e+00 
  1.368183e+02   8.743592e-01  -1.116964e-01  -1.095901e+00  -7.279911e+00 
  1.416679e+02   8.730893e-01  -1.154243e-01  -1.103580e+00  -7.530957e+00 
  1.466893e+02   8.717465e-01  -1.193513e-01  -1.111543e+00  -7.795926e+00 
  1.518888e+02   8.702968e-01  -1.232996e-01  -1.120344e+00  -8.063732e+00 
  1.572725e+02   8.687803e-01  -1.274025e-01  -1.129397e+00  -8.342689e+00 
  1.628470e+02   8.671994e-01  -1.315766e-01  -1.138776e+00  -8.627454e+00 
  1.686192e+02   8.654815e-01  -1.359175e-01  -1.149036e+00  -8.924986e+00 
  1.745959e+02   8.636217e-01  -1.403211e-01  -1.160364e+00  -9.228760e+00 
  1.807845e+02   8.617257e-01  -1.449128e-01  -1.171506e+00  -9.545874e+00 
  1.871925e+02   8.596042e-01  -1.495546e-01  -1.184522e+00  -9.869571e+00 
  1.938276e+02   8.573626e-01  -1.544226e-01  -1.198058e+00  -1.021027e+01 
  2.006978e+02   8.550357e-01  -1.593004e-01  -1.212125e+00  -1.055369e+01 
  2.078116e+02   8.524318e-01  -1.643659e-01  -1.228268e+00  -1.091383e+01 
  2.151776e+02   8.498175e-01  -1.694849e-01  -1.244093e+00  -1.127890e+01 
  2.228046e+02   8.469787e-01  -1.747562e-01  -1.261491e+00  -1.165818e+01 
  2.307019e+02   8.439301e-01  -1.801718e-01  -1.280304e+00  -1.205124e+01 
  2.388792e+02   8.407360e-01  -1.856681e-01  -1.300003e+00  -1.245331e+01 
  2.473464e+02   8.373066e-01  -1.912501e-01  -1.321444e+00  -1.286627e+01 
  2.561136e+02   8.335734e-01  -1.968887e-01  -1.345349e+00  -1.328960e+01 
  2.651916e+02   8.297829e-01  -2.029798e-01  -1.368315e+00  -1.374565e+01 
  2.745914e+02   8.254391e-01  -2.085238e-01  -1.397627e+00  -1.417753e+01 
  2.843243e+02   8.213680e-01  -2.148255e-01  -1.421879e+00  -1.465715e+01 
  2.944023e+02   8.169129e-01  -2.205229e-01  -1.451009e+00  -1.510672e+01 
  3.048375e+02   8.121233e-01  -2.266898e-01  -1.481716e+00  -1.559613e+01 
  3.156425e+02   8.069928e-01  -2.329281e-01  -1.515073e+00  -1.610010e+01 
  3.268305e+02   8.016513e-01  -2.392011e-01  -1.549876e+00  -1.661434e+01 
  3.384151e+02   7.960467e-01  -2.454309e-01  -1.586864e+00  -1.713517e+01 
  3.504103e+02   7.900796e-01  -2.516954e-01  -1.626791e+00  -1.767030e+01 
  3.628307e+02   7.839286e-01  -2.580309e-01  -1.667739e+00  -1.821901e+01 
  3.756913e+02   7.772308e-01  -2.642744e-01  -1.713860e+00  -1.877908e+01 
  3.890078e+02   7.704484e-01  -2.706710e-01  -1.759696e+00  -1.935720e+01 
  4.027963e+02   7.633946e-01  -2.768238e-01  -1.808493e+00  -1.993177e+01 
  4.170735e+02   7.557003e-01  -2.831318e-01  -1.862545e+00  -2.053904e+01 
  4.318567e+02   7.479465e-01  -2.890960e-01  -1.917887e+00  -2.113249e+01 
  4.471640e+02   7.397417e-01  -2.950507e-01  -1.977239e+00  -2.174490e+01 
  4.630138e+02   7.310979e-01  -3.010787e-01  -2.040140e+00  -2.238271e+01 
  4.794255e+02   7.222347e-01  -3.068699e-01  -2.105659e+00  -2.302012e+01 
  4.964188e+02   7.131323e-01  -3.124079e-01  -2.174153e+00  -2.365718e+01 
  5.140145e+02   7.035520e-01  -3.179076e-01  -2.247168e+00  -2.431635e+01 
  5.322339e+02   6.934220e-01  -3.225054e-01  -2.329601e+00  -2.494278e+01 
  5.510990e+02   6.844797e-01  -3.276546e-01  -2.396756e+00  -2.558004e+01 
  5.706329e+02   6.724375e-01  -3.321945e-01  -2.498579e+00  -2.629008e+01 
  5.908591e+02   6.620725e-01  -3.369862e-01  -2.581398e+00  -2.697549e+01 
  6.118022e+02   6.512843e-01  -3.413649e-01  -2.670426e+00  -2.766088e+01 
  6.334877e+02   6.400253e-01  -3.452627e-01  -2.766768e+00  -2.834472e+01 
  6.559418e+02   6.284604e-01  -3.486939e-01  -2.868876e+00  -2.902319e+01 
  6.791918e+02   6.166453e-01  -3.518743e-01  -2.975118e+00  -2.971024e+01 
  7.032659e+02   6.047220e-01  -3.547453e-01  -3.084473e+00  -3.039697e+01 
  7.281934e+02   5.925559e-01  -3.570524e-01  -3.200192e+00  -3.107162e+01 
  7.540043e+02   5.802436e-01  -3.591247e-01  -3.319375e+00  -3.175421e+01 
  7.807302e+02   5.677489e-01  -3.607081e-01  -3.444303e+00  -3.242903e+01 
  8.084034e+02   5.552374e-01  -3.619187e-01  -3.572647e+00  -3.309739e+01 
  8.370574e+02   5.426669e-01  -3.625269e-01  -3.706791e+00  -3.374478e+01 
  8.667272e+02   5.302106e-01  -3.628367e-01  -3.842880e+00  -3.438484e+01 
  8.974485e+02   5.177074e-01  -3.627715e-01  -3.983483e+00  -3.501996e+01 
  9.292588e+02   5.050007e-01  -3.621990e-01  -4.131721e+00  -3.564902e+01 
  9.621966e+02   4.925109e-01  -3.611867e-01  -4.282646e+00  -3.625475e+01 
  9.963019e+02   4.801143e-01  -3.597219e-01  -4.438067e+00  -3.684210e+01 
  1.031616e+03   4.677604e-01  -3.578631e-01  -4.598384e+00  -3.741803e+01 
  1.068182e+03   4.555613e-01  -3.556009e-01  -4.762690e+00  -3.797479e+01 
  1.106044e+03   4.435435e-01  -3.529838e-01  -4.930509e+00  -3.851371e+01 
  1.145248e+03   4.317136e-01  -3.500439e-01  -5.101717e+00  -3.903598e+01 
  1.185841e+03   4.201415e-01  -3.465840e-01  -5.277713e+00  -3.951998e+01 
  1.227874e+03   4.087666e-01  -3.428946e-01  -5.456632e+00  -3.999166e+01 
  1.271396e+03   3.975883e-01  -3.388354e-01  -5.640190e+00  -4.043852e+01 
  1.316461e+03   3.868315e-01  -3.344822e-01  -5.825003e+00  -4.084904e+01 
  1.363123e+03   3.762738e-01  -3.298796e-01  -6.013614e+00  -4.124108e+01 
  1.411440e+03   3.661413e-01  -3.250871e-01  -6.202577e+00  -4.160102e+01 
  1.461468e+03   3.561226e-01  -3.199840e-01  -6.397607e+00  -4.194039e+01 
  1.513271e+03   3.466500e-01  -3.146886e-01  -6.591691e+00  -4.223314e+01 
  1.566909e+03   3.373672e-01  -3.091446e-01  -6.790503e+00  -4.250042e+01 
  1.622448e+03   3.283409e-01  -3.034987e-01  -6.991456e+00  -4.274845e+01 
  1.679956e+03   3.197092e-01  -2.977185e-01  -7.193073e+00  -4.296018e+01 
  1.739503e+03   3.113555e-01  -2.917454e-01  -7.397911e+00  -4.313766e+01 
  1.801160e+03   3.035010e-01  -2.856974e-01  -7.601105e+00  -4.326924e+01 
  1.865002e+03   2.958270e-01  -2.796285e-01  -7.806626e+00  -4.338761e+01 
  1.931108e+03   2.885405e-01  -2.734469e-01  -8.012636e+00  -4.346155e+01 
  1.999556e+03   2.815582e-01  -2.670887e-01  -8.221422e+00  -4.348928e+01 
  2.070431e+03   2.749004e-01  -2.608807e-01  -8.427579e+00  -4.350109e+01 
  2.143818e+03   2.685446e-01  -2.545882e-01  -8.634971e+00  -4.347180e+01 
  2.219806e+03   2.625780e-01  -2.483858e-01  -8.839149e+00  -4.340900e+01 
  2.298488e+03   2.568343e-01  -2.421652e-01  -9.044546e+00  -4.331615e+01 
  2.379958e+03   2.513347e-01  -2.359311e-01  -9.250643e+00  -4.318935e+01 
  2.464316e+03   2.462265e-01  -2.298287e-01  -9.452003e+00  -4.302721e+01 
  2.551665e+03   2.412899e-01  -2.237893e-01  -9.653615e+00  -4.284502e+01 
  2.642109e+03   2.366542e-01  -2.177218e-01  -9.854460e+00  -4.261405e+01 
  2.735759e+03   2.322947e-01  -2.117895e-01  -1.005174e+01  -4.235630e+01 
  2.832729e+03   2.280072e-01  -2.060568e-01  -1.024813e+01  -4.210504e+01 
  2.933135e+03   2.240925e-01  -2.002546e-01  -1.044219e+01  -4.178475e+01 
  3.037101e+03   2.203948e-01  -1.945894e-01  -1.063291e+01  -4.144169e+01 
  3.144752e+03   2.168955e-01  -1.890337e-01  -1.082088e+01  -4.107353e+01 
  3.256219e+03   2.135836e-01  -1.835793e-01  -1.100621e+01  -4.067971e+01 
  3.371636e+03   2.104799e-01  -1.782232e-01  -1.118813e+01  -4.025616e+01 
  3.491145e+03   2.075920e-01  -1.729815e-01  -1.136576e+01  -3.980364e+01 
  3.614889e+03   2.048622e-01  -1.678758e-01  -1.153967e+01  -3.933314e+01 
  3.743020e+03   2.022286e-01  -1.628402e-01  -1.171254e+01  -3.884200e+01 
  3.875692e+03   1.998224e-01  -1.579470e-01  -1.187914e+01  -3.832414e+01 
  4.013066e+03   1.975244e-01  -1.531596e-01  -1.204302e+01  -3.778985e+01 
  4.155311e+03   1.953840e-01  -1.485150e-01  -1.220176e+01  -3.723914e+01 
  4.302597e+03   1.933534e-01  -1.440083e-01  -1.235645e+01  -3.667849e+01 
  4.455103e+03   1.914738e-01  -1.396033e-01  -1.250640e+01  -3.609575e+01 
  4.613015e+03   1.896864e-01  -1.352901e-01  -1.265326e+01  -3.549761e+01 
  4.776525e+03   1.880220e-01  -1.311385e-01  -1.279431e+01  -3.489437e+01 
  4.945830e+03   1.864594e-01  -1.270883e-01  -1.293124e+01  -3.427784e+01 
  5.121136e+03   1.849684e-01  -1.231458e-01  -1.306465e+01  -3.365435e+01 
  5.302656e+03   1.836196e-01  -1.193391e-01  -1.319139e+01  -3.302087e+01 
  5.490610e+03   1.823092e-01  -1.156306e-01  -1.331548e+01  -3.238512e+01 
  5.685226e+03   1.811232e-01  -1.120374e-01  -1.343346e+01  -3.173970e+01 
  5.886740e+03   1.799866e-01  -1.085580e-01  -1.354774e+01  -3.109606e+01 
  6.095397e+03   1.789053e-01  -1.051910e-01  -1.365802e+01  -3.045427e+01 
  6.311450e+03   1.779198e-01  -1.019093e-01  -1.376327e+01  -2.980333e+01 
  6.535161e+03   1.769880e-01  -9.873059e-02  -1.386449e+01  -2.915442e+01 
  6.766801e+03   1.761366e-01  -9.567132e-02  -1.396021e+01  -2.850928e+01 
  7.006652e+03   1.753183e-01  -9.270246e-02  -1.405273e+01  -2.786838e+01 
  7.255004e+03   1.745455e-01  -8.986631e-02  -1.414065e+01  -2.724208e+01 
  7.512160e+03   1.738313e-01  -8.709963e-02  -1.422466e+01  -2.661355e+01 
  7.778430e+03   1.731655e-01  -8.443002e-02  -1.430454e+01  -2.599240e+01 
  8.054138e+03   1.725456e-01  -8.183055e-02  -1.438085e+01  -2.537286e+01 
  8.339619e+03   1.719538e-01  -7.933861e-02  -1.445357e+01  -2.476836e+01 
  8.635219e+03   1.714133e-01  -7.691980e-02  -1.452236e+01  -2.416763e+01 
  8.941296e+03   1.709055e-01  -7.459587e-02  -1.458755e+01  -2.358004e+01 
  9.258223e+03   1.704123e-01  -7.235718e-02  -1.465011e+01  -2.300611e+01 
  9.586382e+03   1.699634e-01  -7.019981e-02  -1.470883e+01  -2.244204e+01 
  9.926174e+03   1.695483e-01  -6.812327e-02  -1.476417e+01  -2.188990e+01 
  1.027801e+04   1.691514e-01  -6.612723e-02  -1.481684e+01  -2.135228e+01 
  1.064232e+04   1.687846e-01  -6.420435e-02  -1.486644e+01  -2.082643e+01 
  1.101954e+04   1.684729e-01  -6.234294e-02  -1.491204e+01  -2.030685e+01 
  1.141013e+04   1.681499e-01  -6.054864e-02  -1.495658e+01  -1.980330e+01 
  1.181456e+04   1.678388e-01  -5.884583e-02  -1.499864e+01  -1.932113e+01 
  1.223333e+04   1.675505e-01  -5.719675e-02  -1.503837e+01  -1.884838e+01 
  1.266694e+04   1.672907e-01  -5.560649e-02  -1.507543e+01  -1.838651e+01 
  1.311593e+04   1.670607e-01  -5.409354e-02  -1.510951e+01  -1.794173e+01 
  1.358082e+04   1.668300e-01  -5.264976e-02  -1.514219e+01  -1.751514e+01 
  1.406220e+04   1.666154e-01  -5.124776e-02  -1.517312e+01  -1.709691e+01 
  1.456064e+04   1.664186e-01  -4.992294e-02  -1.520173e+01  -1.669841e+01 
  1.507674e+04   1.662205e-01  -4.864899e-02  -1.522937e+01  -1.631356e+01 
  1.561114e+04   1.660565e-01  -4.742372e-02  -1.525438e+01  -1.593870e+01 
  1.616448e+04   1.658874e-01  -4.626494e-02  -1.527842e+01  -1.558344e+01 
  1.673744e+04   1.657371e-01  -4.514439e-02  -1.530078e+01  -1.523689e+01 
  1.733070e+04   1.656011e-01  -4.410071e-02  -1.532117e+01  -1.491217e+01 
  1.794499e+04   1.654714e-01  -4.310189e-02  -1.534044e+01  -1.459994e+01 
  1.858105e+04   1.653471e-01  -4.214707e-02  -1.535868e+01  -1.430020e+01 
  1.923966e+04   1.652372e-01  -4.125538e-02  -1.537522e+01  -1.401865e+01 
  1.992162e+04   1.651284e-01  -4.040344e-02  -1.539105e+01  -1.374894e+01 
  2.062774e+04   1.650340e-01  -3.959973e-02  -1.540542e+01  -1.349297e+01 
  2.135890e+04   1.649500e-01  -3.884293e-02  -1.541857e+01  -1.325077e+01 
  2.211597e+04   1.648610e-01  -3.813091e-02  -1.543131e+01  -1.302301e+01 
  2.289988e+04   1.647787e-01  -3.746504e-02  -1.544308e+01  -1.280933e+01 
  2.371157e+04   1.647070e-01  -3.684539e-02  -1.545369e+01  -1.260961e+01 
  2.455203e+04   1.646512e-01  -3.627421e-02  -1.546287e+01  -1.242433e+01 
  2.542228e+04   1.645916e-01  -3.574586e-02  -1.547169e+01  -1.225316e+01 
  2.632338e+04   1.645349e-01  -3.525653e-02  -1.547987e+01  -1.209444e+01 
  2.725642e+04   1.644930e-01  -3.481952e-02  -1.548669e+01  -1.195182e+01 
  2.822253e+04   1.644394e-01  -3.440740e-02  -1.549378e+01  -1.181810e+01 
  2.922288e+04   1.643958e-01  -3.405632e-02  -1.549970e+01  -1.170388e+01 
  3.025870e+04   1.643680e-01  -3.373771e-02  -1.550443e+01  -1.159927e+01 
  3.133122e+04   1.643299e-01  -3.345802e-02  -1.550926e+01  -1.150827e+01 
  3.244177e+04   1.643115e-01  -3.322113e-02  -1.551264e+01  -1.143019e+01 
  3.359167e+04   1.642848e-01  -3.302711e-02  -1.551599e+01  -1.136698e+01 
  3.478234e+04   1.642651e-01  -3.287676e-02  -1.551852e+01  -1.131789e+01 
  3.601521e+04   1.642526e-01  -3.276541e-02  -1.552029e+01  -1.128138e+01 
  3.729177e+04   1.642430e-01  -3.269206e-02  -1.552152e+01  -1.125741e+01 
  3.861359e+04   1.642388e-01  -3.266065e-02  -1.552205e+01  -1.124716e+01 
  3.998226e+04   1.642334e-01  -3.267486e-02  -1.552218e+01  -1.125229e+01 
  4.139944e+04   1.642281e-01  -3.273765e-02  -1.552181e+01  -1.127371e+01 
  4.286685e+04   1.642359e-01  -3.281467e-02  -1.552063e+01  -1.129903e+01 
  4.438628e+04   1.642446e-01  -3.296931e-02  -1.551862e+01  -1.135031e+01 
  4.595956e+04   1.642559e-01  -3.315978e-02  -1.551610e+01  -1.141340e+01 
  4.758861e+04   1.642540e-01  -3.338740e-02  -1.551385e+01  -1.148980e+01 
  4.927539e+04   1.642787e-01  -3.364525e-02  -1.550993e+01  -1.157446e+01 
  5.102197e+04   1.642963e-01  -3.397290e-02  -1.550561e+01  -1.168286e+01 
  5.283046e+04   1.643213e-01  -3.432490e-02  -1.550064e+01  -1.179879e+01 
  5.470305e+04   1.643260e-01  -3.473963e-02  -1.549599e+01  -1.193696e+01 
  5.664201e+04   1.643462e-01  -3.520045e-02  -1.549001e+01  -1.208923e+01 
  5.864970e+04   1.643888e-01  -3.570536e-02  -1.548236e+01  -1.225434e+01 
  6.072855e+04   1.644188e-01  -3.626846e-02  -1.547463e+01  -1.243943e+01 
  6.288109e+04   1.644440e-01  -3.686833e-02  -1.546665e+01  -1.263674e+01 
  6.510993e+04   1.644696e-01  -3.752926e-02  -1.545785e+01  -1.285388e+01 
  6.741777e+04   1.645227e-01  -3.825894e-02  -1.544676e+01  -1.309118e+01 
  6.980740e+04   1.645469e-01  -3.903567e-02  -1.543642e+01  -1.334564e+01 
  7.228174e+04   1.645843e-01  -3.987810e-02  -1.542447e+01  -1.362005e+01 
  7.484378e+04   1.646198e-01  -4.079164e-02  -1.541156e+01  -1.391717e+01 
  7.749664e+04   1.646274e-01  -4.176459e-02  -1.539907e+01  -1.423514e+01 
  8.024352e+04   1.646550e-01  -4.280101e-02  -1.538454e+01  -1.457119e+01 
  8.308778e+04   1.646671e-01  -4.394614e-02  -1.536906e+01  -1.494276e+01 
  8.603284e+04   1.646361e-01  -4.510746e-02  -1.535515e+01  -1.532205e+01 
  8.908230e+04   1.645725e-01  -4.634076e-02  -1.534148e+01  -1.572630e+01 
  9.223984e+04   1.645098e-01  -4.761774e-02  -1.532674e+01  -1.614321e+01 
  9.550930e+04   1.644039e-01  -4.891099e-02  -1.531344e+01  -1.656801e+01 
  9.889466e+04   1.643434e-01  -5.019446e-02  -1.529763e+01  -1.698394e+01 
  1.024000e+05   1.643868e-01  -5.148141e-02  -1.527633e+01  -1.738912e+01 
