  0.000000e+00   7.617132e-04   9.705717e-07   7.617138e-04   7.300600e-02 
  1.600000e+01   5.321078e-04   1.234587e-04   5.462424e-04   1.306254e+01 
  3.200000e+01   1.786681e-04   9.700489e-05   2.033034e-04   2.849901e+01 
  4.800000e+01   4.287655e-05   4.367346e-05   6.120269e-05   4.552753e+01 
  6.400000e+01   3.426869e-05   3.674730e-05   5.024646e-05   4.699894e+01 
  8.000000e+01   3.467270e-05   3.515952e-05   4.938004e-05   4.539941e+01 
  9.600000e+01   3.475089e-05   3.412006e-05   4.870116e-05   4.447521e+01 
  1.120000e+02   3.678549e-05   3.629249e-05   5.167511e-05   4.461347e+01 
  1.280000e+02   4.167606e-05   4.121530e-05   5.861395e-05   4.468152e+01 
  1.440000e+02   4.780743e-05   4.915870e-05   6.857206e-05   4.579839e+01 
  1.600000e+02   5.159678e-05   5.672065e-05   7.667764e-05   4.770831e+01 
  1.760000e+02   5.252361e-05   5.654451e-05   7.717519e-05   4.711131e+01 
  1.920000e+02   4.462123e-05   4.701785e-05   6.482077e-05   4.649810e+01 
  2.080000e+02   3.242279e-05   3.432493e-05   4.721692e-05   4.663234e+01 
  2.240000e+02   2.513113e-05   2.485756e-05   3.534787e-05   4.468644e+01 
  2.400000e+02   2.092627e-05   1.912578e-05   2.834968e-05   4.242607e+01 
  2.560000e+02   1.768928e-05   1.548057e-05   2.350657e-05   4.119042e+01 
  2.720000e+02   1.598167e-05   1.544276e-05   2.222369e-05   4.401750e+01 
  2.880000e+02   1.548999e-05   1.594819e-05   2.223251e-05   4.583501e+01 
  3.040000e+02   1.404398e-05   1.467710e-05   2.031381e-05   4.626281e+01 
  3.200000e+02   1.230357e-05   1.270895e-05   1.768884e-05   4.592852e+01 
  3.360000e+02   1.042902e-05   1.061524e-05   1.488112e-05   4.550702e+01 
  3.520000e+02   9.037927e-06   8.833304e-06   1.263770e-05   4.434400e+01 
  3.680000e+02   8.233427e-06   8.005165e-06   1.148355e-05   4.419466e+01 
  3.840000e+02   7.524941e-06   7.766891e-06   1.081431e-05   4.590647e+01 
  4.000000e+02   7.020467e-06   7.207608e-06   1.006164e-05   4.575356e+01 
  4.160000e+02   6.770675e-06   6.260597e-06   9.221557e-06   4.275843e+01 
  4.320000e+02   6.429640e-06   5.231031e-06   8.288785e-06   3.913113e+01 
  4.480000e+02   5.976404e-06   4.889976e-06   7.722000e-06   3.929050e+01 
  4.640000e+02   4.754543e-06   4.924372e-06   6.845080e-06   4.600522e+01 
  4.800000e+02   4.581535e-06   4.905072e-06   6.711944e-06   4.695329e+01 
  4.960000e+02   4.553006e-06   4.657971e-06   6.513568e-06   4.565289e+01 
  5.120000e+02   4.424366e-06   4.790465e-06   6.521010e-06   4.727513e+01 
  5.280000e+02   4.417564e-06   4.924942e-06   6.615884e-06   4.810859e+01 
  5.440000e+02   4.055815e-06   4.136446e-06   5.793084e-06   4.556391e+01 
  5.600000e+02   3.283384e-06   3.089986e-06   4.508728e-06   4.326191e+01 
  5.760000e+02   2.586363e-06   2.557245e-06   3.637138e-06   4.467565e+01 
  5.920000e+02   2.707436e-06   2.962142e-06   4.013041e-06   4.757229e+01 
  6.080000e+02   2.789101e-06   3.411255e-06   4.406330e-06   5.072997e+01 
  6.240000e+02   2.338923e-06   2.809425e-06   3.655603e-06   5.022169e+01 
  6.400000e+02   1.854267e-06   2.130171e-06   2.824170e-06   4.896114e+01 
  6.560000e+02   1.782865e-06   2.093493e-06   2.749786e-06   4.958154e+01 
  6.720000e+02   1.605737e-06   1.730051e-06   2.360396e-06   4.713424e+01 
  6.880000e+02   1.390448e-06   1.288521e-06   1.895688e-06   4.282111e+01 
  7.040000e+02   1.215676e-06   1.159028e-06   1.679647e-06   4.363348e+01 
  7.200000e+02   1.022126e-06   1.051207e-06   1.466212e-06   4.580358e+01 
  7.360000e+02   1.013315e-06   9.888224e-07   1.415831e-06   4.429913e+01 
  7.520000e+02   1.252296e-06   1.180852e-06   1.721237e-06   4.331810e+01 
  7.680000e+02   1.685611e-06   1.598474e-06   2.323016e-06   4.348013e+01 
  7.840000e+02   1.975049e-06   1.907739e-06   2.745958e-06   4.400685e+01 
  8.000000e+02   1.810300e-06   1.796131e-06   2.550152e-06   4.477489e+01 
  8.160000e+02   1.492912e-06   1.535161e-06   2.141380e-06   4.579935e+01 
  8.320000e+02   1.296436e-06   1.388349e-06   1.899542e-06   4.696074e+01 
  8.480000e+02   1.146859e-06   1.198197e-06   1.658602e-06   4.625411e+01 
  8.640000e+02   1.071032e-06   1.046205e-06   1.497215e-06   4.432817e+01 
  8.800000e+02   1.004826e-06   9.806256e-07   1.404031e-06   4.430165e+01 
  8.960000e+02   9.872388e-07   9.731200e-07   1.386219e-06   4.458735e+01 
  9.120000e+02   9.071059e-07   8.967288e-07   1.275525e-06   4.467039e+01 
  9.280000e+02   7.657349e-07   7.537000e-07   1.074436e-06   4.454619e+01 
  9.440000e+02   7.128749e-07   6.871779e-07   9.901536e-07   4.394849e+01 
  9.600000e+02   6.726725e-07   6.732425e-07   9.517057e-07   4.502427e+01 
  9.760000e+02   6.084244e-07   6.517042e-07   8.915709e-07   4.696708e+01 
  9.920000e+02   5.419870e-07   6.171143e-07   8.213282e-07   4.870844e+01 
  1.008000e+03   5.519520e-07   5.946783e-07   8.113527e-07   4.713399e+01 
  1.024000e+03   5.570213e-07   6.058057e-07   8.229662e-07   4.740233e+01 
  1.040000e+03   5.267567e-07   5.867743e-07   7.885282e-07   4.808517e+01 
  1.056000e+03   5.224568e-07   5.590641e-07   7.651887e-07   4.693860e+01 
  1.072000e+03   5.461755e-07   5.264303e-07   7.585753e-07   4.394538e+01 
  1.088000e+03   5.632817e-07   5.246159e-07   7.697455e-07   4.296446e+01 
  1.104000e+03   5.347347e-07   5.276646e-07   7.512464e-07   4.461871e+01 
  1.120000e+03   4.947141e-07   4.851462e-07   6.928989e-07   4.444054e+01 
  1.136000e+03   4.719844e-07   4.576636e-07   6.574384e-07   4.411745e+01 
  1.152000e+03   4.508252e-07   4.294586e-07   6.226380e-07   4.360956e+01 
  1.168000e+03   3.949246e-07   3.965584e-07   5.596642e-07   4.511827e+01 
  1.184000e+03   3.864569e-07   4.121923e-07   5.650235e-07   4.684564e+01 
  1.200000e+03   4.208745e-07   4.329183e-07   6.037827e-07   4.580818e+01 
  1.216000e+03   4.128303e-07   4.305266e-07   5.964746e-07   4.620207e+01 
  1.232000e+03   3.756756e-07   3.935791e-07   5.440925e-07   4.633325e+01 
  1.248000e+03   3.665188e-07   3.830019e-07   5.301193e-07   4.625982e+01 
  1.264000e+03   3.707918e-07   3.763962e-07   5.283566e-07   4.542975e+01 
  1.280000e+03   3.714349e-07   3.620206e-07   5.186740e-07   4.426462e+01 
  1.296000e+03   3.568899e-07   3.477053e-07   4.982664e-07   4.425317e+01 
  1.312000e+03   3.548051e-07   3.443060e-07   4.944020e-07   4.413961e+01 
  1.328000e+03   3.666046e-07   3.521946e-07   5.083699e-07   4.385152e+01 
  1.344000e+03   3.846098e-07   3.417636e-07   5.145163e-07   4.162424e+01 
  1.360000e+03   3.872055e-07   3.280043e-07   5.074593e-07   4.026815e+01 
  1.376000e+03   3.758937e-07   3.466167e-07   5.113113e-07   4.267957e+01 
  1.392000e+03   3.765198e-07   3.616899e-07   5.220984e-07   4.384914e+01 
  1.408000e+03   3.748866e-07   3.792809e-07   5.332860e-07   4.533384e+01 
  1.424000e+03   3.976948e-07   4.283324e-07   5.844910e-07   4.712414e+01 
  1.440000e+03   4.696156e-07   4.959256e-07   6.829942e-07   4.656086e+01 
  1.456000e+03   5.097577e-07   5.136213e-07   7.236434e-07   4.521631e+01 
  1.472000e+03   4.675456e-07   4.811914e-07   6.709278e-07   4.582404e+01 
  1.488000e+03   3.930573e-07   4.519063e-07   5.989269e-07   4.898403e+01 
  1.504000e+03   3.797029e-07   4.324786e-07   5.755102e-07   4.871786e+01 
  1.520000e+03   3.675526e-07   3.773892e-07   5.267993e-07   4.575652e+01 
  1.536000e+03   3.340673e-07   3.460278e-07   4.809742e-07   4.600753e+01 
  1.552000e+03   3.140323e-07   3.387592e-07   4.619243e-07   4.716925e+01 
  1.568000e+03   3.051444e-07   3.247931e-07   4.456497e-07   4.678656e+01 
  1.584000e+03   2.911283e-07   2.953611e-07   4.147215e-07   4.541350e+01 
  1.600000e+03   2.885831e-07   2.819068e-07   4.034249e-07   4.432951e+01 
  1.616000e+03   3.107921e-07   2.963432e-07   4.294311e-07   4.363671e+01 
  1.632000e+03   3.058439e-07   2.950164e-07   4.249414e-07   4.396765e+01 
  1.648000e+03   2.721600e-07   2.751715e-07   3.870277e-07   4.531524e+01 
  1.664000e+03   2.608000e-07   2.609351e-07   3.689224e-07   4.501484e+01 
  1.680000e+03   2.609196e-07   2.522008e-07   3.628833e-07   4.402653e+01 
  1.696000e+03   2.439668e-07   2.297223e-07   3.351002e-07   4.327755e+01 
  1.712000e+03   2.374318e-07   2.328385e-07   3.325472e-07   4.444039e+01 
  1.728000e+03   2.483008e-07   2.702293e-07   3.669838e-07   4.742158e+01 
  1.744000e+03   2.557388e-07   2.798769e-07   3.791219e-07   4.758034e+01 
  1.760000e+03   2.483553e-07   2.600666e-07   3.596039e-07   4.631955e+01 
  1.776000e+03   2.451212e-07   2.468200e-07   3.478571e-07   4.519785e+01 
  1.792000e+03   2.327549e-07   2.384165e-07   3.331926e-07   4.568843e+01 
  1.808000e+03   2.383121e-07   2.472098e-07   3.433734e-07   4.604988e+01 
  1.824000e+03   2.508441e-07   2.613953e-07   3.622847e-07   4.618002e+01 
  1.840000e+03   2.519928e-07   2.581943e-07   3.607834e-07   4.569641e+01 
  1.856000e+03   2.647713e-07   2.601997e-07   3.712246e-07   4.450106e+01 
  1.872000e+03   2.643397e-07   2.605792e-07   3.711833e-07   4.458955e+01 
  1.888000e+03   2.474127e-07   2.524060e-07   3.534428e-07   4.557237e+01 
  1.904000e+03   2.281265e-07   2.416179e-07   3.322964e-07   4.664511e+01 
  1.920000e+03   2.345979e-07   2.485667e-07   3.417917e-07   4.665602e+01 
  1.936000e+03   2.459129e-07   2.503663e-07   3.509365e-07   4.551413e+01 
  1.952000e+03   2.432843e-07   2.482527e-07   3.475869e-07   4.557911e+01 
  1.968000e+03   2.512692e-07   2.538050e-07   3.571459e-07   4.528766e+01 
  1.984000e+03   2.466645e-07   2.446722e-07   3.474304e-07   4.476768e+01 
  2.000000e+03   2.232860e-07   2.284748e-07   3.194642e-07   4.565805e+01 
  2.016000e+03   2.108638e-07   2.193426e-07   3.042610e-07   4.612908e+01 
  2.032000e+03   2.021191e-07   2.119371e-07   2.928643e-07   4.635833e+01 
  2.048000e+03   2.100287e-07   2.137616e-07   2.996767e-07   4.550467e+01 
  2.064000e+03   2.133764e-07   2.133469e-07   3.017389e-07   4.499605e+01 
  2.080000e+03   2.092677e-07   2.033567e-07   2.917994e-07   4.417927e+01 
  2.096000e+03   2.112289e-07   1.902159e-07   2.842530e-07   4.200368e+01 
  2.112000e+03   2.099159e-07   2.008421e-07   2.905206e-07   4.373452e+01 
  2.128000e+03   2.022272e-07   2.119732e-07   2.929650e-07   4.634790e+01 
  2.144000e+03   2.157425e-07   2.184975e-07   3.070603e-07   4.536350e+01 
  2.160000e+03   2.411842e-07   2.319214e-07   3.346003e-07   4.387836e+01 
  2.176000e+03   2.383048e-07   2.495059e-07   3.450252e-07   4.631540e+01 
  2.192000e+03   2.246411e-07   2.551423e-07   3.399429e-07   4.863757e+01 
  2.208000e+03   2.130714e-07   2.503820e-07   3.287713e-07   4.960271e+01 
  2.224000e+03   2.035353e-07   2.345862e-07   3.105757e-07   4.905393e+01 
  2.240000e+03   2.029192e-07   2.238494e-07   3.021337e-07   4.780774e+01 
  2.256000e+03   1.983675e-07   2.252522e-07   3.001470e-07   4.863136e+01 
  2.272000e+03   2.003170e-07   2.167382e-07   2.951311e-07   4.725480e+01 
  2.288000e+03   1.968732e-07   2.016894e-07   2.818469e-07   4.569231e+01 
  2.304000e+03   2.017528e-07   1.966345e-07   2.817256e-07   4.426393e+01 
  2.320000e+03   2.020601e-07   2.018025e-07   2.855740e-07   4.496345e+01 
  2.336000e+03   1.926468e-07   2.037812e-07   2.804275e-07   4.660883e+01 
  2.352000e+03   1.865946e-07   2.005226e-07   2.739103e-07   4.706054e+01 
  2.368000e+03   1.912755e-07   2.058186e-07   2.809762e-07   4.709746e+01 
  2.384000e+03   2.042719e-07   2.067181e-07   2.906189e-07   4.534101e+01 
  2.400000e+03   2.051190e-07   1.920866e-07   2.810179e-07   4.312078e+01 
  2.416000e+03   1.943370e-07   1.880661e-07   2.704362e-07   4.406050e+01 
  2.432000e+03   1.889578e-07   1.898710e-07   2.678732e-07   4.513811e+01 
  2.448000e+03   1.910707e-07   1.921154e-07   2.709545e-07   4.515621e+01 
  2.464000e+03   1.814514e-07   1.873452e-07   2.608119e-07   4.591558e+01 
  2.480000e+03   1.780283e-07   1.839520e-07   2.559930e-07   4.593755e+01 
  2.496000e+03   1.901630e-07   1.839477e-07   2.645727e-07   4.404821e+01 
  2.512000e+03   1.956971e-07   1.872441e-07   2.708463e-07   4.373547e+01 
  2.528000e+03   2.105323e-07   2.013348e-07   2.913066e-07   4.372073e+01 
  2.544000e+03   2.132561e-07   2.055119e-07   2.961643e-07   4.394056e+01 
  2.560000e+03   2.087506e-07   1.978878e-07   2.876394e-07   4.346978e+01 
  2.576000e+03   1.994114e-07   1.921263e-07   2.769068e-07   4.393405e+01 
  2.592000e+03   1.844885e-07   1.874548e-07   2.630120e-07   4.545692e+01 
  2.608000e+03   1.886154e-07   1.849164e-07   2.641399e-07   4.443263e+01 
  2.624000e+03   2.044073e-07   1.929007e-07   2.810569e-07   4.334109e+01 
  2.640000e+03   2.056619e-07   2.010117e-07   2.875805e-07   4.434487e+01 
  2.656000e+03   2.046907e-07   2.133560e-07   2.956671e-07   4.618747e+01 
  2.672000e+03   2.226497e-07   2.338087e-07   3.228612e-07   4.640043e+01 
  2.688000e+03   2.357266e-07   2.360278e-07   3.335808e-07   4.503658e+01 
  2.704000e+03   2.400099e-07   2.272801e-07   3.305465e-07   4.343954e+01 
  2.720000e+03   2.364915e-07   2.076261e-07   3.147012e-07   4.128128e+01 
  2.736000e+03   2.237028e-07   1.990460e-07   2.994365e-07   4.166201e+01 
  2.752000e+03   1.999145e-07   1.978620e-07   2.812742e-07   4.470435e+01 
  2.768000e+03   1.937395e-07   2.013432e-07   2.794174e-07   4.610257e+01 
  2.784000e+03   2.020081e-07   2.214240e-07   2.997263e-07   4.762537e+01 
  2.800000e+03   2.152011e-07   2.554080e-07   3.339832e-07   4.988326e+01 
  2.816000e+03   2.245062e-07   2.784953e-07   3.577188e-07   5.112632e+01 
  2.832000e+03   2.405336e-07   2.760262e-07   3.661241e-07   4.893060e+01 
  2.848000e+03   2.602776e-07   2.572223e-07   3.659341e-07   4.466173e+01 
  2.864000e+03   2.585491e-07   2.467096e-07   3.573699e-07   4.365765e+01 
  2.880000e+03   2.382185e-07   2.334515e-07   3.335381e-07   4.442094e+01 
  2.896000e+03   2.075763e-07   2.174992e-07   3.006556e-07   4.633725e+01 
  2.912000e+03   1.918006e-07   2.018486e-07   2.784427e-07   4.646217e+01 
  2.928000e+03   1.856910e-07   1.793065e-07   2.581316e-07   4.399789e+01 
  2.944000e+03   1.777146e-07   1.743810e-07   2.489804e-07   4.445755e+01 
  2.960000e+03   1.693485e-07   1.771186e-07   2.450508e-07   4.628473e+01 
  2.976000e+03   1.656973e-07   1.730138e-07   2.395607e-07   4.623745e+01 
  2.992000e+03   1.690691e-07   1.696262e-07   2.394941e-07   4.509424e+01 
  3.008000e+03   1.685417e-07   1.734225e-07   2.418298e-07   4.581772e+01 
  3.024000e+03   1.663537e-07   1.801052e-07   2.451763e-07   4.727296e+01 
  3.040000e+03   1.690000e-07   1.799034e-07   2.468324e-07   4.678994e+01 
  3.056000e+03   1.626919e-07   1.749512e-07   2.389070e-07   4.707941e+01 
  3.072000e+03   1.610737e-07   1.705947e-07   2.346216e-07   4.664428e+01 
  3.088000e+03   1.765636e-07   1.693392e-07   2.446436e-07   4.380351e+01 
  3.104000e+03   1.730009e-07   1.732768e-07   2.448554e-07   4.504565e+01 
  3.120000e+03   1.672434e-07   1.715851e-07   2.396076e-07   4.573413e+01 
  3.136000e+03   1.717094e-07   1.700354e-07   2.416529e-07   4.471934e+01 
  3.152000e+03   1.803511e-07   1.711192e-07   2.486127e-07   4.349538e+01 
  3.168000e+03   1.747170e-07   1.581921e-07   2.356921e-07   4.215829e+01 
  3.184000e+03   1.539958e-07   1.516147e-07   2.161058e-07   4.455360e+01 
  3.200000e+03   1.552937e-07   1.611459e-07   2.237949e-07   4.605949e+01 
  3.216000e+03   1.624759e-07   1.638747e-07   2.307668e-07   4.524559e+01 
  3.232000e+03   1.628469e-07   1.586957e-07   2.273839e-07   4.426034e+01 
  3.248000e+03   1.637061e-07   1.561444e-07   2.262316e-07   4.364571e+01 
  3.264000e+03   1.600008e-07   1.464847e-07   2.169286e-07   4.247487e+01 
  3.280000e+03   1.529572e-07   1.454478e-07   2.110710e-07   4.355846e+01 
  3.296000e+03   1.506994e-07   1.503068e-07   2.128437e-07   4.492525e+01 
  3.312000e+03   1.541671e-07   1.633902e-07   2.246417e-07   4.666362e+01 
  3.328000e+03   1.593695e-07   1.674224e-07   2.311469e-07   4.641160e+01 
  3.344000e+03   1.550561e-07   1.595250e-07   2.224648e-07   4.581389e+01 
  3.360000e+03   1.490981e-07   1.534764e-07   2.139749e-07   4.582902e+01 
  3.376000e+03   1.563451e-07   1.557225e-07   2.206655e-07   4.488568e+01 
  3.392000e+03   1.559637e-07   1.620494e-07   2.249104e-07   4.609631e+01 
  3.408000e+03   1.554583e-07   1.652305e-07   2.268665e-07   4.674541e+01 
  3.424000e+03   1.603481e-07   1.688307e-07   2.328418e-07   4.647614e+01 
  3.440000e+03   1.638608e-07   1.736642e-07   2.387669e-07   4.666367e+01 
  3.456000e+03   1.589538e-07   1.749717e-07   2.363925e-07   4.774630e+01 
  3.472000e+03   1.538621e-07   1.629742e-07   2.241298e-07   4.664735e+01 
  3.488000e+03   1.499525e-07   1.530300e-07   2.142520e-07   4.558195e+01 
  3.504000e+03   1.421397e-07   1.481678e-07   2.053226e-07   4.618955e+01 
  3.520000e+03   1.394752e-07   1.445324e-07   2.008555e-07   4.602013e+01 
  3.536000e+03   1.440384e-07   1.463489e-07   2.053413e-07   4.545586e+01 
  3.552000e+03   1.426974e-07   1.518549e-07   2.083806e-07   4.678072e+01 
  3.568000e+03   1.337374e-07   1.513177e-07   2.019473e-07   4.852915e+01 
  3.584000e+03   1.354406e-07   1.431210e-07   1.970477e-07   4.657935e+01 
  3.600000e+03   1.429002e-07   1.424469e-07   2.017711e-07   4.490898e+01 
  3.616000e+03   1.480295e-07   1.426924e-07   2.056060e-07   4.394827e+01 
  3.632000e+03   1.415723e-07   1.431332e-07   2.013202e-07   4.531413e+01 
  3.648000e+03   1.390571e-07   1.460262e-07   2.016446e-07   4.640035e+01 
  3.664000e+03   1.377512e-07   1.519069e-07   2.050637e-07   4.779783e+01 
  3.680000e+03   1.390449e-07   1.593234e-07   2.114649e-07   4.888811e+01 
  3.696000e+03   1.376384e-07   1.612599e-07   2.120120e-07   4.951860e+01 
  3.712000e+03   1.359145e-07   1.580375e-07   2.084433e-07   4.930400e+01 
  3.728000e+03   1.461639e-07   1.502817e-07   2.096389e-07   4.579582e+01 
  3.744000e+03   1.526808e-07   1.421449e-07   2.086063e-07   4.295333e+01 
  3.760000e+03   1.490524e-07   1.378614e-07   2.030330e-07   4.276633e+01 
  3.776000e+03   1.510028e-07   1.411103e-07   2.066735e-07   4.306039e+01 
  3.792000e+03   1.529894e-07   1.453678e-07   2.110392e-07   4.353670e+01 
  3.808000e+03   1.536034e-07   1.468301e-07   2.124925e-07   4.370849e+01 
  3.824000e+03   1.548004e-07   1.487773e-07   2.147041e-07   4.386338e+01 
  3.840000e+03   1.530127e-07   1.422829e-07   2.089433e-07   4.291903e+01 
  3.856000e+03   1.437507e-07   1.410253e-07   2.013763e-07   4.445168e+01 
  3.872000e+03   1.410015e-07   1.437956e-07   2.013916e-07   4.556210e+01 
  3.888000e+03   1.487137e-07   1.433482e-07   2.065538e-07   4.394754e+01 
  3.904000e+03   1.475050e-07   1.416085e-07   2.044766e-07   4.383161e+01 
  3.920000e+03   1.416724e-07   1.394137e-07   1.987643e-07   4.453960e+01 
  3.936000e+03   1.382752e-07   1.366185e-07   1.943827e-07   4.465469e+01 
  3.952000e+03   1.376090e-07   1.321326e-07   1.907754e-07   4.383692e+01 
  3.968000e+03   1.397092e-07   1.314363e-07   1.918180e-07   4.325238e+01 
  3.984000e+03   1.428786e-07   1.325976e-07   1.949267e-07   4.286267e+01 
  4.000000e+03   1.449641e-07   1.332262e-07   1.968853e-07   4.258389e+01 
  4.016000e+03   1.406329e-07   1.266522e-07   1.892575e-07   4.200579e+01 
  4.032000e+03   1.438404e-07   1.328428e-07   1.957991e-07   4.272380e+01 
  4.048000e+03   1.514786e-07   1.421971e-07   2.077637e-07   4.318978e+01 
  4.064000e+03   1.508996e-07   1.410849e-07   2.065808e-07   4.307480e+01 
  4.080000e+03   1.456180e-07   1.394894e-07   2.016479e-07   4.376856e+01 
  4.096000e+03   1.480010e-07   1.345866e-07   2.000446e-07   4.228221e+01 
  4.112000e+03   1.549271e-07   1.354667e-07   2.058000e-07   4.116612e+01 
  4.128000e+03   1.551235e-07   1.508034e-07   2.163445e-07   4.419096e+01 
  4.144000e+03   1.520172e-07   1.582988e-07   2.194715e-07   4.615966e+01 
  4.160000e+03   1.543026e-07   1.516476e-07   2.163476e-07   4.450281e+01 
  4.176000e+03   1.587047e-07   1.455499e-07   2.153415e-07   4.252430e+01 
  4.192000e+03   1.471736e-07   1.413096e-07   2.040306e-07   4.383552e+01 
  4.208000e+03   1.337806e-07   1.447884e-07   1.971318e-07   4.726289e+01 
  4.224000e+03   1.301409e-07   1.400420e-07   1.911764e-07   4.709871e+01 
  4.240000e+03   1.396507e-07   1.327594e-07   1.926847e-07   4.355087e+01 
  4.256000e+03   1.526239e-07   1.398948e-07   2.070378e-07   4.250832e+01 
  4.272000e+03   1.518087e-07   1.394734e-07   2.061522e-07   4.257506e+01 
  4.288000e+03   1.431414e-07   1.306237e-07   1.937834e-07   4.238201e+01 
  4.304000e+03   1.345092e-07   1.388343e-07   1.933072e-07   4.590649e+01 
  4.320000e+03   1.288553e-07   1.443349e-07   1.934845e-07   4.824303e+01 
  4.336000e+03   1.224862e-07   1.365941e-07   1.834688e-07   4.811689e+01 
  4.352000e+03   1.282990e-07   1.333580e-07   1.850540e-07   4.610767e+01 
  4.368000e+03   1.369317e-07   1.317196e-07   1.900009e-07   4.388854e+01 
  4.384000e+03   1.351280e-07   1.298162e-07   1.873815e-07   4.385146e+01 
  4.400000e+03   1.298727e-07   1.281371e-07   1.824446e-07   4.461459e+01 
  4.416000e+03   1.287727e-07   1.262201e-07   1.803161e-07   4.442645e+01 
  4.432000e+03   1.326615e-07   1.298525e-07   1.856361e-07   4.438695e+01 
  4.448000e+03   1.343667e-07   1.380473e-07   1.926434e-07   4.577409e+01 
  4.464000e+03   1.269696e-07   1.392707e-07   1.884612e-07   4.764535e+01 
  4.480000e+03   1.253411e-07   1.271273e-07   1.785266e-07   4.540537e+01 
  4.496000e+03   1.286303e-07   1.193918e-07   1.754998e-07   4.286678e+01 
  4.512000e+03   1.272108e-07   1.314451e-07   1.829219e-07   4.593788e+01 
  4.528000e+03   1.269481e-07   1.374820e-07   1.871286e-07   4.728123e+01 
  4.544000e+03   1.311144e-07   1.323210e-07   1.862790e-07   4.526242e+01 
  4.560000e+03   1.289943e-07   1.351117e-07   1.868012e-07   4.632690e+01 
  4.576000e+03   1.224314e-07   1.351484e-07   1.823582e-07   4.782647e+01 
  4.592000e+03   1.222801e-07   1.264640e-07   1.759136e-07   4.596363e+01 
  4.608000e+03   1.264076e-07   1.295865e-07   1.810291e-07   4.571143e+01 
  4.624000e+03   1.306165e-07   1.305046e-07   1.846406e-07   4.497545e+01 
  4.640000e+03   1.311186e-07   1.271442e-07   1.826410e-07   4.411834e+01 
  4.656000e+03   1.219835e-07   1.244028e-07   1.742298e-07   4.556256e+01 
  4.672000e+03   1.126615e-07   1.252274e-07   1.684473e-07   4.802370e+01 
  4.688000e+03   1.126064e-07   1.276357e-07   1.702089e-07   4.857972e+01 
  4.704000e+03   1.118437e-07   1.246812e-07   1.674945e-07   4.810672e+01 
  4.720000e+03   1.096052e-07   1.234741e-07   1.651035e-07   4.840523e+01 
  4.736000e+03   1.098557e-07   1.246429e-07   1.661449e-07   4.860822e+01 
  4.752000e+03   1.112517e-07   1.221790e-07   1.652412e-07   4.768016e+01 
  4.768000e+03   1.196470e-07   1.186998e-07   1.685379e-07   4.477230e+01 
  4.784000e+03   1.207039e-07   1.174324e-07   1.684036e-07   4.421292e+01 
  4.800000e+03   1.184714e-07   1.202960e-07   1.688389e-07   4.543782e+01 
  4.816000e+03   1.155096e-07   1.247381e-07   1.700060e-07   4.719979e+01 
  4.832000e+03   1.194347e-07   1.242091e-07   1.723153e-07   4.612262e+01 
  4.848000e+03   1.249200e-07   1.256264e-07   1.771638e-07   4.516152e+01 
  4.864000e+03   1.239353e-07   1.254550e-07   1.763488e-07   4.534914e+01 
  4.880000e+03   1.169561e-07   1.300104e-07   1.748755e-07   4.802578e+01 
  4.896000e+03   1.166233e-07   1.284632e-07   1.735044e-07   4.776577e+01 
  4.912000e+03   1.228554e-07   1.239956e-07   1.745519e-07   4.526464e+01 
  4.928000e+03   1.277644e-07   1.272866e-07   1.803486e-07   4.489267e+01 
  4.944000e+03   1.325129e-07   1.287911e-07   1.847885e-07   4.418398e+01 
  4.960000e+03   1.317952e-07   1.304442e-07   1.854337e-07   4.470481e+01 
  4.976000e+03   1.218864e-07   1.348465e-07   1.817687e-07   4.788988e+01 
  4.992000e+03   1.161890e-07   1.362334e-07   1.790514e-07   4.954024e+01 
  5.008000e+03   1.160927e-07   1.363047e-07   1.790432e-07   4.957848e+01 
  5.024000e+03   1.216495e-07   1.378955e-07   1.838852e-07   4.858170e+01 
  5.040000e+03   1.435269e-07   1.512436e-07   2.085056e-07   4.649958e+01 
  5.056000e+03   1.649850e-07   1.737611e-07   2.396100e-07   4.648407e+01 
  5.072000e+03   1.754904e-07   1.905212e-07   2.590274e-07   4.735162e+01 
  5.088000e+03   1.793094e-07   1.869145e-07   2.590152e-07   4.618963e+01 
  5.104000e+03   1.736010e-07   1.720649e-07   2.444251e-07   4.474539e+01 
  5.120000e+03   1.491994e-07   1.494894e-07   2.112049e-07   4.505563e+01 
  5.136000e+03   1.348914e-07   1.410714e-07   1.951841e-07   4.628287e+01 
  5.152000e+03   1.407696e-07   1.397879e-07   1.983853e-07   4.479952e+01 
  5.168000e+03   1.364500e-07   1.357582e-07   1.924809e-07   4.485439e+01 
  5.184000e+03   1.296305e-07   1.299776e-07   1.835708e-07   4.507660e+01 
  5.200000e+03   1.274532e-07   1.283017e-07   1.808470e-07   4.519008e+01 
  5.216000e+03   1.226444e-07   1.332324e-07   1.810870e-07   4.736950e+01 
  5.232000e+03   1.150096e-07   1.313086e-07   1.745542e-07   4.878576e+01 
  5.248000e+03   1.105951e-07   1.278467e-07   1.690445e-07   4.913823e+01 
  5.264000e+03   1.092695e-07   1.224747e-07   1.641337e-07   4.826128e+01 
  5.280000e+03   1.087945e-07   1.181003e-07   1.605738e-07   4.734860e+01 
  5.296000e+03   1.122743e-07   1.209327e-07   1.650159e-07   4.712626e+01 
  5.312000e+03   1.144540e-07   1.280713e-07   1.717614e-07   4.821367e+01 
  5.328000e+03   1.158213e-07   1.277662e-07   1.724493e-07   4.780737e+01 
  5.344000e+03   1.227881e-07   1.301062e-07   1.788982e-07   4.665754e+01 
  5.360000e+03   1.236939e-07   1.270782e-07   1.773388e-07   4.577318e+01 
  5.376000e+03   1.206208e-07   1.238109e-07   1.728540e-07   4.574774e+01 
  5.392000e+03   1.203945e-07   1.220536e-07   1.714407e-07   4.539208e+01 
  5.408000e+03   1.220199e-07   1.149658e-07   1.676484e-07   4.329506e+01 
  5.424000e+03   1.269003e-07   1.137938e-07   1.704486e-07   4.188315e+01 
  5.440000e+03   1.233521e-07   1.159071e-07   1.692637e-07   4.321769e+01 
  5.456000e+03   1.167643e-07   1.164593e-07   1.649141e-07   4.492509e+01 
  5.472000e+03   1.175621e-07   1.203868e-07   1.682671e-07   4.568014e+01 
  5.488000e+03   1.164907e-07   1.174328e-07   1.654102e-07   4.523075e+01 
  5.504000e+03   1.125517e-07   1.183186e-07   1.633009e-07   4.643088e+01 
  5.520000e+03   1.120286e-07   1.212571e-07   1.650869e-07   4.726535e+01 
  5.536000e+03   1.122065e-07   1.196587e-07   1.640381e-07   4.684087e+01 
  5.552000e+03   1.145045e-07   1.169294e-07   1.636574e-07   4.560029e+01 
  5.568000e+03   1.189529e-07   1.154495e-07   1.657660e-07   4.414370e+01 
  5.584000e+03   1.196755e-07   1.198633e-07   1.693796e-07   4.504493e+01 
  5.600000e+03   1.152965e-07   1.260877e-07   1.708549e-07   4.755973e+01 
  5.616000e+03   1.144127e-07   1.256229e-07   1.699158e-07   4.767389e+01 
  5.632000e+03   1.156056e-07   1.168155e-07   1.643488e-07   4.529827e+01 
  5.648000e+03   1.208433e-07   1.106767e-07   1.638671e-07   4.248563e+01 
  5.664000e+03   1.279376e-07   1.117045e-07   1.698408e-07   4.112476e+01 
  5.680000e+03   1.272478e-07   1.120649e-07   1.695599e-07   4.136980e+01 
  5.696000e+03   1.182162e-07   1.118786e-07   1.627633e-07   4.342227e+01 
  5.712000e+03   1.132937e-07   1.150587e-07   1.614744e-07   4.544284e+01 
  5.728000e+03   1.174305e-07   1.240753e-07   1.708350e-07   4.657605e+01 
  5.744000e+03   1.159786e-07   1.285856e-07   1.731626e-07   4.795093e+01 
  5.760000e+03   1.125078e-07   1.238373e-07   1.673131e-07   4.774443e+01 
  5.776000e+03   1.088269e-07   1.193304e-07   1.615024e-07   4.763581e+01 
  5.792000e+03   1.093732e-07   1.208078e-07   1.629632e-07   4.784392e+01 
  5.808000e+03   1.180643e-07   1.224166e-07   1.700735e-07   4.603684e+01 
  5.824000e+03   1.178860e-07   1.191475e-07   1.676104e-07   4.530493e+01 
  5.840000e+03   1.114447e-07   1.111308e-07   1.573848e-07   4.491920e+01 
  5.856000e+03   1.092884e-07   1.135276e-07   1.575832e-07   4.608997e+01 
  5.872000e+03   1.146128e-07   1.134722e-07   1.612825e-07   4.471349e+01 
  5.888000e+03   1.206116e-07   1.082095e-07   1.620384e-07   4.189759e+01 
  5.904000e+03   1.245074e-07   1.068786e-07   1.640888e-07   4.064317e+01 
  5.920000e+03   1.237601e-07   1.147924e-07   1.688012e-07   4.284715e+01 
  5.936000e+03   1.160175e-07   1.200012e-07   1.669142e-07   4.596698e+01 
  5.952000e+03   1.149878e-07   1.159884e-07   1.633263e-07   4.524821e+01 
  5.968000e+03   1.155632e-07   1.107642e-07   1.600736e-07   4.378527e+01 
  5.984000e+03   1.132055e-07   1.154982e-07   1.617261e-07   4.557435e+01 
  6.000000e+03   1.241162e-07   1.283906e-07   1.785749e-07   4.596981e+01 
  6.016000e+03   1.290258e-07   1.252152e-07   1.797958e-07   4.414130e+01 
  6.032000e+03   1.216734e-07   1.151934e-07   1.675528e-07   4.343293e+01 
  6.048000e+03   1.113911e-07   1.166852e-07   1.613177e-07   4.632972e+01 
  6.064000e+03   1.099203e-07   1.257937e-07   1.670525e-07   4.885259e+01 
  6.080000e+03   1.150994e-07   1.156415e-07   1.631589e-07   4.513461e+01 
  6.096000e+03   1.188343e-07   1.091938e-07   1.613842e-07   4.257911e+01 
  6.112000e+03   1.174480e-07   1.212362e-07   1.687965e-07   4.590929e+01 
  6.128000e+03   1.127112e-07   1.239306e-07   1.675190e-07   4.771442e+01 
  6.144000e+03   1.131560e-07   1.151915e-07   1.614724e-07   4.551072e+01 
  6.160000e+03   1.156033e-07   1.058996e-07   1.567765e-07   4.249157e+01 
  6.176000e+03   1.111690e-07   1.059464e-07   1.535682e-07   4.362204e+01 
  6.192000e+03   1.075027e-07   1.096960e-07   1.535905e-07   4.557856e+01 
  6.208000e+03   1.090591e-07   1.061475e-07   1.521880e-07   4.422488e+01 
  6.224000e+03   1.102570e-07   1.031653e-07   1.509956e-07   4.309686e+01 
  6.240000e+03   1.081938e-07   1.087824e-07   1.534259e-07   4.515543e+01 
  6.256000e+03   1.095723e-07   1.093246e-07   1.547835e-07   4.493516e+01 
  6.272000e+03   1.138112e-07   1.134706e-07   1.607127e-07   4.491413e+01 
  6.288000e+03   1.197700e-07   1.193672e-07   1.690958e-07   4.490348e+01 
  6.304000e+03   1.219786e-07   1.208470e-07   1.717054e-07   4.473299e+01 
  6.320000e+03   1.085125e-07   1.179214e-07   1.602511e-07   4.737940e+01 
  6.336000e+03   1.041353e-07   1.092168e-07   1.509055e-07   4.636440e+01 
  6.352000e+03   1.131274e-07   1.054072e-07   1.546237e-07   4.297675e+01 
  6.368000e+03   1.161531e-07   1.112520e-07   1.608371e-07   4.376534e+01 
  6.384000e+03   1.109702e-07   1.138664e-07   1.589967e-07   4.573800e+01 
  6.400000e+03   1.047846e-07   1.076404e-07   1.502207e-07   4.577021e+01 
  6.416000e+03   1.068890e-07   1.060836e-07   1.505954e-07   4.478334e+01 
  6.432000e+03   1.164928e-07   1.057320e-07   1.573208e-07   4.222773e+01 
  6.448000e+03   1.210316e-07   1.087040e-07   1.626813e-07   4.192847e+01 
  6.464000e+03   1.148092e-07   1.090147e-07   1.583204e-07   4.351704e+01 
  6.480000e+03   1.058748e-07   1.101555e-07   1.527865e-07   4.613519e+01 
  6.496000e+03   1.036059e-07   1.104377e-07   1.514288e-07   4.682812e+01 
  6.512000e+03   1.068670e-07   1.065428e-07   1.509037e-07   4.491296e+01 
  6.528000e+03   1.054743e-07   1.037148e-07   1.479242e-07   4.451810e+01 
  6.544000e+03   1.078334e-07   1.072409e-07   1.520811e-07   4.484214e+01 
  6.560000e+03   1.052056e-07   1.146023e-07   1.555696e-07   4.744787e+01 
  6.576000e+03   1.058931e-07   1.172872e-07   1.580178e-07   4.792258e+01 
  6.592000e+03   1.061461e-07   1.142229e-07   1.559291e-07   4.709902e+01 
  6.608000e+03   1.069362e-07   1.050189e-07   1.498810e-07   4.448174e+01 
  6.624000e+03   1.062578e-07   1.017518e-07   1.471195e-07   4.375902e+01 
  6.640000e+03   1.066984e-07   1.029678e-07   1.482798e-07   4.398064e+01 
  6.656000e+03   1.114142e-07   1.046230e-07   1.528368e-07   4.319947e+01 
  6.672000e+03   1.082658e-07   9.995737e-08   1.473532e-07   4.271501e+01 
  6.688000e+03   1.030812e-07   9.984107e-08   1.435060e-07   4.408521e+01 
  6.704000e+03   1.042574e-07   1.028608e-07   1.464580e-07   4.461366e+01 
  6.720000e+03   1.072411e-07   1.021509e-07   1.481062e-07   4.360746e+01 
  6.736000e+03   1.075204e-07   1.020424e-07   1.482339e-07   4.350260e+01 
  6.752000e+03   1.041466e-07   1.052133e-07   1.480417e-07   4.529192e+01 
  6.768000e+03   1.031542e-07   1.086930e-07   1.498498e-07   4.649765e+01 
  6.784000e+03   1.071837e-07   1.056209e-07   1.504796e-07   4.457921e+01 
  6.800000e+03   1.078308e-07   1.093028e-07   1.535401e-07   4.538840e+01 
  6.816000e+03   1.075537e-07   1.186857e-07   1.601690e-07   4.781691e+01 
  6.832000e+03   1.075915e-07   1.176974e-07   1.594634e-07   4.756842e+01 
  6.848000e+03   1.076069e-07   1.101990e-07   1.540230e-07   4.568184e+01 
  6.864000e+03   1.072858e-07   1.061816e-07   1.509462e-07   4.470364e+01 
  6.880000e+03   1.025363e-07   1.121386e-07   1.519499e-07   4.756110e+01 
  6.896000e+03   1.018349e-07   1.139525e-07   1.528251e-07   4.821407e+01 
  6.912000e+03   1.083295e-07   1.086297e-07   1.534135e-07   4.507927e+01 
  6.928000e+03   1.119867e-07   1.089616e-07   1.562487e-07   4.421558e+01 
  6.944000e+03   1.098702e-07   1.084868e-07   1.544048e-07   4.463700e+01 
  6.960000e+03   1.085651e-07   1.098083e-07   1.544158e-07   4.532618e+01 
  6.976000e+03   1.103499e-07   1.091434e-07   1.552076e-07   4.468505e+01 
  6.992000e+03   1.143901e-07   1.112269e-07   1.595510e-07   4.419674e+01 
  7.008000e+03   1.125763e-07   1.099051e-07   1.573294e-07   4.431212e+01 
  7.024000e+03   1.059566e-07   1.066028e-07   1.503029e-07   4.517418e+01 
  7.040000e+03   1.085169e-07   1.094921e-07   1.541572e-07   4.525631e+01 
  7.056000e+03   1.163788e-07   1.155651e-07   1.640101e-07   4.479898e+01 
  7.072000e+03   1.195593e-07   1.111109e-07   1.632179e-07   4.290245e+01 
  7.088000e+03   1.161113e-07   1.088495e-07   1.591542e-07   4.315112e+01 
  7.104000e+03   1.091114e-07   1.142763e-07   1.580011e-07   4.632449e+01 
  7.120000e+03   1.025456e-07   1.126080e-07   1.523028e-07   4.767767e+01 
  7.136000e+03   1.047836e-07   1.116836e-07   1.531432e-07   4.682571e+01 
  7.152000e+03   1.148555e-07   1.135672e-07   1.615218e-07   4.467685e+01 
  7.168000e+03   1.196017e-07   1.175561e-07   1.677022e-07   4.450580e+01 
  7.184000e+03   1.213488e-07   1.135695e-07   1.662033e-07   4.310335e+01 
  7.200000e+03   1.100978e-07   1.035814e-07   1.511643e-07   4.325325e+01 
  7.216000e+03   1.046195e-07   1.062749e-07   1.491294e-07   4.544971e+01 
  7.232000e+03   1.100838e-07   1.074499e-07   1.538308e-07   4.430629e+01 
  7.248000e+03   1.164348e-07   1.078284e-07   1.586947e-07   4.280227e+01 
  7.264000e+03   1.169255e-07   1.119163e-07   1.618544e-07   4.374605e+01 
  7.280000e+03   1.051684e-07   1.124651e-07   1.539766e-07   4.692028e+01 
  7.296000e+03   1.004015e-07   1.134236e-07   1.514773e-07   4.848505e+01 
  7.312000e+03   1.015827e-07   1.104985e-07   1.500965e-07   4.740726e+01 
  7.328000e+03   1.087124e-07   1.055898e-07   1.515506e-07   4.416521e+01 
  7.344000e+03   1.126179e-07   1.032726e-07   1.528006e-07   4.252139e+01 
  7.360000e+03   1.084733e-07   9.969741e-08   1.473297e-07   4.258600e+01 
  7.376000e+03   1.066347e-07   1.037706e-07   1.487928e-07   4.422013e+01 
  7.392000e+03   1.066432e-07   1.095010e-07   1.528504e-07   4.575750e+01 
  7.408000e+03   1.117807e-07   1.095078e-07   1.564829e-07   4.441152e+01 
  7.424000e+03   1.135753e-07   1.037955e-07   1.538599e-07   4.242394e+01 
  7.440000e+03   1.087486e-07   1.030227e-07   1.497997e-07   4.345121e+01 
  7.456000e+03   1.043822e-07   1.108721e-07   1.522769e-07   4.672695e+01 
  7.472000e+03   1.101535e-07   1.118989e-07   1.570196e-07   4.545035e+01 
  7.488000e+03   1.155047e-07   1.073880e-07   1.577134e-07   4.291447e+01 
  7.504000e+03   1.114912e-07   1.069517e-07   1.544958e-07   4.380949e+01 
  7.520000e+03   1.133098e-07   1.162337e-07   1.623250e-07   4.572978e+01 
  7.536000e+03   1.185418e-07   1.205988e-07   1.691042e-07   4.549281e+01 
  7.552000e+03   1.150302e-07   1.218829e-07   1.675929e-07   4.665682e+01 
  7.568000e+03   1.136712e-07   1.302608e-07   1.728844e-07   4.889062e+01 
  7.584000e+03   1.271390e-07   1.355768e-07   1.858639e-07   4.683957e+01 
  7.600000e+03   1.302470e-07   1.303920e-07   1.842996e-07   4.503186e+01 
  7.616000e+03   1.233860e-07   1.191333e-07   1.715134e-07   4.399539e+01 
  7.632000e+03   1.130977e-07   1.104839e-07   1.581068e-07   4.433020e+01 
  7.648000e+03   1.118650e-07   1.089167e-07   1.561302e-07   4.423491e+01 
  7.664000e+03   1.154501e-07   1.160850e-07   1.637206e-07   4.515711e+01 
  7.680000e+03   1.155659e-07   1.215656e-07   1.677310e-07   4.644933e+01 
  7.696000e+03   1.119968e-07   1.126297e-07   1.588356e-07   4.516142e+01 
  7.712000e+03   1.063483e-07   1.016510e-07   1.471153e-07   4.370629e+01 
  7.728000e+03   1.036653e-07   1.046443e-07   1.472987e-07   4.526928e+01 
  7.744000e+03   1.091576e-07   1.097134e-07   1.547657e-07   4.514550e+01 
  7.760000e+03   1.055965e-07   1.061696e-07   1.497418e-07   4.515508e+01 
  7.776000e+03   1.016389e-07   1.007138e-07   1.430865e-07   4.473808e+01 
  7.792000e+03   1.007010e-07   9.978272e-08   1.417649e-07   4.473757e+01 
  7.808000e+03   1.038010e-07   1.015933e-07   1.452441e-07   4.438417e+01 
  7.824000e+03   1.030969e-07   1.041575e-07   1.465529e-07   4.529319e+01 
  7.840000e+03   1.010173e-07   1.098912e-07   1.492668e-07   4.740929e+01 
  7.856000e+03   1.123317e-07   1.065091e-07   1.547986e-07   4.347590e+01 
  7.872000e+03   1.129058e-07   1.027444e-07   1.526569e-07   4.230223e+01 
  7.888000e+03   1.038280e-07   1.116129e-07   1.524391e-07   4.706947e+01 
  7.904000e+03   1.021857e-07   1.137201e-07   1.528861e-07   4.805803e+01 
  7.920000e+03   1.037355e-07   1.062159e-07   1.484684e-07   4.567688e+01 
  7.936000e+03   1.059008e-07   1.011806e-07   1.464666e-07   4.369423e+01 
  7.952000e+03   1.027814e-07   1.006275e-07   1.438399e-07   4.439331e+01 
  7.968000e+03   1.036406e-07   1.002088e-07   1.441637e-07   4.403551e+01 
  7.984000e+03   1.117718e-07   1.036775e-07   1.524531e-07   4.284843e+01 
  8.000000e+03   1.113580e-07   1.068758e-07   1.543471e-07   4.382337e+01 
  8.016000e+03   1.093590e-07   1.065601e-07   1.526907e-07   4.425734e+01 
  8.032000e+03   1.105873e-07   1.027885e-07   1.509802e-07   4.290681e+01 
  8.048000e+03   1.088196e-07   9.701100e-08   1.457836e-07   4.171650e+01 
  8.064000e+03   1.136122e-07   1.047565e-07   1.545368e-07   4.267770e+01 
  8.080000e+03   1.174933e-07   1.148672e-07   1.643142e-07   4.435247e+01 
  8.096000e+03   1.164854e-07   1.171977e-07   1.652397e-07   4.517464e+01 
  8.112000e+03   1.127022e-07   1.161253e-07   1.618236e-07   4.585703e+01 
  8.128000e+03   1.086107e-07   1.127748e-07   1.565709e-07   4.607756e+01 
  8.144000e+03   1.166994e-07   1.152719e-07   1.640316e-07   4.464740e+01 
  8.160000e+03   1.226329e-07   1.220442e-07   1.730133e-07   4.486215e+01 
  8.176000e+03   1.241218e-07   1.240994e-07   1.755189e-07   4.499483e+01 
  8.192000e+03   1.267113e-07   1.246531e-07   1.777474e-07   4.453087e+01 
  8.208000e+03   1.250635e-07   1.221045e-07   1.747867e-07   4.431410e+01 
  8.224000e+03   1.201999e-07   1.217019e-07   1.710537e-07   4.535575e+01 
  8.240000e+03   1.188454e-07   1.227711e-07   1.708712e-07   4.593084e+01 
  8.256000e+03   1.178583e-07   1.139010e-07   1.639024e-07   4.402176e+01 
  8.272000e+03   1.121405e-07   1.108784e-07   1.577007e-07   4.467577e+01 
  8.288000e+03   1.078300e-07   1.143133e-07   1.571459e-07   4.667171e+01 
  8.304000e+03   1.048987e-07   1.168498e-07   1.570274e-07   4.808498e+01 
  8.320000e+03   1.086222e-07   1.183874e-07   1.606685e-07   4.746315e+01 
  8.336000e+03   1.093561e-07   1.118872e-07   1.564529e-07   4.565545e+01 
  8.352000e+03   1.056376e-07   1.071693e-07   1.504811e-07   4.541239e+01 
  8.368000e+03   1.073870e-07   1.036111e-07   1.492221e-07   4.397478e+01 
  8.384000e+03   1.112747e-07   1.019779e-07   1.509356e-07   4.250375e+01 
  8.400000e+03   1.103965e-07   1.077901e-07   1.542922e-07   4.431561e+01 
  8.416000e+03   1.022399e-07   1.100980e-07   1.502483e-07   4.711940e+01 
  8.432000e+03   9.962973e-08   1.069774e-07   1.461857e-07   4.703678e+01 
  8.448000e+03   9.918938e-08   1.084876e-07   1.469969e-07   4.756355e+01 
  8.464000e+03   9.937141e-08   1.082599e-07   1.469520e-07   4.745127e+01 
  8.480000e+03   1.057373e-07   9.480954e-08   1.420184e-07   4.188103e+01 
  8.496000e+03   1.068301e-07   9.304642e-08   1.416697e-07   4.105506e+01 
  8.512000e+03   1.024383e-07   1.023410e-07   1.448008e-07   4.497276e+01 
  8.528000e+03   1.018809e-07   1.011222e-07   1.435459e-07   4.478588e+01 
  8.544000e+03   1.024358e-07   1.017810e-07   1.444038e-07   4.481628e+01 
  8.560000e+03   1.032272e-07   1.046329e-07   1.469826e-07   4.538748e+01 
  8.576000e+03   1.005733e-07   1.003562e-07   1.420787e-07   4.493809e+01 
  8.592000e+03   9.995175e-08   9.984878e-08   1.412803e-07   4.497047e+01 
  8.608000e+03   1.017149e-07   9.585742e-08   1.397661e-07   4.330184e+01 
  8.624000e+03   9.906791e-08   1.002384e-07   1.409333e-07   4.533647e+01 
  8.640000e+03   1.008628e-07   1.043751e-07   1.451464e-07   4.598045e+01 
  8.656000e+03   1.014901e-07   1.039992e-07   1.453137e-07   4.569954e+01 
  8.672000e+03   1.028784e-07   1.071203e-07   1.485218e-07   4.615718e+01 
  8.688000e+03   9.860248e-08   1.082079e-07   1.463947e-07   4.765923e+01 
  8.704000e+03   9.975376e-08   1.080876e-07   1.470841e-07   4.729616e+01 
  8.720000e+03   1.030994e-07   9.766310e-08   1.420126e-07   4.344891e+01 
  8.736000e+03   1.004731e-07   9.102215e-08   1.355724e-07   4.217454e+01 
  8.752000e+03   9.961713e-08   9.902558e-08   1.404622e-07   4.482938e+01 
  8.768000e+03   9.600810e-08   1.039901e-07   1.415327e-07   4.728548e+01 
  8.784000e+03   9.199937e-08   1.081288e-07   1.419708e-07   4.960782e+01 
  8.800000e+03   9.717520e-08   1.051468e-07   1.431743e-07   4.725632e+01 
  8.816000e+03   1.010165e-07   1.040220e-07   1.449997e-07   4.583980e+01 
  8.832000e+03   1.076996e-07   1.006736e-07   1.474258e-07   4.306882e+01 
  8.848000e+03   1.098303e-07   9.720165e-08   1.466658e-07   4.150937e+01 
  8.864000e+03   1.058273e-07   9.638812e-08   1.431436e-07   4.232744e+01 
  8.880000e+03   1.011582e-07   9.393263e-08   1.380447e-07   4.287890e+01 
  8.896000e+03   1.017917e-07   9.475352e-08   1.390675e-07   4.294915e+01 
  8.912000e+03   1.002382e-07   9.650551e-08   1.391439e-07   4.391308e+01 
  8.928000e+03   9.922976e-08   9.752826e-08   1.391341e-07   4.450453e+01 
  8.944000e+03   9.625744e-08   1.014934e-07   1.398799e-07   4.651669e+01 
  8.960000e+03   9.641712e-08   9.869510e-08   1.379746e-07   4.566891e+01 
  8.976000e+03   1.030831e-07   9.598254e-08   1.408502e-07   4.295715e+01 
  8.992000e+03   1.064422e-07   1.028925e-07   1.480433e-07   4.402853e+01 
  9.008000e+03   1.083597e-07   1.058058e-07   1.514487e-07   4.431679e+01 
  9.024000e+03   1.083307e-07   1.033145e-07   1.496978e-07   4.364229e+01 
  9.040000e+03   1.071607e-07   1.043951e-07   1.496053e-07   4.425102e+01 
  9.056000e+03   1.121067e-07   1.079039e-07   1.555993e-07   4.390561e+01 
  9.072000e+03   1.058339e-07   1.036808e-07   1.481571e-07   4.441119e+01 
  9.088000e+03   1.011237e-07   1.033846e-07   1.446181e-07   4.563340e+01 
  9.104000e+03   1.014273e-07   1.015161e-07   1.435026e-07   4.502505e+01 
  9.120000e+03   1.006180e-07   1.012192e-07   1.427211e-07   4.517067e+01 
  9.136000e+03   1.016918e-07   1.049923e-07   1.461664e-07   4.591486e+01 
  9.152000e+03   1.090533e-07   1.059209e-07   1.520258e-07   4.416520e+01 
  9.168000e+03   1.172316e-07   1.106654e-07   1.612144e-07   4.334963e+01 
  9.184000e+03   1.169838e-07   1.161876e-07   1.648781e-07   4.480435e+01 
  9.200000e+03   1.209566e-07   1.181974e-07   1.691187e-07   4.433899e+01 
  9.216000e+03   1.240742e-07   1.194494e-07   1.722282e-07   4.391199e+01 
  9.232000e+03   1.148352e-07   1.166289e-07   1.636748e-07   4.544399e+01 
  9.248000e+03   1.044489e-07   1.101254e-07   1.517800e-07   4.651540e+01 
  9.264000e+03   1.042261e-07   1.105137e-07   1.519090e-07   4.667715e+01 
  9.280000e+03   1.083701e-07   1.095595e-07   1.541018e-07   4.531271e+01 
  9.296000e+03   1.151781e-07   1.066145e-07   1.569479e-07   4.278885e+01 
  9.312000e+03   1.186039e-07   1.068327e-07   1.596249e-07   4.201102e+01 
  9.328000e+03   1.151012e-07   1.093844e-07   1.587867e-07   4.354119e+01 
  9.344000e+03   1.145283e-07   1.142856e-07   1.617960e-07   4.493924e+01 
  9.360000e+03   1.085354e-07   1.168747e-07   1.594980e-07   4.711876e+01 
  9.376000e+03   1.032120e-07   1.116835e-07   1.520721e-07   4.725753e+01 
  9.392000e+03   1.064764e-07   1.111086e-07   1.538907e-07   4.621959e+01 
  9.408000e+03   1.096494e-07   1.159033e-07   1.595511e-07   4.658823e+01 
  9.424000e+03   1.065672e-07   1.163537e-07   1.577807e-07   4.751372e+01 
  9.440000e+03   1.127737e-07   1.142468e-07   1.605311e-07   4.537178e+01 
  9.456000e+03   1.259411e-07   1.205305e-07   1.743237e-07   4.374244e+01 
  9.472000e+03   1.320428e-07   1.205431e-07   1.787902e-07   4.239323e+01 
  9.488000e+03   1.254268e-07   1.260112e-07   1.777940e-07   4.513317e+01 
  9.504000e+03   1.206620e-07   1.311391e-07   1.782044e-07   4.738263e+01 
  9.520000e+03   1.247363e-07   1.299484e-07   1.801270e-07   4.617238e+01 
  9.536000e+03   1.264685e-07   1.298344e-07   1.812491e-07   4.575240e+01 
  9.552000e+03   1.257989e-07   1.230922e-07   1.760031e-07   4.437693e+01 
  9.568000e+03   1.189741e-07   1.155936e-07   1.658817e-07   4.417434e+01 
  9.584000e+03   1.129750e-07   1.203879e-07   1.650957e-07   4.681941e+01 
  9.600000e+03   1.141209e-07   1.244332e-07   1.688408e-07   4.747527e+01 
  9.616000e+03   1.178261e-07   1.166153e-07   1.657773e-07   4.470409e+01 
  9.632000e+03   1.252187e-07   1.095052e-07   1.663464e-07   4.117006e+01 
  9.648000e+03   1.259595e-07   1.072674e-07   1.654451e-07   4.041779e+01 
  9.664000e+03   1.136740e-07   1.109185e-07   1.588228e-07   4.429708e+01 
  9.680000e+03   1.079248e-07   1.158102e-07   1.583028e-07   4.701853e+01 
  9.696000e+03   1.091564e-07   1.144679e-07   1.581708e-07   4.636062e+01 
  9.712000e+03   1.083041e-07   1.114948e-07   1.554377e-07   4.583166e+01 
  9.728000e+03   1.043793e-07   1.097372e-07   1.514506e-07   4.643340e+01 
  9.744000e+03   9.925282e-08   1.046259e-07   1.442141e-07   4.650964e+01 
  9.760000e+03   1.003154e-07   1.019988e-07   1.430627e-07   4.547673e+01 
  9.776000e+03   1.026718e-07   1.043145e-07   1.463660e-07   4.545472e+01 
  9.792000e+03   1.006880e-07   1.017958e-07   1.431798e-07   4.531349e+01 
  9.808000e+03   9.931323e-08   9.458939e-08   1.371505e-07   4.360444e+01 
  9.824000e+03   9.338142e-08   9.387455e-08   1.324104e-07   4.515088e+01 
  9.840000e+03   9.567317e-08   9.877775e-08   1.375151e-07   4.591470e+01 
  9.856000e+03   1.045252e-07   1.025739e-07   1.464477e-07   4.446016e+01 
  9.872000e+03   1.074259e-07   1.016037e-07   1.478636e-07   4.340451e+01 
  9.888000e+03   1.014432e-07   1.020262e-07   1.438752e-07   4.516416e+01 
  9.904000e+03   8.929410e-08   9.884722e-08   1.332074e-07   4.790677e+01 
  9.920000e+03   8.276890e-08   9.176485e-08   1.235778e-07   4.795057e+01 
  9.936000e+03   9.215608e-08   8.722710e-08   1.268909e-07   4.342606e+01 
  9.952000e+03   1.019335e-07   9.074131e-08   1.364713e-07   4.167551e+01 
  9.968000e+03   1.017571e-07   9.293241e-08   1.378076e-07   4.240473e+01 
  9.984000e+03   9.650700e-08   9.568992e-08   1.359050e-07   4.475642e+01 
  1.000000e+04   9.951857e-08   9.361055e-08   1.366268e-07   4.324781e+01 
  1.001600e+04   9.990557e-08   8.491589e-08   1.311176e-07   4.036325e+01 
  1.003200e+04   9.436173e-08   8.603954e-08   1.276986e-07   4.235873e+01 
  1.004800e+04   9.370073e-08   8.885788e-08   1.291339e-07   4.348043e+01 
  1.006400e+04   8.947584e-08   8.566220e-08   1.238706e-07   4.375258e+01 
  1.008000e+04   8.818748e-08   8.572079e-08   1.229841e-07   4.418738e+01 
  1.009600e+04   9.361835e-08   8.997482e-08   1.298455e-07   4.386307e+01 
  1.011200e+04   9.281530e-08   9.517801e-08   1.329418e-07   4.572006e+01 
  1.012800e+04   9.374070e-08   9.788617e-08   1.355324e-07   4.623928e+01 
  1.014400e+04   9.773180e-08   9.726527e-08   1.378841e-07   4.486292e+01 
  1.016000e+04   9.717397e-08   9.596720e-08   1.365741e-07   4.464201e+01 
  1.017600e+04   9.730921e-08   9.331325e-08   1.348200e-07   4.379910e+01 
  1.019200e+04   9.440398e-08   8.915565e-08   1.298493e-07   4.336225e+01 
  1.020800e+04   9.332620e-08   8.864411e-08   1.287150e-07   4.352610e+01 
  1.022400e+04   8.904495e-08   9.249186e-08   1.283890e-07   4.608776e+01 
  1.024000e+04   8.700763e-08   9.592160e-08   1.295040e-07   4.778976e+01 
  1.025600e+04   9.206330e-08   9.656333e-08   1.334171e-07   4.636663e+01 
  1.027200e+04   9.886432e-08   9.115004e-08   1.344711e-07   4.267516e+01 
  1.028800e+04   9.937002e-08   8.851163e-08   1.330741e-07   4.169234e+01 
  1.030400e+04   9.769653e-08   9.157465e-08   1.339049e-07   4.314744e+01 
  1.032000e+04   9.581225e-08   9.203794e-08   1.328570e-07   4.384895e+01 
  1.033600e+04   9.281050e-08   9.143192e-08   1.302827e-07   4.457130e+01 
  1.035200e+04   8.777524e-08   9.070025e-08   1.262182e-07   4.593893e+01 
  1.036800e+04   8.919883e-08   8.792615e-08   1.252495e-07   4.458832e+01 
  1.038400e+04   9.343660e-08   8.593908e-08   1.269485e-07   4.260655e+01 
  1.040000e+04   9.153691e-08   8.797278e-08   1.269575e-07   4.386255e+01 
  1.041600e+04   8.918243e-08   9.306794e-08   1.288998e-07   4.622134e+01 
  1.043200e+04   8.646273e-08   8.992045e-08   1.247457e-07   4.612305e+01 
  1.044800e+04   8.486486e-08   9.100476e-08   1.244344e-07   4.699948e+01 
  1.046400e+04   8.567184e-08   9.230129e-08   1.259333e-07   4.713326e+01 
  1.048000e+04   8.532562e-08   9.062728e-08   1.244740e-07   4.672586e+01 
  1.049600e+04   8.514049e-08   9.246114e-08   1.256900e-07   4.736037e+01 
  1.051200e+04   8.784041e-08   9.447392e-08   1.290010e-07   4.708379e+01 
  1.052800e+04   9.018832e-08   9.805090e-08   1.332213e-07   4.739180e+01 
  1.054400e+04   9.208824e-08   9.961742e-08   1.356609e-07   4.724912e+01 
  1.056000e+04   9.403442e-08   9.541731e-08   1.339662e-07   4.541821e+01 
  1.057600e+04   9.014342e-08   8.990636e-08   1.273145e-07   4.492456e+01 
  1.059200e+04   8.724748e-08   8.858577e-08   1.243365e-07   4.543608e+01 
  1.060800e+04   8.609673e-08   8.868205e-08   1.236008e-07   4.584745e+01 
  1.062400e+04   8.613041e-08   8.588958e-08   1.216366e-07   4.491978e+01 
  1.064000e+04   9.168268e-08   8.769985e-08   1.268739e-07   4.372807e+01 
  1.065600e+04   9.115985e-08   8.925680e-08   1.275809e-07   4.439566e+01 
  1.067200e+04   8.890426e-08   8.522567e-08   1.231559e-07   4.378978e+01 
  1.068800e+04   9.110154e-08   9.059458e-08   1.284791e-07   4.484013e+01 
  1.070400e+04   8.811225e-08   9.563812e-08   1.300401e-07   4.734535e+01 
  1.072000e+04   8.344870e-08   8.674316e-08   1.203664e-07   4.610895e+01 
  1.073600e+04   8.861840e-08   8.246963e-08   1.210556e-07   4.294172e+01 
  1.075200e+04   9.060935e-08   8.378969e-08   1.234130e-07   4.276066e+01 
  1.076800e+04   8.626005e-08   8.662126e-08   1.222458e-07   4.511971e+01 
  1.078400e+04   8.793589e-08   9.136728e-08   1.268097e-07   4.609635e+01 
  1.080000e+04   9.011153e-08   9.050589e-08   1.277161e-07   4.512510e+01 
  1.081600e+04   8.464421e-08   8.909370e-08   1.228915e-07   4.646704e+01 
  1.083200e+04   8.084675e-08   8.759748e-08   1.192037e-07   4.729501e+01 
  1.084800e+04   7.902273e-08   8.968697e-08   1.195339e-07   4.861689e+01 
  1.086400e+04   8.100960e-08   8.694657e-08   1.188371e-07   4.702446e+01 
  1.088000e+04   8.580822e-08   8.637194e-08   1.217504e-07   4.518759e+01 
  1.089600e+04   8.622354e-08   9.033351e-08   1.248785e-07   4.633352e+01 
  1.091200e+04   8.838281e-08   8.851539e-08   1.250859e-07   4.504294e+01 
  1.092800e+04   8.857590e-08   8.359391e-08   1.217934e-07   4.334252e+01 
  1.094400e+04   8.566890e-08   8.498616e-08   1.206723e-07   4.477077e+01 
  1.096000e+04   8.628542e-08   9.070857e-08   1.251927e-07   4.643155e+01 
  1.097600e+04   8.860295e-08   9.002532e-08   1.263133e-07   4.545622e+01 
  1.099200e+04   9.007310e-08   8.796167e-08   1.258985e-07   4.432052e+01 
  1.100800e+04   8.743618e-08   8.798830e-08   1.240444e-07   4.518033e+01 
  1.102400e+04   8.598074e-08   8.703778e-08   1.223449e-07   4.535004e+01 
  1.104000e+04   8.582648e-08   8.410449e-08   1.201655e-07   4.441941e+01 
  1.105600e+04   8.462953e-08   8.215287e-08   1.179460e-07   4.414924e+01 
  1.107200e+04   8.402295e-08   8.414705e-08   1.189142e-07   4.504228e+01 
  1.108800e+04   8.637110e-08   8.638114e-08   1.221543e-07   4.500333e+01 
  1.110400e+04   8.780667e-08   8.714183e-08   1.237082e-07   4.478226e+01 
  1.112000e+04   8.346100e-08   8.663559e-08   1.202974e-07   4.606921e+01 
  1.113600e+04   8.154929e-08   8.313295e-08   1.164533e-07   4.555096e+01 
  1.115200e+04   8.188083e-08   8.264564e-08   1.163390e-07   4.526634e+01 
  1.116800e+04   8.743915e-08   8.412083e-08   1.213339e-07   4.389192e+01 
  1.118400e+04   9.029601e-08   8.435815e-08   1.235705e-07   4.305282e+01 
  1.120000e+04   9.392156e-08   8.407260e-08   1.260534e-07   4.183287e+01 
  1.121600e+04   9.732104e-08   8.538029e-08   1.294650e-07   4.126065e+01 
  1.123200e+04   8.989473e-08   8.797961e-08   1.257834e-07   4.438313e+01 
  1.124800e+04   8.664409e-08   8.905443e-08   1.242493e-07   4.578597e+01 
  1.126400e+04   8.866952e-08   9.035463e-08   1.265948e-07   4.553929e+01 
  1.128000e+04   8.899434e-08   8.919402e-08   1.259983e-07   4.506421e+01 
  1.129600e+04   8.968198e-08   8.502112e-08   1.235777e-07   4.347178e+01 
  1.131200e+04   9.033120e-08   8.414514e-08   1.234509e-07   4.296943e+01 
  1.132800e+04   9.006137e-08   8.435556e-08   1.233974e-07   4.312631e+01 
  1.134400e+04   8.875696e-08   8.063014e-08   1.199125e-07   4.225318e+01 
  1.136000e+04   8.460736e-08   7.966750e-08   1.162124e-07   4.327759e+01 
  1.137600e+04   8.505540e-08   8.303579e-08   1.188670e-07   4.431163e+01 
  1.139200e+04   8.860432e-08   8.740853e-08   1.244627e-07   4.461075e+01 
  1.140800e+04   8.852881e-08   8.906164e-08   1.255760e-07   4.517191e+01 
  1.142400e+04   8.128534e-08   8.870007e-08   1.203121e-07   4.749765e+01 
  1.144000e+04   8.078911e-08   9.104310e-08   1.217199e-07   4.841504e+01 
  1.145600e+04   8.640949e-08   9.117319e-08   1.256151e-07   4.653660e+01 
  1.147200e+04   8.838629e-08   8.973937e-08   1.259575e-07   4.543522e+01 
  1.148800e+04   8.880409e-08   8.970245e-08   1.262248e-07   4.528835e+01 
  1.150400e+04   8.855917e-08   8.888758e-08   1.254740e-07   4.510604e+01 
  1.152000e+04   8.575011e-08   8.420309e-08   1.201800e-07   4.447847e+01 
  1.153600e+04   8.290550e-08   8.319407e-08   1.174503e-07   4.509954e+01 
  1.155200e+04   8.749677e-08   8.482596e-08   1.218652e-07   4.411205e+01 
  1.156800e+04   9.265067e-08   8.253782e-08   1.240832e-07   4.169623e+01 
  1.158400e+04   9.068004e-08   8.342952e-08   1.232208e-07   4.261538e+01 
  1.160000e+04   8.501548e-08   8.916967e-08   1.232025e-07   4.636620e+01 
  1.161600e+04   8.657008e-08   9.032212e-08   1.251098e-07   4.621511e+01 
  1.163200e+04   8.810719e-08   9.323629e-08   1.282805e-07   4.662011e+01 
  1.164800e+04   8.814964e-08   9.642790e-08   1.306472e-07   4.756798e+01 
  1.166400e+04   8.876661e-08   9.385906e-08   1.291860e-07   4.659726e+01 
  1.168000e+04   9.081713e-08   9.060025e-08   1.282816e-07   4.493150e+01 
  1.169600e+04   9.282538e-08   9.080284e-08   1.298526e-07   4.436895e+01 
  1.171200e+04   9.480127e-08   8.700800e-08   1.286766e-07   4.254551e+01 
  1.172800e+04   1.030332e-07   9.329113e-08   1.389931e-07   4.215916e+01 
  1.174400e+04   9.993221e-08   9.867931e-08   1.404423e-07   4.463856e+01 
  1.176000e+04   9.051505e-08   9.357437e-08   1.301889e-07   4.595209e+01 
  1.177600e+04   9.210324e-08   9.216588e-08   1.302980e-07   4.501947e+01 
  1.179200e+04   9.713114e-08   8.948149e-08   1.320659e-07   4.265264e+01 
  1.180800e+04   9.412919e-08   9.076128e-08   1.307590e-07   4.395643e+01 
  1.182400e+04   9.230310e-08   8.800016e-08   1.275300e-07   4.363290e+01 
  1.184000e+04   9.116201e-08   8.507268e-08   1.246911e-07   4.302108e+01 
  1.185600e+04   8.999707e-08   8.457463e-08   1.235004e-07   4.322088e+01 
  1.187200e+04   9.163026e-08   8.280180e-08   1.235000e-07   4.210258e+01 
  1.188800e+04   8.680396e-08   8.129708e-08   1.189292e-07   4.312370e+01 
  1.190400e+04   8.039250e-08   7.905742e-08   1.127521e-07   4.452027e+01 
  1.192000e+04   7.876487e-08   8.467210e-08   1.156428e-07   4.706998e+01 
  1.193600e+04   8.182235e-08   8.803961e-08   1.201910e-07   4.709620e+01 
  1.195200e+04   8.541405e-08   8.684468e-08   1.218095e-07   4.547583e+01 
  1.196800e+04   8.829633e-08   8.592514e-08   1.232046e-07   4.422024e+01 
  1.198400e+04   9.289547e-08   8.905604e-08   1.286878e-07   4.379116e+01 
  1.200000e+04   9.065649e-08   9.128470e-08   1.286526e-07   4.519783e+01 
  1.201600e+04   8.597468e-08   8.276174e-08   1.193363e-07   4.390915e+01 
  1.203200e+04   8.976485e-08   7.723268e-08   1.184171e-07   4.070834e+01 
  1.204800e+04   8.939945e-08   8.110496e-08   1.207074e-07   4.221494e+01 
  1.206400e+04   8.857155e-08   8.256234e-08   1.210845e-07   4.298893e+01 
  1.208000e+04   9.144746e-08   7.827391e-08   1.203721e-07   4.056167e+01 
  1.209600e+04   8.644364e-08   8.033991e-08   1.180127e-07   4.290409e+01 
  1.211200e+04   8.374263e-08   8.028060e-08   1.160078e-07   4.379084e+01 
  1.212800e+04   8.355125e-08   7.412324e-08   1.116918e-07   4.157812e+01 
  1.214400e+04   8.330298e-08   7.261719e-08   1.105108e-07   4.107944e+01 
  1.216000e+04   8.130257e-08   7.396807e-08   1.099153e-07   4.229554e+01 
  1.217600e+04   8.467791e-08   7.215752e-08   1.112522e-07   4.043568e+01 
  1.219200e+04   9.216104e-08   7.574091e-08   1.192910e-07   3.941447e+01 
  1.220800e+04   9.399034e-08   8.120956e-08   1.242142e-07   4.082768e+01 
  1.222400e+04   9.459762e-08   9.070077e-08   1.310547e-07   4.379523e+01 
  1.224000e+04   9.463424e-08   9.900293e-08   1.369570e-07   4.629244e+01 
  1.225600e+04   8.990795e-08   9.864340e-08   1.334689e-07   4.765257e+01 
  1.227200e+04   8.769743e-08   9.273836e-08   1.276372e-07   4.660028e+01 
  1.228800e+04   8.827580e-08   8.761923e-08   1.243774e-07   4.478613e+01 
  1.230400e+04   9.042270e-08   8.428061e-08   1.236102e-07   4.298647e+01 
  1.232000e+04   8.845555e-08   8.080275e-08   1.198060e-07   4.241121e+01 
  1.233600e+04   8.558755e-08   7.825681e-08   1.159714e-07   4.243817e+01 
  1.235200e+04   8.486197e-08   8.093181e-08   1.172668e-07   4.364205e+01 
  1.236800e+04   8.504301e-08   8.643146e-08   1.212547e-07   4.546392e+01 
  1.238400e+04   8.361305e-08   8.922316e-08   1.222780e-07   4.685912e+01 
  1.240000e+04   8.268885e-08   8.704334e-08   1.200583e-07   4.646960e+01 
  1.241600e+04   8.212211e-08   8.061787e-08   1.150795e-07   4.447042e+01 
  1.243200e+04   8.153028e-08   7.779130e-08   1.126884e-07   4.365562e+01 
  1.244800e+04   8.556410e-08   8.078182e-08   1.176729e-07   4.335325e+01 
  1.246400e+04   9.119606e-08   8.180824e-08   1.225125e-07   4.189397e+01 
  1.248000e+04   8.881634e-08   8.098315e-08   1.201941e-07   4.235870e+01 
  1.249600e+04   8.241091e-08   8.119166e-08   1.156877e-07   4.457301e+01 
  1.251200e+04   7.702977e-08   7.999094e-08   1.110502e-07   4.608038e+01 
  1.252800e+04   7.416062e-08   8.150717e-08   1.101963e-07   4.770200e+01 
  1.254400e+04   7.902576e-08   8.115405e-08   1.132742e-07   4.576123e+01 
  1.256000e+04   8.186075e-08   7.884581e-08   1.136567e-07   4.392522e+01 
  1.257600e+04   7.911355e-08   7.684558e-08   1.102914e-07   4.416686e+01 
  1.259200e+04   7.481791e-08   7.696890e-08   1.073403e-07   4.581189e+01 
  1.260800e+04   7.642834e-08   7.942726e-08   1.102269e-07   4.610233e+01 
  1.262400e+04   7.727070e-08   8.363033e-08   1.138630e-07   4.726344e+01 
  1.264000e+04   7.760673e-08   8.109482e-08   1.122460e-07   4.625909e+01 
  1.265600e+04   7.553018e-08   7.644844e-08   1.074671e-07   4.534617e+01 
  1.267200e+04   7.206378e-08   7.789814e-08   1.061193e-07   4.722800e+01 
  1.268800e+04   6.876639e-08   8.282413e-08   1.076506e-07   5.029816e+01 
  1.270400e+04   6.957204e-08   7.955188e-08   1.056824e-07   4.882870e+01 
  1.272000e+04   7.319730e-08   7.590834e-08   1.054510e-07   4.604164e+01 
  1.273600e+04   7.334052e-08   7.693014e-08   1.062877e-07   4.636840e+01 
  1.275200e+04   7.409062e-08   7.647760e-08   1.064812e-07   4.590824e+01 
  1.276800e+04   7.550089e-08   7.614693e-08   1.072322e-07   4.524408e+01 
  1.278400e+04   7.627042e-08   7.609940e-08   1.077418e-07   4.493569e+01 
  1.280000e+04   7.812179e-08   7.885516e-08   1.110007e-07   4.526767e+01 
