  0.000000e+00   7.433184e-03   9.471332e-06   7.433190e-03   7.300600e-02 
  1.600000e+01   5.132502e-03   1.059473e-03   5.240712e-03   1.166342e+01 
  3.200000e+01   1.625775e-03   8.245872e-04   1.822934e-03   2.689396e+01 
  4.800000e+01   3.016285e-04   2.838779e-04   4.142058e-04   4.326352e+01 
  6.400000e+01   1.133703e-04   1.153577e-04   1.617412e-04   4.549781e+01 
  8.000000e+01   7.168626e-05   7.412700e-05   1.031200e-04   4.595897e+01 
  9.600000e+01   8.766812e-05   7.888585e-05   1.179350e-04   4.198163e+01 
  1.120000e+02   1.106267e-04   1.021794e-04   1.505951e-04   4.272685e+01 
  1.280000e+02   1.212038e-04   1.221053e-04   1.720467e-04   4.521230e+01 
  1.440000e+02   1.513654e-04   1.633046e-04   2.226654e-04   4.717288e+01 
  1.600000e+02   1.929573e-04   2.158693e-04   2.895377e-04   4.820768e+01 
  1.760000e+02   2.044784e-04   2.151652e-04   2.968291e-04   4.645880e+01 
  1.920000e+02   2.032980e-04   1.884185e-04   2.771851e-04   4.282465e+01 
  2.080000e+02   1.801490e-04   1.723855e-04   2.493400e-04   4.373843e+01 
  2.240000e+02   1.470743e-04   1.707742e-04   2.253768e-04   4.926428e+01 
  2.400000e+02   1.379998e-04   1.640231e-04   2.143537e-04   4.992464e+01 
  2.560000e+02   1.379265e-04   1.513536e-04   2.047721e-04   4.765752e+01 
  2.720000e+02   1.396611e-04   1.439114e-04   2.005385e-04   4.585870e+01 
  2.880000e+02   1.496346e-04   1.381414e-04   2.036505e-04   4.271293e+01 
  3.040000e+02   1.579973e-04   1.382018e-04   2.099116e-04   4.117649e+01 
  3.200000e+02   1.632987e-04   1.442563e-04   2.178907e-04   4.145702e+01 
  3.360000e+02   1.551983e-04   1.372504e-04   2.071815e-04   4.148811e+01 
  3.520000e+02   1.545712e-04   1.412426e-04   2.093842e-04   4.242014e+01 
  3.680000e+02   1.559090e-04   1.389441e-04   2.088375e-04   4.170701e+01 
  3.840000e+02   1.380181e-04   1.327777e-04   1.915174e-04   4.389135e+01 
  4.000000e+02   1.235018e-04   1.287807e-04   1.784297e-04   4.619872e+01 
  4.160000e+02   1.141537e-04   1.217253e-04   1.668775e-04   4.683853e+01 
  4.320000e+02   1.030094e-04   1.106316e-04   1.511631e-04   4.704330e+01 
  4.480000e+02   9.409202e-05   1.023541e-04   1.390312e-04   4.740832e+01 
  4.640000e+02   9.357346e-05   1.059036e-04   1.413208e-04   4.853707e+01 
  4.800000e+02   9.255175e-05   1.034131e-04   1.387807e-04   4.817236e+01 
  4.960000e+02   9.023859e-05   9.564745e-05   1.314969e-04   4.666670e+01 
  5.120000e+02   8.944594e-05   9.611533e-05   1.312964e-04   4.705842e+01 
  5.280000e+02   1.014998e-04   1.074825e-04   1.478333e-04   4.663979e+01 
  5.440000e+02   1.110995e-04   1.121207e-04   1.578422e-04   4.526212e+01 
  5.600000e+02   9.690968e-05   9.568183e-05   1.361855e-04   4.463472e+01 
  5.760000e+02   7.942755e-05   8.280807e-05   1.147428e-04   4.619370e+01 
  5.920000e+02   7.934153e-05   8.166458e-05   1.138604e-04   4.582662e+01 
  6.080000e+02   8.917783e-05   8.817607e-05   1.254102e-04   4.467637e+01 
  6.240000e+02   8.981606e-05   8.716292e-05   1.251571e-04   4.414112e+01 
  6.400000e+02   7.862201e-05   7.572657e-05   1.091601e-04   4.392530e+01 
  6.560000e+02   7.388034e-05   7.416608e-05   1.046848e-04   4.511058e+01 
  6.720000e+02   6.724062e-05   7.047185e-05   9.740423e-05   4.634412e+01 
  6.880000e+02   5.722667e-05   6.056286e-05   8.332318e-05   4.662237e+01 
  7.040000e+02   5.312938e-05   5.212893e-05   7.443223e-05   4.445543e+01 
  7.200000e+02   5.007309e-05   4.752832e-05   6.903808e-05   4.350645e+01 
  7.360000e+02   4.722212e-05   5.167823e-05   7.000405e-05   4.757981e+01 
  7.520000e+02   5.174673e-05   5.930478e-05   7.870694e-05   4.889348e+01 
  7.680000e+02   6.839286e-05   7.481075e-05   1.013619e-04   4.756608e+01 
  7.840000e+02   8.184844e-05   8.175801e-05   1.156872e-04   4.496833e+01 
  8.000000e+02   7.952672e-05   8.055909e-05   1.132001e-04   4.536948e+01 
  8.160000e+02   7.329545e-05   8.061214e-05   1.089520e-04   4.772176e+01 
  8.320000e+02   7.088282e-05   7.496203e-05   1.031682e-04   4.660212e+01 
  8.480000e+02   6.526920e-05   6.608044e-05   9.288000e-05   4.535386e+01 
  8.640000e+02   5.997108e-05   6.168066e-05   8.602927e-05   4.580513e+01 
  8.800000e+02   6.206334e-05   6.544323e-05   9.019243e-05   4.651841e+01 
  8.960000e+02   6.630168e-05   6.926862e-05   9.588563e-05   4.625371e+01 
  9.120000e+02   6.097198e-05   6.160290e-05   8.667468e-05   4.529491e+01 
  9.280000e+02   5.906660e-05   5.338313e-05   7.961546e-05   4.210660e+01 
  9.440000e+02   5.551802e-05   5.173036e-05   7.588333e-05   4.297734e+01 
  9.600000e+02   4.927835e-05   5.005375e-05   7.024055e-05   4.544725e+01 
  9.760000e+02   4.820106e-05   4.721382e-05   6.747212e-05   4.440719e+01 
  9.920000e+02   4.816052e-05   4.483276e-05   6.579826e-05   4.295054e+01 
  1.008000e+03   5.182031e-05   4.267159e-05   6.712830e-05   3.946985e+01 
  1.024000e+03   5.414172e-05   4.487873e-05   7.032372e-05   3.965575e+01 
  1.040000e+03   5.113220e-05   4.610276e-05   6.884741e-05   4.203903e+01 
  1.056000e+03   4.528402e-05   4.556481e-05   6.424014e-05   4.517708e+01 
  1.072000e+03   4.144552e-05   4.273181e-05   5.952931e-05   4.587545e+01 
  1.088000e+03   3.831037e-05   3.926306e-05   5.485683e-05   4.570362e+01 
  1.104000e+03   3.704202e-05   3.572245e-05   5.146071e-05   4.396106e+01 
  1.120000e+03   3.632782e-05   3.306708e-05   4.912374e-05   4.230975e+01 
  1.136000e+03   3.626734e-05   3.306722e-05   4.907913e-05   4.235740e+01 
  1.152000e+03   3.516357e-05   3.422623e-05   4.907047e-05   4.422607e+01 
  1.168000e+03   3.329376e-05   3.284922e-05   4.677121e-05   4.461493e+01 
  1.184000e+03   3.319703e-05   3.023982e-05   4.490534e-05   4.233100e+01 
  1.200000e+03   3.316018e-05   3.098260e-05   4.538192e-05   4.305560e+01 
  1.216000e+03   3.265460e-05   3.145794e-05   4.534231e-05   4.393069e+01 
  1.232000e+03   3.091016e-05   3.080814e-05   4.364149e-05   4.490529e+01 
  1.248000e+03   3.048457e-05   3.068801e-05   4.325579e-05   4.519055e+01 
  1.264000e+03   3.139676e-05   2.846835e-05   4.238165e-05   4.219950e+01 
  1.280000e+03   2.991861e-05   2.625354e-05   3.980417e-05   4.126691e+01 
  1.296000e+03   2.809409e-05   2.757965e-05   3.936896e-05   4.447058e+01 
  1.312000e+03   2.885011e-05   2.993411e-05   4.157378e-05   4.605643e+01 
  1.328000e+03   2.805176e-05   3.010236e-05   4.114673e-05   4.701949e+01 
  1.344000e+03   2.698981e-05   2.887651e-05   3.952597e-05   4.693424e+01 
  1.360000e+03   2.632456e-05   2.997817e-05   3.989578e-05   4.871284e+01 
  1.376000e+03   2.631100e-05   3.170323e-05   4.119907e-05   5.031020e+01 
  1.392000e+03   2.699125e-05   2.975759e-05   4.017514e-05   4.779078e+01 
  1.408000e+03   3.066655e-05   2.804407e-05   4.155608e-05   4.244242e+01 
  1.424000e+03   3.418966e-05   3.147341e-05   4.647051e-05   4.263123e+01 
  1.440000e+03   3.603995e-05   3.559663e-05   5.065568e-05   4.464543e+01 
  1.456000e+03   3.513169e-05   3.496886e-05   4.956871e-05   4.486691e+01 
  1.472000e+03   3.392078e-05   3.215724e-05   4.674086e-05   4.347121e+01 
  1.488000e+03   3.386500e-05   3.338514e-05   4.755424e-05   4.459118e+01 
  1.504000e+03   3.176899e-05   3.467580e-05   4.702849e-05   4.750496e+01 
  1.520000e+03   2.621038e-05   2.953795e-05   3.949018e-05   4.841588e+01 
  1.536000e+03   2.446742e-05   2.603206e-05   3.572566e-05   4.677464e+01 
  1.552000e+03   2.344357e-05   2.589052e-05   3.492735e-05   4.783952e+01 
  1.568000e+03   2.347952e-05   2.629281e-05   3.525053e-05   4.823509e+01 
  1.584000e+03   2.455093e-05   2.538432e-05   3.531447e-05   4.595614e+01 
  1.600000e+03   2.613868e-05   2.615999e-05   3.698075e-05   4.502335e+01 
  1.616000e+03   2.713949e-05   2.761016e-05   3.871528e-05   4.549254e+01 
  1.632000e+03   2.364341e-05   2.500734e-05   3.441479e-05   4.660587e+01 
  1.648000e+03   2.211310e-05   2.478133e-05   3.321300e-05   4.825654e+01 
  1.664000e+03   2.450342e-05   2.506453e-05   3.505207e-05   4.564856e+01 
  1.680000e+03   2.310888e-05   2.281239e-05   3.247191e-05   4.463008e+01 
  1.696000e+03   2.177053e-05   2.165920e-05   3.070956e-05   4.485313e+01 
  1.712000e+03   2.197716e-05   2.083542e-05   3.028383e-05   4.347237e+01 
  1.728000e+03   2.394001e-05   2.172532e-05   3.232822e-05   4.222342e+01 
  1.744000e+03   2.425322e-05   2.230994e-05   3.295379e-05   4.261018e+01 
  1.760000e+03   2.148948e-05   2.178631e-05   3.060132e-05   4.539299e+01 
  1.776000e+03   2.075080e-05   2.117294e-05   2.964606e-05   4.557690e+01 
  1.792000e+03   2.206693e-05   1.995716e-05   2.975295e-05   4.212595e+01 
  1.808000e+03   2.301500e-05   2.024966e-05   3.065516e-05   4.134280e+01 
  1.824000e+03   2.258561e-05   2.132518e-05   3.106241e-05   4.335582e+01 
  1.840000e+03   2.209660e-05   2.140912e-05   3.076703e-05   4.409468e+01 
  1.856000e+03   2.374542e-05   2.205801e-05   3.240988e-05   4.289017e+01 
  1.872000e+03   2.288380e-05   2.083149e-05   3.094542e-05   4.231209e+01 
  1.888000e+03   2.084582e-05   1.981255e-05   2.875910e-05   4.354423e+01 
  1.904000e+03   1.968937e-05   1.973526e-05   2.787744e-05   4.506670e+01 
  1.920000e+03   1.942578e-05   1.964432e-05   2.762716e-05   4.532049e+01 
  1.936000e+03   2.145202e-05   2.083166e-05   2.990229e-05   4.415945e+01 
  1.952000e+03   2.402131e-05   2.139317e-05   3.216661e-05   4.168798e+01 
  1.968000e+03   2.392872e-05   2.153550e-05   3.219257e-05   4.198674e+01 
  1.984000e+03   2.063950e-05   2.005806e-05   2.878045e-05   4.418147e+01 
  2.000000e+03   1.817616e-05   1.823757e-05   2.574843e-05   4.509662e+01 
  2.016000e+03   1.733471e-05   1.745870e-05   2.460281e-05   4.520416e+01 
  2.032000e+03   1.635725e-05   1.805534e-05   2.436299e-05   4.782497e+01 
  2.048000e+03   1.723564e-05   1.855745e-05   2.532679e-05   4.711493e+01 
  2.064000e+03   1.805927e-05   1.859122e-05   2.591855e-05   4.583154e+01 
  2.080000e+03   1.796768e-05   1.845592e-05   2.575769e-05   4.576798e+01 
  2.096000e+03   1.817796e-05   1.799128e-05   2.557586e-05   4.470428e+01 
  2.112000e+03   1.749217e-05   1.821533e-05   2.525419e-05   4.616021e+01 
  2.128000e+03   1.730106e-05   1.793031e-05   2.491632e-05   4.602322e+01 
  2.144000e+03   1.822366e-05   1.990679e-05   2.698855e-05   4.752747e+01 
  2.160000e+03   1.928494e-05   2.266309e-05   2.975777e-05   4.960419e+01 
  2.176000e+03   1.970266e-05   2.164337e-05   2.926824e-05   4.768739e+01 
  2.192000e+03   2.026047e-05   1.955318e-05   2.815694e-05   4.398225e+01 
  2.208000e+03   2.051662e-05   1.870237e-05   2.776167e-05   4.235141e+01 
  2.224000e+03   1.912973e-05   1.842763e-05   2.656171e-05   4.392903e+01 
  2.240000e+03   1.705972e-05   1.812163e-05   2.488830e-05   4.672889e+01 
  2.256000e+03   1.672360e-05   1.689149e-05   2.376975e-05   4.528616e+01 
  2.272000e+03   1.740572e-05   1.598046e-05   2.362910e-05   4.255552e+01 
  2.288000e+03   1.726724e-05   1.617195e-05   2.365776e-05   4.312396e+01 
  2.304000e+03   1.659537e-05   1.748696e-05   2.410809e-05   4.649850e+01 
  2.320000e+03   1.708520e-05   1.777871e-05   2.465738e-05   4.613958e+01 
  2.336000e+03   1.729482e-05   1.751637e-05   2.461573e-05   4.536465e+01 
  2.352000e+03   1.582115e-05   1.623111e-05   2.266623e-05   4.573279e+01 
  2.368000e+03   1.511828e-05   1.510771e-05   2.137300e-05   4.497996e+01 
  2.384000e+03   1.546697e-05   1.490079e-05   2.147698e-05   4.393190e+01 
  2.400000e+03   1.577646e-05   1.498882e-05   2.176147e-05   4.353346e+01 
  2.416000e+03   1.567905e-05   1.471035e-05   2.149947e-05   4.317424e+01 
  2.432000e+03   1.517572e-05   1.378180e-05   2.049977e-05   4.224411e+01 
  2.448000e+03   1.469950e-05   1.472087e-05   2.080335e-05   4.504161e+01 
  2.464000e+03   1.519257e-05   1.572433e-05   2.186478e-05   4.598536e+01 
  2.480000e+03   1.582061e-05   1.567903e-05   2.227384e-05   4.474247e+01 
  2.496000e+03   1.643965e-05   1.555375e-05   2.263142e-05   4.341388e+01 
  2.512000e+03   1.655484e-05   1.618727e-05   2.315362e-05   4.435681e+01 
  2.528000e+03   1.559365e-05   1.621631e-05   2.249734e-05   4.612139e+01 
  2.544000e+03   1.453128e-05   1.573612e-05   2.141924e-05   4.727955e+01 
  2.560000e+03   1.394147e-05   1.609174e-05   2.129105e-05   4.909518e+01 
  2.576000e+03   1.452766e-05   1.596568e-05   2.158600e-05   4.769998e+01 
  2.592000e+03   1.482815e-05   1.575836e-05   2.163793e-05   4.674198e+01 
  2.608000e+03   1.425948e-05   1.583666e-05   2.131039e-05   4.799982e+01 
  2.624000e+03   1.496032e-05   1.553598e-05   2.156799e-05   4.608140e+01 
  2.640000e+03   1.547797e-05   1.527098e-05   2.174329e-05   4.461432e+01 
  2.656000e+03   1.524541e-05   1.576082e-05   2.192774e-05   4.595231e+01 
  2.672000e+03   1.630327e-05   1.647819e-05   2.318032e-05   4.530572e+01 
  2.688000e+03   1.754258e-05   1.704310e-05   2.445832e-05   4.417261e+01 
  2.704000e+03   1.765916e-05   1.756019e-05   2.490394e-05   4.483899e+01 
  2.720000e+03   1.643454e-05   1.700251e-05   2.364697e-05   4.597314e+01 
  2.736000e+03   1.587408e-05   1.596205e-05   2.251163e-05   4.515832e+01 
  2.752000e+03   1.637748e-05   1.636485e-05   2.315232e-05   4.497790e+01 
  2.768000e+03   1.788474e-05   1.770886e-05   2.516879e-05   4.471687e+01 
  2.784000e+03   1.980859e-05   1.887116e-05   2.735874e-05   4.361167e+01 
  2.800000e+03   2.331987e-05   2.281168e-05   3.262192e-05   4.436885e+01 
  2.816000e+03   2.615630e-05   2.519038e-05   3.631401e-05   4.392229e+01 
  2.832000e+03   2.655980e-05   2.504672e-05   3.650700e-05   4.332060e+01 
  2.848000e+03   2.415390e-05   2.480703e-05   3.462368e-05   4.576427e+01 
  2.864000e+03   2.321522e-05   2.500104e-05   3.411742e-05   4.712114e+01 
  2.880000e+03   2.264667e-05   2.351073e-05   3.264393e-05   4.607243e+01 
  2.896000e+03   1.946111e-05   1.973566e-05   2.771698e-05   4.540130e+01 
  2.912000e+03   1.575560e-05   1.632894e-05   2.269082e-05   4.602375e+01 
  2.928000e+03   1.369188e-05   1.404492e-05   1.961446e-05   4.572923e+01 
  2.944000e+03   1.244517e-05   1.263988e-05   1.773834e-05   4.544473e+01 
  2.960000e+03   1.239382e-05   1.244012e-05   1.756028e-05   4.510683e+01 
  2.976000e+03   1.224027e-05   1.228709e-05   1.734349e-05   4.510938e+01 
  2.992000e+03   1.169085e-05   1.168438e-05   1.652878e-05   4.498416e+01 
  3.008000e+03   1.161467e-05   1.188419e-05   1.661729e-05   4.565712e+01 
  3.024000e+03   1.193471e-05   1.182849e-05   1.680328e-05   4.474389e+01 
  3.040000e+03   1.232995e-05   1.171812e-05   1.701006e-05   4.354259e+01 
  3.056000e+03   1.231026e-05   1.177816e-05   1.703724e-05   4.373458e+01 
  3.072000e+03   1.208599e-05   1.162913e-05   1.677224e-05   4.389636e+01 
  3.088000e+03   1.180126e-05   1.080422e-05   1.600003e-05   4.247454e+01 
  3.104000e+03   1.175713e-05   1.011336e-05   1.550839e-05   4.070179e+01 
  3.120000e+03   1.131143e-05   1.063270e-05   1.552426e-05   4.322841e+01 
  3.136000e+03   1.093787e-05   1.086858e-05   1.541957e-05   4.481796e+01 
  3.152000e+03   1.024302e-05   1.095754e-05   1.499957e-05   4.693030e+01 
  3.168000e+03   9.804015e-06   1.106392e-05   1.478273e-05   4.845505e+01 
  3.184000e+03   1.041998e-05   1.070978e-05   1.494240e-05   4.578579e+01 
  3.200000e+03   1.073739e-05   1.090808e-05   1.530613e-05   4.545181e+01 
  3.216000e+03   1.069250e-05   1.091002e-05   1.527606e-05   4.557691e+01 
  3.232000e+03   1.124628e-05   1.092883e-05   1.568178e-05   4.417982e+01 
  3.248000e+03   1.092754e-05   1.134266e-05   1.575014e-05   4.606787e+01 
  3.264000e+03   1.018881e-05   1.123300e-05   1.516549e-05   4.779063e+01 
  3.280000e+03   9.645030e-06   1.056602e-05   1.430620e-05   4.760909e+01 
  3.296000e+03   1.000954e-05   1.044378e-05   1.446594e-05   4.621627e+01 
  3.312000e+03   1.044460e-05   1.064481e-05   1.491313e-05   4.554391e+01 
  3.328000e+03   9.765825e-06   1.052231e-05   1.435585e-05   4.713541e+01 
  3.344000e+03   8.995783e-06   1.004216e-05   1.348218e-05   4.814596e+01 
  3.360000e+03   8.932655e-06   9.981051e-06   1.339454e-05   4.817269e+01 
  3.376000e+03   9.192778e-06   1.004900e-05   1.361945e-05   4.754786e+01 
  3.392000e+03   9.363126e-06   1.002002e-05   1.371382e-05   4.694102e+01 
  3.408000e+03   9.547608e-06   1.032296e-05   1.406131e-05   4.723457e+01 
  3.424000e+03   9.807059e-06   1.033849e-05   1.425001e-05   4.651110e+01 
  3.440000e+03   9.524939e-06   9.673238e-06   1.357557e-05   4.544258e+01 
  3.456000e+03   9.494278e-06   9.268628e-06   1.326834e-05   4.431097e+01 
  3.472000e+03   9.923550e-06   9.507034e-06   1.374265e-05   4.377198e+01 
  3.488000e+03   1.008075e-05   9.724582e-06   1.400675e-05   4.396972e+01 
  3.504000e+03   1.011491e-05   9.285453e-06   1.373066e-05   4.255183e+01 
  3.520000e+03   9.918258e-06   8.578794e-06   1.311364e-05   4.085815e+01 
  3.536000e+03   9.312877e-06   8.516216e-06   1.261965e-05   4.244154e+01 
  3.552000e+03   8.979082e-06   9.044056e-06   1.274437e-05   4.520655e+01 
  3.568000e+03   9.126763e-06   9.126816e-06   1.290723e-05   4.500016e+01 
  3.584000e+03   9.490347e-06   9.070211e-06   1.312766e-05   4.370327e+01 
  3.600000e+03   9.385319e-06   9.037036e-06   1.302890e-05   4.391693e+01 
  3.616000e+03   8.760836e-06   9.066885e-06   1.260796e-05   4.598350e+01 
  3.632000e+03   8.580253e-06   9.306616e-06   1.265835e-05   4.732543e+01 
  3.648000e+03   8.577753e-06   9.203662e-06   1.258115e-05   4.701599e+01 
  3.664000e+03   8.484009e-06   8.924705e-06   1.231376e-05   4.645011e+01 
  3.680000e+03   8.441550e-06   8.745019e-06   1.215463e-05   4.601159e+01 
  3.696000e+03   7.952090e-06   8.418741e-06   1.158063e-05   4.663277e+01 
  3.712000e+03   7.844342e-06   8.151893e-06   1.131314e-05   4.610146e+01 
  3.728000e+03   7.986730e-06   8.041648e-06   1.133384e-05   4.519630e+01 
  3.744000e+03   7.955226e-06   8.221291e-06   1.144007e-05   4.594229e+01 
  3.760000e+03   8.036391e-06   8.171236e-06   1.146092e-05   4.547668e+01 
  3.776000e+03   8.474658e-06   8.177586e-06   1.177679e-05   4.397796e+01 
  3.792000e+03   8.548741e-06   8.526679e-06   1.207416e-05   4.492597e+01 
  3.808000e+03   8.412016e-06   8.147967e-06   1.171116e-05   4.408649e+01 
  3.824000e+03   8.376230e-06   7.755241e-06   1.141512e-05   4.279546e+01 
  3.840000e+03   8.189580e-06   7.525247e-06   1.112199e-05   4.257930e+01 
  3.856000e+03   8.214340e-06   7.303193e-06   1.099145e-05   4.163961e+01 
  3.872000e+03   8.051175e-06   7.529885e-06   1.102364e-05   4.308379e+01 
  3.888000e+03   7.710340e-06   8.028033e-06   1.113098e-05   4.615641e+01 
  3.904000e+03   7.525523e-06   8.569544e-06   1.140485e-05   4.871134e+01 
  3.920000e+03   7.621857e-06   8.221197e-06   1.121074e-05   4.716645e+01 
  3.936000e+03   7.646649e-06   8.087469e-06   1.113007e-05   4.660482e+01 
  3.952000e+03   7.595378e-06   8.565120e-06   1.144775e-05   4.843402e+01 
  3.968000e+03   7.813209e-06   8.019248e-06   1.119619e-05   4.574559e+01 
  3.984000e+03   7.622424e-06   7.089323e-06   1.040960e-05   4.292471e+01 
  4.000000e+03   7.272494e-06   6.801467e-06   9.957365e-06   4.308314e+01 
  4.016000e+03   7.232723e-06   6.719140e-06   9.872138e-06   4.289183e+01 
  4.032000e+03   7.053090e-06   6.895236e-06   9.863587e-06   4.435161e+01 
  4.048000e+03   6.872687e-06   6.925395e-06   9.756789e-06   4.521886e+01 
  4.064000e+03   7.090550e-06   6.685939e-06   9.745650e-06   4.331772e+01 
  4.080000e+03   7.243305e-06   6.692579e-06   9.861849e-06   4.273693e+01 
  4.096000e+03   8.780049e-06   8.220747e-06   1.202788e-05   4.311573e+01 
  4.112000e+03   1.387981e-05   1.342716e-05   1.931160e-05   4.405034e+01 
  4.128000e+03   1.582389e-05   1.543477e-05   2.210493e-05   4.428680e+01 
  4.144000e+03   1.104613e-05   1.099091e-05   1.558259e-05   4.485642e+01 
  4.160000e+03   7.677194e-06   8.101739e-06   1.116143e-05   4.654121e+01 
  4.176000e+03   7.579265e-06   7.360166e-06   1.056491e-05   4.415977e+01 
  4.192000e+03   8.136902e-06   7.160913e-06   1.083918e-05   4.134952e+01 
  4.208000e+03   7.702040e-06   7.270286e-06   1.059143e-05   4.334823e+01 
  4.224000e+03   7.209614e-06   7.134346e-06   1.014285e-05   4.469935e+01 
  4.240000e+03   7.086468e-06   7.242857e-06   1.013297e-05   4.562529e+01 
  4.256000e+03   7.062987e-06   7.270614e-06   1.013645e-05   4.582989e+01 
  4.272000e+03   7.065496e-06   7.021443e-06   9.961019e-06   4.482082e+01 
  4.288000e+03   6.856314e-06   6.631430e-06   9.538601e-06   4.404478e+01 
  4.304000e+03   6.652080e-06   6.702047e-06   9.442860e-06   4.521438e+01 
  4.320000e+03   6.984798e-06   6.913582e-06   9.827767e-06   4.470641e+01 
  4.336000e+03   6.828412e-06   6.739840e-06   9.594408e-06   4.462598e+01 
  4.352000e+03   6.669334e-06   6.638269e-06   9.409922e-06   4.486625e+01 
  4.368000e+03   6.490612e-06   6.796678e-06   9.398025e-06   4.631955e+01 
  4.384000e+03   6.557832e-06   7.204565e-06   9.742223e-06   4.769051e+01 
  4.400000e+03   6.922924e-06   6.930582e-06   9.795909e-06   4.503167e+01 
  4.416000e+03   7.046019e-06   6.820708e-06   9.806550e-06   4.406912e+01 
  4.432000e+03   6.710222e-06   6.970456e-06   9.675450e-06   4.608974e+01 
  4.448000e+03   6.289430e-06   6.928336e-06   9.357284e-06   4.776735e+01 
  4.464000e+03   5.904506e-06   7.017056e-06   9.170729e-06   4.992104e+01 
  4.480000e+03   5.863675e-06   7.054081e-06   9.172935e-06   5.026509e+01 
  4.496000e+03   6.449240e-06   7.058587e-06   9.561189e-06   4.758290e+01 
  4.512000e+03   6.641817e-06   6.846564e-06   9.538824e-06   4.586966e+01 
  4.528000e+03   6.223641e-06   6.311782e-06   8.864102e-06   4.540286e+01 
  4.544000e+03   6.465988e-06   6.572779e-06   9.220110e-06   4.546925e+01 
  4.560000e+03   6.775961e-06   7.038415e-06   9.770001e-06   4.608841e+01 
  4.576000e+03   6.839764e-06   7.029154e-06   9.807720e-06   4.578237e+01 
  4.592000e+03   7.081781e-06   6.813038e-06   9.826957e-06   4.389196e+01 
  4.608000e+03   6.476808e-06   6.565973e-06   9.222855e-06   4.539169e+01 
  4.624000e+03   6.106532e-06   6.606290e-06   8.996266e-06   4.725121e+01 
  4.640000e+03   6.333834e-06   6.493610e-06   9.071076e-06   4.571362e+01 
  4.656000e+03   6.600918e-06   6.375837e-06   9.177332e-06   4.400631e+01 
  4.672000e+03   6.588382e-06   6.646954e-06   9.358888e-06   4.525355e+01 
  4.688000e+03   6.126329e-06   6.428494e-06   8.880172e-06   4.637870e+01 
  4.704000e+03   5.896020e-06   5.959081e-06   8.382941e-06   4.530477e+01 
  4.720000e+03   6.323532e-06   5.909306e-06   8.654880e-06   4.306060e+01 
  4.736000e+03   6.479368e-06   5.937090e-06   8.788131e-06   4.249924e+01 
  4.752000e+03   6.274171e-06   5.806104e-06   8.548453e-06   4.278110e+01 
  4.768000e+03   6.163662e-06   5.855263e-06   8.501460e-06   4.353014e+01 
  4.784000e+03   6.480883e-06   5.991315e-06   8.825967e-06   4.275214e+01 
  4.800000e+03   6.554796e-06   6.061403e-06   8.927819e-06   4.276043e+01 
  4.816000e+03   6.294604e-06   6.267313e-06   8.882638e-06   4.487552e+01 
  4.832000e+03   6.292881e-06   6.840789e-06   9.294985e-06   4.738887e+01 
  4.848000e+03   6.040014e-06   6.971038e-06   9.223727e-06   4.909290e+01 
  4.864000e+03   5.637342e-06   6.763210e-06   8.804581e-06   5.018776e+01 
  4.880000e+03   5.907743e-06   6.503212e-06   8.785965e-06   4.774690e+01 
  4.896000e+03   6.000775e-06   6.404180e-06   8.776264e-06   4.686258e+01 
  4.912000e+03   6.075068e-06   6.165012e-06   8.655277e-06   4.542102e+01 
  4.928000e+03   6.153482e-06   5.953626e-06   8.562184e-06   4.405428e+01 
  4.944000e+03   6.051756e-06   6.054442e-06   8.560375e-06   4.501271e+01 
  4.960000e+03   5.823543e-06   6.132785e-06   8.457228e-06   4.648158e+01 
  4.976000e+03   6.035464e-06   6.168440e-06   8.629975e-06   4.562428e+01 
  4.992000e+03   6.489244e-06   6.125083e-06   8.923393e-06   4.334639e+01 
  5.008000e+03   6.963963e-06   6.363225e-06   9.433314e-06   4.241907e+01 
  5.024000e+03   7.190512e-06   7.151591e-06   1.014144e-05   4.484451e+01 
  5.040000e+03   7.690305e-06   8.436538e-06   1.141560e-05   4.764934e+01 
  5.056000e+03   8.958224e-06   9.740139e-06   1.323330e-05   4.739455e+01 
  5.072000e+03   9.724088e-06   1.042319e-05   1.425485e-05   4.698733e+01 
  5.088000e+03   9.367479e-06   1.029399e-05   1.391818e-05   4.769796e+01 
  5.104000e+03   8.638680e-06   9.154810e-06   1.258719e-05   4.666150e+01 
  5.120000e+03   7.667962e-06   7.584061e-06   1.078497e-05   4.468482e+01 
  5.136000e+03   6.953615e-06   6.579262e-06   9.572850e-06   4.341546e+01 
  5.152000e+03   6.693328e-06   6.492188e-06   9.324652e-06   4.412604e+01 
  5.168000e+03   6.139420e-06   6.412419e-06   8.877590e-06   4.624597e+01 
  5.184000e+03   6.161706e-06   5.706338e-06   8.398149e-06   4.280268e+01 
  5.200000e+03   6.192925e-06   5.174057e-06   8.069894e-06   3.987803e+01 
  5.216000e+03   6.074534e-06   5.594710e-06   8.258375e-06   4.264540e+01 
  5.232000e+03   6.013543e-06   5.560340e-06   8.190243e-06   4.275759e+01 
  5.248000e+03   5.627202e-06   5.184687e-06   7.651561e-06   4.265628e+01 
  5.264000e+03   5.481429e-06   5.347017e-06   7.657457e-06   4.428883e+01 
  5.280000e+03   5.508947e-06   5.269930e-06   7.623691e-06   4.372970e+01 
  5.296000e+03   5.268364e-06   4.862558e-06   7.169389e-06   4.270618e+01 
  5.312000e+03   4.832999e-06   5.088411e-06   7.017821e-06   4.647466e+01 
  5.328000e+03   4.611489e-06   5.232965e-06   6.974938e-06   4.861226e+01 
  5.344000e+03   4.538024e-06   5.192366e-06   6.895964e-06   4.884719e+01 
  5.360000e+03   4.590302e-06   5.148968e-06   6.898024e-06   4.828301e+01 
  5.376000e+03   4.840866e-06   5.077150e-06   7.015086e-06   4.636474e+01 
  5.392000e+03   5.100574e-06   4.981197e-06   7.129388e-06   4.432160e+01 
  5.408000e+03   5.300494e-06   4.989396e-06   7.279375e-06   4.326828e+01 
  5.424000e+03   4.996442e-06   5.073804e-06   7.120949e-06   4.544015e+01 
  5.440000e+03   4.710899e-06   5.104690e-06   6.946253e-06   4.729741e+01 
  5.456000e+03   4.880073e-06   4.966454e-06   6.962813e-06   4.550262e+01 
  5.472000e+03   4.779130e-06   4.915637e-06   6.855915e-06   4.580669e+01 
  5.488000e+03   4.892555e-06   5.026724e-06   7.014631e-06   4.577493e+01 
  5.504000e+03   5.079181e-06   4.950268e-06   7.092477e-06   4.426359e+01 
  5.520000e+03   4.967413e-06   4.923842e-06   6.994241e-06   4.474761e+01 
  5.536000e+03   4.829445e-06   4.983982e-06   6.940001e-06   4.590219e+01 
  5.552000e+03   4.983921e-06   4.842892e-06   6.949322e-06   4.417777e+01 
  5.568000e+03   5.238384e-06   4.821058e-06   7.119218e-06   4.262439e+01 
  5.584000e+03   5.186681e-06   4.971022e-06   7.184199e-06   4.378373e+01 
  5.600000e+03   5.176898e-06   4.868069e-06   7.106220e-06   4.323901e+01 
  5.616000e+03   5.079171e-06   4.785513e-06   6.978475e-06   4.329488e+01 
  5.632000e+03   4.967226e-06   4.715117e-06   6.848770e-06   4.350846e+01 
  5.648000e+03   5.230682e-06   4.354059e-06   6.805723e-06   3.977425e+01 
  5.664000e+03   5.264634e-06   4.271030e-06   6.779238e-06   3.905132e+01 
  5.680000e+03   5.130316e-06   4.722569e-06   6.973005e-06   4.263025e+01 
  5.696000e+03   5.041267e-06   4.752278e-06   6.928096e-06   4.330979e+01 
  5.712000e+03   4.964727e-06   4.798306e-06   6.904510e-06   4.402342e+01 
  5.728000e+03   4.851101e-06   4.587586e-06   6.676760e-06   4.340080e+01 
  5.744000e+03   4.715553e-06   4.566727e-06   6.564407e-06   4.408143e+01 
  5.760000e+03   4.641957e-06   4.722859e-06   6.622172e-06   4.549496e+01 
  5.776000e+03   4.646556e-06   4.435940e-06   6.424021e-06   4.367159e+01 
  5.792000e+03   4.386988e-06   4.493331e-06   6.279784e-06   4.568609e+01 
  5.808000e+03   4.335531e-06   4.935647e-06   6.569433e-06   4.870354e+01 
  5.824000e+03   4.458817e-06   4.791398e-06   6.545116e-06   4.705912e+01 
  5.840000e+03   4.243504e-06   4.290190e-06   6.034323e-06   4.531344e+01 
  5.856000e+03   4.273962e-06   4.189122e-06   5.984604e-06   4.442564e+01 
  5.872000e+03   4.797921e-06   4.529058e-06   6.597909e-06   4.334882e+01 
  5.888000e+03   4.944832e-06   4.763754e-06   6.866201e-06   4.393148e+01 
  5.904000e+03   4.795007e-06   4.731151e-06   6.736162e-06   4.461594e+01 
  5.920000e+03   4.674079e-06   4.484017e-06   6.477147e-06   4.381108e+01 
  5.936000e+03   4.419914e-06   4.221050e-06   6.111702e-06   4.368162e+01 
  5.952000e+03   4.778123e-06   4.516126e-06   6.574637e-06   4.338530e+01 
  5.968000e+03   4.902442e-06   4.560241e-06   6.695501e-06   4.292889e+01 
  5.984000e+03   4.374182e-06   4.591688e-06   6.341693e-06   4.638968e+01 
  6.000000e+03   4.289230e-06   4.732308e-06   6.386880e-06   4.781173e+01 
  6.016000e+03   4.422559e-06   4.638931e-06   6.409267e-06   4.636786e+01 
  6.032000e+03   4.680522e-06   4.624841e-06   6.580003e-06   4.465716e+01 
  6.048000e+03   4.816297e-06   4.730333e-06   6.750761e-06   4.448408e+01 
  6.064000e+03   4.474308e-06   4.473012e-06   6.326711e-06   4.499170e+01 
  6.080000e+03   4.119462e-06   4.371106e-06   6.006374e-06   4.669764e+01 
  6.096000e+03   4.077966e-06   4.581481e-06   6.133496e-06   4.832779e+01 
  6.112000e+03   4.279794e-06   4.592659e-06   6.277672e-06   4.701955e+01 
  6.128000e+03   4.325861e-06   4.569226e-06   6.292130e-06   4.656720e+01 
  6.144000e+03   4.348026e-06   4.563638e-06   6.303342e-06   4.638596e+01 
  6.160000e+03   4.504038e-06   4.656135e-06   6.478113e-06   4.595126e+01 
  6.176000e+03   4.500968e-06   4.556596e-06   6.404786e-06   4.535188e+01 
  6.192000e+03   4.543280e-06   4.243490e-06   6.216800e-06   4.304592e+01 
  6.208000e+03   4.752766e-06   4.169315e-06   6.322339e-06   4.125852e+01 
  6.224000e+03   4.646043e-06   4.031585e-06   6.151374e-06   4.094968e+01 
  6.240000e+03   4.358721e-06   3.997285e-06   5.914113e-06   4.252324e+01 
  6.256000e+03   4.239642e-06   4.280341e-06   6.024607e-06   4.527369e+01 
  6.272000e+03   4.348665e-06   4.434759e-06   6.211117e-06   4.556159e+01 
  6.288000e+03   4.234782e-06   4.186796e-06   5.955052e-06   4.467353e+01 
  6.304000e+03   4.342238e-06   4.107217e-06   5.976978e-06   4.340673e+01 
  6.320000e+03   4.605551e-06   4.113936e-06   6.175400e-06   4.177301e+01 
  6.336000e+03   4.566928e-06   4.342318e-06   6.301790e-06   4.355582e+01 
  6.352000e+03   4.124387e-06   4.449487e-06   6.067001e-06   4.717147e+01 
  6.368000e+03   3.920810e-06   4.254037e-06   5.785291e-06   4.733422e+01 
  6.384000e+03   4.064252e-06   4.234025e-06   5.868995e-06   4.617204e+01 
  6.400000e+03   4.115070e-06   4.336542e-06   5.978244e-06   4.650107e+01 
  6.416000e+03   4.224152e-06   4.406641e-06   6.104257e-06   4.621128e+01 
  6.432000e+03   4.313913e-06   4.309249e-06   6.097498e-06   4.496901e+01 
  6.448000e+03   4.237125e-06   4.030465e-06   5.847895e-06   4.356811e+01 
  6.464000e+03   4.284614e-06   3.802210e-06   5.728413e-06   4.158618e+01 
  6.480000e+03   4.245445e-06   3.839599e-06   5.724188e-06   4.212633e+01 
  6.496000e+03   4.387949e-06   3.964839e-06   5.913886e-06   4.210016e+01 
  6.512000e+03   4.555329e-06   4.115541e-06   6.139112e-06   4.209643e+01 
  6.528000e+03   4.306664e-06   4.213872e-06   6.025286e-06   4.437605e+01 
  6.544000e+03   4.039572e-06   4.085201e-06   5.745173e-06   4.532177e+01 
  6.560000e+03   4.268348e-06   4.102494e-06   5.920241e-06   4.386493e+01 
  6.576000e+03   4.435421e-06   4.133483e-06   6.062891e-06   4.298193e+01 
  6.592000e+03   4.317035e-06   4.115441e-06   5.964364e-06   4.363049e+01 
  6.608000e+03   3.941419e-06   4.019721e-06   5.629648e-06   4.556351e+01 
  6.624000e+03   3.817458e-06   3.925378e-06   5.475544e-06   4.579853e+01 
  6.640000e+03   3.902971e-06   4.055544e-06   5.628553e-06   4.609829e+01 
  6.656000e+03   4.145146e-06   4.176185e-06   5.884111e-06   4.521371e+01 
  6.672000e+03   4.345422e-06   4.125440e-06   5.991823e-06   4.351241e+01 
  6.688000e+03   4.334652e-06   4.083529e-06   5.955200e-06   4.329131e+01 
  6.704000e+03   4.215452e-06   4.084403e-06   5.869616e-06   4.409541e+01 
  6.720000e+03   4.186609e-06   4.182660e-06   5.917967e-06   4.497296e+01 
  6.736000e+03   4.154281e-06   4.329857e-06   6.000476e-06   4.618555e+01 
  6.752000e+03   4.290987e-06   4.252545e-06   6.041250e-06   4.474220e+01 
  6.768000e+03   4.098700e-06   4.159742e-06   5.839760e-06   4.542350e+01 
  6.784000e+03   3.636773e-06   4.137529e-06   5.508654e-06   4.868542e+01 
  6.800000e+03   3.771107e-06   4.208054e-06   5.650572e-06   4.813445e+01 
  6.816000e+03   3.825831e-06   4.165312e-06   5.655688e-06   4.743258e+01 
  6.832000e+03   3.815074e-06   4.213401e-06   5.683972e-06   4.784036e+01 
  6.848000e+03   4.020358e-06   4.311131e-06   5.894839e-06   4.699884e+01 
  6.864000e+03   3.838328e-06   4.251964e-06   5.728172e-06   4.792684e+01 
  6.880000e+03   3.779060e-06   4.070329e-06   5.554176e-06   4.712512e+01 
  6.896000e+03   4.014168e-06   4.008607e-06   5.672960e-06   4.496028e+01 
  6.912000e+03   3.970646e-06   4.151486e-06   5.744638e-06   4.627549e+01 
  6.928000e+03   4.038996e-06   4.095298e-06   5.751952e-06   4.539656e+01 
  6.944000e+03   4.004074e-06   3.878267e-06   5.574367e-06   4.408561e+01 
  6.960000e+03   4.048842e-06   3.864500e-06   5.597096e-06   4.366553e+01 
  6.976000e+03   4.183227e-06   3.860750e-06   5.692520e-06   4.270428e+01 
  6.992000e+03   4.388989e-06   4.042930e-06   5.967286e-06   4.264981e+01 
  7.008000e+03   4.570715e-06   4.388850e-06   6.336674e-06   4.383715e+01 
  7.024000e+03   4.284377e-06   4.244107e-06   6.030616e-06   4.472946e+01 
  7.040000e+03   3.916601e-06   4.137898e-06   5.697540e-06   4.657380e+01 
  7.056000e+03   3.908077e-06   4.229209e-06   5.758409e-06   4.725996e+01 
  7.072000e+03   3.882466e-06   4.298888e-06   5.792579e-06   4.791378e+01 
  7.088000e+03   3.656438e-06   4.153224e-06   5.533426e-06   4.863977e+01 
  7.104000e+03   3.432522e-06   3.905862e-06   5.199804e-06   4.869057e+01 
  7.120000e+03   3.694354e-06   3.932651e-06   5.395738e-06   4.678955e+01 
  7.136000e+03   4.163615e-06   4.217308e-06   5.926329e-06   4.536706e+01 
  7.152000e+03   4.247051e-06   4.428101e-06   6.135595e-06   4.619558e+01 
  7.168000e+03   4.077337e-06   4.398017e-06   5.997269e-06   4.716685e+01 
  7.184000e+03   3.929331e-06   4.206470e-06   5.756217e-06   4.695097e+01 
  7.200000e+03   3.802593e-06   3.895257e-06   5.443596e-06   4.568967e+01 
  7.216000e+03   3.752674e-06   3.653084e-06   5.237136e-06   4.422955e+01 
  7.232000e+03   4.062710e-06   3.993778e-06   5.697006e-06   4.450978e+01 
  7.248000e+03   3.984936e-06   4.180523e-06   5.775508e-06   4.637214e+01 
  7.264000e+03   3.740856e-06   4.007785e-06   5.482367e-06   4.697297e+01 
  7.280000e+03   3.776227e-06   3.762192e-06   5.330477e-06   4.489332e+01 
  7.296000e+03   4.105423e-06   3.751633e-06   5.561407e-06   4.242180e+01 
  7.312000e+03   4.213072e-06   3.950542e-06   5.775531e-06   4.315808e+01 
  7.328000e+03   4.023018e-06   3.777261e-06   5.518367e-06   4.319543e+01 
  7.344000e+03   3.880419e-06   3.558126e-06   5.264780e-06   4.251907e+01 
  7.360000e+03   3.832245e-06   3.586181e-06   5.248504e-06   4.310024e+01 
  7.376000e+03   3.785799e-06   3.687524e-06   5.284894e-06   4.424659e+01 
  7.392000e+03   3.785183e-06   3.629779e-06   5.244322e-06   4.379937e+01 
  7.408000e+03   3.694842e-06   3.806347e-06   5.304727e-06   4.585163e+01 
  7.424000e+03   3.855988e-06   3.911819e-06   5.492810e-06   4.541180e+01 
  7.440000e+03   4.015207e-06   3.868398e-06   5.575517e-06   4.393316e+01 
  7.456000e+03   3.948333e-06   3.791094e-06   5.473731e-06   4.383610e+01 
  7.472000e+03   3.952841e-06   3.754777e-06   5.451908e-06   4.352798e+01 
  7.488000e+03   3.858963e-06   3.536246e-06   5.234179e-06   4.250128e+01 
  7.504000e+03   3.716244e-06   3.385374e-06   5.027050e-06   4.233247e+01 
  7.520000e+03   3.856495e-06   3.478170e-06   5.193286e-06   4.204727e+01 
  7.536000e+03   3.720220e-06   3.692573e-06   5.241673e-06   4.478631e+01 
  7.552000e+03   3.663333e-06   3.659595e-06   5.178092e-06   4.497075e+01 
  7.568000e+03   3.669129e-06   3.601341e-06   5.141222e-06   4.446580e+01 
  7.584000e+03   3.531251e-06   3.553573e-06   5.009751e-06   4.518052e+01 
  7.600000e+03   3.533042e-06   3.608165e-06   5.049876e-06   4.560271e+01 
  7.616000e+03   3.734447e-06   3.676424e-06   5.240438e-06   4.455141e+01 
  7.632000e+03   3.874859e-06   3.647837e-06   5.321771e-06   4.327143e+01 
  7.648000e+03   3.979977e-06   3.648449e-06   5.399203e-06   4.251152e+01 
  7.664000e+03   4.012121e-06   3.804749e-06   5.529306e-06   4.348036e+01 
  7.680000e+03   3.819936e-06   3.914858e-06   5.469737e-06   4.570310e+01 
  7.696000e+03   3.456315e-06   3.996507e-06   5.283766e-06   4.914563e+01 
  7.712000e+03   3.365559e-06   3.965415e-06   5.201106e-06   4.967780e+01 
  7.728000e+03   3.215565e-06   3.746407e-06   4.937147e-06   4.936029e+01 
  7.744000e+03   2.963584e-06   3.653558e-06   4.704394e-06   5.095276e+01 
  7.760000e+03   3.360035e-06   3.741465e-06   5.028757e-06   4.807447e+01 
  7.776000e+03   3.676190e-06   3.808464e-06   5.293276e-06   4.601247e+01 
  7.792000e+03   3.634812e-06   3.730902e-06   5.208789e-06   4.574741e+01 
  7.808000e+03   3.441719e-06   3.663969e-06   5.026938e-06   4.679150e+01 
  7.824000e+03   3.222419e-06   3.667066e-06   4.881737e-06   4.869274e+01 
  7.840000e+03   3.154940e-06   3.751836e-06   4.902032e-06   4.993933e+01 
  7.856000e+03   3.527263e-06   3.893418e-06   5.253597e-06   4.782482e+01 
  7.872000e+03   4.000471e-06   3.800970e-06   5.518255e-06   4.353513e+01 
  7.888000e+03   3.931583e-06   3.461548e-06   5.238288e-06   4.136219e+01 
  7.904000e+03   3.608568e-06   3.235055e-06   4.846375e-06   4.187599e+01 
  7.920000e+03   3.507979e-06   3.537720e-06   4.982106e-06   4.524186e+01 
  7.936000e+03   3.535383e-06   3.781677e-06   5.176873e-06   4.692786e+01 
  7.952000e+03   3.629308e-06   3.660551e-06   5.154756e-06   4.524556e+01 
  7.968000e+03   3.601180e-06   3.513435e-06   5.031176e-06   4.429340e+01 
  7.984000e+03   3.435623e-06   3.545801e-06   4.937227e-06   4.590414e+01 
  8.000000e+03   3.556919e-06   3.526449e-06   5.008744e-06   4.475354e+01 
  8.016000e+03   3.667604e-06   3.421598e-06   5.015840e-06   4.301254e+01 
  8.032000e+03   3.833706e-06   3.603232e-06   5.261234e-06   4.322495e+01 
  8.048000e+03   5.720258e-06   5.603377e-06   8.007446e-06   4.440862e+01 
  8.064000e+03   8.657465e-06   8.666138e-06   1.224964e-05   4.502868e+01 
  8.080000e+03   7.494637e-06   7.547079e-06   1.063616e-05   4.519975e+01 
  8.096000e+03   4.570021e-06   4.319493e-06   6.288331e-06   4.338569e+01 
  8.112000e+03   3.755262e-06   3.370908e-06   5.046287e-06   4.191270e+01 
  8.128000e+03   3.399724e-06   3.482290e-06   4.866669e-06   4.568736e+01 
  8.144000e+03   3.393430e-06   3.527695e-06   4.894895e-06   4.611135e+01 
  8.160000e+03   3.476012e-06   3.606851e-06   5.009195e-06   4.605828e+01 
  8.176000e+03   3.581477e-06   3.765048e-06   5.196400e-06   4.643137e+01 
  8.192000e+03   3.721612e-06   3.928822e-06   5.411657e-06   4.655146e+01 
  8.208000e+03   3.676142e-06   3.746605e-06   5.248911e-06   4.554388e+01 
  8.224000e+03   3.591582e-06   3.400771e-06   4.946181e-06   4.343687e+01 
  8.240000e+03   3.648019e-06   3.303807e-06   4.921705e-06   4.216537e+01 
  8.256000e+03   3.855104e-06   3.359648e-06   5.113615e-06   4.107151e+01 
  8.272000e+03   3.938613e-06   3.567032e-06   5.313793e-06   4.216578e+01 
  8.288000e+03   3.876882e-06   3.629656e-06   5.310801e-06   4.311366e+01 
  8.304000e+03   3.827075e-06   3.432623e-06   5.140953e-06   4.188992e+01 
  8.320000e+03   3.572336e-06   3.325439e-06   4.880587e-06   4.295005e+01 
  8.336000e+03   3.397220e-06   3.307340e-06   4.741266e-06   4.423195e+01 
  8.352000e+03   3.348884e-06   3.312260e-06   4.710211e-06   4.468498e+01 
  8.368000e+03   3.469575e-06   3.383741e-06   4.846406e-06   4.428243e+01 
  8.384000e+03   3.506123e-06   3.371121e-06   4.863883e-06   4.387542e+01 
  8.400000e+03   3.572632e-06   3.242864e-06   4.824921e-06   4.222989e+01 
  8.416000e+03   3.720043e-06   3.231961e-06   4.927910e-06   4.098400e+01 
  8.432000e+03   3.499826e-06   3.331958e-06   4.832259e-06   4.359243e+01 
  8.448000e+03   3.211619e-06   3.388704e-06   4.668812e-06   4.653685e+01 
  8.464000e+03   3.168949e-06   3.292145e-06   4.569514e-06   4.609234e+01 
  8.480000e+03   3.447675e-06   3.303224e-06   4.774699e-06   4.377421e+01 
  8.496000e+03   3.687544e-06   3.293016e-06   4.943879e-06   4.176519e+01 
  8.512000e+03   3.486598e-06   3.269064e-06   4.779450e-06   4.315570e+01 
  8.528000e+03   3.377154e-06   3.447612e-06   4.826095e-06   4.559150e+01 
  8.544000e+03   3.387977e-06   3.418859e-06   4.813210e-06   4.525994e+01 
  8.560000e+03   3.581642e-06   3.248960e-06   4.835690e-06   4.221164e+01 
  8.576000e+03   3.740063e-06   3.241619e-06   4.949361e-06   4.091640e+01 
  8.592000e+03   3.839868e-06   3.209572e-06   5.004591e-06   3.989072e+01 
  8.608000e+03   3.839336e-06   3.292040e-06   5.057472e-06   4.061145e+01 
  8.624000e+03   3.713136e-06   3.300826e-06   4.968182e-06   4.163579e+01 
  8.640000e+03   3.583027e-06   3.238848e-06   4.829929e-06   4.211174e+01 
  8.656000e+03   3.276300e-06   3.196561e-06   4.577350e-06   4.429421e+01 
  8.672000e+03   3.094571e-06   3.264064e-06   4.497831e-06   4.652689e+01 
  8.688000e+03   3.048847e-06   3.235913e-06   4.445965e-06   4.670490e+01 
  8.704000e+03   2.908204e-06   3.128467e-06   4.271411e-06   4.708966e+01 
  8.720000e+03   3.136177e-06   3.235657e-06   4.506116e-06   4.589445e+01 
  8.736000e+03   3.137198e-06   3.276414e-06   4.536176e-06   4.624348e+01 
  8.752000e+03   3.037175e-06   3.366445e-06   4.534025e-06   4.794351e+01 
  8.768000e+03   3.185997e-06   3.313461e-06   4.596695e-06   4.612351e+01 
  8.784000e+03   3.189583e-06   3.118486e-06   4.460762e-06   4.435425e+01 
  8.800000e+03   3.124433e-06   3.257915e-06   4.513988e-06   4.619812e+01 
  8.816000e+03   3.015921e-06   3.253289e-06   4.436178e-06   4.716832e+01 
  8.832000e+03   3.094149e-06   3.194910e-06   4.447607e-06   4.591789e+01 
  8.848000e+03   3.369302e-06   3.358795e-06   4.757489e-06   4.491052e+01 
  8.864000e+03   3.442998e-06   3.487458e-06   4.900674e-06   4.536756e+01 
  8.880000e+03   3.306595e-06   3.416435e-06   4.754534e-06   4.593600e+01 
  8.896000e+03   3.206056e-06   3.321541e-06   4.616430e-06   4.601356e+01 
  8.912000e+03   3.418069e-06   3.215313e-06   4.692699e-06   4.324924e+01 
  8.928000e+03   3.512167e-06   3.129704e-06   4.704292e-06   4.170433e+01 
  8.944000e+03   3.478157e-06   3.114959e-06   4.669105e-06   4.184691e+01 
  8.960000e+03   4.779209e-06   4.908795e-06   6.851066e-06   4.576633e+01 
  8.976000e+03   6.617586e-06   7.047670e-06   9.667579e-06   4.680266e+01 
  8.992000e+03   5.448846e-06   5.807685e-06   7.963614e-06   4.682587e+01 
  9.008000e+03   3.580893e-06   3.773659e-06   5.202240e-06   4.650140e+01 
  9.024000e+03   3.226050e-06   3.303909e-06   4.617707e-06   4.568313e+01 
  9.040000e+03   3.320993e-06   3.166725e-06   4.588806e-06   4.363785e+01 
  9.056000e+03   3.457796e-06   3.319293e-06   4.793127e-06   4.382921e+01 
  9.072000e+03   3.452143e-06   3.322647e-06   4.791375e-06   4.390496e+01 
  9.088000e+03   3.457350e-06   3.241391e-06   4.739186e-06   4.315349e+01 
  9.104000e+03   3.516914e-06   3.357957e-06   4.862567e-06   4.367548e+01 
  9.120000e+03   3.421796e-06   3.415350e-06   4.834595e-06   4.494598e+01 
  9.136000e+03   3.133312e-06   3.270692e-06   4.529356e-06   4.622893e+01 
  9.152000e+03   2.886284e-06   3.329556e-06   4.406425e-06   4.907904e+01 
  9.168000e+03   2.904480e-06   3.411436e-06   4.480391e-06   4.958908e+01 
  9.184000e+03   3.114668e-06   3.406662e-06   4.615897e-06   4.756371e+01 
  9.200000e+03   3.071499e-06   3.313516e-06   4.518130e-06   4.717069e+01 
  9.216000e+03   3.029133e-06   3.201404e-06   4.407339e-06   4.658379e+01 
  9.232000e+03   3.271976e-06   2.984942e-06   4.428962e-06   4.237342e+01 
  9.248000e+03   3.189816e-06   3.039125e-06   4.405816e-06   4.361417e+01 
  9.264000e+03   3.201495e-06   3.144555e-06   4.487516e-06   4.448592e+01 
  9.280000e+03   3.246455e-06   3.027491e-06   4.439050e-06   4.300116e+01 
  9.296000e+03   3.203915e-06   2.981572e-06   4.376624e-06   4.294133e+01 
  9.312000e+03   3.172426e-06   2.874927e-06   4.281296e-06   4.218361e+01 
  9.328000e+03   3.196212e-06   2.889731e-06   4.308865e-06   4.211708e+01 
  9.344000e+03   3.272982e-06   2.927859e-06   4.391442e-06   4.181435e+01 
  9.360000e+03   3.200211e-06   2.934459e-06   4.341935e-06   4.251951e+01 
  9.376000e+03   3.188578e-06   3.212647e-06   4.526381e-06   4.521543e+01 
  9.392000e+03   3.203934e-06   3.393060e-06   4.666696e-06   4.664214e+01 
  9.408000e+03   3.079589e-06   3.279314e-06   4.498640e-06   4.679900e+01 
  9.424000e+03   3.186592e-06   3.232687e-06   4.539233e-06   4.541142e+01 
  9.440000e+03   3.079639e-06   3.201905e-06   4.442563e-06   4.611508e+01 
  9.456000e+03   2.999171e-06   3.203102e-06   4.388040e-06   4.688321e+01 
  9.472000e+03   3.117219e-06   3.245033e-06   4.499700e-06   4.615089e+01 
  9.488000e+03   3.041539e-06   3.270678e-06   4.466352e-06   4.707898e+01 
  9.504000e+03   3.146095e-06   3.359524e-06   4.602643e-06   4.687901e+01 
  9.520000e+03   3.241971e-06   3.502619e-06   4.772705e-06   4.721312e+01 
  9.536000e+03   3.166394e-06   3.537313e-06   4.747487e-06   4.816697e+01 
  9.552000e+03   3.125037e-06   3.423862e-06   4.635589e-06   4.761259e+01 
  9.568000e+03   2.917991e-06   3.251658e-06   4.368976e-06   4.809566e+01 
  9.584000e+03   2.868222e-06   3.326948e-06   4.392639e-06   4.923478e+01 
  9.600000e+03   2.966465e-06   3.284056e-06   4.425487e-06   4.790871e+01 
  9.616000e+03   2.931620e-06   3.214149e-06   4.350305e-06   4.763210e+01 
  9.632000e+03   3.106549e-06   3.206691e-06   4.464696e-06   4.590876e+01 
  9.648000e+03   3.160962e-06   3.179289e-06   4.483253e-06   4.516562e+01 
  9.664000e+03   3.063446e-06   3.107805e-06   4.363847e-06   4.541183e+01 
  9.680000e+03   3.004165e-06   3.101326e-06   4.317781e-06   4.591170e+01 
  9.696000e+03   3.115720e-06   3.107672e-06   4.400606e-06   4.492591e+01 
  9.712000e+03   3.168328e-06   3.186715e-06   4.493713e-06   4.516577e+01 
  9.728000e+03   3.189222e-06   3.212056e-06   4.526416e-06   4.520438e+01 
  9.744000e+03   3.031158e-06   3.241084e-06   4.437628e-06   4.691692e+01 
  9.760000e+03   3.001190e-06   3.304743e-06   4.464132e-06   4.775595e+01 
  9.776000e+03   3.217779e-06   3.189845e-06   4.530918e-06   4.475022e+01 
  9.792000e+03   3.287404e-06   3.102752e-06   4.520409e-06   4.334482e+01 
  9.808000e+03   3.293891e-06   3.086235e-06   4.513819e-06   4.313583e+01 
  9.824000e+03   3.291864e-06   3.043138e-06   4.482974e-06   4.275160e+01 
  9.840000e+03   3.217514e-06   3.050561e-06   4.433770e-06   4.347425e+01 
  9.856000e+03   3.797464e-06   3.774735e-06   5.354377e-06   4.482802e+01 
  9.872000e+03   8.013762e-06   8.897276e-06   1.197422e-05   4.799068e+01 
  9.888000e+03   1.156239e-05   1.276025e-05   1.721955e-05   4.781947e+01 
  9.904000e+03   8.540436e-06   9.246917e-06   1.258747e-05   4.727449e+01 
  9.920000e+03   4.174033e-06   4.514059e-06   6.148112e-06   4.724124e+01 
  9.936000e+03   3.412507e-06   3.749846e-06   5.070162e-06   4.769657e+01 
  9.952000e+03   3.569832e-06   3.664534e-06   5.115908e-06   4.574999e+01 
  9.968000e+03   3.285713e-06   3.316460e-06   4.668492e-06   4.526683e+01 
  9.984000e+03   2.943876e-06   3.082831e-06   4.262658e-06   4.632081e+01 
  1.000000e+04   2.955246e-06   2.906564e-06   4.145069e-06   4.452417e+01 
  1.001600e+04   3.162010e-06   3.058165e-06   4.398942e-06   4.404354e+01 
  1.003200e+04   3.146670e-06   3.048188e-06   4.380980e-06   4.408922e+01 
  1.004800e+04   3.095076e-06   2.715990e-06   4.117779e-06   4.126758e+01 
  1.006400e+04   3.247422e-06   2.697967e-06   4.221940e-06   3.971990e+01 
  1.008000e+04   3.260799e-06   2.840226e-06   4.324314e-06   4.105656e+01 
  1.009600e+04   3.153115e-06   2.755937e-06   4.187759e-06   4.115464e+01 
  1.011200e+04   3.365948e-06   2.978866e-06   4.494802e-06   4.150885e+01 
  1.012800e+04   3.752337e-06   3.712507e-06   5.278517e-06   4.469429e+01 
  1.014400e+04   4.733283e-06   4.915407e-06   6.823870e-06   4.608136e+01 
  1.016000e+04   4.790731e-06   4.844195e-06   6.813026e-06   4.531793e+01 
  1.017600e+04   3.504953e-06   3.556519e-06   4.993348e-06   4.541839e+01 
  1.019200e+04   3.080165e-06   3.033234e-06   4.322953e-06   4.456017e+01 
  1.020800e+04   2.933211e-06   2.877410e-06   4.108918e-06   4.444979e+01 
  1.022400e+04   2.908751e-06   2.822814e-06   4.053285e-06   4.414099e+01 
  1.024000e+04   2.929986e-06   2.832815e-06   4.075495e-06   4.403397e+01 
  1.025600e+04   2.865231e-06   2.936353e-06   4.102647e-06   4.570235e+01 
  1.027200e+04   2.852500e-06   2.980154e-06   4.125296e-06   4.625378e+01 
  1.028800e+04   2.960947e-06   3.080871e-06   4.273052e-06   4.613712e+01 
  1.030400e+04   3.143299e-06   3.072295e-06   4.395376e-06   4.434550e+01 
  1.032000e+04   3.264863e-06   2.988306e-06   4.425980e-06   4.246764e+01 
  1.033600e+04   3.189330e-06   2.864537e-06   4.286886e-06   4.192900e+01 
  1.035200e+04   3.179706e-06   2.804367e-06   4.239694e-06   4.141093e+01 
  1.036800e+04   3.077085e-06   2.870539e-06   4.208141e-06   4.301106e+01 
  1.038400e+04   3.376758e-06   3.410688e-06   4.799509e-06   4.528641e+01 
  1.040000e+04   3.578982e-06   3.630326e-06   5.097880e-06   4.540805e+01 
  1.041600e+04   3.276475e-06   3.038909e-06   4.468809e-06   4.284571e+01 
  1.043200e+04   2.961547e-06   2.747473e-06   4.039724e-06   4.285256e+01 
  1.044800e+04   2.865036e-06   2.887504e-06   4.067691e-06   4.522378e+01 
  1.046400e+04   2.932286e-06   2.868106e-06   4.101748e-06   4.436606e+01 
  1.048000e+04   3.054905e-06   2.879072e-06   4.197797e-06   4.330273e+01 
  1.049600e+04   3.183456e-06   3.006031e-06   4.378426e-06   4.335804e+01 
  1.051200e+04   3.075284e-06   3.040887e-06   4.324855e-06   4.467777e+01 
  1.052800e+04   3.121464e-06   3.066619e-06   4.375807e-06   4.449220e+01 
  1.054400e+04   3.209237e-06   2.985500e-06   4.383197e-06   4.293153e+01 
  1.056000e+04   3.168549e-06   2.973294e-06   4.345133e-06   4.317913e+01 
  1.057600e+04   3.142981e-06   2.970535e-06   4.324629e-06   4.338426e+01 
  1.059200e+04   3.044924e-06   2.840964e-06   4.164449e-06   4.301536e+01 
  1.060800e+04   2.903422e-06   2.803916e-06   4.036311e-06   4.400116e+01 
  1.062400e+04   2.672563e-06   2.914599e-06   3.954425e-06   4.748050e+01 
  1.064000e+04   2.581517e-06   3.054917e-06   3.999594e-06   4.980096e+01 
  1.065600e+04   2.499384e-06   3.087058e-06   3.972008e-06   5.100522e+01 
  1.067200e+04   2.585097e-06   2.992457e-06   3.954431e-06   4.917721e+01 
  1.068800e+04   2.662832e-06   2.901585e-06   3.938257e-06   4.745689e+01 
  1.070400e+04   2.745174e-06   2.841346e-06   3.950851e-06   4.598626e+01 
  1.072000e+04   2.912503e-06   2.817709e-06   4.052426e-06   4.405225e+01 
  1.073600e+04   3.144587e-06   2.988922e-06   4.338443e-06   4.354618e+01 
  1.075200e+04   3.174813e-06   3.021526e-06   4.382814e-06   4.358288e+01 
  1.076800e+04   3.067050e-06   2.973131e-06   4.271569e-06   4.410918e+01 
  1.078400e+04   2.910866e-06   3.004549e-06   4.183355e-06   4.590733e+01 
  1.080000e+04   2.769974e-06   3.187674e-06   4.223035e-06   4.901054e+01 
  1.081600e+04   2.934111e-06   3.066384e-06   4.244022e-06   4.626280e+01 
  1.083200e+04   2.958163e-06   2.858757e-06   4.113784e-06   4.402096e+01 
  1.084800e+04   2.790184e-06   3.013200e-06   4.106641e-06   4.720071e+01 
  1.086400e+04   2.833718e-06   2.998608e-06   4.125725e-06   4.661941e+01 
  1.088000e+04   3.066845e-06   2.873297e-06   4.202544e-06   4.313378e+01 
  1.089600e+04   3.136584e-06   3.055792e-06   4.379044e-06   4.425250e+01 
  1.091200e+04   2.866103e-06   3.236612e-06   4.323217e-06   4.847429e+01 
  1.092800e+04   2.677132e-06   3.123675e-06   4.113926e-06   4.940192e+01 
  1.094400e+04   2.819702e-06   2.915192e-06   4.055745e-06   4.595392e+01 
  1.096000e+04   2.949562e-06   2.766816e-06   4.044155e-06   4.316894e+01 
  1.097600e+04   2.943739e-06   2.723626e-06   4.010453e-06   4.277582e+01 
  1.099200e+04   2.874107e-06   2.902026e-06   4.084391e-06   4.527693e+01 
  1.100800e+04   2.781287e-06   2.942769e-06   4.049129e-06   4.661594e+01 
  1.102400e+04   2.831046e-06   2.927120e-06   4.072204e-06   4.595588e+01 
  1.104000e+04   2.902882e-06   3.036342e-06   4.200726e-06   4.628727e+01 
  1.105600e+04   2.912336e-06   2.954466e-06   4.148563e-06   4.541143e+01 
  1.107200e+04   2.846582e-06   2.644543e-06   3.885439e-06   4.289282e+01 
  1.108800e+04   2.910560e-06   2.629394e-06   3.922381e-06   4.209458e+01 
  1.110400e+04   2.967467e-06   2.640963e-06   3.972473e-06   4.166819e+01 
  1.112000e+04   2.976782e-06   2.707774e-06   4.024087e-06   4.229063e+01 
  1.113600e+04   3.056872e-06   2.890706e-06   4.207214e-06   4.339966e+01 
  1.115200e+04   3.279184e-06   3.091159e-06   4.506474e-06   4.330937e+01 
  1.116800e+04   3.291669e-06   3.066418e-06   4.498667e-06   4.297100e+01 
  1.118400e+04   3.116708e-06   2.854697e-06   4.226484e-06   4.248760e+01 
  1.120000e+04   3.011475e-06   2.695159e-06   4.041394e-06   4.182736e+01 
  1.121600e+04   2.967381e-06   2.794488e-06   4.076091e-06   4.328127e+01 
  1.123200e+04   2.831347e-06   2.953170e-06   4.091178e-06   4.620648e+01 
  1.124800e+04   2.785355e-06   3.115339e-06   4.178940e-06   4.820081e+01 
  1.126400e+04   2.876973e-06   3.165643e-06   4.277648e-06   4.773507e+01 
  1.128000e+04   2.865813e-06   3.181454e-06   4.281885e-06   4.798788e+01 
  1.129600e+04   2.779405e-06   3.085479e-06   4.152742e-06   4.798741e+01 
  1.131200e+04   2.834882e-06   2.837615e-06   4.011061e-06   4.502760e+01 
  1.132800e+04   2.993939e-06   2.865817e-06   4.144463e-06   4.374744e+01 
  1.134400e+04   3.034231e-06   3.018279e-06   4.279785e-06   4.484899e+01 
  1.136000e+04   3.026921e-06   2.946807e-06   4.224444e-06   4.423164e+01 
  1.137600e+04   2.973427e-06   2.814378e-06   4.094141e-06   4.342591e+01 
  1.139200e+04   2.792160e-06   2.765689e-06   3.930037e-06   4.472711e+01 
  1.140800e+04   2.706733e-06   2.824568e-06   3.912108e-06   4.622040e+01 
  1.142400e+04   2.736431e-06   2.803719e-06   3.917767e-06   4.569585e+01 
  1.144000e+04   2.695106e-06   2.856920e-06   3.927543e-06   4.666941e+01 
  1.145600e+04   2.616108e-06   2.826785e-06   3.851588e-06   4.721663e+01 
  1.147200e+04   2.680331e-06   2.816025e-06   3.887694e-06   4.641423e+01 
  1.148800e+04   2.803931e-06   2.846262e-06   3.995402e-06   4.542925e+01 
  1.150400e+04   2.696291e-06   2.804931e-06   3.890710e-06   4.613135e+01 
  1.152000e+04   2.696706e-06   2.840078e-06   3.916410e-06   4.648330e+01 
  1.153600e+04   2.775127e-06   2.905889e-06   4.018149e-06   4.631857e+01 
  1.155200e+04   3.048991e-06   2.899550e-06   4.207581e-06   4.356089e+01 
  1.156800e+04   3.188202e-06   2.916827e-06   4.321170e-06   4.245481e+01 
  1.158400e+04   2.950360e-06   3.095882e-06   4.276576e-06   4.637874e+01 
  1.160000e+04   2.763515e-06   3.173794e-06   4.208324e-06   4.895296e+01 
  1.161600e+04   3.003152e-06   3.067612e-06   4.292920e-06   4.560835e+01 
  1.163200e+04   3.258978e-06   3.004350e-06   4.432501e-06   4.267199e+01 
  1.164800e+04   3.190842e-06   3.021239e-06   4.394242e-06   4.343609e+01 
  1.166400e+04   3.017674e-06   3.095567e-06   4.323065e-06   4.573001e+01 
  1.168000e+04   2.964697e-06   3.139212e-06   4.317879e-06   4.663768e+01 
  1.169600e+04   2.878066e-06   3.083197e-06   4.217745e-06   4.697081e+01 
  1.171200e+04   3.056621e-06   3.082040e-06   4.340727e-06   4.523724e+01 
  1.172800e+04   3.442966e-06   2.894351e-06   4.497920e-06   4.005230e+01 
  1.174400e+04   3.434562e-06   2.828915e-06   4.449604e-06   3.947695e+01 
  1.176000e+04   3.197375e-06   2.913099e-06   4.325431e-06   4.233636e+01 
  1.177600e+04   3.269509e-06   2.994644e-06   4.433687e-06   4.248752e+01 
  1.179200e+04   3.326791e-06   3.097836e-06   4.545781e-06   4.295900e+01 
  1.180800e+04   2.987267e-06   3.253696e-06   4.417047e-06   4.744449e+01 
  1.182400e+04   2.904445e-06   3.345519e-06   4.430384e-06   4.903679e+01 
  1.184000e+04   3.010146e-06   3.181660e-06   4.379947e-06   4.658670e+01 
  1.185600e+04   3.030816e-06   2.897156e-06   4.192775e-06   4.370834e+01 
  1.187200e+04   3.122010e-06   2.911768e-06   4.269114e-06   4.300438e+01 
  1.188800e+04   3.008617e-06   3.047862e-06   4.282667e-06   4.537126e+01 
  1.190400e+04   2.829671e-06   3.126904e-06   4.217175e-06   4.785668e+01 
  1.192000e+04   2.822063e-06   3.022815e-06   4.135391e-06   4.696714e+01 
  1.193600e+04   2.857480e-06   2.949751e-06   4.106851e-06   4.591030e+01 
  1.195200e+04   2.921172e-06   2.964713e-06   4.162062e-06   4.542384e+01 
  1.196800e+04   2.845181e-06   2.946154e-06   4.095715e-06   4.599887e+01 
  1.198400e+04   2.707686e-06   2.933868e-06   3.992386e-06   4.729588e+01 
  1.200000e+04   2.690961e-06   2.813536e-06   3.893232e-06   4.627567e+01 
  1.201600e+04   2.684156e-06   2.794372e-06   3.874689e-06   4.615250e+01 
  1.203200e+04   2.779485e-06   2.925633e-06   4.035451e-06   4.646742e+01 
  1.204800e+04   2.920519e-06   2.929190e-06   4.136373e-06   4.508492e+01 
  1.206400e+04   2.940778e-06   2.936738e-06   4.156032e-06   4.496062e+01 
  1.208000e+04   3.003079e-06   2.894024e-06   4.170594e-06   4.394055e+01 
  1.209600e+04   3.046970e-06   2.853913e-06   4.174786e-06   4.312614e+01 
  1.211200e+04   2.958626e-06   2.669502e-06   3.984935e-06   4.205922e+01 
  1.212800e+04   2.739222e-06   2.700634e-06   3.846656e-06   4.459358e+01 
  1.214400e+04   2.709673e-06   3.040047e-06   4.072372e-06   4.828856e+01 
  1.216000e+04   2.680867e-06   2.965930e-06   3.997973e-06   4.788996e+01 
  1.217600e+04   2.787511e-06   2.816834e-06   3.962924e-06   4.529978e+01 
  1.219200e+04   2.821309e-06   2.877592e-06   4.029928e-06   4.556584e+01 
  1.220800e+04   2.759039e-06   2.870990e-06   3.981819e-06   4.613916e+01 
  1.222400e+04   2.742449e-06   2.770994e-06   3.898645e-06   4.529664e+01 
  1.224000e+04   2.739846e-06   2.666417e-06   3.823158e-06   4.422184e+01 
  1.225600e+04   2.616963e-06   2.779447e-06   3.817567e-06   4.672463e+01 
  1.227200e+04   2.713899e-06   2.784965e-06   3.888608e-06   4.574044e+01 
  1.228800e+04   2.670899e-06   2.688547e-06   3.789721e-06   4.518867e+01 
  1.230400e+04   2.611776e-06   2.605510e-06   3.689180e-06   4.493118e+01 
  1.232000e+04   2.750000e-06   2.596267e-06   3.781944e-06   4.335290e+01 
  1.233600e+04   2.903406e-06   2.593730e-06   3.893225e-06   4.177571e+01 
  1.235200e+04   2.896049e-06   2.575141e-06   3.875365e-06   4.164321e+01 
  1.236800e+04   2.849403e-06   2.543657e-06   3.819593e-06   4.175523e+01 
  1.238400e+04   2.812975e-06   2.648359e-06   3.863500e-06   4.327351e+01 
  1.240000e+04   2.748117e-06   2.755778e-06   3.891846e-06   4.507975e+01 
  1.241600e+04   2.872978e-06   2.720521e-06   3.956670e-06   4.343872e+01 
  1.243200e+04   2.829156e-06   2.634919e-06   3.866125e-06   4.296410e+01 
  1.244800e+04   2.534145e-06   2.598435e-06   3.629567e-06   4.571764e+01 
  1.246400e+04   2.565707e-06   2.655930e-06   3.692806e-06   4.598989e+01 
  1.248000e+04   2.658050e-06   2.749873e-06   3.824531e-06   4.597275e+01 
  1.249600e+04   2.514986e-06   2.773000e-06   3.743619e-06   4.779338e+01 
  1.251200e+04   2.426920e-06   2.752975e-06   3.669989e-06   4.860180e+01 
  1.252800e+04   2.532074e-06   2.736574e-06   3.728302e-06   4.722279e+01 
  1.254400e+04   2.624245e-06   2.718438e-06   3.778434e-06   4.601004e+01 
  1.256000e+04   2.702129e-06   2.592380e-06   3.744588e-06   4.381250e+01 
  1.257600e+04   2.584625e-06   2.609685e-06   3.672975e-06   4.527641e+01 
  1.259200e+04   2.561360e-06   2.610075e-06   3.656919e-06   4.553971e+01 
  1.260800e+04   2.649502e-06   2.464488e-06   3.618503e-06   4.292806e+01 
  1.262400e+04   2.755633e-06   2.412006e-06   3.662142e-06   4.119566e+01 
  1.264000e+04   2.710644e-06   2.474844e-06   3.670483e-06   4.239638e+01 
  1.265600e+04   2.698368e-06   2.579265e-06   3.732801e-06   4.370720e+01 
  1.267200e+04   2.720941e-06   2.625901e-06   3.781385e-06   4.398167e+01 
  1.268800e+04   2.726163e-06   2.651363e-06   3.802853e-06   4.420308e+01 
  1.270400e+04   2.614863e-06   2.754088e-06   3.797698e-06   4.648542e+01 
  1.272000e+04   2.534834e-06   2.740913e-06   3.733362e-06   4.723693e+01 
  1.273600e+04   2.527044e-06   2.736126e-06   3.724558e-06   4.727491e+01 
  1.275200e+04   2.609813e-06   2.712429e-06   3.764093e-06   4.610456e+01 
  1.276800e+04   2.599030e-06   2.589140e-06   3.668596e-06   4.489078e+01 
  1.278400e+04   2.520523e-06   2.399910e-06   3.480317e-06   4.359580e+01 
  1.280000e+04   2.508348e-06   2.322462e-06   3.418426e-06   4.279639e+01 
