  1.000000e+01  -5.211163e+02   5.098184e+02   5.725484e+01   1.356279e+02 
  1.023413e+01   2.898771e+02  -1.360116e+02   5.010842e+01  -2.513617e+01 
  1.047374e+01  -4.971086e+01  -5.010602e+02   5.404034e+01  -9.566585e+01 
  1.071896e+01  -6.168484e+02  -1.637119e+02   5.609918e+01  -1.651363e+02 
  1.096992e+01   2.567412e+02   2.463167e+02   5.102392e+01   4.381287e+01 
  1.122676e+01   1.153784e+03   2.277461e+02   6.140849e+01   1.116610e+01 
  1.148961e+01   7.159921e+02   2.290154e+02   5.752120e+01   1.773726e+01 
  1.175861e+01  -4.460113e+01  -6.691368e+02   5.652955e+01  -9.381339e+01 
  1.203392e+01   4.343897e+02   2.655799e+02   5.413680e+01   3.144104e+01 
  1.231567e+01   3.155411e+02   4.907935e+01   5.008493e+01   8.840960e+00 
  1.260401e+01  -1.047667e+02  -3.895080e+02   5.211367e+01  -1.050547e+02 
  1.289911e+01  -3.156685e+02  -1.806989e+02   5.121555e+01  -1.502118e+02 
  1.320111e+01  -6.198500e+01   8.238228e+02   5.834119e+01   9.430286e+01 
  1.351019e+01   7.775057e+02  -3.578187e+02   5.864837e+01  -2.471253e+01 
  1.382650e+01   7.236068e+02   6.175107e+02   5.956613e+01   4.047674e+01 
  1.415022e+01  -2.088210e+02   2.459959e+02   5.017535e+01   1.303273e+02 
  1.448152e+01   4.298756e+02   6.784793e+02   5.809645e+01   5.764218e+01 
  1.482057e+01  -2.052816e+02   3.328904e+02   5.184568e+01   1.216606e+02 
  1.516756e+01  -5.067188e+02  -2.627869e+02   5.512979e+01  -1.525885e+02 
  1.552268e+01   7.580711e+01   5.185753e+02   5.438807e+01   8.168321e+01 
  1.588611e+01  -2.928981e+02   2.364603e+02   5.151378e+01   1.410856e+02 
  1.625805e+01   3.322716e+02  -3.914506e+02   5.421008e+01  -4.967469e+01 
  1.663870e+01   3.830184e+02  -6.157941e+01   5.177523e+01  -9.133512e+00 
  1.702826e+01   1.888355e+02   6.619687e+01   4.602504e+01   1.931828e+01 
  1.742694e+01   1.017925e+02   1.763253e+01   4.028271e+01   9.827280e+00 
  1.783495e+01  -3.724798e+02  -1.424500e+02   5.201488e+01  -1.590713e+02 
  1.825252e+01   1.854593e+02  -8.019268e+01   4.610937e+01  -2.338367e+01 
  1.867986e+01  -6.673123e+01  -1.082421e+02   4.208694e+01  -1.216538e+02 
  1.911721e+01  -2.287423e+01  -9.873659e+01   4.011661e+01  -1.030436e+02 
  1.956480e+01  -2.800069e+06  -6.545826e+06   1.370491e+02  -1.131595e+02 
  2.002287e+01  -1.884829e+02  -3.252692e+02   5.150222e+01  -1.200909e+02 
  2.049166e+01  -1.537812e+02  -4.821937e+02   5.408510e+01  -1.076885e+02 
  2.097143e+01   1.613564e+01  -2.664201e+02   4.852724e+01  -8.653413e+01 
  2.146243e+01  -1.092741e+02  -3.096994e+02   5.032838e+01  -1.094348e+02 
  2.196493e+01  -2.994089e+02  -1.283565e+02   5.025801e+01  -1.567952e+02 
  2.247919e+01  -9.447301e+01  -1.945729e+02   4.670095e+01  -1.158984e+02 
  2.300550e+01  -5.358407e+01   2.232460e+02   4.721893e+01   1.034969e+02 
  2.354412e+01  -2.740140e+02  -1.790219e+02   5.029921e+01  -1.468421e+02 
  2.409535e+01  -1.685361e+02   9.748519e+01   4.578728e+01   1.499539e+02 
  2.465950e+01  -7.568021e+01  -7.798559e+01   4.072222e+01  -1.341405e+02 
  2.523685e+01   5.562222e+01   8.967714e+01   4.046722e+01   5.819075e+01 
  2.582771e+01  -4.753552e+02  -4.137904e+02   5.598993e+01  -1.389608e+02 
  2.643242e+01  -7.927562e+00   1.208149e+02   4.166107e+01   9.375422e+01 
  2.705127e+01  -1.403564e+02  -2.297138e+02   4.860148e+01  -1.214252e+02 
  2.768462e+01  -4.844177e+01  -1.905030e+02   4.587015e+01  -1.042670e+02 
  2.833280e+01  -2.162748e+02  -1.064877e+02   4.764284e+01  -1.537856e+02 
  2.899615e+01  -4.347859e+01  -4.073585e+01   3.550204e+01  -1.368654e+02 
  2.967503e+01  -1.378508e+02  -3.231270e+01   4.302048e+01  -1.668078e+02 
  3.036981e+01  -1.499742e+01  -1.779444e+02   4.503643e+01  -9.481758e+01 
  3.108086e+01  -1.180132e+02  -1.205898e+02   4.454372e+01  -1.343813e+02 
  3.180855e+01  -8.193504e+01  -1.633602e+02   4.523745e+01  -1.166365e+02 
  3.255328e+01  -2.153358e+02   2.304568e+02   4.997735e+01   1.330573e+02 
  3.331544e+01  -3.272316e+02  -5.171418e+01   5.040424e+01  -1.710195e+02 
  3.409546e+01  -1.962899e+02  -4.584032e+01   4.608858e+01  -1.668551e+02 
  3.489373e+01  -8.730182e+01   8.833888e+00   3.886471e+01   1.742220e+02 
  3.571069e+01  -1.610017e+02   4.446674e+01   4.445586e+01   1.645605e+02 
  3.654678e+01  -1.190517e+02  -3.858923e+01   4.194859e+01  -1.620405e+02 
  3.740245e+01  -1.866273e+02  -7.253424e+01   4.603046e+01  -1.587610e+02 
  3.827814e+01  -1.329571e+02   1.084413e+01   4.250303e+01   1.753372e+02 
  3.917435e+01  -1.250884e+02  -1.646939e+02   4.631152e+01  -1.272174e+02 
  4.009153e+01  -1.293995e+02   4.333724e+01   4.270034e+01   1.614838e+02 
  4.103019e+01  -1.835089e+02   8.851829e+00   4.528324e+01   1.772384e+02 
  4.199082e+01  -1.274201e+02   8.364014e+01   4.366078e+01   1.467186e+02 
  4.297395e+01  -1.225711e+02  -6.237134e+01   4.276780e+01  -1.530303e+02 
  4.398009e+01  -1.230294e+02  -6.482916e+01   4.286435e+01  -1.522134e+02 
  4.500979e+01  -1.544791e+02  -2.672971e+01   4.390551e+01  -1.701832e+02 
  4.606360e+01  -1.427716e+02  -5.919350e+01   4.378172e+01  -1.574810e+02 
  4.714208e+01  -2.029109e+02  -4.544949e+01   4.635870e+01  -1.673748e+02 
  4.824582e+01  -1.239785e+02   4.603356e+01   4.242784e+01   1.596299e+02 
  4.937539e+01  -2.208414e+02   2.874977e+01   4.695460e+01   1.725828e+02 
  5.053141e+01  -1.797702e+02   1.969871e+01   4.514619e+01   1.737466e+02 
  5.171449e+01  -1.312972e+02   1.813669e+01   4.244720e+01   1.721352e+02 
  5.292528e+01  -1.329667e+02   4.885088e+01   4.302473e+01   1.598271e+02 
  5.416441e+01  -1.422166e+02  -2.614712e+01   4.320338e+01  -1.695823e+02 
  5.543256e+01  -1.329296e+02  -2.904881e+01   4.267503e+01  -1.676731e+02 
  5.673039e+01  -1.129328e+02  -8.687281e+00   4.108203e+01  -1.756012e+02 
  5.805861e+01  -1.474399e+02   1.004419e+02   4.502797e+01   1.457357e+02 
  5.941793e+01  -1.572414e+02   1.715775e+01   4.398274e+01   1.737727e+02 
  6.080908e+01  -1.404287e+02  -4.091010e+01   4.330289e+01  -1.637579e+02 
  6.223279e+01  -1.378255e+02   4.723249e+01   4.326884e+01   1.610835e+02 
  6.368984e+01  -9.971359e+01   5.920343e+01   4.128653e+01   1.493009e+02 
  6.518101e+01  -1.441702e+02   7.095340e+01   4.411946e+01   1.537959e+02 
  6.670708e+01  -1.245972e+02   5.744079e+01   4.274710e+01   1.552497e+02 
  6.826888e+01  -1.237490e+02   4.535892e+01   4.239831e+01   1.598701e+02 
  6.986726e+01  -9.782994e+01   5.274173e+01   4.091751e+01   1.516702e+02 
  7.150304e+01  -1.514858e+02   4.298836e+01   4.394381e+01   1.641572e+02 
  7.317714e+01  -1.521743e+02   7.609477e+01   4.461610e+01   1.534326e+02 
  7.489043e+01  -2.170344e+02   2.662635e+01   4.679545e+01   1.730058e+02 
  7.664383e+01  -1.109199e+02   4.359431e+01   4.152401e+01   1.585439e+02 
  7.843828e+01  -1.322294e+02   7.460030e+01   4.362667e+01   1.505694e+02 
  8.027474e+01  -1.039068e+02   6.488750e+01   4.176294e+01   1.480161e+02 
  8.215421e+01  -1.116537e+02   2.473761e+01   4.116558e+01   1.675075e+02 
  8.407767e+01  -1.105729e+02   4.832021e+01   4.163197e+01   1.563947e+02 
  8.604617e+01  -1.055427e+02   6.339775e+01   4.180657e+01   1.490074e+02 
  8.806076e+01  -1.169085e+02   4.527430e+01   4.196380e+01   1.588305e+02 
  9.012252e+01  -8.629477e+01   7.083362e+01   4.095664e+01   1.406197e+02 
  9.223254e+01  -1.086304e+02   6.514388e+01   4.205320e+01   1.490496e+02 
  9.439198e+01  -6.017673e+01   7.956357e+01   3.997893e+01   1.271015e+02 
  9.660197e+01  -5.779057e+01   6.442294e+01   3.874485e+01   1.318937e+02 
  9.886369e+01  -1.376399e+02  -7.862931e+00   4.278904e+01  -1.767304e+02 
  1.011784e+02  -1.525548e+02   6.166108e+01   4.432570e+01   1.579919e+02 
  1.035473e+02  -9.245982e+01   3.483965e+01   3.989566e+01   1.593531e+02 
  1.059716e+02  -1.205287e+02   4.960442e+01   4.230136e+01   1.576300e+02 
  1.084527e+02  -8.476584e+01   7.151310e+01   4.089883e+01   1.398472e+02 
  1.109919e+02  -8.125078e+01   6.780229e+01   4.049173e+01   1.401556e+02 
  1.135905e+02  -8.601165e+01   6.460117e+01   4.063383e+01   1.430907e+02 
  1.162500e+02  -8.445630e+01   9.100295e+01   4.187927e+01   1.328632e+02 
  1.189717e+02  -1.170059e+02   5.914820e+01   4.235248e+01   1.531827e+02 
  1.217572e+02  -7.661263e+01   5.811826e+01   3.966011e+01   1.428161e+02 
  1.246079e+02  -6.891960e+01   7.433907e+01   4.011833e+01   1.328335e+02 
  1.275253e+02  -9.160653e+01   6.215470e+01   4.088312e+01   1.458432e+02 
  1.305111e+02  -7.141556e+01   8.625013e+01   4.098272e+01   1.296249e+02 
  1.335667e+02  -9.760440e+01   4.247700e+01   4.054265e+01   1.564815e+02 
  1.366939e+02  -7.557181e+01   3.288925e+01   3.832049e+01   1.564811e+02 
  1.398943e+02  -4.795227e+01   7.152503e+01   3.870126e+01   1.238389e+02 
  1.431696e+02  -5.708303e+01   3.940318e+01   3.682243e+01   1.453835e+02 
  1.465216e+02  -5.041875e+01   5.228311e+01   3.722270e+01   1.339600e+02 
  1.499521e+02  -5.823306e+01   1.398882e+01   3.554704e+01   1.664923e+02 
  1.534629e+02  -5.133276e+01   6.534299e+01   3.839148e+01   1.281528e+02 
  1.570559e+02  -5.989151e+01   6.471778e+01   3.890722e+01   1.327820e+02 
  1.607331e+02  -6.604970e+01   6.622791e+01   3.941943e+01   1.349228e+02 
  1.644963e+02  -5.580245e+01   5.553724e+01   3.792273e+01   1.351365e+02 
  1.683476e+02  -4.604646e+01   6.249524e+01   3.780024e+01   1.263828e+02 
  1.722891e+02  -5.334455e+01   5.615528e+01   3.778083e+01   1.335296e+02 
  1.763229e+02  -4.403329e+01   6.144309e+01   3.756954e+01   1.256273e+02 
  1.804511e+02  -5.044186e+01   7.488662e+01   3.911285e+01   1.239633e+02 
  1.846760e+02  -3.955832e+01   6.103169e+01   3.723433e+01   1.229497e+02 
  1.889998e+02  -2.488785e+01   6.606467e+01   3.697573e+01   1.106424e+02 
  1.934249e+02  -1.905907e+01   6.576369e+01   3.670998e+01   1.061622e+02 
  1.979535e+02  -5.194931e+01   5.817570e+01   3.784128e+01   1.317640e+02 
  2.025881e+02  -3.628728e+01   6.678920e+01   3.761745e+01   1.185157e+02 
  2.073313e+02  -1.304889e+01   6.780034e+01   3.678260e+01   1.008940e+02 
  2.121855e+02  -1.118446e+01   5.051086e+01   3.427557e+01   1.024854e+02 
  2.171534e+02  -2.306419e+01   4.674407e+01   3.434084e+01   1.162624e+02 
  2.222376e+02  -2.421379e+01   6.015036e+01   3.623701e+01   1.119275e+02 
  2.274408e+02  -3.346279e+01   5.192497e+01   3.581604e+01   1.227996e+02 
  2.327659e+02  -4.398557e+01   7.141645e+01   3.847266e+01   1.216290e+02 
  2.382156e+02  -2.814960e+01   4.873267e+01   3.500686e+01   1.200121e+02 
  2.437929e+02  -1.749605e+01   5.465214e+01   3.517588e+01   1.077517e+02 
  2.495008e+02  -1.650218e+01   8.288453e+01   3.853830e+01   1.012603e+02 
  2.553423e+02  -1.652373e+01   4.963588e+01   3.437236e+01   1.084125e+02 
  2.613206e+02  -1.642300e+01   5.375130e+01   3.499538e+01   1.069898e+02 
  2.674389e+02  -2.090609e+01   5.307380e+01   3.512403e+01   1.114998e+02 
  2.737004e+02  -1.221614e+01   5.161005e+01   3.449144e+01   1.033169e+02 
  2.801085e+02  -2.148190e+01   4.812551e+01   3.443660e+01   1.140547e+02 
  2.866667e+02  -2.674579e+01   5.111853e+01   3.522241e+01   1.176191e+02 
  2.933784e+02  -1.885706e+01   4.846668e+01   3.432104e+01   1.112596e+02 
  3.002472e+02  -1.143240e+01   3.781460e+01   3.193304e+01   1.068215e+02 
  3.072768e+02  -1.658928e+01   4.091613e+01   3.289886e+01   1.120699e+02 
  3.144711e+02  -1.457623e+01   4.681101e+01   3.380887e+01   1.072958e+02 
  3.218337e+02  -1.502345e+01   5.166024e+01   3.461571e+01   1.062151e+02 
  3.293688e+02  -5.199188e+00   5.423119e+01   3.472472e+01   9.547625e+01 
  3.370803e+02  -8.099898e+00   4.388980e+01   3.299273e+01   1.004563e+02 
  3.449723e+02  -7.835413e+00   3.668509e+01   3.148353e+01   1.020564e+02 
  3.530491e+02  -1.211237e+01   4.010760e+01   3.244359e+01   1.068041e+02 
  3.613150e+02  -9.698985e+00   4.021457e+01   3.233322e+01   1.035597e+02 
  3.697744e+02  -1.281631e+01   3.678341e+01   3.181065e+01   1.092097e+02 
  3.784319e+02  -1.406423e+01   4.093555e+01   3.272659e+01   1.089612e+02 
  3.872921e+02  -8.967910e+00   4.089153e+01   3.243668e+01   1.023697e+02 
  3.963597e+02  -1.095871e+01   3.798856e+01   3.194021e+01   1.060915e+02 
  4.056396e+02  -7.308931e+00   3.225623e+01   3.038972e+01   1.027671e+02 
  4.151368e+02  -1.013698e+01   3.363365e+01   3.091308e+01   1.067725e+02 
  4.248563e+02  -7.802414e+00   4.021817e+01   3.224890e+01   1.009791e+02 
  4.348034e+02  -1.149081e+01   3.181792e+01   3.058585e+01   1.098568e+02 
  4.449834e+02  -1.039182e+01   3.692404e+01   3.167723e+01   1.057186e+02 
  4.554018e+02  -7.594523e+00   3.322621e+01   3.065078e+01   1.028749e+02 
  4.660640e+02  -7.459341e+00   3.250282e+01   3.046134e+01   1.029255e+02 
  4.769760e+02  -5.399263e+00   3.375614e+01   3.067677e+01   9.908743e+01 
  4.881433e+02  -7.829208e+00   2.551066e+01   2.852535e+01   1.070612e+02 
  4.995722e+02  -4.810609e+00   2.920082e+01   2.942420e+01   9.935500e+01 
  5.112686e+02  -1.040825e+01   3.304900e+01   3.079387e+01   1.074810e+02 
  5.232388e+02  -3.725798e+00   3.222648e+01   3.022192e+01   9.659485e+01 
  5.354894e+02  -5.330733e+00   2.816702e+01   2.914765e+01   1.007167e+02 
  5.480267e+02  -5.050179e+00   2.867970e+01   2.928411e+01   9.998677e+01 
  5.608576e+02  -1.232724e+00   2.508285e+01   2.799801e+01   9.281360e+01 
  5.739889e+02  -5.647455e+00   2.487571e+01   2.813377e+01   1.027909e+02 
  5.874276e+02  -1.429480e+00   2.275410e+01   2.715830e+01   9.359476e+01 
  6.011810e+02  -2.287779e+00   3.008408e+01   2.959178e+01   9.434875e+01 
  6.152563e+02  -1.176414e+00   2.505509e+01   2.798748e+01   9.268824e+01 
  6.296613e+02  -4.290276e+00   2.639774e+01   2.854456e+01   9.923125e+01 
  6.444035e+02  -1.230522e+01   2.642791e+01   2.929344e+01   1.149674e+02 
  6.594908e+02   1.654539e+00   2.397923e+01   2.761733e+01   8.605291e+01 
  6.749314e+02  -2.623091e+00   2.223235e+01   2.699975e+01   9.672895e+01 
  6.907335e+02  -2.526281e+00   2.019773e+01   2.617347e+01   9.712938e+01 
  7.069055e+02  -6.817898e-01   2.083147e+01   2.637905e+01   9.187455e+01 
  7.234562e+02  -3.004558e+00   2.203122e+01   2.694080e+01   9.776593e+01 
  7.403944e+02  -1.493939e+00   2.077167e+01   2.637183e+01   9.411374e+01 
  7.577292e+02  -3.380386e+00   2.110784e+01   2.659886e+01   9.909856e+01 
  7.754698e+02  -1.269579e+00   2.186010e+01   2.680766e+01   9.332385e+01 
  7.936258e+02  -2.310240e+00   1.966368e+01   2.593283e+01   9.670082e+01 
  8.122068e+02  -1.781832e+00   1.897404e+01   2.560133e+01   9.536485e+01 
  8.312230e+02  -1.896008e+00   1.865368e+01   2.545993e+01   9.580375e+01 
  8.506843e+02  -3.816375e+00   1.698926e+01   2.481729e+01   1.026604e+02 
  8.706013e+02  -2.934384e+00   1.688556e+01   2.467952e+01   9.985844e+01 
  8.909845e+02  -3.420361e-01   1.635889e+01   2.427698e+01   9.119778e+01 
  9.118450e+02  -6.208578e-01   1.718266e+01   2.470747e+01   9.206935e+01 
  9.331939e+02  -8.919744e-01   1.681570e+01   2.452650e+01   9.303635e+01 
  9.550427e+02   1.955227e+00   1.728391e+01   2.480807e+01   8.354590e+01 
  9.774030e+02   7.711471e-01   1.513649e+01   2.361176e+01   8.708351e+01 
  1.000287e+03  -5.385491e-01   1.455756e+01   2.326771e+01   9.211865e+01 
  1.023706e+03  -1.068802e+00   1.470012e+01   2.336931e+01   9.415849e+01 
  1.047674e+03  -8.453386e-01   1.355524e+01   2.265900e+01   9.356848e+01 
  1.072203e+03  -4.227238e-01   1.369693e+01   2.273660e+01   9.176773e+01 
  1.097307e+03  -1.382281e+00   1.471338e+01   2.339241e+01   9.536702e+01 
  1.122998e+03   3.296243e-01   1.448873e+01   2.322285e+01   8.869672e+01 
  1.149290e+03  -9.314326e-01   1.374746e+01   2.278434e+01   9.387604e+01 
  1.176199e+03  -1.007577e+00   1.323878e+01   2.246204e+01   9.435227e+01 
  1.203737e+03   1.045027e-02   1.330228e+01   2.247852e+01   8.995499e+01 
  1.231920e+03   5.367708e-01   1.107073e+01   2.089373e+01   8.722415e+01 
  1.260763e+03  -1.857132e+00   8.642424e+00   1.892876e+01   1.021276e+02 
  1.290281e+03   2.980867e-01   1.128711e+01   2.105469e+01   8.848719e+01 
  1.320490e+03   6.602947e-01   1.211108e+01   2.167654e+01   8.687933e+01 
  1.351406e+03  -2.583414e-01   5.668713e+00   1.507870e+01   9.260934e+01 
  1.383047e+03   2.087906e-01   9.519256e+00   1.957415e+01   8.874350e+01 
  1.415428e+03  -7.010469e-02   1.073396e+01   2.061538e+01   9.037420e+01 
  1.448567e+03   2.670594e+00   9.195535e+00   1.962322e+01   7.380549e+01 
  1.482482e+03  -6.143323e-02   9.845834e+00   1.986522e+01   9.035749e+01 
  1.517191e+03   2.861050e-01   9.407411e+00   1.947342e+01   8.825801e+01 
  1.552713e+03   7.445700e-02   9.477550e+00   1.953419e+01   8.954988e+01 
  1.589067e+03  -2.290725e-01   9.175361e+00   1.925517e+01   9.143015e+01 
  1.626271e+03  -8.443480e-02   8.983523e+00   1.906932e+01   9.053850e+01 
  1.664347e+03   2.397355e-01   8.891212e+00   1.898237e+01   8.845549e+01 
  1.703314e+03   6.824242e-02   8.899165e+00   1.898724e+01   8.956064e+01 
  1.743193e+03   2.026562e-01   8.613948e+00   1.870645e+01   8.865228e+01 
  1.784007e+03   1.504389e-01   8.112758e+00   1.818486e+01   8.893765e+01 
  1.825775e+03   5.682416e-02   7.990108e+00   1.805127e+01   8.959252e+01 
  1.868522e+03   6.483037e-03   7.700596e+00   1.773049e+01   8.995176e+01 
  1.912270e+03   1.785541e-01   7.662152e+00   1.768937e+01   8.866505e+01 
  1.957041e+03   5.544024e-02   7.498916e+00   1.750021e+01   8.957641e+01 
  2.002861e+03   7.443476e-01   7.486020e+00   1.752775e+01   8.432165e+01 
  2.049754e+03   1.492945e-01   7.383513e+00   1.736704e+01   8.884163e+01 
  2.097745e+03  -6.374779e-02   6.950808e+00   1.684107e+01   9.052546e+01 
  2.146859e+03   3.759105e-01   6.637175e+00   1.645358e+01   8.675839e+01 
  2.197123e+03   4.639494e-01   6.579437e+00   1.638531e+01   8.596645e+01 
  2.248564e+03   3.659773e-01   6.330537e+00   1.604330e+01   8.669132e+01 
  2.301209e+03   2.747825e-01   6.275589e+00   1.596141e+01   8.749284e+01 
  2.355087e+03   1.467060e-02   6.191599e+00   1.583608e+01   8.986423e+01 
  2.410227e+03   1.658379e-01   4.509292e+00   1.308804e+01   8.789378e+01 
  2.466657e+03   1.964354e-01   5.817718e+00   1.530000e+01   8.806614e+01 
  2.524408e+03   1.961712e-01   5.481234e+00   1.478313e+01   8.795028e+01 
  2.583512e+03   1.748834e-01   5.418443e+00   1.468201e+01   8.815138e+01 
  2.644000e+03   2.980218e-01   5.259636e+00   1.443303e+01   8.675697e+01 
  2.705903e+03   5.809390e-02   5.386469e+00   1.462659e+01   8.938208e+01 
  2.769256e+03   3.643752e-01   5.309523e+00   1.452152e+01   8.607413e+01 
  2.834093e+03   3.459408e-01   4.940371e+00   1.389643e+01   8.599449e+01 
  2.900447e+03   3.606759e-01   4.935560e+00   1.388986e+01   8.582042e+01 
  2.968354e+03   2.133847e-01   4.710113e+00   1.346953e+01   8.740607e+01 
  3.037852e+03   2.302493e-01   4.670885e+00   1.339852e+01   8.717791e+01 
  3.108977e+03   2.413165e-01   4.547327e+00   1.316734e+01   8.696229e+01 
  3.181767e+03   3.260142e-01   4.413811e+00   1.291990e+01   8.577567e+01 
  3.256261e+03   2.699445e-01   4.317542e+00   1.272167e+01   8.642236e+01 
  3.332500e+03   2.973958e-01   4.170365e+00   1.242551e+01   8.592104e+01 
  3.410523e+03   2.175891e-01   4.112787e+00   1.229486e+01   8.697155e+01 
  3.490374e+03   3.536886e-01   3.808589e+00   1.165258e+01   8.469438e+01 
  3.572093e+03   1.502569e-01   3.796459e+00   1.159437e+01   8.773351e+01 
  3.655726e+03   8.003597e-02   3.829520e+00   1.166478e+01   8.880270e+01 
  3.741317e+03   3.004749e-01   3.677216e+00   1.133928e+01   8.532858e+01 
  3.828912e+03  -2.615752e-02   2.458432e+00   7.813655e+00   9.060959e+01 
  3.918558e+03   1.931193e-01   3.563993e+00   1.105147e+01   8.689839e+01 
  4.010303e+03   1.958687e-01   3.582572e+00   1.109686e+01   8.687060e+01 
  4.104195e+03  -5.238332e-03   2.671397e+00   8.534786e+00   9.011235e+01 
  4.200287e+03   2.168629e-01   3.134320e+00   9.943608e+00   8.604202e+01 
  4.298627e+03   8.434523e-02   3.250472e+00   1.024185e+01   8.851359e+01 
  4.399271e+03   1.725179e-01   3.103012e+00   9.849073e+00   8.681780e+01 
  4.502270e+03  -4.565435e-02   2.421386e+00   7.682822e+00   9.108015e+01 
  4.607681e+03   1.889862e-01   3.044377e+00   9.686671e+00   8.644779e+01 
  4.715561e+03   1.987673e-01   3.002076e+00   9.567431e+00   8.621198e+01 
  4.825965e+03   2.127416e-01   2.904014e+00   9.283220e+00   8.581012e+01 
  4.938955e+03   2.779325e-01   2.789342e+00   8.952941e+00   8.430978e+01 
  5.054590e+03   2.835421e-01   2.724447e+00   8.752354e+00   8.405843e+01 
  5.172933e+03   2.928724e-01   2.652647e+00   8.526208e+00   8.369962e+01 
  5.294046e+03   2.923453e-01   2.565857e+00   8.240666e+00   8.349993e+01 
  5.417995e+03   3.300692e-01   2.551819e+00   8.209055e+00   8.262990e+01 
  5.544845e+03  -2.130390e-01   5.859925e-01  -4.103041e+00   1.099789e+02 
  5.674666e+03   3.099990e-01   2.465300e+00   7.905529e+00   8.283295e+01 
  5.807526e+03   2.745734e-01   2.401380e+00   7.665629e+00   8.347713e+01 
  5.943498e+03   2.627767e-01   2.331516e+00   7.407588e+00   8.356953e+01 
  6.082652e+03   2.973791e-01   2.269255e+00   7.191615e+00   8.253410e+01 
  6.225064e+03   3.217674e-01   2.191267e+00   6.906556e+00   8.164633e+01 
  6.370811e+03   3.127258e-01   2.143015e+00   6.712018e+00   8.169754e+01 
  6.519970e+03   3.383209e-01   2.120772e+00   6.639021e+00   8.093613e+01 
  6.672621e+03   2.474012e-01   2.076539e+00   6.408013e+00   8.320573e+01 
  6.828846e+03   2.981268e-01   2.062859e+00   6.379165e+00   8.177647e+01 
  6.988729e+03   1.719024e-01   1.914486e+00   5.675919e+00   8.486915e+01 
  7.152355e+03   2.819765e-01   1.927263e+00   5.790806e+00   8.167615e+01 
  7.319812e+03   3.038353e-01   1.887028e+00   5.626722e+00   8.085315e+01 
  7.491190e+03   2.908640e-01   1.839108e+00   5.399441e+00   8.101283e+01 
  7.666581e+03   3.361354e-01   1.816102e+00   5.329088e+00   7.951400e+01 
  7.846078e+03   3.004634e-01   1.761379e+00   5.041628e+00   8.031942e+01 
  8.029777e+03   2.983002e-01   1.738976e+00   4.931818e+00   8.026633e+01 
  8.217777e+03   2.975195e-01   1.704588e+00   4.762719e+00   8.009930e+01 
  8.410179e+03   3.049556e-01   1.669602e+00   4.594782e+00   7.964893e+01 
  8.607085e+03   3.016765e-01   1.638649e+00   4.434476e+00   7.956860e+01 
  8.808602e+03   3.109891e-01   1.602121e+00   4.254538e+00   7.901488e+01 
  9.014837e+03   3.134381e-01   1.545998e+00   3.959119e+00   7.853910e+01 
  9.225900e+03   3.273726e-01   1.517492e+00   3.820091e+00   7.782600e+01 
  9.441905e+03   3.089485e-01   1.520154e+00   3.813532e+00   7.851196e+01 
  9.662967e+03   3.319713e-01   1.463063e+00   3.523290e+00   7.721595e+01 
  9.889205e+03   3.228454e-01   1.430419e+00   3.325048e+00   7.728145e+01 
  1.012074e+04   3.480091e-01   1.422945e+00   3.316061e+00   7.625696e+01 
  1.035770e+04   3.319930e-01   1.357458e+00   2.906825e+00   7.625696e+01 
  1.060020e+04   3.244111e-01   1.305912e+00   2.578344e+00   7.604914e+01 
  1.084838e+04   3.312113e-01   1.298152e+00   2.540402e+00   7.568688e+01 
  1.110237e+04   3.272719e-01   1.290537e+00   2.486088e+00   7.577013e+01 
  1.136231e+04   3.124364e-01   1.210714e+00   1.940823e+00   7.552995e+01 
  1.162833e+04   3.406121e-01   1.206418e+00   1.963033e+00   7.423385e+01 
  1.190059e+04   3.452031e-01   1.180704e+00   1.799040e+00   7.370263e+01 
  1.217921e+04   3.232050e-01   1.141127e+00   1.481805e+00   7.418612e+01 
  1.246436e+04   3.454350e-01   1.113329e+00   1.331641e+00   7.276234e+01 
  1.275619e+04   3.428609e-01   1.084663e+00   1.119505e+00   7.245831e+01 
  1.305485e+04   3.438793e-01   1.041384e+00   8.016923e-01   7.172606e+01 
  1.336050e+04   3.414684e-01   1.036259e+00   7.570527e-01   7.176189e+01 
  1.367331e+04   3.443457e-01   9.961988e-01   4.570865e-01   7.093179e+01 
  1.399344e+04   3.675203e-01   9.616970e-01   2.527805e-01   6.908524e+01 
  1.432107e+04   3.479721e-01   9.447998e-01   5.922868e-02   6.978111e+01 
  1.465637e+04   3.538682e-01   8.997608e-01  -2.928486e-01   6.853071e+01 
  1.499951e+04   3.290577e-01   8.967685e-01  -3.978014e-01   6.985003e+01 
  1.535069e+04   3.389760e-01   8.338261e-01  -9.142349e-01   6.787674e+01 
  1.571010e+04   3.501897e-01   8.384989e-01  -8.317081e-01   6.733269e+01 
  1.607792e+04   3.592009e-01   8.367581e-01  -8.134624e-01   6.676727e+01 
  1.645435e+04   3.388620e-01   7.877634e-01  -1.334772e+00   6.672469e+01 
  1.683959e+04   3.425181e-01   7.655898e-01  -1.527689e+00   6.589668e+01 
  1.723385e+04   3.366077e-01   7.474706e-01  -1.726198e+00   6.575658e+01 
  1.763735e+04   3.523605e-01   7.114115e-01  -2.004773e+00   6.365088e+01 
  1.805029e+04   3.398393e-01   6.959255e-01  -2.219913e+00   6.397248e+01 
  1.847290e+04   3.290707e-01   6.761093e-01  -2.476355e+00   6.404725e+01 
  1.890540e+04   3.340752e-01   6.543156e-01  -2.678193e+00   6.295241e+01 
  1.934803e+04   3.310146e-01   6.350586e-01  -2.899927e+00   6.246990e+01 
  1.980103e+04   3.284456e-01   6.194301e-01  -3.084145e+00   6.206575e+01 
  2.026462e+04   3.279554e-01   5.824333e-01  -3.499031e+00   6.061709e+01 
  2.073908e+04   3.191667e-01   5.736668e-01  -3.655621e+00   6.091007e+01 
  2.122464e+04   3.232605e-01   5.588257e-01  -3.800894e+00   5.995217e+01 
  2.172157e+04   3.142771e-01   5.470489e-01  -4.000813e+00   6.012283e+01 
  2.223013e+04   3.070507e-01   5.312822e-01  -4.241879e+00   5.997454e+01 
  2.275061e+04   3.163851e-01   5.054581e-01  -4.490535e+00   5.795601e+01 
  2.328326e+04   3.023255e-01   4.752308e-01  -4.986053e+00   5.753688e+01 
  2.382839e+04   3.063391e-01   4.617527e-01  -5.127779e+00   5.643864e+01 
  2.438628e+04   2.842315e-01   4.549007e-01  -5.410266e+00   5.800200e+01 
  2.495723e+04   1.148577e-02  -2.411745e-03  -3.860942e+01  -1.185850e+01 
  2.554155e+04   2.974185e-01   4.173450e-01  -5.806480e+00   5.452465e+01 
  2.613956e+04   2.879109e-01   4.034799e-01  -6.096148e+00   5.448950e+01 
  2.675156e+04   2.868810e-01   3.912396e-01  -6.282505e+00   5.374883e+01 
  2.737789e+04   2.791166e-01   3.704794e-01  -6.672364e+00   5.300588e+01 
  2.801888e+04   2.702006e-01   3.495519e-01  -7.095315e+00   5.229628e+01 
  2.867489e+04   2.606889e-01   3.434985e-01  -7.306040e+00   5.280430e+01 
  2.934625e+04   2.709175e-01   3.266928e-01  -7.444272e+00   5.033199e+01 
  3.003333e+04   2.608427e-01   3.186909e-01  -7.705670e+00   5.070029e+01 
  3.073650e+04   2.609707e-01   3.041751e-01  -7.941782e+00   4.937166e+01 
  3.145612e+04   2.567262e-01   2.933542e-01  -8.182563e+00   4.880951e+01 
  3.219260e+04   2.541710e-01   2.809084e-01  -8.431106e+00   4.786063e+01 
  3.294632e+04   2.446407e-01   2.686178e-01  -8.794110e+00   4.767465e+01 
  3.371769e+04   2.421058e-01   2.536596e-01  -9.102419e+00   4.633503e+01 
  3.450712e+04   2.379324e-01   2.489036e-01  -9.260442e+00   4.629097e+01 
  3.531503e+04   2.351556e-01   2.405798e-01  -9.462427e+00   4.565324e+01 
  3.614186e+04   2.329230e-01   2.268318e-01  -9.759012e+00   4.424095e+01 
  3.698804e+04   2.275966e-01   2.122757e-01  -1.013850e+01   4.300518e+01 
  3.785404e+04   2.358870e-01   2.061767e-01  -1.008103e+01   4.115504e+01 
  3.874031e+04   2.207561e-01   2.007567e-01  -1.050432e+01   4.228354e+01 
  3.964734e+04   2.175595e-01   1.913539e-01  -1.075987e+01   4.133315e+01 
  4.057559e+04   2.139478e-01   1.802631e-01  -1.106413e+01   4.011602e+01 
  4.152559e+04   2.114065e-01   1.711478e-01  -1.130860e+01   3.899249e+01 
  4.249782e+04   2.060335e-01   1.601208e-01  -1.166926e+01   3.785289e+01 
  4.349281e+04   2.019552e-01   1.583275e-01  -1.181421e+01   3.809550e+01 
  4.451111e+04   1.995059e-01   1.428707e-01  -1.220298e+01   3.560730e+01 
  4.555324e+04   1.949532e-01   1.372918e-01  -1.245225e+01   3.515433e+01 
  4.661977e+04   1.923503e-01   1.331807e-01  -1.261729e+01   3.469819e+01 
  4.771127e+04   1.870419e-01   1.240296e-01  -1.297845e+01   3.354881e+01 
  4.882833e+04   1.812769e-01   1.147956e-01  -1.336871e+01   3.234449e+01 
  4.997154e+04   1.726840e-01   1.123947e-01  -1.372099e+01   3.305885e+01 
  5.114152e+04   1.777227e-01   1.035612e-01  -1.373554e+01   3.022989e+01 
  5.233889e+04   1.697680e-01   9.509191e-02  -1.421778e+01   2.925444e+01 
  5.356430e+04   1.624731e-01   8.835465e-02  -1.465922e+01   2.853782e+01 
  5.481839e+04   1.595981e-01   8.719423e-02  -1.480508e+01   2.864938e+01 
  5.610185e+04   1.567802e-01   7.795824e-02  -1.513463e+01   2.643865e+01 
  5.741535e+04   1.524651e-01   7.146925e-02  -1.547394e+01   2.511521e+01 
  5.875961e+04   1.470685e-01   6.102524e-02  -1.595967e+01   2.253572e+01 
  6.013534e+04   1.362833e-01   5.453236e-02  -1.666615e+01   2.180830e+01 
  6.154328e+04   1.386687e-01   5.086403e-02  -1.661222e+01   2.014317e+01 
  6.298419e+04   1.332797e-01   5.105738e-02  -1.691002e+01   2.096105e+01 
  6.445883e+04   1.196150e-01   4.582944e-02  -1.784942e+01   2.096390e+01 
  6.596800e+04   1.145897e-01   4.721566e-02  -1.813605e+01   2.239366e+01 
  6.751250e+04   1.064684e-01   5.099183e-02  -1.855871e+01   2.559155e+01 
  6.909316e+04   1.115456e-01   4.228698e-02  -1.846777e+01   2.076174e+01 
  7.071083e+04   1.105616e-01   4.487620e-02  -1.846559e+01   2.209189e+01 
  7.236638e+04   1.068612e-01   4.014890e-02  -1.885014e+01   2.059173e+01 
  7.406068e+04   1.076005e-01   3.386686e-02  -1.895348e+01   1.747120e+01 
  7.579465e+04   1.029903e-01   3.090797e-02  -1.936955e+01   1.670479e+01 
  7.756922e+04   1.006287e-01   3.143747e-02  -1.954112e+01   1.734935e+01 
  7.938534e+04   9.713758e-02   2.896428e-02  -1.988233e+01   1.660342e+01 
  8.124398e+04   9.452493e-02   2.838967e-02  -2.011399e+01   1.671714e+01 
  8.314613e+04   9.247611e-02   3.211179e-02  -2.018499e+01   1.914926e+01 
  8.509283e+04   9.332401e-02   2.179508e-02  -2.036949e+01   1.314536e+01 
  8.708509e+04   4.537025e-02   9.604041e-03  -2.667421e+01   1.195202e+01 
  8.912401e+04   8.666760e-02   1.080350e-02  -2.117590e+01   7.105518e+00 
  9.121066e+04   8.518166e-02   1.828744e-02  -2.119738e+01   1.211677e+01 
  9.334616e+04   8.287638e-02   1.596642e-02  -2.147311e+01   1.090463e+01 
  9.553166e+04   8.438119e-02   1.231692e-02  -2.138353e+01   8.304675e+00 
  9.776833e+04   7.725356e-02   8.598570e-03  -2.218816e+01   6.351064e+00 
  1.000574e+05   7.611302e-02   6.148620e-03  -2.234257e+01   4.618482e+00 
  1.024000e+05   7.030964e-02   2.262569e-03  -2.305521e+01   1.843146e+00 
