  0.000000e+00   2.531656e-05   0.000000e+00   2.531656e-05   0.000000e+00 
  1.280000e+02   1.265624e-05   0.000000e+00   1.265624e-05   0.000000e+00 
  2.560000e+02   2.109677e-07   0.000000e+00   2.109677e-07   0.000000e+00 
  3.840000e+02   2.073001e-07   0.000000e+00   2.073001e-07   0.000000e+00 
  5.120000e+02   2.942236e-07   0.000000e+00   2.942236e-07   0.000000e+00 
  6.400000e+02   2.563750e-07   0.000000e+00   2.563750e-07   0.000000e+00 
  7.680000e+02   2.089065e-07   0.000000e+00   2.089065e-07   0.000000e+00 
  8.960000e+02   2.112182e-07   0.000000e+00   2.112182e-07   0.000000e+00 
  1.024000e+03   2.027547e-07   0.000000e+00   2.027547e-07   0.000000e+00 
  1.152000e+03   2.188933e-07   0.000000e+00   2.188933e-07   0.000000e+00 
  1.280000e+03   2.469599e-07   0.000000e+00   2.469599e-07   0.000000e+00 
  1.408000e+03   2.264629e-07   0.000000e+00   2.264629e-07   0.000000e+00 
  1.536000e+03   2.644567e-07   0.000000e+00   2.644567e-07   0.000000e+00 
  1.664000e+03   2.708952e-07   0.000000e+00   2.708952e-07   0.000000e+00 
  1.792000e+03   3.130210e-07   0.000000e+00   3.130210e-07   0.000000e+00 
  1.920000e+03   4.852415e-07   0.000000e+00   4.852415e-07   0.000000e+00 
  2.048000e+03   4.552777e-07   0.000000e+00   4.552777e-07   0.000000e+00 
  2.176000e+03   4.266744e-07   0.000000e+00   4.266744e-07   0.000000e+00 
  2.304000e+03   5.577716e-07   0.000000e+00   5.577716e-07   0.000000e+00 
  2.432000e+03   5.725717e-07   0.000000e+00   5.725717e-07   0.000000e+00 
  2.560000e+03   9.907731e-07   0.000000e+00   9.907731e-07   0.000000e+00 
  2.688000e+03   1.474532e-06   0.000000e+00   1.474532e-06   0.000000e+00 
  2.816000e+03   1.371131e-06   0.000000e+00   1.371131e-06   0.000000e+00 
  2.944000e+03   1.219935e-06   0.000000e+00   1.219935e-06   0.000000e+00 
  3.072000e+03   1.273790e-06   0.000000e+00   1.273790e-06   0.000000e+00 
  3.200000e+03   1.171200e-06   0.000000e+00   1.171200e-06   0.000000e+00 
  3.328000e+03   1.237806e-06   0.000000e+00   1.237806e-06   0.000000e+00 
  3.456000e+03   1.289043e-06   0.000000e+00   1.289043e-06   0.000000e+00 
  3.584000e+03   1.364311e-06   0.000000e+00   1.364311e-06   0.000000e+00 
  3.712000e+03   1.601864e-06   0.000000e+00   1.601864e-06   0.000000e+00 
  3.840000e+03   1.960853e-06   0.000000e+00   1.960853e-06   0.000000e+00 
  3.968000e+03   2.593933e-06   0.000000e+00   2.593933e-06   0.000000e+00 
  4.096000e+03   3.439957e-06   0.000000e+00   3.439957e-06   0.000000e+00 
  4.224000e+03   3.097481e-06   0.000000e+00   3.097481e-06   0.000000e+00 
  4.352000e+03   2.773267e-06   0.000000e+00   2.773267e-06   0.000000e+00 
  4.480000e+03   2.706074e-06   0.000000e+00   2.706074e-06   0.000000e+00 
  4.608000e+03   2.723519e-06   0.000000e+00   2.723519e-06   0.000000e+00 
  4.736000e+03   2.665453e-06   0.000000e+00   2.665453e-06   0.000000e+00 
  4.864000e+03   2.754509e-06   0.000000e+00   2.754509e-06   0.000000e+00 
  4.992000e+03   3.217819e-06   0.000000e+00   3.217819e-06   0.000000e+00 
  5.120000e+03   4.020144e-06   0.000000e+00   4.020144e-06   0.000000e+00 
  5.248000e+03   3.743366e-06   0.000000e+00   3.743366e-06   0.000000e+00 
  5.376000e+03   3.275469e-06   0.000000e+00   3.275469e-06   0.000000e+00 
  5.504000e+03   3.193293e-06   0.000000e+00   3.193293e-06   0.000000e+00 
  5.632000e+03   2.994951e-06   0.000000e+00   2.994951e-06   0.000000e+00 
  5.760000e+03   2.697824e-06   0.000000e+00   2.697824e-06   0.000000e+00 
  5.888000e+03   2.672193e-06   0.000000e+00   2.672193e-06   0.000000e+00 
  6.016000e+03   2.780175e-06   0.000000e+00   2.780175e-06   0.000000e+00 
  6.144000e+03   2.529936e-06   0.000000e+00   2.529936e-06   0.000000e+00 
  6.272000e+03   2.496971e-06   0.000000e+00   2.496971e-06   0.000000e+00 
  6.400000e+03   2.390121e-06   0.000000e+00   2.390121e-06   0.000000e+00 
  6.528000e+03   2.270025e-06   0.000000e+00   2.270025e-06   0.000000e+00 
  6.656000e+03   2.273549e-06   0.000000e+00   2.273549e-06   0.000000e+00 
  6.784000e+03   2.396377e-06   0.000000e+00   2.396377e-06   0.000000e+00 
  6.912000e+03   2.502534e-06   0.000000e+00   2.502534e-06   0.000000e+00 
  7.040000e+03   2.747086e-06   0.000000e+00   2.747086e-06   0.000000e+00 
  7.168000e+03   2.989541e-06   0.000000e+00   2.989541e-06   0.000000e+00 
  7.296000e+03   2.867404e-06   0.000000e+00   2.867404e-06   0.000000e+00 
  7.424000e+03   2.875552e-06   0.000000e+00   2.875552e-06   0.000000e+00 
  7.552000e+03   4.125596e-06   0.000000e+00   4.125596e-06   0.000000e+00 
  7.680000e+03   4.698637e-06   0.000000e+00   4.698637e-06   0.000000e+00 
  7.808000e+03   3.831208e-06   0.000000e+00   3.831208e-06   0.000000e+00 
  7.936000e+03   3.640728e-06   0.000000e+00   3.640728e-06   0.000000e+00 
  8.064000e+03   3.708781e-06   0.000000e+00   3.708781e-06   0.000000e+00 
  8.192000e+03   4.741690e-06   0.000000e+00   4.741690e-06   0.000000e+00 
  8.320000e+03   4.122167e-06   0.000000e+00   4.122167e-06   0.000000e+00 
  8.448000e+03   3.285099e-06   0.000000e+00   3.285099e-06   0.000000e+00 
  8.576000e+03   3.120904e-06   0.000000e+00   3.120904e-06   0.000000e+00 
  8.704000e+03   3.030952e-06   0.000000e+00   3.030952e-06   0.000000e+00 
  8.832000e+03   3.135451e-06   0.000000e+00   3.135451e-06   0.000000e+00 
  8.960000e+03   3.385815e-06   0.000000e+00   3.385815e-06   0.000000e+00 
  9.088000e+03   4.056490e-06   0.000000e+00   4.056490e-06   0.000000e+00 
  9.216000e+03   5.288131e-06   0.000000e+00   5.288131e-06   0.000000e+00 
  9.344000e+03   5.667228e-06   0.000000e+00   5.667228e-06   0.000000e+00 
  9.472000e+03   6.790193e-06   0.000000e+00   6.790193e-06   0.000000e+00 
  9.600000e+03   6.724749e-06   0.000000e+00   6.724749e-06   0.000000e+00 
  9.728000e+03   4.944046e-06   0.000000e+00   4.944046e-06   0.000000e+00 
  9.856000e+03   3.754778e-06   0.000000e+00   3.754778e-06   0.000000e+00 
  9.984000e+03   3.773829e-06   0.000000e+00   3.773829e-06   0.000000e+00 
  1.011200e+04   3.360464e-06   0.000000e+00   3.360464e-06   0.000000e+00 
  1.024000e+04   3.180730e-06   0.000000e+00   3.180730e-06   0.000000e+00 
  1.036800e+04   2.826419e-06   0.000000e+00   2.826419e-06   0.000000e+00 
  1.049600e+04   2.610740e-06   0.000000e+00   2.610740e-06   0.000000e+00 
  1.062400e+04   2.782915e-06   0.000000e+00   2.782915e-06   0.000000e+00 
  1.075200e+04   2.882545e-06   0.000000e+00   2.882545e-06   0.000000e+00 
  1.088000e+04   2.866892e-06   0.000000e+00   2.866892e-06   0.000000e+00 
  1.100800e+04   2.809885e-06   0.000000e+00   2.809885e-06   0.000000e+00 
  1.113600e+04   2.775729e-06   0.000000e+00   2.775729e-06   0.000000e+00 
  1.126400e+04   2.927426e-06   0.000000e+00   2.927426e-06   0.000000e+00 
  1.139200e+04   2.688245e-06   0.000000e+00   2.688245e-06   0.000000e+00 
  1.152000e+04   2.555835e-06   0.000000e+00   2.555835e-06   0.000000e+00 
  1.164800e+04   2.458846e-06   0.000000e+00   2.458846e-06   0.000000e+00 
  1.177600e+04   2.474450e-06   0.000000e+00   2.474450e-06   0.000000e+00 
  1.190400e+04   2.491002e-06   0.000000e+00   2.491002e-06   0.000000e+00 
  1.203200e+04   2.618808e-06   0.000000e+00   2.618808e-06   0.000000e+00 
  1.216000e+04   3.218984e-06   0.000000e+00   3.218984e-06   0.000000e+00 
  1.228800e+04   4.160887e-06   0.000000e+00   4.160887e-06   0.000000e+00 
  1.241600e+04   3.428401e-06   0.000000e+00   3.428401e-06   0.000000e+00 
  1.254400e+04   2.915006e-06   0.000000e+00   2.915006e-06   0.000000e+00 
  1.267200e+04   2.806511e-06   0.000000e+00   2.806511e-06   0.000000e+00 
  1.280000e+04   2.795440e-06   0.000000e+00   2.795440e-06   0.000000e+00 
  1.292800e+04   2.760999e-06   0.000000e+00   2.760999e-06   0.000000e+00 
  1.305600e+04   2.855383e-06   0.000000e+00   2.855383e-06   0.000000e+00 
  1.318400e+04   3.649305e-06   0.000000e+00   3.649305e-06   0.000000e+00 
  1.331200e+04   5.343360e-06   0.000000e+00   5.343360e-06   0.000000e+00 
  1.344000e+04   2.393964e-05   0.000000e+00   2.393964e-05   0.000000e+00 
  1.356800e+04   3.614507e-05   0.000000e+00   3.614507e-05   0.000000e+00 
  1.369600e+04   1.486390e-05   0.000000e+00   1.486390e-05   0.000000e+00 
  1.382400e+04   4.063540e-06   0.000000e+00   4.063540e-06   0.000000e+00 
  1.395200e+04   4.320505e-06   0.000000e+00   4.320505e-06   0.000000e+00 
  1.408000e+04   7.527654e-06   0.000000e+00   7.527654e-06   0.000000e+00 
  1.420800e+04   2.799589e-05   0.000000e+00   2.799589e-05   0.000000e+00 
  1.433600e+04   3.420751e-05   0.000000e+00   3.420751e-05   0.000000e+00 
  1.446400e+04   1.247304e-05   0.000000e+00   1.247304e-05   0.000000e+00 
  1.459200e+04   4.432306e-06   0.000000e+00   4.432306e-06   0.000000e+00 
  1.472000e+04   3.551356e-06   0.000000e+00   3.551356e-06   0.000000e+00 
  1.484800e+04   3.473236e-06   0.000000e+00   3.473236e-06   0.000000e+00 
  1.497600e+04   4.837364e-06   0.000000e+00   4.837364e-06   0.000000e+00 
  1.510400e+04   6.984113e-06   0.000000e+00   6.984113e-06   0.000000e+00 
  1.523200e+04   4.362041e-06   0.000000e+00   4.362041e-06   0.000000e+00 
  1.536000e+04   3.139331e-06   0.000000e+00   3.139331e-06   0.000000e+00 
  1.548800e+04   6.134929e-06   0.000000e+00   6.134929e-06   0.000000e+00 
  1.561600e+04   1.716029e-05   0.000000e+00   1.716029e-05   0.000000e+00 
  1.574400e+04   2.241093e-05   0.000000e+00   2.241093e-05   0.000000e+00 
  1.587200e+04   9.805844e-06   0.000000e+00   9.805844e-06   0.000000e+00 
  1.600000e+04   2.716385e-06   0.000000e+00   2.716385e-06   0.000000e+00 
  1.612800e+04   2.718961e-06   0.000000e+00   2.718961e-06   0.000000e+00 
  1.625600e+04   3.050035e-06   0.000000e+00   3.050035e-06   0.000000e+00 
  1.638400e+04   3.736233e-06   0.000000e+00   3.736233e-06   0.000000e+00 
  1.651200e+04   3.203865e-06   0.000000e+00   3.203865e-06   0.000000e+00 
  1.664000e+04   3.058272e-06   0.000000e+00   3.058272e-06   0.000000e+00 
  1.676800e+04   3.345161e-06   0.000000e+00   3.345161e-06   0.000000e+00 
  1.689600e+04   3.332428e-06   0.000000e+00   3.332428e-06   0.000000e+00 
  1.702400e+04   5.676198e-06   0.000000e+00   5.676198e-06   0.000000e+00 
  1.715200e+04   6.710111e-06   0.000000e+00   6.710111e-06   0.000000e+00 
  1.728000e+04   4.053451e-06   0.000000e+00   4.053451e-06   0.000000e+00 
  1.740800e+04   4.466034e-06   0.000000e+00   4.466034e-06   0.000000e+00 
  1.753600e+04   3.655197e-06   0.000000e+00   3.655197e-06   0.000000e+00 
  1.766400e+04   3.171049e-06   0.000000e+00   3.171049e-06   0.000000e+00 
  1.779200e+04   3.423409e-06   0.000000e+00   3.423409e-06   0.000000e+00 
  1.792000e+04   5.603757e-06   0.000000e+00   5.603757e-06   0.000000e+00 
  1.804800e+04   5.404549e-06   0.000000e+00   5.404549e-06   0.000000e+00 
  1.817600e+04   3.577348e-06   0.000000e+00   3.577348e-06   0.000000e+00 
  1.830400e+04   3.411538e-06   0.000000e+00   3.411538e-06   0.000000e+00 
  1.843200e+04   4.175491e-06   0.000000e+00   4.175491e-06   0.000000e+00 
  1.856000e+04   6.066668e-06   0.000000e+00   6.066668e-06   0.000000e+00 
  1.868800e+04   5.191124e-06   0.000000e+00   5.191124e-06   0.000000e+00 
  1.881600e+04   3.974301e-06   0.000000e+00   3.974301e-06   0.000000e+00 
  1.894400e+04   4.157279e-06   0.000000e+00   4.157279e-06   0.000000e+00 
  1.907200e+04   4.908976e-06   0.000000e+00   4.908976e-06   0.000000e+00 
  1.920000e+04   4.741888e-06   0.000000e+00   4.741888e-06   0.000000e+00 
  1.932800e+04   4.657345e-06   0.000000e+00   4.657345e-06   0.000000e+00 
  1.945600e+04   8.786114e-06   0.000000e+00   8.786114e-06   0.000000e+00 
  1.958400e+04   1.754909e-05   0.000000e+00   1.754909e-05   0.000000e+00 
  1.971200e+04   1.535790e-05   0.000000e+00   1.535790e-05   0.000000e+00 
  1.984000e+04   1.661919e-05   0.000000e+00   1.661919e-05   0.000000e+00 
  1.996800e+04   1.694365e-05   0.000000e+00   1.694365e-05   0.000000e+00 
  2.009600e+04   2.206658e-05   0.000000e+00   2.206658e-05   0.000000e+00 
  2.022400e+04   1.904285e-05   0.000000e+00   1.904285e-05   0.000000e+00 
  2.035200e+04   1.470286e-05   0.000000e+00   1.470286e-05   0.000000e+00 
  2.048000e+04   1.035452e-05   0.000000e+00   1.035452e-05   0.000000e+00 
  2.060800e+04   8.431501e-06   0.000000e+00   8.431501e-06   0.000000e+00 
  2.073600e+04   6.168760e-06   0.000000e+00   6.168760e-06   0.000000e+00 
  2.086400e+04   4.230288e-06   0.000000e+00   4.230288e-06   0.000000e+00 
  2.099200e+04   4.022372e-06   0.000000e+00   4.022372e-06   0.000000e+00 
  2.112000e+04   4.040842e-06   0.000000e+00   4.040842e-06   0.000000e+00 
  2.124800e+04   3.970781e-06   0.000000e+00   3.970781e-06   0.000000e+00 
  2.137600e+04   4.191930e-06   0.000000e+00   4.191930e-06   0.000000e+00 
  2.150400e+04   4.478295e-06   0.000000e+00   4.478295e-06   0.000000e+00 
  2.163200e+04   4.414964e-06   0.000000e+00   4.414964e-06   0.000000e+00 
  2.176000e+04   4.191311e-06   0.000000e+00   4.191311e-06   0.000000e+00 
  2.188800e+04   4.024919e-06   0.000000e+00   4.024919e-06   0.000000e+00 
  2.201600e+04   4.056353e-06   0.000000e+00   4.056353e-06   0.000000e+00 
  2.214400e+04   4.006960e-06   0.000000e+00   4.006960e-06   0.000000e+00 
  2.227200e+04   3.981756e-06   0.000000e+00   3.981756e-06   0.000000e+00 
  2.240000e+04   4.236624e-06   0.000000e+00   4.236624e-06   0.000000e+00 
  2.252800e+04   4.473349e-06   0.000000e+00   4.473349e-06   0.000000e+00 
  2.265600e+04   4.348131e-06   0.000000e+00   4.348131e-06   0.000000e+00 
  2.278400e+04   4.231648e-06   0.000000e+00   4.231648e-06   0.000000e+00 
  2.291200e+04   4.279506e-06   0.000000e+00   4.279506e-06   0.000000e+00 
  2.304000e+04   4.255170e-06   0.000000e+00   4.255170e-06   0.000000e+00 
  2.316800e+04   4.377823e-06   0.000000e+00   4.377823e-06   0.000000e+00 
  2.329600e+04   4.482425e-06   0.000000e+00   4.482425e-06   0.000000e+00 
  2.342400e+04   4.648524e-06   0.000000e+00   4.648524e-06   0.000000e+00 
  2.355200e+04   4.808503e-06   0.000000e+00   4.808503e-06   0.000000e+00 
  2.368000e+04   4.688276e-06   0.000000e+00   4.688276e-06   0.000000e+00 
  2.380800e+04   4.409621e-06   0.000000e+00   4.409621e-06   0.000000e+00 
  2.393600e+04   4.255002e-06   0.000000e+00   4.255002e-06   0.000000e+00 
  2.406400e+04   4.148017e-06   0.000000e+00   4.148017e-06   0.000000e+00 
  2.419200e+04   4.030696e-06   0.000000e+00   4.030696e-06   0.000000e+00 
  2.432000e+04   4.125520e-06   0.000000e+00   4.125520e-06   0.000000e+00 
  2.444800e+04   4.289711e-06   0.000000e+00   4.289711e-06   0.000000e+00 
  2.457600e+04   4.273499e-06   0.000000e+00   4.273499e-06   0.000000e+00 
  2.470400e+04   4.051602e-06   0.000000e+00   4.051602e-06   0.000000e+00 
  2.483200e+04   3.873364e-06   0.000000e+00   3.873364e-06   0.000000e+00 
  2.496000e+04   3.888525e-06   0.000000e+00   3.888525e-06   0.000000e+00 
  2.508800e+04   3.925307e-06   0.000000e+00   3.925307e-06   0.000000e+00 
  2.521600e+04   4.001180e-06   0.000000e+00   4.001180e-06   0.000000e+00 
  2.534400e+04   3.978599e-06   0.000000e+00   3.978599e-06   0.000000e+00 
  2.547200e+04   4.125402e-06   0.000000e+00   4.125402e-06   0.000000e+00 
  2.560000e+04   4.200606e-06   0.000000e+00   4.200606e-06   0.000000e+00 
  2.572800e+04   4.400047e-06   0.000000e+00   4.400047e-06   0.000000e+00 
  2.585600e+04   5.092705e-06   0.000000e+00   5.092705e-06   0.000000e+00 
  2.598400e+04   4.591420e-06   0.000000e+00   4.591420e-06   0.000000e+00 
  2.611200e+04   3.945272e-06   0.000000e+00   3.945272e-06   0.000000e+00 
  2.624000e+04   3.807573e-06   0.000000e+00   3.807573e-06   0.000000e+00 
  2.636800e+04   3.812681e-06   0.000000e+00   3.812681e-06   0.000000e+00 
  2.649600e+04   3.968815e-06   0.000000e+00   3.968815e-06   0.000000e+00 
  2.662400e+04   4.146605e-06   0.000000e+00   4.146605e-06   0.000000e+00 
  2.675200e+04   4.162889e-06   0.000000e+00   4.162889e-06   0.000000e+00 
  2.688000e+04   4.897971e-06   0.000000e+00   4.897971e-06   0.000000e+00 
  2.700800e+04   1.606776e-05   0.000000e+00   1.606776e-05   0.000000e+00 
  2.713600e+04   1.939592e-05   0.000000e+00   1.939592e-05   0.000000e+00 
  2.726400e+04   7.621340e-06   0.000000e+00   7.621340e-06   0.000000e+00 
  2.739200e+04   4.104309e-06   0.000000e+00   4.104309e-06   0.000000e+00 
  2.752000e+04   3.904732e-06   0.000000e+00   3.904732e-06   0.000000e+00 
  2.764800e+04   3.699906e-06   0.000000e+00   3.699906e-06   0.000000e+00 
  2.777600e+04   3.686468e-06   0.000000e+00   3.686468e-06   0.000000e+00 
  2.790400e+04   3.768484e-06   0.000000e+00   3.768484e-06   0.000000e+00 
  2.803200e+04   3.909651e-06   0.000000e+00   3.909651e-06   0.000000e+00 
  2.816000e+04   3.827583e-06   0.000000e+00   3.827583e-06   0.000000e+00 
  2.828800e+04   3.757267e-06   0.000000e+00   3.757267e-06   0.000000e+00 
  2.841600e+04   7.085793e-06   0.000000e+00   7.085793e-06   0.000000e+00 
  2.854400e+04   2.117387e-05   0.000000e+00   2.117387e-05   0.000000e+00 
  2.867200e+04   1.749204e-05   0.000000e+00   1.749204e-05   0.000000e+00 
  2.880000e+04   5.019694e-06   0.000000e+00   5.019694e-06   0.000000e+00 
  2.892800e+04   3.985943e-06   0.000000e+00   3.985943e-06   0.000000e+00 
  2.905600e+04   3.825198e-06   0.000000e+00   3.825198e-06   0.000000e+00 
  2.918400e+04   3.730403e-06   0.000000e+00   3.730403e-06   0.000000e+00 
  2.931200e+04   3.722200e-06   0.000000e+00   3.722200e-06   0.000000e+00 
  2.944000e+04   3.697558e-06   0.000000e+00   3.697558e-06   0.000000e+00 
  2.956800e+04   3.793403e-06   0.000000e+00   3.793403e-06   0.000000e+00 
  2.969600e+04   3.976428e-06   0.000000e+00   3.976428e-06   0.000000e+00 
  2.982400e+04   3.926677e-06   0.000000e+00   3.926677e-06   0.000000e+00 
  2.995200e+04   3.853159e-06   0.000000e+00   3.853159e-06   0.000000e+00 
  3.008000e+04   3.850091e-06   0.000000e+00   3.850091e-06   0.000000e+00 
  3.020800e+04   3.887017e-06   0.000000e+00   3.887017e-06   0.000000e+00 
  3.033600e+04   3.891140e-06   0.000000e+00   3.891140e-06   0.000000e+00 
  3.046400e+04   3.929559e-06   0.000000e+00   3.929559e-06   0.000000e+00 
  3.059200e+04   4.183457e-06   0.000000e+00   4.183457e-06   0.000000e+00 
  3.072000e+04   4.834253e-06   0.000000e+00   4.834253e-06   0.000000e+00 
  3.084800e+04   4.330659e-06   0.000000e+00   4.330659e-06   0.000000e+00 
  3.097600e+04   4.045957e-06   0.000000e+00   4.045957e-06   0.000000e+00 
  3.110400e+04   4.558805e-06   0.000000e+00   4.558805e-06   0.000000e+00 
  3.123200e+04   6.595061e-06   0.000000e+00   6.595061e-06   0.000000e+00 
  3.136000e+04   5.912559e-06   0.000000e+00   5.912559e-06   0.000000e+00 
  3.148800e+04   6.182793e-06   0.000000e+00   6.182793e-06   0.000000e+00 
  3.161600e+04   4.460206e-06   0.000000e+00   4.460206e-06   0.000000e+00 
  3.174400e+04   4.131832e-06   0.000000e+00   4.131832e-06   0.000000e+00 
  3.187200e+04   4.137882e-06   0.000000e+00   4.137882e-06   0.000000e+00 
  3.200000e+04   6.125706e-06   0.000000e+00   6.125706e-06   0.000000e+00 
  3.212800e+04   7.480621e-06   0.000000e+00   7.480621e-06   0.000000e+00 
  3.225600e+04   4.786225e-06   0.000000e+00   4.786225e-06   0.000000e+00 
  3.238400e+04   4.148899e-06   0.000000e+00   4.148899e-06   0.000000e+00 
  3.251200e+04   4.143189e-06   0.000000e+00   4.143189e-06   0.000000e+00 
  3.264000e+04   4.135773e-06   0.000000e+00   4.135773e-06   0.000000e+00 
  3.276800e+04   4.171212e-06   0.000000e+00   4.171212e-06   0.000000e+00 
  3.289600e+04   4.130484e-06   0.000000e+00   4.130484e-06   0.000000e+00 
  3.302400e+04   4.180381e-06   0.000000e+00   4.180381e-06   0.000000e+00 
  3.315200e+04   4.231317e-06   0.000000e+00   4.231317e-06   0.000000e+00 
  3.328000e+04   4.352206e-06   0.000000e+00   4.352206e-06   0.000000e+00 
  3.340800e+04   4.637698e-06   0.000000e+00   4.637698e-06   0.000000e+00 
  3.353600e+04   4.593953e-06   0.000000e+00   4.593953e-06   0.000000e+00 
  3.366400e+04   4.468091e-06   0.000000e+00   4.468091e-06   0.000000e+00 
  3.379200e+04   4.400242e-06   0.000000e+00   4.400242e-06   0.000000e+00 
  3.392000e+04   4.343573e-06   0.000000e+00   4.343573e-06   0.000000e+00 
  3.404800e+04   4.376979e-06   0.000000e+00   4.376979e-06   0.000000e+00 
  3.417600e+04   4.416787e-06   0.000000e+00   4.416787e-06   0.000000e+00 
  3.430400e+04   4.398683e-06   0.000000e+00   4.398683e-06   0.000000e+00 
  3.443200e+04   4.420492e-06   0.000000e+00   4.420492e-06   0.000000e+00 
  3.456000e+04   4.396056e-06   0.000000e+00   4.396056e-06   0.000000e+00 
  3.468800e+04   4.514179e-06   0.000000e+00   4.514179e-06   0.000000e+00 
  3.481600e+04   4.489620e-06   0.000000e+00   4.489620e-06   0.000000e+00 
  3.494400e+04   4.383436e-06   0.000000e+00   4.383436e-06   0.000000e+00 
  3.507200e+04   4.395329e-06   0.000000e+00   4.395329e-06   0.000000e+00 
  3.520000e+04   4.361654e-06   0.000000e+00   4.361654e-06   0.000000e+00 
  3.532800e+04   4.466939e-06   0.000000e+00   4.466939e-06   0.000000e+00 
  3.545600e+04   4.524562e-06   0.000000e+00   4.524562e-06   0.000000e+00 
  3.558400e+04   4.474252e-06   0.000000e+00   4.474252e-06   0.000000e+00 
  3.571200e+04   4.485304e-06   0.000000e+00   4.485304e-06   0.000000e+00 
  3.584000e+04   4.592929e-06   0.000000e+00   4.592929e-06   0.000000e+00 
  3.596800e+04   4.579278e-06   0.000000e+00   4.579278e-06   0.000000e+00 
  3.609600e+04   4.511397e-06   0.000000e+00   4.511397e-06   0.000000e+00 
  3.622400e+04   4.620372e-06   0.000000e+00   4.620372e-06   0.000000e+00 
  3.635200e+04   4.651639e-06   0.000000e+00   4.651639e-06   0.000000e+00 
  3.648000e+04   4.511745e-06   0.000000e+00   4.511745e-06   0.000000e+00 
  3.660800e+04   4.602173e-06   0.000000e+00   4.602173e-06   0.000000e+00 
  3.673600e+04   4.530530e-06   0.000000e+00   4.530530e-06   0.000000e+00 
  3.686400e+04   4.599287e-06   0.000000e+00   4.599287e-06   0.000000e+00 
  3.699200e+04   4.730706e-06   0.000000e+00   4.730706e-06   0.000000e+00 
  3.712000e+04   4.712006e-06   0.000000e+00   4.712006e-06   0.000000e+00 
  3.724800e+04   4.780783e-06   0.000000e+00   4.780783e-06   0.000000e+00 
  3.737600e+04   5.386178e-06   0.000000e+00   5.386178e-06   0.000000e+00 
  3.750400e+04   5.195329e-06   0.000000e+00   5.195329e-06   0.000000e+00 
  3.763200e+04   4.920365e-06   0.000000e+00   4.920365e-06   0.000000e+00 
  3.776000e+04   4.965008e-06   0.000000e+00   4.965008e-06   0.000000e+00 
  3.788800e+04   5.091638e-06   0.000000e+00   5.091638e-06   0.000000e+00 
  3.801600e+04   5.415850e-06   0.000000e+00   5.415850e-06   0.000000e+00 
  3.814400e+04   5.761911e-06   0.000000e+00   5.761911e-06   0.000000e+00 
  3.827200e+04   5.541359e-06   0.000000e+00   5.541359e-06   0.000000e+00 
  3.840000e+04   5.081326e-06   0.000000e+00   5.081326e-06   0.000000e+00 
  3.852800e+04   4.975266e-06   0.000000e+00   4.975266e-06   0.000000e+00 
  3.865600e+04   4.983610e-06   0.000000e+00   4.983610e-06   0.000000e+00 
  3.878400e+04   4.974084e-06   0.000000e+00   4.974084e-06   0.000000e+00 
  3.891200e+04   4.781691e-06   0.000000e+00   4.781691e-06   0.000000e+00 
  3.904000e+04   6.694394e-06   0.000000e+00   6.694394e-06   0.000000e+00 
  3.916800e+04   1.165158e-05   0.000000e+00   1.165158e-05   0.000000e+00 
  3.929600e+04   7.835032e-06   0.000000e+00   7.835032e-06   0.000000e+00 
  3.942400e+04   4.774128e-06   0.000000e+00   4.774128e-06   0.000000e+00 
  3.955200e+04   4.561872e-06   0.000000e+00   4.561872e-06   0.000000e+00 
  3.968000e+04   4.570376e-06   0.000000e+00   4.570376e-06   0.000000e+00 
  3.980800e+04   4.589985e-06   0.000000e+00   4.589985e-06   0.000000e+00 
  3.993600e+04   4.667002e-06   0.000000e+00   4.667002e-06   0.000000e+00 
  4.006400e+04   4.790737e-06   0.000000e+00   4.790737e-06   0.000000e+00 
  4.019200e+04   4.718906e-06   0.000000e+00   4.718906e-06   0.000000e+00 
  4.032000e+04   4.810306e-06   0.000000e+00   4.810306e-06   0.000000e+00 
  4.044800e+04   6.806093e-06   0.000000e+00   6.806093e-06   0.000000e+00 
  4.057600e+04   1.614237e-05   0.000000e+00   1.614237e-05   0.000000e+00 
  4.070400e+04   1.632973e-05   0.000000e+00   1.632973e-05   0.000000e+00 
  4.083200e+04   6.785691e-06   0.000000e+00   6.785691e-06   0.000000e+00 
  4.096000e+04   4.715914e-06   0.000000e+00   4.715914e-06   0.000000e+00 
  4.108800e+04   4.547732e-06   0.000000e+00   4.547732e-06   0.000000e+00 
  4.121600e+04   4.564916e-06   0.000000e+00   4.564916e-06   0.000000e+00 
  4.134400e+04   5.058531e-06   0.000000e+00   5.058531e-06   0.000000e+00 
  4.147200e+04   5.247073e-06   0.000000e+00   5.247073e-06   0.000000e+00 
  4.160000e+04   4.632562e-06   0.000000e+00   4.632562e-06   0.000000e+00 
  4.172800e+04   4.506225e-06   0.000000e+00   4.506225e-06   0.000000e+00 
  4.185600e+04   4.663463e-06   0.000000e+00   4.663463e-06   0.000000e+00 
  4.198400e+04   4.755610e-06   0.000000e+00   4.755610e-06   0.000000e+00 
  4.211200e+04   4.817527e-06   0.000000e+00   4.817527e-06   0.000000e+00 
  4.224000e+04   4.845466e-06   0.000000e+00   4.845466e-06   0.000000e+00 
  4.236800e+04   4.743747e-06   0.000000e+00   4.743747e-06   0.000000e+00 
  4.249600e+04   4.778761e-06   0.000000e+00   4.778761e-06   0.000000e+00 
  4.262400e+04   5.192943e-06   0.000000e+00   5.192943e-06   0.000000e+00 
  4.275200e+04   1.156999e-05   0.000000e+00   1.156999e-05   0.000000e+00 
  4.288000e+04   2.004831e-05   0.000000e+00   2.004831e-05   0.000000e+00 
  4.300800e+04   1.179345e-05   0.000000e+00   1.179345e-05   0.000000e+00 
  4.313600e+04   5.321951e-06   0.000000e+00   5.321951e-06   0.000000e+00 
  4.326400e+04   4.877774e-06   0.000000e+00   4.877774e-06   0.000000e+00 
  4.339200e+04   4.830340e-06   0.000000e+00   4.830340e-06   0.000000e+00 
  4.352000e+04   5.033255e-06   0.000000e+00   5.033255e-06   0.000000e+00 
  4.364800e+04   5.121796e-06   0.000000e+00   5.121796e-06   0.000000e+00 
  4.377600e+04   4.853502e-06   0.000000e+00   4.853502e-06   0.000000e+00 
  4.390400e+04   4.947855e-06   0.000000e+00   4.947855e-06   0.000000e+00 
  4.403200e+04   5.021388e-06   0.000000e+00   5.021388e-06   0.000000e+00 
  4.416000e+04   5.050666e-06   0.000000e+00   5.050666e-06   0.000000e+00 
  4.428800e+04   5.146801e-06   0.000000e+00   5.146801e-06   0.000000e+00 
  4.441600e+04   5.228053e-06   0.000000e+00   5.228053e-06   0.000000e+00 
  4.454400e+04   5.274101e-06   0.000000e+00   5.274101e-06   0.000000e+00 
  4.467200e+04   5.266531e-06   0.000000e+00   5.266531e-06   0.000000e+00 
  4.480000e+04   5.207768e-06   0.000000e+00   5.207768e-06   0.000000e+00 
  4.492800e+04   5.162901e-06   0.000000e+00   5.162901e-06   0.000000e+00 
  4.505600e+04   5.147359e-06   0.000000e+00   5.147359e-06   0.000000e+00 
  4.518400e+04   5.097020e-06   0.000000e+00   5.097020e-06   0.000000e+00 
  4.531200e+04   5.217256e-06   0.000000e+00   5.217256e-06   0.000000e+00 
  4.544000e+04   5.276001e-06   0.000000e+00   5.276001e-06   0.000000e+00 
  4.556800e+04   5.394483e-06   0.000000e+00   5.394483e-06   0.000000e+00 
  4.569600e+04   5.400254e-06   0.000000e+00   5.400254e-06   0.000000e+00 
  4.582400e+04   5.228998e-06   0.000000e+00   5.228998e-06   0.000000e+00 
  4.595200e+04   5.044773e-06   0.000000e+00   5.044773e-06   0.000000e+00 
  4.608000e+04   5.144851e-06   0.000000e+00   5.144851e-06   0.000000e+00 
  4.620800e+04   5.178493e-06   0.000000e+00   5.178493e-06   0.000000e+00 
  4.633600e+04   5.225915e-06   0.000000e+00   5.225915e-06   0.000000e+00 
  4.646400e+04   5.371728e-06   0.000000e+00   5.371728e-06   0.000000e+00 
  4.659200e+04   5.347365e-06   0.000000e+00   5.347365e-06   0.000000e+00 
  4.672000e+04   5.535167e-06   0.000000e+00   5.535167e-06   0.000000e+00 
  4.684800e+04   6.321128e-06   0.000000e+00   6.321128e-06   0.000000e+00 
  4.697600e+04   6.089278e-06   0.000000e+00   6.089278e-06   0.000000e+00 
  4.710400e+04   5.738139e-06   0.000000e+00   5.738139e-06   0.000000e+00 
  4.723200e+04   5.704790e-06   0.000000e+00   5.704790e-06   0.000000e+00 
  4.736000e+04   5.622135e-06   0.000000e+00   5.622135e-06   0.000000e+00 
  4.748800e+04   5.720428e-06   0.000000e+00   5.720428e-06   0.000000e+00 
  4.761600e+04   5.843438e-06   0.000000e+00   5.843438e-06   0.000000e+00 
  4.774400e+04   5.821293e-06   0.000000e+00   5.821293e-06   0.000000e+00 
  4.787200e+04   5.800863e-06   0.000000e+00   5.800863e-06   0.000000e+00 
  4.800000e+04   5.805853e-06   0.000000e+00   5.805853e-06   0.000000e+00 
  4.812800e+04   5.704637e-06   0.000000e+00   5.704637e-06   0.000000e+00 
  4.825600e+04   5.637073e-06   0.000000e+00   5.637073e-06   0.000000e+00 
  4.838400e+04   5.545106e-06   0.000000e+00   5.545106e-06   0.000000e+00 
  4.851200e+04   5.651914e-06   0.000000e+00   5.651914e-06   0.000000e+00 
  4.864000e+04   5.764961e-06   0.000000e+00   5.764961e-06   0.000000e+00 
  4.876800e+04   6.170049e-06   0.000000e+00   6.170049e-06   0.000000e+00 
  4.889600e+04   7.402158e-06   0.000000e+00   7.402158e-06   0.000000e+00 
  4.902400e+04   6.284922e-06   0.000000e+00   6.284922e-06   0.000000e+00 
  4.915200e+04   5.732545e-06   0.000000e+00   5.732545e-06   0.000000e+00 
  4.928000e+04   5.585335e-06   0.000000e+00   5.585335e-06   0.000000e+00 
  4.940800e+04   5.587214e-06   0.000000e+00   5.587214e-06   0.000000e+00 
  4.953600e+04   5.550244e-06   0.000000e+00   5.550244e-06   0.000000e+00 
  4.966400e+04   5.671146e-06   0.000000e+00   5.671146e-06   0.000000e+00 
  4.979200e+04   5.623583e-06   0.000000e+00   5.623583e-06   0.000000e+00 
  4.992000e+04   5.665377e-06   0.000000e+00   5.665377e-06   0.000000e+00 
  5.004800e+04   5.710233e-06   0.000000e+00   5.710233e-06   0.000000e+00 
  5.017600e+04   5.878737e-06   0.000000e+00   5.878737e-06   0.000000e+00 
  5.030400e+04   5.965795e-06   0.000000e+00   5.965795e-06   0.000000e+00 
  5.043200e+04   5.757878e-06   0.000000e+00   5.757878e-06   0.000000e+00 
  5.056000e+04   5.881650e-06   0.000000e+00   5.881650e-06   0.000000e+00 
  5.068800e+04   6.008373e-06   0.000000e+00   6.008373e-06   0.000000e+00 
  5.081600e+04   5.944975e-06   0.000000e+00   5.944975e-06   0.000000e+00 
  5.094400e+04   5.928530e-06   0.000000e+00   5.928530e-06   0.000000e+00 
  5.107200e+04   5.786566e-06   0.000000e+00   5.786566e-06   0.000000e+00 
  5.120000e+04   5.744332e-06   0.000000e+00   5.744332e-06   0.000000e+00 
  5.132800e+04   5.750699e-06   0.000000e+00   5.750699e-06   0.000000e+00 
  5.145600e+04   5.846407e-06   0.000000e+00   5.846407e-06   0.000000e+00 
  5.158400e+04   5.834091e-06   0.000000e+00   5.834091e-06   0.000000e+00 
  5.171200e+04   5.781716e-06   0.000000e+00   5.781716e-06   0.000000e+00 
  5.184000e+04   5.666763e-06   0.000000e+00   5.666763e-06   0.000000e+00 
  5.196800e+04   5.790100e-06   0.000000e+00   5.790100e-06   0.000000e+00 
  5.209600e+04   5.755348e-06   0.000000e+00   5.755348e-06   0.000000e+00 
  5.222400e+04   5.800244e-06   0.000000e+00   5.800244e-06   0.000000e+00 
  5.235200e+04   5.794665e-06   0.000000e+00   5.794665e-06   0.000000e+00 
  5.248000e+04   5.759533e-06   0.000000e+00   5.759533e-06   0.000000e+00 
  5.260800e+04   6.007344e-06   0.000000e+00   6.007344e-06   0.000000e+00 
  5.273600e+04   5.973137e-06   0.000000e+00   5.973137e-06   0.000000e+00 
  5.286400e+04   5.818750e-06   0.000000e+00   5.818750e-06   0.000000e+00 
  5.299200e+04   5.759808e-06   0.000000e+00   5.759808e-06   0.000000e+00 
  5.312000e+04   5.667001e-06   0.000000e+00   5.667001e-06   0.000000e+00 
  5.324800e+04   5.622801e-06   0.000000e+00   5.622801e-06   0.000000e+00 
  5.337600e+04   5.729535e-06   0.000000e+00   5.729535e-06   0.000000e+00 
  5.350400e+04   5.822898e-06   0.000000e+00   5.822898e-06   0.000000e+00 
  5.363200e+04   5.826136e-06   0.000000e+00   5.826136e-06   0.000000e+00 
  5.376000e+04   5.759724e-06   0.000000e+00   5.759724e-06   0.000000e+00 
  5.388800e+04   5.803829e-06   0.000000e+00   5.803829e-06   0.000000e+00 
  5.401600e+04   6.607947e-06   0.000000e+00   6.607947e-06   0.000000e+00 
  5.414400e+04   8.956795e-06   0.000000e+00   8.956795e-06   0.000000e+00 
  5.427200e+04   8.182936e-06   0.000000e+00   8.182936e-06   0.000000e+00 
  5.440000e+04   6.041560e-06   0.000000e+00   6.041560e-06   0.000000e+00 
  5.452800e+04   5.863821e-06   0.000000e+00   5.863821e-06   0.000000e+00 
  5.465600e+04   5.880585e-06   0.000000e+00   5.880585e-06   0.000000e+00 
  5.478400e+04   5.965978e-06   0.000000e+00   5.965978e-06   0.000000e+00 
  5.491200e+04   5.969351e-06   0.000000e+00   5.969351e-06   0.000000e+00 
  5.504000e+04   5.943142e-06   0.000000e+00   5.943142e-06   0.000000e+00 
  5.516800e+04   5.916753e-06   0.000000e+00   5.916753e-06   0.000000e+00 
  5.529600e+04   5.832737e-06   0.000000e+00   5.832737e-06   0.000000e+00 
  5.542400e+04   5.849896e-06   0.000000e+00   5.849896e-06   0.000000e+00 
  5.555200e+04   5.777315e-06   0.000000e+00   5.777315e-06   0.000000e+00 
  5.568000e+04   5.861017e-06   0.000000e+00   5.861017e-06   0.000000e+00 
  5.580800e+04   5.972597e-06   0.000000e+00   5.972597e-06   0.000000e+00 
  5.593600e+04   5.992283e-06   0.000000e+00   5.992283e-06   0.000000e+00 
  5.606400e+04   5.950434e-06   0.000000e+00   5.950434e-06   0.000000e+00 
  5.619200e+04   6.124734e-06   0.000000e+00   6.124734e-06   0.000000e+00 
  5.632000e+04   6.067724e-06   0.000000e+00   6.067724e-06   0.000000e+00 
  5.644800e+04   6.012080e-06   0.000000e+00   6.012080e-06   0.000000e+00 
  5.657600e+04   5.990656e-06   0.000000e+00   5.990656e-06   0.000000e+00 
  5.670400e+04   5.900503e-06   0.000000e+00   5.900503e-06   0.000000e+00 
  5.683200e+04   5.971316e-06   0.000000e+00   5.971316e-06   0.000000e+00 
  5.696000e+04   6.236177e-06   0.000000e+00   6.236177e-06   0.000000e+00 
  5.708800e+04   8.471825e-06   0.000000e+00   8.471825e-06   0.000000e+00 
  5.721600e+04   9.607105e-06   0.000000e+00   9.607105e-06   0.000000e+00 
  5.734400e+04   6.565338e-06   0.000000e+00   6.565338e-06   0.000000e+00 
  5.747200e+04   6.330618e-06   0.000000e+00   6.330618e-06   0.000000e+00 
  5.760000e+04   6.611506e-06   0.000000e+00   6.611506e-06   0.000000e+00 
  5.772800e+04   6.224514e-06   0.000000e+00   6.224514e-06   0.000000e+00 
  5.785600e+04   6.701953e-06   0.000000e+00   6.701953e-06   0.000000e+00 
  5.798400e+04   7.415478e-06   0.000000e+00   7.415478e-06   0.000000e+00 
  5.811200e+04   6.597475e-06   0.000000e+00   6.597475e-06   0.000000e+00 
  5.824000e+04   6.402438e-06   0.000000e+00   6.402438e-06   0.000000e+00 
  5.836800e+04   6.251624e-06   0.000000e+00   6.251624e-06   0.000000e+00 
  5.849600e+04   6.254809e-06   0.000000e+00   6.254809e-06   0.000000e+00 
  5.862400e+04   6.964733e-06   0.000000e+00   6.964733e-06   0.000000e+00 
  5.875200e+04   9.459543e-06   0.000000e+00   9.459543e-06   0.000000e+00 
  5.888000e+04   7.616663e-06   0.000000e+00   7.616663e-06   0.000000e+00 
  5.900800e+04   6.515121e-06   0.000000e+00   6.515121e-06   0.000000e+00 
  5.913600e+04   6.837770e-06   0.000000e+00   6.837770e-06   0.000000e+00 
  5.926400e+04   6.909013e-06   0.000000e+00   6.909013e-06   0.000000e+00 
  5.939200e+04   6.979555e-06   0.000000e+00   6.979555e-06   0.000000e+00 
  5.952000e+04   7.422705e-06   0.000000e+00   7.422705e-06   0.000000e+00 
  5.964800e+04   6.652483e-06   0.000000e+00   6.652483e-06   0.000000e+00 
  5.977600e+04   6.579586e-06   0.000000e+00   6.579586e-06   0.000000e+00 
  5.990400e+04   7.048308e-06   0.000000e+00   7.048308e-06   0.000000e+00 
  6.003200e+04   6.801549e-06   0.000000e+00   6.801549e-06   0.000000e+00 
  6.016000e+04   6.642661e-06   0.000000e+00   6.642661e-06   0.000000e+00 
  6.028800e+04   7.101358e-06   0.000000e+00   7.101358e-06   0.000000e+00 
  6.041600e+04   7.486915e-06   0.000000e+00   7.486915e-06   0.000000e+00 
  6.054400e+04   6.594682e-06   0.000000e+00   6.594682e-06   0.000000e+00 
  6.067200e+04   6.485360e-06   0.000000e+00   6.485360e-06   0.000000e+00 
  6.080000e+04   6.805349e-06   0.000000e+00   6.805349e-06   0.000000e+00 
  6.092800e+04   6.576684e-06   0.000000e+00   6.576684e-06   0.000000e+00 
  6.105600e+04   6.468765e-06   0.000000e+00   6.468765e-06   0.000000e+00 
  6.118400e+04   6.492166e-06   0.000000e+00   6.492166e-06   0.000000e+00 
  6.131200e+04   6.505638e-06   0.000000e+00   6.505638e-06   0.000000e+00 
  6.144000e+04   6.661694e-06   0.000000e+00   6.661694e-06   0.000000e+00 
  6.156800e+04   6.788307e-06   0.000000e+00   6.788307e-06   0.000000e+00 
  6.169600e+04   6.624615e-06   0.000000e+00   6.624615e-06   0.000000e+00 
  6.182400e+04   6.608727e-06   0.000000e+00   6.608727e-06   0.000000e+00 
  6.195200e+04   6.727756e-06   0.000000e+00   6.727756e-06   0.000000e+00 
  6.208000e+04   6.742122e-06   0.000000e+00   6.742122e-06   0.000000e+00 
  6.220800e+04   6.732881e-06   0.000000e+00   6.732881e-06   0.000000e+00 
  6.233600e+04   6.739705e-06   0.000000e+00   6.739705e-06   0.000000e+00 
  6.246400e+04   7.128211e-06   0.000000e+00   7.128211e-06   0.000000e+00 
  6.259200e+04   7.033206e-06   0.000000e+00   7.033206e-06   0.000000e+00 
  6.272000e+04   7.233029e-06   0.000000e+00   7.233029e-06   0.000000e+00 
  6.284800e+04   6.888651e-06   0.000000e+00   6.888651e-06   0.000000e+00 
  6.297600e+04   6.787442e-06   0.000000e+00   6.787442e-06   0.000000e+00 
  6.310400e+04   6.710737e-06   0.000000e+00   6.710737e-06   0.000000e+00 
  6.323200e+04   6.717622e-06   0.000000e+00   6.717622e-06   0.000000e+00 
  6.336000e+04   6.741530e-06   0.000000e+00   6.741530e-06   0.000000e+00 
  6.348800e+04   6.697839e-06   0.000000e+00   6.697839e-06   0.000000e+00 
  6.361600e+04   6.630811e-06   0.000000e+00   6.630811e-06   0.000000e+00 
  6.374400e+04   6.851181e-06   0.000000e+00   6.851181e-06   0.000000e+00 
  6.387200e+04   6.809033e-06   0.000000e+00   6.809033e-06   0.000000e+00 
  6.400000e+04   6.841742e-06   0.000000e+00   6.841742e-06   0.000000e+00 
  6.412800e+04   7.378946e-06   0.000000e+00   7.378946e-06   0.000000e+00 
  6.425600e+04   7.757554e-06   0.000000e+00   7.757554e-06   0.000000e+00 
  6.438400e+04   7.618196e-06   0.000000e+00   7.618196e-06   0.000000e+00 
  6.451200e+04   7.173096e-06   0.000000e+00   7.173096e-06   0.000000e+00 
  6.464000e+04   6.925731e-06   0.000000e+00   6.925731e-06   0.000000e+00 
  6.476800e+04   6.845594e-06   0.000000e+00   6.845594e-06   0.000000e+00 
  6.489600e+04   6.700719e-06   0.000000e+00   6.700719e-06   0.000000e+00 
  6.502400e+04   6.797680e-06   0.000000e+00   6.797680e-06   0.000000e+00 
  6.515200e+04   6.901488e-06   0.000000e+00   6.901488e-06   0.000000e+00 
  6.528000e+04   6.634399e-06   0.000000e+00   6.634399e-06   0.000000e+00 
  6.540800e+04   6.626488e-06   0.000000e+00   6.626488e-06   0.000000e+00 
  6.553600e+04   6.739150e-06   0.000000e+00   6.739150e-06   0.000000e+00 
  6.566400e+04   6.846568e-06   0.000000e+00   6.846568e-06   0.000000e+00 
  6.579200e+04   6.870923e-06   0.000000e+00   6.870923e-06   0.000000e+00 
  6.592000e+04   7.025819e-06   0.000000e+00   7.025819e-06   0.000000e+00 
  6.604800e+04   7.037682e-06   0.000000e+00   7.037682e-06   0.000000e+00 
  6.617600e+04   7.029927e-06   0.000000e+00   7.029927e-06   0.000000e+00 
  6.630400e+04   7.136472e-06   0.000000e+00   7.136472e-06   0.000000e+00 
  6.643200e+04   1.027422e-05   0.000000e+00   1.027422e-05   0.000000e+00 
  6.656000e+04   1.105863e-05   0.000000e+00   1.105863e-05   0.000000e+00 
  6.668800e+04   7.490537e-06   0.000000e+00   7.490537e-06   0.000000e+00 
  6.681600e+04   6.994828e-06   0.000000e+00   6.994828e-06   0.000000e+00 
  6.694400e+04   6.933367e-06   0.000000e+00   6.933367e-06   0.000000e+00 
  6.707200e+04   6.929425e-06   0.000000e+00   6.929425e-06   0.000000e+00 
  6.720000e+04   7.033058e-06   0.000000e+00   7.033058e-06   0.000000e+00 
  6.732800e+04   6.972298e-06   0.000000e+00   6.972298e-06   0.000000e+00 
  6.745600e+04   6.915784e-06   0.000000e+00   6.915784e-06   0.000000e+00 
  6.758400e+04   7.239577e-06   0.000000e+00   7.239577e-06   0.000000e+00 
  6.771200e+04   1.608226e-05   0.000000e+00   1.608226e-05   0.000000e+00 
  6.784000e+04   1.812441e-05   0.000000e+00   1.812441e-05   0.000000e+00 
  6.796800e+04   8.357815e-06   0.000000e+00   8.357815e-06   0.000000e+00 
  6.809600e+04   6.999347e-06   0.000000e+00   6.999347e-06   0.000000e+00 
  6.822400e+04   7.167744e-06   0.000000e+00   7.167744e-06   0.000000e+00 
  6.835200e+04   6.965107e-06   0.000000e+00   6.965107e-06   0.000000e+00 
  6.848000e+04   6.953665e-06   0.000000e+00   6.953665e-06   0.000000e+00 
  6.860800e+04   7.005560e-06   0.000000e+00   7.005560e-06   0.000000e+00 
  6.873600e+04   6.995816e-06   0.000000e+00   6.995816e-06   0.000000e+00 
  6.886400e+04   7.243676e-06   0.000000e+00   7.243676e-06   0.000000e+00 
  6.899200e+04   7.371681e-06   0.000000e+00   7.371681e-06   0.000000e+00 
  6.912000e+04   7.436596e-06   0.000000e+00   7.436596e-06   0.000000e+00 
  6.924800e+04   1.088644e-05   0.000000e+00   1.088644e-05   0.000000e+00 
  6.937600e+04   1.612910e-05   0.000000e+00   1.612910e-05   0.000000e+00 
  6.950400e+04   2.128211e-05   0.000000e+00   2.128211e-05   0.000000e+00 
  6.963200e+04   1.242112e-05   0.000000e+00   1.242112e-05   0.000000e+00 
  6.976000e+04   7.575186e-06   0.000000e+00   7.575186e-06   0.000000e+00 
  6.988800e+04   7.375806e-06   0.000000e+00   7.375806e-06   0.000000e+00 
  7.001600e+04   7.416950e-06   0.000000e+00   7.416950e-06   0.000000e+00 
  7.014400e+04   7.289849e-06   0.000000e+00   7.289849e-06   0.000000e+00 
  7.027200e+04   7.142460e-06   0.000000e+00   7.142460e-06   0.000000e+00 
  7.040000e+04   7.156539e-06   0.000000e+00   7.156539e-06   0.000000e+00 
  7.052800e+04   7.314175e-06   0.000000e+00   7.314175e-06   0.000000e+00 
  7.065600e+04   7.383216e-06   0.000000e+00   7.383216e-06   0.000000e+00 
  7.078400e+04   7.991019e-06   0.000000e+00   7.991019e-06   0.000000e+00 
  7.091200e+04   7.841808e-06   0.000000e+00   7.841808e-06   0.000000e+00 
  7.104000e+04   1.283124e-05   0.000000e+00   1.283124e-05   0.000000e+00 
  7.116800e+04   2.877597e-05   0.000000e+00   2.877597e-05   0.000000e+00 
  7.129600e+04   1.934967e-05   0.000000e+00   1.934967e-05   0.000000e+00 
  7.142400e+04   7.592486e-06   0.000000e+00   7.592486e-06   0.000000e+00 
  7.155200e+04   7.572589e-06   0.000000e+00   7.572589e-06   0.000000e+00 
  7.168000e+04   7.391526e-06   0.000000e+00   7.391526e-06   0.000000e+00 
  7.180800e+04   7.525587e-06   0.000000e+00   7.525587e-06   0.000000e+00 
  7.193600e+04   7.513719e-06   0.000000e+00   7.513719e-06   0.000000e+00 
  7.206400e+04   7.267788e-06   0.000000e+00   7.267788e-06   0.000000e+00 
  7.219200e+04   7.354074e-06   0.000000e+00   7.354074e-06   0.000000e+00 
  7.232000e+04   7.467308e-06   0.000000e+00   7.467308e-06   0.000000e+00 
  7.244800e+04   7.365673e-06   0.000000e+00   7.365673e-06   0.000000e+00 
  7.257600e+04   7.459384e-06   0.000000e+00   7.459384e-06   0.000000e+00 
  7.270400e+04   7.514107e-06   0.000000e+00   7.514107e-06   0.000000e+00 
  7.283200e+04   7.581836e-06   0.000000e+00   7.581836e-06   0.000000e+00 
  7.296000e+04   7.548881e-06   0.000000e+00   7.548881e-06   0.000000e+00 
  7.308800e+04   7.574008e-06   0.000000e+00   7.574008e-06   0.000000e+00 
  7.321600e+04   7.599792e-06   0.000000e+00   7.599792e-06   0.000000e+00 
  7.334400e+04   1.659862e-05   0.000000e+00   1.659862e-05   0.000000e+00 
  7.347200e+04   5.299936e-05   0.000000e+00   5.299936e-05   0.000000e+00 
  7.360000e+04   4.288759e-05   0.000000e+00   4.288759e-05   0.000000e+00 
  7.372800e+04   9.709204e-06   0.000000e+00   9.709204e-06   0.000000e+00 
  7.385600e+04   8.276119e-06   0.000000e+00   8.276119e-06   0.000000e+00 
  7.398400e+04   7.701930e-06   0.000000e+00   7.701930e-06   0.000000e+00 
  7.411200e+04   7.699738e-06   0.000000e+00   7.699738e-06   0.000000e+00 
  7.424000e+04   7.601866e-06   0.000000e+00   7.601866e-06   0.000000e+00 
  7.436800e+04   7.574206e-06   0.000000e+00   7.574206e-06   0.000000e+00 
  7.449600e+04   8.563850e-06   0.000000e+00   8.563850e-06   0.000000e+00 
  7.462400e+04   8.724991e-06   0.000000e+00   8.724991e-06   0.000000e+00 
  7.475200e+04   7.935038e-06   0.000000e+00   7.935038e-06   0.000000e+00 
  7.488000e+04   8.089913e-06   0.000000e+00   8.089913e-06   0.000000e+00 
  7.500800e+04   7.819302e-06   0.000000e+00   7.819302e-06   0.000000e+00 
  7.513600e+04   7.810551e-06   0.000000e+00   7.810551e-06   0.000000e+00 
  7.526400e+04   7.815795e-06   0.000000e+00   7.815795e-06   0.000000e+00 
  7.539200e+04   7.712797e-06   0.000000e+00   7.712797e-06   0.000000e+00 
  7.552000e+04   7.658609e-06   0.000000e+00   7.658609e-06   0.000000e+00 
  7.564800e+04   7.860002e-06   0.000000e+00   7.860002e-06   0.000000e+00 
  7.577600e+04   8.123670e-06   0.000000e+00   8.123670e-06   0.000000e+00 
  7.590400e+04   8.005219e-06   0.000000e+00   8.005219e-06   0.000000e+00 
  7.603200e+04   7.909723e-06   0.000000e+00   7.909723e-06   0.000000e+00 
  7.616000e+04   8.004108e-06   0.000000e+00   8.004108e-06   0.000000e+00 
  7.628800e+04   7.952513e-06   0.000000e+00   7.952513e-06   0.000000e+00 
  7.641600e+04   7.900598e-06   0.000000e+00   7.900598e-06   0.000000e+00 
  7.654400e+04   7.969156e-06   0.000000e+00   7.969156e-06   0.000000e+00 
  7.667200e+04   7.923133e-06   0.000000e+00   7.923133e-06   0.000000e+00 
  7.680000e+04   7.838782e-06   0.000000e+00   7.838782e-06   0.000000e+00 
  7.692800e+04   7.759698e-06   0.000000e+00   7.759698e-06   0.000000e+00 
  7.705600e+04   7.834711e-06   0.000000e+00   7.834711e-06   0.000000e+00 
  7.718400e+04   7.901512e-06   0.000000e+00   7.901512e-06   0.000000e+00 
  7.731200e+04   7.886501e-06   0.000000e+00   7.886501e-06   0.000000e+00 
  7.744000e+04   7.897574e-06   0.000000e+00   7.897574e-06   0.000000e+00 
  7.756800e+04   8.021059e-06   0.000000e+00   8.021059e-06   0.000000e+00 
  7.769600e+04   7.987753e-06   0.000000e+00   7.987753e-06   0.000000e+00 
  7.782400e+04   8.050941e-06   0.000000e+00   8.050941e-06   0.000000e+00 
  7.795200e+04   8.104697e-06   0.000000e+00   8.104697e-06   0.000000e+00 
  7.808000e+04   8.251737e-06   0.000000e+00   8.251737e-06   0.000000e+00 
  7.820800e+04   8.189734e-06   0.000000e+00   8.189734e-06   0.000000e+00 
  7.833600e+04   9.624664e-06   0.000000e+00   9.624664e-06   0.000000e+00 
  7.846400e+04   8.679896e-06   0.000000e+00   8.679896e-06   0.000000e+00 
  7.859200e+04   7.760472e-06   0.000000e+00   7.760472e-06   0.000000e+00 
  7.872000e+04   7.882974e-06   0.000000e+00   7.882974e-06   0.000000e+00 
  7.884800e+04   7.930140e-06   0.000000e+00   7.930140e-06   0.000000e+00 
  7.897600e+04   7.972963e-06   0.000000e+00   7.972963e-06   0.000000e+00 
  7.910400e+04   8.084931e-06   0.000000e+00   8.084931e-06   0.000000e+00 
  7.923200e+04   8.062354e-06   0.000000e+00   8.062354e-06   0.000000e+00 
  7.936000e+04   8.135037e-06   0.000000e+00   8.135037e-06   0.000000e+00 
  7.948800e+04   8.239214e-06   0.000000e+00   8.239214e-06   0.000000e+00 
  7.961600e+04   8.208265e-06   0.000000e+00   8.208265e-06   0.000000e+00 
  7.974400e+04   8.100824e-06   0.000000e+00   8.100824e-06   0.000000e+00 
  7.987200e+04   7.882185e-06   0.000000e+00   7.882185e-06   0.000000e+00 
  8.000000e+04   7.894692e-06   0.000000e+00   7.894692e-06   0.000000e+00 
  8.012800e+04   8.094049e-06   0.000000e+00   8.094049e-06   0.000000e+00 
  8.025600e+04   8.011126e-06   0.000000e+00   8.011126e-06   0.000000e+00 
  8.038400e+04   8.251030e-06   0.000000e+00   8.251030e-06   0.000000e+00 
  8.051200e+04   8.496409e-06   0.000000e+00   8.496409e-06   0.000000e+00 
  8.064000e+04   8.251031e-06   0.000000e+00   8.251031e-06   0.000000e+00 
  8.076800e+04   8.110316e-06   0.000000e+00   8.110316e-06   0.000000e+00 
  8.089600e+04   8.073044e-06   0.000000e+00   8.073044e-06   0.000000e+00 
  8.102400e+04   8.177231e-06   0.000000e+00   8.177231e-06   0.000000e+00 
  8.115200e+04   8.339386e-06   0.000000e+00   8.339386e-06   0.000000e+00 
  8.128000e+04   8.468501e-06   0.000000e+00   8.468501e-06   0.000000e+00 
  8.140800e+04   8.848782e-06   0.000000e+00   8.848782e-06   0.000000e+00 
  8.153600e+04   8.817228e-06   0.000000e+00   8.817228e-06   0.000000e+00 
  8.166400e+04   8.267539e-06   0.000000e+00   8.267539e-06   0.000000e+00 
  8.179200e+04   8.246220e-06   0.000000e+00   8.246220e-06   0.000000e+00 
  8.192000e+04   8.476373e-06   0.000000e+00   8.476373e-06   0.000000e+00 
  8.204800e+04   8.424226e-06   0.000000e+00   8.424226e-06   0.000000e+00 
  8.217600e+04   8.534075e-06   0.000000e+00   8.534075e-06   0.000000e+00 
  8.230400e+04   8.384545e-06   0.000000e+00   8.384545e-06   0.000000e+00 
  8.243200e+04   8.128563e-06   0.000000e+00   8.128563e-06   0.000000e+00 
  8.256000e+04   8.296703e-06   0.000000e+00   8.296703e-06   0.000000e+00 
  8.268800e+04   8.395523e-06   0.000000e+00   8.395523e-06   0.000000e+00 
  8.281600e+04   8.511149e-06   0.000000e+00   8.511149e-06   0.000000e+00 
  8.294400e+04   8.498918e-06   0.000000e+00   8.498918e-06   0.000000e+00 
  8.307200e+04   8.448118e-06   0.000000e+00   8.448118e-06   0.000000e+00 
  8.320000e+04   8.376325e-06   0.000000e+00   8.376325e-06   0.000000e+00 
  8.332800e+04   8.428176e-06   0.000000e+00   8.428176e-06   0.000000e+00 
  8.345600e+04   8.513934e-06   0.000000e+00   8.513934e-06   0.000000e+00 
  8.358400e+04   8.413059e-06   0.000000e+00   8.413059e-06   0.000000e+00 
  8.371200e+04   8.373485e-06   0.000000e+00   8.373485e-06   0.000000e+00 
  8.384000e+04   8.619970e-06   0.000000e+00   8.619970e-06   0.000000e+00 
  8.396800e+04   8.797976e-06   0.000000e+00   8.797976e-06   0.000000e+00 
  8.409600e+04   8.575567e-06   0.000000e+00   8.575567e-06   0.000000e+00 
  8.422400e+04   8.528892e-06   0.000000e+00   8.528892e-06   0.000000e+00 
  8.435200e+04   8.495458e-06   0.000000e+00   8.495458e-06   0.000000e+00 
  8.448000e+04   8.349306e-06   0.000000e+00   8.349306e-06   0.000000e+00 
  8.460800e+04   8.562903e-06   0.000000e+00   8.562903e-06   0.000000e+00 
  8.473600e+04   8.650804e-06   0.000000e+00   8.650804e-06   0.000000e+00 
  8.486400e+04   8.704938e-06   0.000000e+00   8.704938e-06   0.000000e+00 
  8.499200e+04   8.584102e-06   0.000000e+00   8.584102e-06   0.000000e+00 
  8.512000e+04   8.438629e-06   0.000000e+00   8.438629e-06   0.000000e+00 
  8.524800e+04   8.579050e-06   0.000000e+00   8.579050e-06   0.000000e+00 
  8.537600e+04   8.541805e-06   0.000000e+00   8.541805e-06   0.000000e+00 
  8.550400e+04   8.574318e-06   0.000000e+00   8.574318e-06   0.000000e+00 
  8.563200e+04   8.756618e-06   0.000000e+00   8.756618e-06   0.000000e+00 
  8.576000e+04   8.771205e-06   0.000000e+00   8.771205e-06   0.000000e+00 
  8.588800e+04   8.668659e-06   0.000000e+00   8.668659e-06   0.000000e+00 
  8.601600e+04   8.641267e-06   0.000000e+00   8.641267e-06   0.000000e+00 
  8.614400e+04   8.890784e-06   0.000000e+00   8.890784e-06   0.000000e+00 
  8.627200e+04   8.803774e-06   0.000000e+00   8.803774e-06   0.000000e+00 
  8.640000e+04   8.709788e-06   0.000000e+00   8.709788e-06   0.000000e+00 
  8.652800e+04   8.835666e-06   0.000000e+00   8.835666e-06   0.000000e+00 
  8.665600e+04   8.777209e-06   0.000000e+00   8.777209e-06   0.000000e+00 
  8.678400e+04   8.645205e-06   0.000000e+00   8.645205e-06   0.000000e+00 
  8.691200e+04   8.856524e-06   0.000000e+00   8.856524e-06   0.000000e+00 
  8.704000e+04   9.001011e-06   0.000000e+00   9.001011e-06   0.000000e+00 
  8.716800e+04   9.080842e-06   0.000000e+00   9.080842e-06   0.000000e+00 
  8.729600e+04   8.864411e-06   0.000000e+00   8.864411e-06   0.000000e+00 
  8.742400e+04   9.066021e-06   0.000000e+00   9.066021e-06   0.000000e+00 
  8.755200e+04   8.884890e-06   0.000000e+00   8.884890e-06   0.000000e+00 
  8.768000e+04   8.881157e-06   0.000000e+00   8.881157e-06   0.000000e+00 
  8.780800e+04   8.922705e-06   0.000000e+00   8.922705e-06   0.000000e+00 
  8.793600e+04   8.873047e-06   0.000000e+00   8.873047e-06   0.000000e+00 
  8.806400e+04   8.899930e-06   0.000000e+00   8.899930e-06   0.000000e+00 
  8.819200e+04   8.841263e-06   0.000000e+00   8.841263e-06   0.000000e+00 
  8.832000e+04   9.111160e-06   0.000000e+00   9.111160e-06   0.000000e+00 
  8.844800e+04   9.188365e-06   0.000000e+00   9.188365e-06   0.000000e+00 
  8.857600e+04   9.455966e-06   0.000000e+00   9.455966e-06   0.000000e+00 
  8.870400e+04   9.559459e-06   0.000000e+00   9.559459e-06   0.000000e+00 
  8.883200e+04   9.550954e-06   0.000000e+00   9.550954e-06   0.000000e+00 
  8.896000e+04   9.491040e-06   0.000000e+00   9.491040e-06   0.000000e+00 
  8.908800e+04   9.657808e-06   0.000000e+00   9.657808e-06   0.000000e+00 
  8.921600e+04   9.701230e-06   0.000000e+00   9.701230e-06   0.000000e+00 
  8.934400e+04   9.520627e-06   0.000000e+00   9.520627e-06   0.000000e+00 
  8.947200e+04   9.506056e-06   0.000000e+00   9.506056e-06   0.000000e+00 
  8.960000e+04   9.683306e-06   0.000000e+00   9.683306e-06   0.000000e+00 
  8.972800e+04   9.772813e-06   0.000000e+00   9.772813e-06   0.000000e+00 
  8.985600e+04   9.317269e-06   0.000000e+00   9.317269e-06   0.000000e+00 
  8.998400e+04   9.267401e-06   0.000000e+00   9.267401e-06   0.000000e+00 
  9.011200e+04   9.642212e-06   0.000000e+00   9.642212e-06   0.000000e+00 
  9.024000e+04   9.570477e-06   0.000000e+00   9.570477e-06   0.000000e+00 
  9.036800e+04   9.576419e-06   0.000000e+00   9.576419e-06   0.000000e+00 
  9.049600e+04   9.899410e-06   0.000000e+00   9.899410e-06   0.000000e+00 
  9.062400e+04   9.898636e-06   0.000000e+00   9.898636e-06   0.000000e+00 
  9.075200e+04   9.724651e-06   0.000000e+00   9.724651e-06   0.000000e+00 
  9.088000e+04   9.520281e-06   0.000000e+00   9.520281e-06   0.000000e+00 
  9.100800e+04   9.307590e-06   0.000000e+00   9.307590e-06   0.000000e+00 
  9.113600e+04   9.283295e-06   0.000000e+00   9.283295e-06   0.000000e+00 
  9.126400e+04   9.491105e-06   0.000000e+00   9.491105e-06   0.000000e+00 
  9.139200e+04   9.389491e-06   0.000000e+00   9.389491e-06   0.000000e+00 
  9.152000e+04   9.485595e-06   0.000000e+00   9.485595e-06   0.000000e+00 
  9.164800e+04   9.588258e-06   0.000000e+00   9.588258e-06   0.000000e+00 
  9.177600e+04   9.417713e-06   0.000000e+00   9.417713e-06   0.000000e+00 
  9.190400e+04   9.410113e-06   0.000000e+00   9.410113e-06   0.000000e+00 
  9.203200e+04   9.634497e-06   0.000000e+00   9.634497e-06   0.000000e+00 
  9.216000e+04   9.558659e-06   0.000000e+00   9.558659e-06   0.000000e+00 
  9.228800e+04   9.410920e-06   0.000000e+00   9.410920e-06   0.000000e+00 
  9.241600e+04   9.539977e-06   0.000000e+00   9.539977e-06   0.000000e+00 
  9.254400e+04   9.609383e-06   0.000000e+00   9.609383e-06   0.000000e+00 
  9.267200e+04   9.623974e-06   0.000000e+00   9.623974e-06   0.000000e+00 
  9.280000e+04   9.515556e-06   0.000000e+00   9.515556e-06   0.000000e+00 
  9.292800e+04   9.402244e-06   0.000000e+00   9.402244e-06   0.000000e+00 
  9.305600e+04   9.509768e-06   0.000000e+00   9.509768e-06   0.000000e+00 
  9.318400e+04   9.369225e-06   0.000000e+00   9.369225e-06   0.000000e+00 
  9.331200e+04   9.487801e-06   0.000000e+00   9.487801e-06   0.000000e+00 
  9.344000e+04   9.802549e-06   0.000000e+00   9.802549e-06   0.000000e+00 
  9.356800e+04   9.708251e-06   0.000000e+00   9.708251e-06   0.000000e+00 
  9.369600e+04   9.893709e-06   0.000000e+00   9.893709e-06   0.000000e+00 
  9.382400e+04   9.874550e-06   0.000000e+00   9.874550e-06   0.000000e+00 
  9.395200e+04   9.801501e-06   0.000000e+00   9.801501e-06   0.000000e+00 
  9.408000e+04   9.649249e-06   0.000000e+00   9.649249e-06   0.000000e+00 
  9.420800e+04   9.702848e-06   0.000000e+00   9.702848e-06   0.000000e+00 
  9.433600e+04   9.674950e-06   0.000000e+00   9.674950e-06   0.000000e+00 
  9.446400e+04   9.660565e-06   0.000000e+00   9.660565e-06   0.000000e+00 
  9.459200e+04   9.648360e-06   0.000000e+00   9.648360e-06   0.000000e+00 
  9.472000e+04   9.708369e-06   0.000000e+00   9.708369e-06   0.000000e+00 
  9.484800e+04   9.826110e-06   0.000000e+00   9.826110e-06   0.000000e+00 
  9.497600e+04   9.988244e-06   0.000000e+00   9.988244e-06   0.000000e+00 
  9.510400e+04   9.928619e-06   0.000000e+00   9.928619e-06   0.000000e+00 
  9.523200e+04   9.915839e-06   0.000000e+00   9.915839e-06   0.000000e+00 
  9.536000e+04   1.026339e-05   0.000000e+00   1.026339e-05   0.000000e+00 
  9.548800e+04   1.138175e-05   0.000000e+00   1.138175e-05   0.000000e+00 
  9.561600e+04   1.185798e-05   0.000000e+00   1.185798e-05   0.000000e+00 
  9.574400e+04   1.021462e-05   0.000000e+00   1.021462e-05   0.000000e+00 
  9.587200e+04   1.013758e-05   0.000000e+00   1.013758e-05   0.000000e+00 
  9.600000e+04   1.182523e-05   0.000000e+00   1.182523e-05   0.000000e+00 
  9.612800e+04   1.138619e-05   0.000000e+00   1.138619e-05   0.000000e+00 
  9.625600e+04   1.015089e-05   0.000000e+00   1.015089e-05   0.000000e+00 
  9.638400e+04   1.015456e-05   0.000000e+00   1.015456e-05   0.000000e+00 
  9.651200e+04   1.011708e-05   0.000000e+00   1.011708e-05   0.000000e+00 
  9.664000e+04   1.009055e-05   0.000000e+00   1.009055e-05   0.000000e+00 
  9.676800e+04   9.963600e-06   0.000000e+00   9.963600e-06   0.000000e+00 
  9.689600e+04   1.005599e-05   0.000000e+00   1.005599e-05   0.000000e+00 
  9.702400e+04   1.003460e-05   0.000000e+00   1.003460e-05   0.000000e+00 
  9.715200e+04   1.017972e-05   0.000000e+00   1.017972e-05   0.000000e+00 
  9.728000e+04   1.024901e-05   0.000000e+00   1.024901e-05   0.000000e+00 
  9.740800e+04   1.009951e-05   0.000000e+00   1.009951e-05   0.000000e+00 
  9.753600e+04   1.018187e-05   0.000000e+00   1.018187e-05   0.000000e+00 
  9.766400e+04   1.011461e-05   0.000000e+00   1.011461e-05   0.000000e+00 
  9.779200e+04   1.032389e-05   0.000000e+00   1.032389e-05   0.000000e+00 
  9.792000e+04   1.170094e-05   0.000000e+00   1.170094e-05   0.000000e+00 
  9.804800e+04   1.094029e-05   0.000000e+00   1.094029e-05   0.000000e+00 
  9.817600e+04   1.025771e-05   0.000000e+00   1.025771e-05   0.000000e+00 
  9.830400e+04   1.023049e-05   0.000000e+00   1.023049e-05   0.000000e+00 
  9.843200e+04   1.037676e-05   0.000000e+00   1.037676e-05   0.000000e+00 
  9.856000e+04   1.036665e-05   0.000000e+00   1.036665e-05   0.000000e+00 
  9.868800e+04   1.025484e-05   0.000000e+00   1.025484e-05   0.000000e+00 
  9.881600e+04   1.012916e-05   0.000000e+00   1.012916e-05   0.000000e+00 
  9.894400e+04   1.027707e-05   0.000000e+00   1.027707e-05   0.000000e+00 
  9.907200e+04   1.013859e-05   0.000000e+00   1.013859e-05   0.000000e+00 
  9.920000e+04   1.028993e-05   0.000000e+00   1.028993e-05   0.000000e+00 
  9.932800e+04   1.055178e-05   0.000000e+00   1.055178e-05   0.000000e+00 
  9.945600e+04   1.157630e-05   0.000000e+00   1.157630e-05   0.000000e+00 
  9.958400e+04   1.943000e-05   0.000000e+00   1.943000e-05   0.000000e+00 
  9.971200e+04   2.504272e-05   0.000000e+00   2.504272e-05   0.000000e+00 
  9.984000e+04   2.438829e-05   0.000000e+00   2.438829e-05   0.000000e+00 
  9.996800e+04   1.662701e-05   0.000000e+00   1.662701e-05   0.000000e+00 
  1.000960e+05   1.152756e-05   0.000000e+00   1.152756e-05   0.000000e+00 
  1.002240e+05   1.113831e-05   0.000000e+00   1.113831e-05   0.000000e+00 
  1.003520e+05   1.053598e-05   0.000000e+00   1.053598e-05   0.000000e+00 
  1.004800e+05   1.063782e-05   0.000000e+00   1.063782e-05   0.000000e+00 
  1.006080e+05   1.085830e-05   0.000000e+00   1.085830e-05   0.000000e+00 
  1.007360e+05   1.068528e-05   0.000000e+00   1.068528e-05   0.000000e+00 
  1.008640e+05   1.052708e-05   0.000000e+00   1.052708e-05   0.000000e+00 
  1.009920e+05   1.065714e-05   0.000000e+00   1.065714e-05   0.000000e+00 
  1.011200e+05   1.067459e-05   0.000000e+00   1.067459e-05   0.000000e+00 
  1.012480e+05   1.079143e-05   0.000000e+00   1.079143e-05   0.000000e+00 
  1.013760e+05   1.071007e-05   0.000000e+00   1.071007e-05   0.000000e+00 
  1.015040e+05   1.101899e-05   0.000000e+00   1.101899e-05   0.000000e+00 
  1.016320e+05   1.101983e-05   0.000000e+00   1.101983e-05   0.000000e+00 
  1.017600e+05   1.065376e-05   0.000000e+00   1.065376e-05   0.000000e+00 
  1.018880e+05   1.077327e-05   0.000000e+00   1.077327e-05   0.000000e+00 
  1.020160e+05   1.079178e-05   0.000000e+00   1.079178e-05   0.000000e+00 
  1.021440e+05   1.081399e-05   0.000000e+00   1.081399e-05   0.000000e+00 
  1.022720e+05   1.093622e-05   0.000000e+00   1.093622e-05   0.000000e+00 
  1.024000e+05   1.076514e-05   0.000000e+00   1.076514e-05   0.000000e+00 
