  0.000000e+00   3.551196e-05   0.000000e+00   3.551196e-05   0.000000e+00 
  2.500000e-01   1.796471e-05   0.000000e+00   1.796471e-05   0.000000e+00 
  5.000000e-01   1.449049e-06   0.000000e+00   1.449049e-06   0.000000e+00 
  7.500000e-01   1.206355e-06   0.000000e+00   1.206355e-06   0.000000e+00 
  1.000000e+00   1.135067e-06   0.000000e+00   1.135067e-06   0.000000e+00 
  1.250000e+00   9.688692e-07   0.000000e+00   9.688692e-07   0.000000e+00 
  1.500000e+00   9.629695e-07   0.000000e+00   9.629695e-07   0.000000e+00 
  1.750000e+00   1.015180e-06   0.000000e+00   1.015180e-06   0.000000e+00 
  2.000000e+00   9.072443e-07   0.000000e+00   9.072443e-07   0.000000e+00 
  2.250000e+00   8.854785e-07   0.000000e+00   8.854785e-07   0.000000e+00 
  2.500000e+00   6.469630e-07   0.000000e+00   6.469630e-07   0.000000e+00 
  2.750000e+00   4.942467e-07   0.000000e+00   4.942467e-07   0.000000e+00 
  3.000000e+00   6.014093e-07   0.000000e+00   6.014093e-07   0.000000e+00 
  3.250000e+00   5.730862e-07   0.000000e+00   5.730862e-07   0.000000e+00 
  3.500000e+00   4.691348e-07   0.000000e+00   4.691348e-07   0.000000e+00 
  3.750000e+00   3.960690e-07   0.000000e+00   3.960690e-07   0.000000e+00 
  4.000000e+00   5.152556e-07   0.000000e+00   5.152556e-07   0.000000e+00 
  4.250000e+00   4.679315e-07   0.000000e+00   4.679315e-07   0.000000e+00 
  4.500000e+00   4.186392e-07   0.000000e+00   4.186392e-07   0.000000e+00 
  4.750000e+00   3.765923e-07   0.000000e+00   3.765923e-07   0.000000e+00 
  5.000000e+00   4.000294e-07   0.000000e+00   4.000294e-07   0.000000e+00 
  5.250000e+00   4.856195e-07   0.000000e+00   4.856195e-07   0.000000e+00 
  5.500000e+00   4.027698e-07   0.000000e+00   4.027698e-07   0.000000e+00 
  5.750000e+00   4.107595e-07   0.000000e+00   4.107595e-07   0.000000e+00 
  6.000000e+00   4.447337e-07   0.000000e+00   4.447337e-07   0.000000e+00 
  6.250000e+00   4.464888e-07   0.000000e+00   4.464888e-07   0.000000e+00 
  6.500000e+00   4.972821e-07   0.000000e+00   4.972821e-07   0.000000e+00 
  6.750000e+00   4.438854e-07   0.000000e+00   4.438854e-07   0.000000e+00 
  7.000000e+00   4.311885e-07   0.000000e+00   4.311885e-07   0.000000e+00 
  7.250000e+00   4.061943e-07   0.000000e+00   4.061943e-07   0.000000e+00 
  7.500000e+00   3.999261e-07   0.000000e+00   3.999261e-07   0.000000e+00 
  7.750000e+00   3.849178e-07   0.000000e+00   3.849178e-07   0.000000e+00 
  8.000000e+00   3.660611e-07   0.000000e+00   3.660611e-07   0.000000e+00 
  8.250000e+00   4.636482e-07   0.000000e+00   4.636482e-07   0.000000e+00 
  8.500000e+00   4.287326e-07   0.000000e+00   4.287326e-07   0.000000e+00 
  8.750000e+00   4.352437e-07   0.000000e+00   4.352437e-07   0.000000e+00 
  9.000000e+00   4.056240e-07   0.000000e+00   4.056240e-07   0.000000e+00 
  9.250000e+00   3.467964e-07   0.000000e+00   3.467964e-07   0.000000e+00 
  9.500000e+00   4.221752e-07   0.000000e+00   4.221752e-07   0.000000e+00 
  9.750000e+00   3.533874e-07   0.000000e+00   3.533874e-07   0.000000e+00 
  1.000000e+01   3.740444e-07   0.000000e+00   3.740444e-07   0.000000e+00 
  1.025000e+01   4.335969e-07   0.000000e+00   4.335969e-07   0.000000e+00 
  1.050000e+01   3.790692e-07   0.000000e+00   3.790692e-07   0.000000e+00 
  1.075000e+01   3.807871e-07   0.000000e+00   3.807871e-07   0.000000e+00 
  1.100000e+01   3.719177e-07   0.000000e+00   3.719177e-07   0.000000e+00 
  1.125000e+01   3.544842e-07   0.000000e+00   3.544842e-07   0.000000e+00 
  1.150000e+01   3.878909e-07   0.000000e+00   3.878909e-07   0.000000e+00 
  1.175000e+01   4.290052e-07   0.000000e+00   4.290052e-07   0.000000e+00 
  1.200000e+01   3.867097e-07   0.000000e+00   3.867097e-07   0.000000e+00 
  1.225000e+01   3.913193e-07   0.000000e+00   3.913193e-07   0.000000e+00 
  1.250000e+01   3.486873e-07   0.000000e+00   3.486873e-07   0.000000e+00 
  1.275000e+01   3.680492e-07   0.000000e+00   3.680492e-07   0.000000e+00 
  1.300000e+01   3.486973e-07   0.000000e+00   3.486973e-07   0.000000e+00 
  1.325000e+01   4.311200e-07   0.000000e+00   4.311200e-07   0.000000e+00 
  1.350000e+01   4.205381e-07   0.000000e+00   4.205381e-07   0.000000e+00 
  1.375000e+01   3.374961e-07   0.000000e+00   3.374961e-07   0.000000e+00 
  1.400000e+01   3.698128e-07   0.000000e+00   3.698128e-07   0.000000e+00 
  1.425000e+01   3.182015e-07   0.000000e+00   3.182015e-07   0.000000e+00 
  1.450000e+01   3.505405e-07   0.000000e+00   3.505405e-07   0.000000e+00 
  1.475000e+01   3.910680e-07   0.000000e+00   3.910680e-07   0.000000e+00 
  1.500000e+01   4.050075e-07   0.000000e+00   4.050075e-07   0.000000e+00 
  1.525000e+01   4.030443e-07   0.000000e+00   4.030443e-07   0.000000e+00 
  1.550000e+01   3.972607e-07   0.000000e+00   3.972607e-07   0.000000e+00 
  1.575000e+01   3.465869e-07   0.000000e+00   3.465869e-07   0.000000e+00 
  1.600000e+01   3.809513e-07   0.000000e+00   3.809513e-07   0.000000e+00 
  1.625000e+01   3.282775e-07   0.000000e+00   3.282775e-07   0.000000e+00 
  1.650000e+01   3.973509e-07   0.000000e+00   3.973509e-07   0.000000e+00 
  1.675000e+01   3.957744e-07   0.000000e+00   3.957744e-07   0.000000e+00 
  1.700000e+01   4.055989e-07   0.000000e+00   4.055989e-07   0.000000e+00 
  1.725000e+01   3.366719e-07   0.000000e+00   3.366719e-07   0.000000e+00 
  1.750000e+01   3.243504e-07   0.000000e+00   3.243504e-07   0.000000e+00 
  1.775000e+01   3.138657e-07   0.000000e+00   3.138657e-07   0.000000e+00 
  1.800000e+01   3.639105e-07   0.000000e+00   3.639105e-07   0.000000e+00 
  1.825000e+01   3.283977e-07   0.000000e+00   3.283977e-07   0.000000e+00 
  1.850000e+01   3.595183e-07   0.000000e+00   3.595183e-07   0.000000e+00 
  1.875000e+01   4.300893e-07   0.000000e+00   4.300893e-07   0.000000e+00 
  1.900000e+01   3.740600e-07   0.000000e+00   3.740600e-07   0.000000e+00 
  1.925000e+01   3.776983e-07   0.000000e+00   3.776983e-07   0.000000e+00 
  1.950000e+01   3.479136e-07   0.000000e+00   3.479136e-07   0.000000e+00 
  1.975000e+01   3.756143e-07   0.000000e+00   3.756143e-07   0.000000e+00 
  2.000000e+01   2.847056e-07   0.000000e+00   2.847056e-07   0.000000e+00 
  2.025000e+01   3.408743e-07   0.000000e+00   3.408743e-07   0.000000e+00 
  2.050000e+01   2.386585e-07   0.000000e+00   2.386585e-07   0.000000e+00 
  2.075000e+01   2.779212e-07   0.000000e+00   2.779212e-07   0.000000e+00 
  2.100000e+01   3.339619e-07   0.000000e+00   3.339619e-07   0.000000e+00 
  2.125000e+01   4.702809e-07   0.000000e+00   4.702809e-07   0.000000e+00 
  2.150000e+01   5.007947e-07   0.000000e+00   5.007947e-07   0.000000e+00 
  2.175000e+01   3.873757e-07   0.000000e+00   3.873757e-07   0.000000e+00 
  2.200000e+01   3.452721e-07   0.000000e+00   3.452721e-07   0.000000e+00 
  2.225000e+01   3.947141e-07   0.000000e+00   3.947141e-07   0.000000e+00 
  2.250000e+01   3.057185e-07   0.000000e+00   3.057185e-07   0.000000e+00 
  2.275000e+01   3.635835e-07   0.000000e+00   3.635835e-07   0.000000e+00 
  2.300000e+01   3.690684e-07   0.000000e+00   3.690684e-07   0.000000e+00 
  2.325000e+01   3.679117e-07   0.000000e+00   3.679117e-07   0.000000e+00 
  2.350000e+01   4.099616e-07   0.000000e+00   4.099616e-07   0.000000e+00 
  2.375000e+01   4.680705e-07   0.000000e+00   4.680705e-07   0.000000e+00 
  2.400000e+01   3.639159e-07   0.000000e+00   3.639159e-07   0.000000e+00 
  2.425000e+01   3.135705e-07   0.000000e+00   3.135705e-07   0.000000e+00 
  2.450000e+01   3.542488e-07   0.000000e+00   3.542488e-07   0.000000e+00 
  2.475000e+01   2.514234e-07   0.000000e+00   2.514234e-07   0.000000e+00 
  2.500000e+01   3.372800e-07   0.000000e+00   3.372800e-07   0.000000e+00 
  2.525000e+01   4.195412e-07   0.000000e+00   4.195412e-07   0.000000e+00 
  2.550000e+01   3.790573e-07   0.000000e+00   3.790573e-07   0.000000e+00 
  2.575000e+01   3.199468e-07   0.000000e+00   3.199468e-07   0.000000e+00 
  2.600000e+01   3.244092e-07   0.000000e+00   3.244092e-07   0.000000e+00 
  2.625000e+01   3.812228e-07   0.000000e+00   3.812228e-07   0.000000e+00 
  2.650000e+01   3.845767e-07   0.000000e+00   3.845767e-07   0.000000e+00 
  2.675000e+01   4.434449e-07   0.000000e+00   4.434449e-07   0.000000e+00 
  2.700000e+01   3.264390e-07   0.000000e+00   3.264390e-07   0.000000e+00 
  2.725000e+01   3.027467e-07   0.000000e+00   3.027467e-07   0.000000e+00 
  2.750000e+01   2.750679e-07   0.000000e+00   2.750679e-07   0.000000e+00 
  2.775000e+01   3.171663e-07   0.000000e+00   3.171663e-07   0.000000e+00 
  2.800000e+01   2.915914e-07   0.000000e+00   2.915914e-07   0.000000e+00 
  2.825000e+01   3.236080e-07   0.000000e+00   3.236080e-07   0.000000e+00 
  2.850000e+01   3.233250e-07   0.000000e+00   3.233250e-07   0.000000e+00 
  2.875000e+01   3.164062e-07   0.000000e+00   3.164062e-07   0.000000e+00 
  2.900000e+01   3.215512e-07   0.000000e+00   3.215512e-07   0.000000e+00 
  2.925000e+01   3.313245e-07   0.000000e+00   3.313245e-07   0.000000e+00 
  2.950000e+01   3.727620e-07   0.000000e+00   3.727620e-07   0.000000e+00 
  2.975000e+01   3.727599e-07   0.000000e+00   3.727599e-07   0.000000e+00 
  3.000000e+01   3.407107e-07   0.000000e+00   3.407107e-07   0.000000e+00 
  3.025000e+01   3.748345e-07   0.000000e+00   3.748345e-07   0.000000e+00 
  3.050000e+01   4.065766e-07   0.000000e+00   4.065766e-07   0.000000e+00 
  3.075000e+01   3.159155e-07   0.000000e+00   3.159155e-07   0.000000e+00 
  3.100000e+01   3.707305e-07   0.000000e+00   3.707305e-07   0.000000e+00 
  3.125000e+01   3.566538e-07   0.000000e+00   3.566538e-07   0.000000e+00 
  3.150000e+01   2.870068e-07   0.000000e+00   2.870068e-07   0.000000e+00 
  3.175000e+01   2.797407e-07   0.000000e+00   2.797407e-07   0.000000e+00 
  3.200000e+01   4.049306e-07   0.000000e+00   4.049306e-07   0.000000e+00 
  3.225000e+01   3.678637e-07   0.000000e+00   3.678637e-07   0.000000e+00 
  3.250000e+01   3.335773e-07   0.000000e+00   3.335773e-07   0.000000e+00 
  3.275000e+01   3.036101e-07   0.000000e+00   3.036101e-07   0.000000e+00 
  3.300000e+01   3.196993e-07   0.000000e+00   3.196993e-07   0.000000e+00 
  3.325000e+01   3.668085e-07   0.000000e+00   3.668085e-07   0.000000e+00 
  3.350000e+01   3.786330e-07   0.000000e+00   3.786330e-07   0.000000e+00 
  3.375000e+01   4.232700e-07   0.000000e+00   4.232700e-07   0.000000e+00 
  3.400000e+01   4.267557e-07   0.000000e+00   4.267557e-07   0.000000e+00 
  3.425000e+01   4.425906e-07   0.000000e+00   4.425906e-07   0.000000e+00 
  3.450000e+01   3.479674e-07   0.000000e+00   3.479674e-07   0.000000e+00 
  3.475000e+01   3.609748e-07   0.000000e+00   3.609748e-07   0.000000e+00 
  3.500000e+01   3.969677e-07   0.000000e+00   3.969677e-07   0.000000e+00 
  3.525000e+01   4.132909e-07   0.000000e+00   4.132909e-07   0.000000e+00 
  3.550000e+01   3.205043e-07   0.000000e+00   3.205043e-07   0.000000e+00 
  3.575000e+01   3.440612e-07   0.000000e+00   3.440612e-07   0.000000e+00 
  3.600000e+01   3.897371e-07   0.000000e+00   3.897371e-07   0.000000e+00 
  3.625000e+01   4.619388e-07   0.000000e+00   4.619388e-07   0.000000e+00 
  3.650000e+01   4.041584e-07   0.000000e+00   4.041584e-07   0.000000e+00 
  3.675000e+01   3.158894e-07   0.000000e+00   3.158894e-07   0.000000e+00 
  3.700000e+01   3.911597e-07   0.000000e+00   3.911597e-07   0.000000e+00 
  3.725000e+01   4.283475e-07   0.000000e+00   4.283475e-07   0.000000e+00 
  3.750000e+01   3.377073e-07   0.000000e+00   3.377073e-07   0.000000e+00 
  3.775000e+01   3.144960e-07   0.000000e+00   3.144960e-07   0.000000e+00 
  3.800000e+01   2.895380e-07   0.000000e+00   2.895380e-07   0.000000e+00 
  3.825000e+01   3.665002e-07   0.000000e+00   3.665002e-07   0.000000e+00 
  3.850000e+01   3.444166e-07   0.000000e+00   3.444166e-07   0.000000e+00 
  3.875000e+01   3.438888e-07   0.000000e+00   3.438888e-07   0.000000e+00 
  3.900000e+01   2.451104e-07   0.000000e+00   2.451104e-07   0.000000e+00 
  3.925000e+01   3.832595e-07   0.000000e+00   3.832595e-07   0.000000e+00 
  3.950000e+01   3.977770e-07   0.000000e+00   3.977770e-07   0.000000e+00 
  3.975000e+01   2.861908e-07   0.000000e+00   2.861908e-07   0.000000e+00 
  4.000000e+01   3.099578e-07   0.000000e+00   3.099578e-07   0.000000e+00 
  4.025000e+01   3.851097e-07   0.000000e+00   3.851097e-07   0.000000e+00 
  4.050000e+01   3.733551e-07   0.000000e+00   3.733551e-07   0.000000e+00 
  4.075000e+01   3.297392e-07   0.000000e+00   3.297392e-07   0.000000e+00 
  4.100000e+01   3.712027e-07   0.000000e+00   3.712027e-07   0.000000e+00 
  4.125000e+01   4.320147e-07   0.000000e+00   4.320147e-07   0.000000e+00 
  4.150000e+01   3.397882e-07   0.000000e+00   3.397882e-07   0.000000e+00 
  4.175000e+01   3.430004e-07   0.000000e+00   3.430004e-07   0.000000e+00 
  4.200000e+01   3.219851e-07   0.000000e+00   3.219851e-07   0.000000e+00 
  4.225000e+01   4.082774e-07   0.000000e+00   4.082774e-07   0.000000e+00 
  4.250000e+01   3.737461e-07   0.000000e+00   3.737461e-07   0.000000e+00 
  4.275000e+01   3.405137e-07   0.000000e+00   3.405137e-07   0.000000e+00 
  4.300000e+01   2.602283e-07   0.000000e+00   2.602283e-07   0.000000e+00 
  4.325000e+01   2.857786e-07   0.000000e+00   2.857786e-07   0.000000e+00 
  4.350000e+01   3.940624e-07   0.000000e+00   3.940624e-07   0.000000e+00 
  4.375000e+01   3.674945e-07   0.000000e+00   3.674945e-07   0.000000e+00 
  4.400000e+01   3.390647e-07   0.000000e+00   3.390647e-07   0.000000e+00 
  4.425000e+01   3.465371e-07   0.000000e+00   3.465371e-07   0.000000e+00 
  4.450000e+01   3.999005e-07   0.000000e+00   3.999005e-07   0.000000e+00 
  4.475000e+01   3.440541e-07   0.000000e+00   3.440541e-07   0.000000e+00 
  4.500000e+01   2.797257e-07   0.000000e+00   2.797257e-07   0.000000e+00 
  4.525000e+01   3.021043e-07   0.000000e+00   3.021043e-07   0.000000e+00 
  4.550000e+01   3.975971e-07   0.000000e+00   3.975971e-07   0.000000e+00 
  4.575000e+01   3.153565e-07   0.000000e+00   3.153565e-07   0.000000e+00 
  4.600000e+01   3.572819e-07   0.000000e+00   3.572819e-07   0.000000e+00 
  4.625000e+01   3.641024e-07   0.000000e+00   3.641024e-07   0.000000e+00 
  4.650000e+01   3.631893e-07   0.000000e+00   3.631893e-07   0.000000e+00 
  4.675000e+01   2.726377e-07   0.000000e+00   2.726377e-07   0.000000e+00 
  4.700000e+01   3.136683e-07   0.000000e+00   3.136683e-07   0.000000e+00 
  4.725000e+01   3.678956e-07   0.000000e+00   3.678956e-07   0.000000e+00 
  4.750000e+01   4.227910e-07   0.000000e+00   4.227910e-07   0.000000e+00 
  4.775000e+01   3.537461e-07   0.000000e+00   3.537461e-07   0.000000e+00 
  4.800000e+01   3.387082e-07   0.000000e+00   3.387082e-07   0.000000e+00 
  4.825000e+01   2.862421e-07   0.000000e+00   2.862421e-07   0.000000e+00 
  4.850000e+01   3.471273e-07   0.000000e+00   3.471273e-07   0.000000e+00 
  4.875000e+01   3.776280e-07   0.000000e+00   3.776280e-07   0.000000e+00 
  4.900000e+01   3.592871e-07   0.000000e+00   3.592871e-07   0.000000e+00 
  4.925000e+01   3.967923e-07   0.000000e+00   3.967923e-07   0.000000e+00 
  4.950000e+01   3.631612e-07   0.000000e+00   3.631612e-07   0.000000e+00 
  4.975000e+01   4.406390e-07   0.000000e+00   4.406390e-07   0.000000e+00 
  5.000000e+01   3.794306e-07   0.000000e+00   3.794306e-07   0.000000e+00 
  5.025000e+01   3.517987e-07   0.000000e+00   3.517987e-07   0.000000e+00 
  5.050000e+01   4.202209e-07   0.000000e+00   4.202209e-07   0.000000e+00 
  5.075000e+01   4.123474e-07   0.000000e+00   4.123474e-07   0.000000e+00 
  5.100000e+01   3.743206e-07   0.000000e+00   3.743206e-07   0.000000e+00 
  5.125000e+01   3.339283e-07   0.000000e+00   3.339283e-07   0.000000e+00 
  5.150000e+01   3.101455e-07   0.000000e+00   3.101455e-07   0.000000e+00 
  5.175000e+01   3.242226e-07   0.000000e+00   3.242226e-07   0.000000e+00 
  5.200000e+01   4.106759e-07   0.000000e+00   4.106759e-07   0.000000e+00 
  5.225000e+01   3.225944e-07   0.000000e+00   3.225944e-07   0.000000e+00 
  5.250000e+01   3.008026e-07   0.000000e+00   3.008026e-07   0.000000e+00 
  5.275000e+01   3.375760e-07   0.000000e+00   3.375760e-07   0.000000e+00 
  5.300000e+01   3.456760e-07   0.000000e+00   3.456760e-07   0.000000e+00 
  5.325000e+01   3.221340e-07   0.000000e+00   3.221340e-07   0.000000e+00 
  5.350000e+01   2.983434e-07   0.000000e+00   2.983434e-07   0.000000e+00 
  5.375000e+01   3.291454e-07   0.000000e+00   3.291454e-07   0.000000e+00 
  5.400000e+01   3.353184e-07   0.000000e+00   3.353184e-07   0.000000e+00 
  5.425000e+01   3.152175e-07   0.000000e+00   3.152175e-07   0.000000e+00 
  5.450000e+01   2.984221e-07   0.000000e+00   2.984221e-07   0.000000e+00 
  5.475000e+01   3.348120e-07   0.000000e+00   3.348120e-07   0.000000e+00 
  5.500000e+01   3.431332e-07   0.000000e+00   3.431332e-07   0.000000e+00 
  5.525000e+01   2.701033e-07   0.000000e+00   2.701033e-07   0.000000e+00 
  5.550000e+01   2.813076e-07   0.000000e+00   2.813076e-07   0.000000e+00 
  5.575000e+01   3.562121e-07   0.000000e+00   3.562121e-07   0.000000e+00 
  5.600000e+01   3.051084e-07   0.000000e+00   3.051084e-07   0.000000e+00 
  5.625000e+01   3.727917e-07   0.000000e+00   3.727917e-07   0.000000e+00 
  5.650000e+01   3.612004e-07   0.000000e+00   3.612004e-07   0.000000e+00 
  5.675000e+01   3.664411e-07   0.000000e+00   3.664411e-07   0.000000e+00 
  5.700000e+01   2.966924e-07   0.000000e+00   2.966924e-07   0.000000e+00 
  5.725000e+01   3.838156e-07   0.000000e+00   3.838156e-07   0.000000e+00 
  5.750000e+01   3.805534e-07   0.000000e+00   3.805534e-07   0.000000e+00 
  5.775000e+01   3.120456e-07   0.000000e+00   3.120456e-07   0.000000e+00 
  5.800000e+01   3.992466e-07   0.000000e+00   3.992466e-07   0.000000e+00 
  5.825000e+01   3.825765e-07   0.000000e+00   3.825765e-07   0.000000e+00 
  5.850000e+01   3.395531e-07   0.000000e+00   3.395531e-07   0.000000e+00 
  5.875000e+01   3.194937e-07   0.000000e+00   3.194937e-07   0.000000e+00 
  5.900000e+01   3.427664e-07   0.000000e+00   3.427664e-07   0.000000e+00 
  5.925000e+01   2.950677e-07   0.000000e+00   2.950677e-07   0.000000e+00 
  5.950000e+01   3.609233e-07   0.000000e+00   3.609233e-07   0.000000e+00 
  5.975000e+01   1.056181e-06   0.000000e+00   1.056181e-06   0.000000e+00 
  6.000000e+01   2.212274e-06   0.000000e+00   2.212274e-06   0.000000e+00 
  6.025000e+01   1.189350e-06   0.000000e+00   1.189350e-06   0.000000e+00 
  6.050000e+01   2.884322e-07   0.000000e+00   2.884322e-07   0.000000e+00 
  6.075000e+01   3.412116e-07   0.000000e+00   3.412116e-07   0.000000e+00 
  6.100000e+01   3.205544e-07   0.000000e+00   3.205544e-07   0.000000e+00 
  6.125000e+01   3.323786e-07   0.000000e+00   3.323786e-07   0.000000e+00 
  6.150000e+01   4.056077e-07   0.000000e+00   4.056077e-07   0.000000e+00 
  6.175000e+01   3.248369e-07   0.000000e+00   3.248369e-07   0.000000e+00 
  6.200000e+01   3.711675e-07   0.000000e+00   3.711675e-07   0.000000e+00 
  6.225000e+01   4.395942e-07   0.000000e+00   4.395942e-07   0.000000e+00 
  6.250000e+01   4.394177e-07   0.000000e+00   4.394177e-07   0.000000e+00 
  6.275000e+01   3.573443e-07   0.000000e+00   3.573443e-07   0.000000e+00 
  6.300000e+01   3.775792e-07   0.000000e+00   3.775792e-07   0.000000e+00 
  6.325000e+01   4.492731e-07   0.000000e+00   4.492731e-07   0.000000e+00 
  6.350000e+01   3.631793e-07   0.000000e+00   3.631793e-07   0.000000e+00 
  6.375000e+01   4.169148e-07   0.000000e+00   4.169148e-07   0.000000e+00 
  6.400000e+01   3.555052e-07   0.000000e+00   3.555052e-07   0.000000e+00 
  6.425000e+01   3.165947e-07   0.000000e+00   3.165947e-07   0.000000e+00 
  6.450000e+01   3.758262e-07   0.000000e+00   3.758262e-07   0.000000e+00 
  6.475000e+01   3.535464e-07   0.000000e+00   3.535464e-07   0.000000e+00 
  6.500000e+01   3.086797e-07   0.000000e+00   3.086797e-07   0.000000e+00 
  6.525000e+01   3.178460e-07   0.000000e+00   3.178460e-07   0.000000e+00 
  6.550000e+01   4.379093e-07   0.000000e+00   4.379093e-07   0.000000e+00 
  6.575000e+01   3.952979e-07   0.000000e+00   3.952979e-07   0.000000e+00 
  6.600000e+01   5.993819e-07   0.000000e+00   5.993819e-07   0.000000e+00 
  6.625000e+01   9.639037e-07   0.000000e+00   9.639037e-07   0.000000e+00 
  6.650000e+01   6.446139e-07   0.000000e+00   6.446139e-07   0.000000e+00 
  6.675000e+01   3.506852e-07   0.000000e+00   3.506852e-07   0.000000e+00 
  6.700000e+01   3.188522e-07   0.000000e+00   3.188522e-07   0.000000e+00 
  6.725000e+01   3.737868e-07   0.000000e+00   3.737868e-07   0.000000e+00 
  6.750000e+01   3.628126e-07   0.000000e+00   3.628126e-07   0.000000e+00 
  6.775000e+01   4.064439e-07   0.000000e+00   4.064439e-07   0.000000e+00 
  6.800000e+01   3.299491e-07   0.000000e+00   3.299491e-07   0.000000e+00 
  6.825000e+01   3.508171e-07   0.000000e+00   3.508171e-07   0.000000e+00 
  6.850000e+01   4.210462e-07   0.000000e+00   4.210462e-07   0.000000e+00 
  6.875000e+01   3.961507e-07   0.000000e+00   3.961507e-07   0.000000e+00 
  6.900000e+01   4.030811e-07   0.000000e+00   4.030811e-07   0.000000e+00 
  6.925000e+01   3.071755e-07   0.000000e+00   3.071755e-07   0.000000e+00 
  6.950000e+01   3.533783e-07   0.000000e+00   3.533783e-07   0.000000e+00 
  6.975000e+01   4.461529e-07   0.000000e+00   4.461529e-07   0.000000e+00 
  7.000000e+01   3.414076e-07   0.000000e+00   3.414076e-07   0.000000e+00 
  7.025000e+01   4.729319e-07   0.000000e+00   4.729319e-07   0.000000e+00 
  7.050000e+01   4.329967e-07   0.000000e+00   4.329967e-07   0.000000e+00 
  7.075000e+01   3.915090e-07   0.000000e+00   3.915090e-07   0.000000e+00 
  7.100000e+01   2.935693e-07   0.000000e+00   2.935693e-07   0.000000e+00 
  7.125000e+01   3.476754e-07   0.000000e+00   3.476754e-07   0.000000e+00 
  7.150000e+01   3.950062e-07   0.000000e+00   3.950062e-07   0.000000e+00 
  7.175000e+01   3.850983e-07   0.000000e+00   3.850983e-07   0.000000e+00 
  7.200000e+01   3.392452e-07   0.000000e+00   3.392452e-07   0.000000e+00 
  7.225000e+01   2.992233e-07   0.000000e+00   2.992233e-07   0.000000e+00 
  7.250000e+01   3.847984e-07   0.000000e+00   3.847984e-07   0.000000e+00 
  7.275000e+01   3.445167e-07   0.000000e+00   3.445167e-07   0.000000e+00 
  7.300000e+01   3.333674e-07   0.000000e+00   3.333674e-07   0.000000e+00 
  7.325000e+01   3.152301e-07   0.000000e+00   3.152301e-07   0.000000e+00 
  7.350000e+01   3.308050e-07   0.000000e+00   3.308050e-07   0.000000e+00 
  7.375000e+01   3.486570e-07   0.000000e+00   3.486570e-07   0.000000e+00 
  7.400000e+01   4.009534e-07   0.000000e+00   4.009534e-07   0.000000e+00 
  7.425000e+01   4.178219e-07   0.000000e+00   4.178219e-07   0.000000e+00 
  7.450000e+01   3.521732e-07   0.000000e+00   3.521732e-07   0.000000e+00 
  7.475000e+01   3.324952e-07   0.000000e+00   3.324952e-07   0.000000e+00 
  7.500000e+01   3.607416e-07   0.000000e+00   3.607416e-07   0.000000e+00 
  7.525000e+01   3.109226e-07   0.000000e+00   3.109226e-07   0.000000e+00 
  7.550000e+01   9.052728e-07   0.000000e+00   9.052728e-07   0.000000e+00 
  7.575000e+01   1.401699e-06   0.000000e+00   1.401699e-06   0.000000e+00 
  7.600000e+01   5.763561e-07   0.000000e+00   5.763561e-07   0.000000e+00 
  7.625000e+01   3.847013e-07   0.000000e+00   3.847013e-07   0.000000e+00 
  7.650000e+01   5.046428e-07   0.000000e+00   5.046428e-07   0.000000e+00 
  7.675000e+01   4.868302e-07   0.000000e+00   4.868302e-07   0.000000e+00 
  7.700000e+01   3.419662e-07   0.000000e+00   3.419662e-07   0.000000e+00 
  7.725000e+01   3.788885e-07   0.000000e+00   3.788885e-07   0.000000e+00 
  7.750000e+01   3.721944e-07   0.000000e+00   3.721944e-07   0.000000e+00 
  7.775000e+01   3.651917e-07   0.000000e+00   3.651917e-07   0.000000e+00 
  7.800000e+01   3.656129e-07   0.000000e+00   3.656129e-07   0.000000e+00 
  7.825000e+01   3.956091e-07   0.000000e+00   3.956091e-07   0.000000e+00 
  7.850000e+01   3.462581e-07   0.000000e+00   3.462581e-07   0.000000e+00 
  7.875000e+01   3.769537e-07   0.000000e+00   3.769537e-07   0.000000e+00 
  7.900000e+01   3.281984e-07   0.000000e+00   3.281984e-07   0.000000e+00 
  7.925000e+01   3.762034e-07   0.000000e+00   3.762034e-07   0.000000e+00 
  7.950000e+01   4.072700e-07   0.000000e+00   4.072700e-07   0.000000e+00 
  7.975000e+01   4.084982e-07   0.000000e+00   4.084982e-07   0.000000e+00 
  8.000000e+01   3.807210e-07   0.000000e+00   3.807210e-07   0.000000e+00 
  8.025000e+01   4.628094e-07   0.000000e+00   4.628094e-07   0.000000e+00 
  8.050000e+01   4.720935e-07   0.000000e+00   4.720935e-07   0.000000e+00 
  8.075000e+01   4.519594e-07   0.000000e+00   4.519594e-07   0.000000e+00 
  8.100000e+01   3.678146e-07   0.000000e+00   3.678146e-07   0.000000e+00 
  8.125000e+01   3.607530e-07   0.000000e+00   3.607530e-07   0.000000e+00 
  8.150000e+01   3.872730e-07   0.000000e+00   3.872730e-07   0.000000e+00 
  8.175000e+01   3.099897e-07   0.000000e+00   3.099897e-07   0.000000e+00 
  8.200000e+01   3.653171e-07   0.000000e+00   3.653171e-07   0.000000e+00 
  8.225000e+01   3.197676e-07   0.000000e+00   3.197676e-07   0.000000e+00 
  8.250000e+01   3.925464e-07   0.000000e+00   3.925464e-07   0.000000e+00 
  8.275000e+01   3.610524e-07   0.000000e+00   3.610524e-07   0.000000e+00 
  8.300000e+01   3.723935e-07   0.000000e+00   3.723935e-07   0.000000e+00 
  8.325000e+01   4.557540e-07   0.000000e+00   4.557540e-07   0.000000e+00 
  8.350000e+01   4.182945e-07   0.000000e+00   4.182945e-07   0.000000e+00 
  8.375000e+01   3.588766e-07   0.000000e+00   3.588766e-07   0.000000e+00 
  8.400000e+01   3.352276e-07   0.000000e+00   3.352276e-07   0.000000e+00 
  8.425000e+01   5.054684e-07   0.000000e+00   5.054684e-07   0.000000e+00 
  8.450000e+01   4.065697e-07   0.000000e+00   4.065697e-07   0.000000e+00 
  8.475000e+01   3.398477e-07   0.000000e+00   3.398477e-07   0.000000e+00 
  8.500000e+01   6.735393e-07   0.000000e+00   6.735393e-07   0.000000e+00 
  8.525000e+01   1.008781e-06   0.000000e+00   1.008781e-06   0.000000e+00 
  8.550000e+01   4.732614e-07   0.000000e+00   4.732614e-07   0.000000e+00 
  8.575000e+01   3.975804e-07   0.000000e+00   3.975804e-07   0.000000e+00 
  8.600000e+01   3.399215e-07   0.000000e+00   3.399215e-07   0.000000e+00 
  8.625000e+01   3.051041e-07   0.000000e+00   3.051041e-07   0.000000e+00 
  8.650000e+01   3.626655e-07   0.000000e+00   3.626655e-07   0.000000e+00 
  8.675000e+01   3.488724e-07   0.000000e+00   3.488724e-07   0.000000e+00 
  8.700000e+01   3.491985e-07   0.000000e+00   3.491985e-07   0.000000e+00 
  8.725000e+01   4.031679e-07   0.000000e+00   4.031679e-07   0.000000e+00 
  8.750000e+01   4.522223e-07   0.000000e+00   4.522223e-07   0.000000e+00 
  8.775000e+01   4.190350e-07   0.000000e+00   4.190350e-07   0.000000e+00 
  8.800000e+01   3.739279e-07   0.000000e+00   3.739279e-07   0.000000e+00 
  8.825000e+01   3.364715e-07   0.000000e+00   3.364715e-07   0.000000e+00 
  8.850000e+01   3.873087e-07   0.000000e+00   3.873087e-07   0.000000e+00 
  8.875000e+01   3.025598e-07   0.000000e+00   3.025598e-07   0.000000e+00 
  8.900000e+01   3.711401e-07   0.000000e+00   3.711401e-07   0.000000e+00 
  8.925000e+01   3.368732e-07   0.000000e+00   3.368732e-07   0.000000e+00 
  8.950000e+01   3.759384e-07   0.000000e+00   3.759384e-07   0.000000e+00 
  8.975000e+01   4.217825e-07   0.000000e+00   4.217825e-07   0.000000e+00 
  9.000000e+01   4.318973e-07   0.000000e+00   4.318973e-07   0.000000e+00 
  9.025000e+01   3.878667e-07   0.000000e+00   3.878667e-07   0.000000e+00 
  9.050000e+01   2.829687e-07   0.000000e+00   2.829687e-07   0.000000e+00 
  9.075000e+01   3.126711e-07   0.000000e+00   3.126711e-07   0.000000e+00 
  9.100000e+01   4.238383e-07   0.000000e+00   4.238383e-07   0.000000e+00 
  9.125000e+01   4.012755e-07   0.000000e+00   4.012755e-07   0.000000e+00 
  9.150000e+01   4.376680e-07   0.000000e+00   4.376680e-07   0.000000e+00 
  9.175000e+01   3.879491e-07   0.000000e+00   3.879491e-07   0.000000e+00 
  9.200000e+01   3.556994e-07   0.000000e+00   3.556994e-07   0.000000e+00 
  9.225000e+01   4.127670e-07   0.000000e+00   4.127670e-07   0.000000e+00 
  9.250000e+01   3.804612e-07   0.000000e+00   3.804612e-07   0.000000e+00 
  9.275000e+01   3.710403e-07   0.000000e+00   3.710403e-07   0.000000e+00 
  9.300000e+01   3.110189e-07   0.000000e+00   3.110189e-07   0.000000e+00 
  9.325000e+01   3.182454e-07   0.000000e+00   3.182454e-07   0.000000e+00 
  9.350000e+01   2.899764e-07   0.000000e+00   2.899764e-07   0.000000e+00 
  9.375000e+01   3.322262e-07   0.000000e+00   3.322262e-07   0.000000e+00 
  9.400000e+01   4.029261e-07   0.000000e+00   4.029261e-07   0.000000e+00 
  9.425000e+01   3.639595e-07   0.000000e+00   3.639595e-07   0.000000e+00 
  9.450000e+01   6.979058e-07   0.000000e+00   6.979058e-07   0.000000e+00 
  9.475000e+01   1.011357e-06   0.000000e+00   1.011357e-06   0.000000e+00 
  9.500000e+01   5.484093e-07   0.000000e+00   5.484093e-07   0.000000e+00 
  9.525000e+01   3.779648e-07   0.000000e+00   3.779648e-07   0.000000e+00 
  9.550000e+01   4.152155e-07   0.000000e+00   4.152155e-07   0.000000e+00 
  9.575000e+01   4.158342e-07   0.000000e+00   4.158342e-07   0.000000e+00 
  9.600000e+01   2.837034e-07   0.000000e+00   2.837034e-07   0.000000e+00 
  9.625000e+01   3.677323e-07   0.000000e+00   3.677323e-07   0.000000e+00 
  9.650000e+01   3.814910e-07   0.000000e+00   3.814910e-07   0.000000e+00 
  9.675000e+01   3.645772e-07   0.000000e+00   3.645772e-07   0.000000e+00 
  9.700000e+01   3.524708e-07   0.000000e+00   3.524708e-07   0.000000e+00 
  9.725000e+01   3.522732e-07   0.000000e+00   3.522732e-07   0.000000e+00 
  9.750000e+01   2.929447e-07   0.000000e+00   2.929447e-07   0.000000e+00 
  9.775000e+01   4.397564e-07   0.000000e+00   4.397564e-07   0.000000e+00 
  9.800000e+01   3.983167e-07   0.000000e+00   3.983167e-07   0.000000e+00 
  9.825000e+01   2.854139e-07   0.000000e+00   2.854139e-07   0.000000e+00 
  9.850000e+01   3.133499e-07   0.000000e+00   3.133499e-07   0.000000e+00 
  9.875000e+01   3.996728e-07   0.000000e+00   3.996728e-07   0.000000e+00 
  9.900000e+01   3.612245e-07   0.000000e+00   3.612245e-07   0.000000e+00 
  9.925000e+01   4.479460e-07   0.000000e+00   4.479460e-07   0.000000e+00 
  9.950000e+01   3.446796e-07   0.000000e+00   3.446796e-07   0.000000e+00 
  9.975000e+01   5.930099e-07   0.000000e+00   5.930099e-07   0.000000e+00 
  1.000000e+02   8.765572e-07   0.000000e+00   8.765572e-07   0.000000e+00 
  1.002500e+02   4.900959e-07   0.000000e+00   4.900959e-07   0.000000e+00 
  1.005000e+02   3.352872e-07   0.000000e+00   3.352872e-07   0.000000e+00 
  1.007500e+02   5.053858e-07   0.000000e+00   5.053858e-07   0.000000e+00 
  1.010000e+02   4.758353e-07   0.000000e+00   4.758353e-07   0.000000e+00 
  1.012500e+02   3.293137e-07   0.000000e+00   3.293137e-07   0.000000e+00 
  1.015000e+02   3.866886e-07   0.000000e+00   3.866886e-07   0.000000e+00 
  1.017500e+02   4.174657e-07   0.000000e+00   4.174657e-07   0.000000e+00 
  1.020000e+02   4.564397e-07   0.000000e+00   4.564397e-07   0.000000e+00 
  1.022500e+02   3.970547e-07   0.000000e+00   3.970547e-07   0.000000e+00 
  1.025000e+02   3.855782e-07   0.000000e+00   3.855782e-07   0.000000e+00 
  1.027500e+02   2.671257e-07   0.000000e+00   2.671257e-07   0.000000e+00 
  1.030000e+02   3.645710e-07   0.000000e+00   3.645710e-07   0.000000e+00 
  1.032500e+02   3.539430e-07   0.000000e+00   3.539430e-07   0.000000e+00 
  1.035000e+02   3.554498e-07   0.000000e+00   3.554498e-07   0.000000e+00 
  1.037500e+02   4.410178e-07   0.000000e+00   4.410178e-07   0.000000e+00 
  1.040000e+02   1.921034e-06   0.000000e+00   1.921034e-06   0.000000e+00 
  1.042500e+02   2.047865e-06   0.000000e+00   2.047865e-06   0.000000e+00 
  1.045000e+02   5.700242e-07   0.000000e+00   5.700242e-07   0.000000e+00 
  1.047500e+02   4.360598e-07   0.000000e+00   4.360598e-07   0.000000e+00 
  1.050000e+02   4.347313e-07   0.000000e+00   4.347313e-07   0.000000e+00 
  1.052500e+02   4.532005e-07   0.000000e+00   4.532005e-07   0.000000e+00 
  1.055000e+02   4.021584e-07   0.000000e+00   4.021584e-07   0.000000e+00 
  1.057500e+02   3.941693e-07   0.000000e+00   3.941693e-07   0.000000e+00 
  1.060000e+02   4.327528e-07   0.000000e+00   4.327528e-07   0.000000e+00 
  1.062500e+02   4.548476e-07   0.000000e+00   4.548476e-07   0.000000e+00 
  1.065000e+02   3.418485e-07   0.000000e+00   3.418485e-07   0.000000e+00 
  1.067500e+02   3.615732e-07   0.000000e+00   3.615732e-07   0.000000e+00 
  1.070000e+02   3.288972e-07   0.000000e+00   3.288972e-07   0.000000e+00 
  1.072500e+02   3.746645e-07   0.000000e+00   3.746645e-07   0.000000e+00 
  1.075000e+02   5.004379e-07   0.000000e+00   5.004379e-07   0.000000e+00 
  1.077500e+02   4.458653e-07   0.000000e+00   4.458653e-07   0.000000e+00 
  1.080000e+02   3.757471e-07   0.000000e+00   3.757471e-07   0.000000e+00 
  1.082500e+02   3.619711e-07   0.000000e+00   3.619711e-07   0.000000e+00 
  1.085000e+02   3.800656e-07   0.000000e+00   3.800656e-07   0.000000e+00 
  1.087500e+02   3.860677e-07   0.000000e+00   3.860677e-07   0.000000e+00 
  1.090000e+02   4.608885e-07   0.000000e+00   4.608885e-07   0.000000e+00 
  1.092500e+02   3.782350e-07   0.000000e+00   3.782350e-07   0.000000e+00 
  1.095000e+02   3.433169e-07   0.000000e+00   3.433169e-07   0.000000e+00 
  1.097500e+02   4.223737e-07   0.000000e+00   4.223737e-07   0.000000e+00 
  1.100000e+02   4.277703e-07   0.000000e+00   4.277703e-07   0.000000e+00 
  1.102500e+02   4.221923e-07   0.000000e+00   4.221923e-07   0.000000e+00 
  1.105000e+02   3.568506e-07   0.000000e+00   3.568506e-07   0.000000e+00 
  1.107500e+02   3.982751e-07   0.000000e+00   3.982751e-07   0.000000e+00 
  1.110000e+02   3.637967e-07   0.000000e+00   3.637967e-07   0.000000e+00 
  1.112500e+02   3.915591e-07   0.000000e+00   3.915591e-07   0.000000e+00 
  1.115000e+02   4.208863e-07   0.000000e+00   4.208863e-07   0.000000e+00 
  1.117500e+02   4.563289e-07   0.000000e+00   4.563289e-07   0.000000e+00 
  1.120000e+02   4.093054e-07   0.000000e+00   4.093054e-07   0.000000e+00 
  1.122500e+02   4.206152e-07   0.000000e+00   4.206152e-07   0.000000e+00 
  1.125000e+02   5.023180e-07   0.000000e+00   5.023180e-07   0.000000e+00 
  1.127500e+02   4.448211e-07   0.000000e+00   4.448211e-07   0.000000e+00 
  1.130000e+02   3.547267e-07   0.000000e+00   3.547267e-07   0.000000e+00 
  1.132500e+02   8.119395e-07   0.000000e+00   8.119395e-07   0.000000e+00 
  1.135000e+02   2.597358e-06   0.000000e+00   2.597358e-06   0.000000e+00 
  1.137500e+02   2.325093e-06   0.000000e+00   2.325093e-06   0.000000e+00 
  1.140000e+02   6.625160e-07   0.000000e+00   6.625160e-07   0.000000e+00 
  1.142500e+02   4.734420e-07   0.000000e+00   4.734420e-07   0.000000e+00 
  1.145000e+02   4.859227e-07   0.000000e+00   4.859227e-07   0.000000e+00 
  1.147500e+02   4.719967e-07   0.000000e+00   4.719967e-07   0.000000e+00 
  1.150000e+02   4.668403e-07   0.000000e+00   4.668403e-07   0.000000e+00 
  1.152500e+02   5.829265e-07   0.000000e+00   5.829265e-07   0.000000e+00 
  1.155000e+02   5.822139e-07   0.000000e+00   5.822139e-07   0.000000e+00 
  1.157500e+02   5.147852e-07   0.000000e+00   5.147852e-07   0.000000e+00 
  1.160000e+02   5.467000e-07   0.000000e+00   5.467000e-07   0.000000e+00 
  1.162500e+02   5.632542e-07   0.000000e+00   5.632542e-07   0.000000e+00 
  1.165000e+02   5.523562e-07   0.000000e+00   5.523562e-07   0.000000e+00 
  1.167500e+02   4.657149e-07   0.000000e+00   4.657149e-07   0.000000e+00 
  1.170000e+02   5.844569e-07   0.000000e+00   5.844569e-07   0.000000e+00 
  1.172500e+02   5.143968e-07   0.000000e+00   5.143968e-07   0.000000e+00 
  1.175000e+02   3.972923e-07   0.000000e+00   3.972923e-07   0.000000e+00 
  1.177500e+02   5.347644e-07   0.000000e+00   5.347644e-07   0.000000e+00 
  1.180000e+02   5.918664e-07   0.000000e+00   5.918664e-07   0.000000e+00 
  1.182500e+02   5.226207e-07   0.000000e+00   5.226207e-07   0.000000e+00 
  1.185000e+02   4.705167e-07   0.000000e+00   4.705167e-07   0.000000e+00 
  1.187500e+02   5.314574e-07   0.000000e+00   5.314574e-07   0.000000e+00 
  1.190000e+02   5.522474e-07   0.000000e+00   5.522474e-07   0.000000e+00 
  1.192500e+02   5.962278e-07   0.000000e+00   5.962278e-07   0.000000e+00 
  1.195000e+02   6.156205e-07   0.000000e+00   6.156205e-07   0.000000e+00 
  1.197500e+02   1.345927e-06   0.000000e+00   1.345927e-06   0.000000e+00 
  1.200000e+02   2.570344e-06   0.000000e+00   2.570344e-06   0.000000e+00 
  1.202500e+02   1.391415e-06   0.000000e+00   1.391415e-06   0.000000e+00 
  1.205000e+02   4.380705e-07   0.000000e+00   4.380705e-07   0.000000e+00 
  1.207500e+02   4.075995e-07   0.000000e+00   4.075995e-07   0.000000e+00 
  1.210000e+02   6.358741e-07   0.000000e+00   6.358741e-07   0.000000e+00 
  1.212500e+02   5.232076e-07   0.000000e+00   5.232076e-07   0.000000e+00 
  1.215000e+02   4.928637e-07   0.000000e+00   4.928637e-07   0.000000e+00 
  1.217500e+02   4.553274e-07   0.000000e+00   4.553274e-07   0.000000e+00 
  1.220000e+02   5.877164e-07   0.000000e+00   5.877164e-07   0.000000e+00 
  1.222500e+02   7.050095e-07   0.000000e+00   7.050095e-07   0.000000e+00 
  1.225000e+02   5.434387e-07   0.000000e+00   5.434387e-07   0.000000e+00 
  1.227500e+02   7.076898e-07   0.000000e+00   7.076898e-07   0.000000e+00 
  1.230000e+02   1.817595e-06   0.000000e+00   1.817595e-06   0.000000e+00 
  1.232500e+02   1.526755e-06   0.000000e+00   1.526755e-06   0.000000e+00 
  1.235000e+02   6.683523e-07   0.000000e+00   6.683523e-07   0.000000e+00 
  1.237500e+02   6.068893e-07   0.000000e+00   6.068893e-07   0.000000e+00 
  1.240000e+02   6.549731e-07   0.000000e+00   6.549731e-07   0.000000e+00 
  1.242500e+02   6.494894e-07   0.000000e+00   6.494894e-07   0.000000e+00 
  1.245000e+02   5.384837e-07   0.000000e+00   5.384837e-07   0.000000e+00 
  1.247500e+02   5.970109e-07   0.000000e+00   5.970109e-07   0.000000e+00 
  1.250000e+02   7.993671e-07   0.000000e+00   7.993671e-07   0.000000e+00 
  1.252500e+02   6.056450e-07   0.000000e+00   6.056450e-07   0.000000e+00 
  1.255000e+02   5.605508e-07   0.000000e+00   5.605508e-07   0.000000e+00 
  1.257500e+02   5.998439e-07   0.000000e+00   5.998439e-07   0.000000e+00 
  1.260000e+02   6.629966e-07   0.000000e+00   6.629966e-07   0.000000e+00 
  1.262500e+02   5.575250e-07   0.000000e+00   5.575250e-07   0.000000e+00 
  1.265000e+02   4.873455e-07   0.000000e+00   4.873455e-07   0.000000e+00 
  1.267500e+02   5.818112e-07   0.000000e+00   5.818112e-07   0.000000e+00 
  1.270000e+02   5.840589e-07   0.000000e+00   5.840589e-07   0.000000e+00 
  1.272500e+02   7.328895e-07   0.000000e+00   7.328895e-07   0.000000e+00 
  1.275000e+02   6.901398e-07   0.000000e+00   6.901398e-07   0.000000e+00 
  1.277500e+02   7.486992e-07   0.000000e+00   7.486992e-07   0.000000e+00 
  1.280000e+02   7.501968e-07   0.000000e+00   7.501968e-07   0.000000e+00 
  1.282500e+02   6.786968e-07   0.000000e+00   6.786968e-07   0.000000e+00 
  1.285000e+02   6.411142e-07   0.000000e+00   6.411142e-07   0.000000e+00 
  1.287500e+02   6.632026e-07   0.000000e+00   6.632026e-07   0.000000e+00 
  1.290000e+02   6.879342e-07   0.000000e+00   6.879342e-07   0.000000e+00 
  1.292500e+02   6.129359e-07   0.000000e+00   6.129359e-07   0.000000e+00 
  1.295000e+02   4.716319e-07   0.000000e+00   4.716319e-07   0.000000e+00 
  1.297500e+02   5.309836e-07   0.000000e+00   5.309836e-07   0.000000e+00 
  1.300000e+02   5.430279e-07   0.000000e+00   5.430279e-07   0.000000e+00 
  1.302500e+02   4.630553e-07   0.000000e+00   4.630553e-07   0.000000e+00 
  1.305000e+02   5.934824e-07   0.000000e+00   5.934824e-07   0.000000e+00 
  1.307500e+02   6.681099e-07   0.000000e+00   6.681099e-07   0.000000e+00 
  1.310000e+02   6.772036e-07   0.000000e+00   6.772036e-07   0.000000e+00 
  1.312500e+02   6.478507e-07   0.000000e+00   6.478507e-07   0.000000e+00 
  1.315000e+02   6.410064e-07   0.000000e+00   6.410064e-07   0.000000e+00 
  1.317500e+02   5.764673e-07   0.000000e+00   5.764673e-07   0.000000e+00 
  1.320000e+02   6.467932e-07   0.000000e+00   6.467932e-07   0.000000e+00 
  1.322500e+02   1.004762e-06   0.000000e+00   1.004762e-06   0.000000e+00 
  1.325000e+02   2.297776e-06   0.000000e+00   2.297776e-06   0.000000e+00 
  1.327500e+02   1.556057e-06   0.000000e+00   1.556057e-06   0.000000e+00 
  1.330000e+02   5.387598e-07   0.000000e+00   5.387598e-07   0.000000e+00 
  1.332500e+02   6.965241e-07   0.000000e+00   6.965241e-07   0.000000e+00 
  1.335000e+02   6.845298e-07   0.000000e+00   6.845298e-07   0.000000e+00 
  1.337500e+02   6.897648e-07   0.000000e+00   6.897648e-07   0.000000e+00 
  1.340000e+02   7.545227e-07   0.000000e+00   7.545227e-07   0.000000e+00 
  1.342500e+02   6.426540e-07   0.000000e+00   6.426540e-07   0.000000e+00 
  1.345000e+02   7.875370e-07   0.000000e+00   7.875370e-07   0.000000e+00 
  1.347500e+02   8.431850e-07   0.000000e+00   8.431850e-07   0.000000e+00 
  1.350000e+02   7.958817e-07   0.000000e+00   7.958817e-07   0.000000e+00 
  1.352500e+02   7.879649e-07   0.000000e+00   7.879649e-07   0.000000e+00 
  1.355000e+02   6.731025e-07   0.000000e+00   6.731025e-07   0.000000e+00 
  1.357500e+02   8.454003e-07   0.000000e+00   8.454003e-07   0.000000e+00 
  1.360000e+02   8.163309e-07   0.000000e+00   8.163309e-07   0.000000e+00 
  1.362500e+02   8.002515e-07   0.000000e+00   8.002515e-07   0.000000e+00 
  1.365000e+02   1.074385e-06   0.000000e+00   1.074385e-06   0.000000e+00 
  1.367500e+02   1.116131e-06   0.000000e+00   1.116131e-06   0.000000e+00 
  1.370000e+02   8.626561e-07   0.000000e+00   8.626561e-07   0.000000e+00 
  1.372500e+02   8.206291e-07   0.000000e+00   8.206291e-07   0.000000e+00 
  1.375000e+02   8.350589e-07   0.000000e+00   8.350589e-07   0.000000e+00 
  1.377500e+02   7.350926e-07   0.000000e+00   7.350926e-07   0.000000e+00 
  1.380000e+02   9.048223e-07   0.000000e+00   9.048223e-07   0.000000e+00 
  1.382500e+02   8.852545e-07   0.000000e+00   8.852545e-07   0.000000e+00 
  1.385000e+02   8.893940e-07   0.000000e+00   8.893940e-07   0.000000e+00 
  1.387500e+02   1.004972e-06   0.000000e+00   1.004972e-06   0.000000e+00 
  1.390000e+02   9.805603e-07   0.000000e+00   9.805603e-07   0.000000e+00 
  1.392500e+02   9.119799e-07   0.000000e+00   9.119799e-07   0.000000e+00 
  1.395000e+02   6.903673e-07   0.000000e+00   6.903673e-07   0.000000e+00 
  1.397500e+02   9.809756e-07   0.000000e+00   9.809756e-07   0.000000e+00 
  1.400000e+02   1.056553e-06   0.000000e+00   1.056553e-06   0.000000e+00 
  1.402500e+02   6.790650e-07   0.000000e+00   6.790650e-07   0.000000e+00 
  1.405000e+02   9.417509e-07   0.000000e+00   9.417509e-07   0.000000e+00 
  1.407500e+02   8.872889e-07   0.000000e+00   8.872889e-07   0.000000e+00 
  1.410000e+02   8.711400e-07   0.000000e+00   8.711400e-07   0.000000e+00 
  1.412500e+02   8.712408e-07   0.000000e+00   8.712408e-07   0.000000e+00 
  1.415000e+02   8.211420e-07   0.000000e+00   8.211420e-07   0.000000e+00 
  1.417500e+02   2.041146e-06   0.000000e+00   2.041146e-06   0.000000e+00 
  1.420000e+02   3.902896e-06   0.000000e+00   3.902896e-06   0.000000e+00 
  1.422500e+02   2.162254e-06   0.000000e+00   2.162254e-06   0.000000e+00 
  1.425000e+02   1.018800e-06   0.000000e+00   1.018800e-06   0.000000e+00 
  1.427500e+02   9.779924e-07   0.000000e+00   9.779924e-07   0.000000e+00 
  1.430000e+02   1.166917e-06   0.000000e+00   1.166917e-06   0.000000e+00 
  1.432500e+02   1.039909e-06   0.000000e+00   1.039909e-06   0.000000e+00 
  1.435000e+02   7.412845e-07   0.000000e+00   7.412845e-07   0.000000e+00 
  1.437500e+02   7.078702e-07   0.000000e+00   7.078702e-07   0.000000e+00 
  1.440000e+02   9.600400e-07   0.000000e+00   9.600400e-07   0.000000e+00 
  1.442500e+02   9.334599e-07   0.000000e+00   9.334599e-07   0.000000e+00 
  1.445000e+02   8.436979e-07   0.000000e+00   8.436979e-07   0.000000e+00 
  1.447500e+02   8.061606e-07   0.000000e+00   8.061606e-07   0.000000e+00 
  1.450000e+02   1.011051e-06   0.000000e+00   1.011051e-06   0.000000e+00 
  1.452500e+02   1.161870e-06   0.000000e+00   1.161870e-06   0.000000e+00 
  1.455000e+02   1.217448e-06   0.000000e+00   1.217448e-06   0.000000e+00 
  1.457500e+02   1.179079e-06   0.000000e+00   1.179079e-06   0.000000e+00 
  1.460000e+02   1.192131e-06   0.000000e+00   1.192131e-06   0.000000e+00 
  1.462500e+02   1.125835e-06   0.000000e+00   1.125835e-06   0.000000e+00 
  1.465000e+02   1.094570e-06   0.000000e+00   1.094570e-06   0.000000e+00 
  1.467500e+02   1.186625e-06   0.000000e+00   1.186625e-06   0.000000e+00 
  1.470000e+02   1.167652e-06   0.000000e+00   1.167652e-06   0.000000e+00 
  1.472500e+02   1.195414e-06   0.000000e+00   1.195414e-06   0.000000e+00 
  1.475000e+02   1.299171e-06   0.000000e+00   1.299171e-06   0.000000e+00 
  1.477500e+02   1.194217e-06   0.000000e+00   1.194217e-06   0.000000e+00 
  1.480000e+02   1.258621e-06   0.000000e+00   1.258621e-06   0.000000e+00 
  1.482500e+02   1.224628e-06   0.000000e+00   1.224628e-06   0.000000e+00 
  1.485000e+02   1.040253e-06   0.000000e+00   1.040253e-06   0.000000e+00 
  1.487500e+02   1.016566e-06   0.000000e+00   1.016566e-06   0.000000e+00 
  1.490000e+02   1.215647e-06   0.000000e+00   1.215647e-06   0.000000e+00 
  1.492500e+02   1.362093e-06   0.000000e+00   1.362093e-06   0.000000e+00 
  1.495000e+02   1.333392e-06   0.000000e+00   1.333392e-06   0.000000e+00 
  1.497500e+02   1.525090e-06   0.000000e+00   1.525090e-06   0.000000e+00 
  1.500000e+02   1.193129e-06   0.000000e+00   1.193129e-06   0.000000e+00 
  1.502500e+02   1.254937e-06   0.000000e+00   1.254937e-06   0.000000e+00 
  1.505000e+02   1.098469e-06   0.000000e+00   1.098469e-06   0.000000e+00 
  1.507500e+02   1.297501e-06   0.000000e+00   1.297501e-06   0.000000e+00 
  1.510000e+02   1.541704e-06   0.000000e+00   1.541704e-06   0.000000e+00 
  1.512500e+02   3.106739e-06   0.000000e+00   3.106739e-06   0.000000e+00 
  1.515000e+02   4.888132e-06   0.000000e+00   4.888132e-06   0.000000e+00 
  1.517500e+02   2.508667e-06   0.000000e+00   2.508667e-06   0.000000e+00 
  1.520000e+02   1.220841e-06   0.000000e+00   1.220841e-06   0.000000e+00 
  1.522500e+02   1.528614e-06   0.000000e+00   1.528614e-06   0.000000e+00 
  1.525000e+02   1.449029e-06   0.000000e+00   1.449029e-06   0.000000e+00 
  1.527500e+02   1.636269e-06   0.000000e+00   1.636269e-06   0.000000e+00 
  1.530000e+02   1.405062e-06   0.000000e+00   1.405062e-06   0.000000e+00 
  1.532500e+02   1.159654e-06   0.000000e+00   1.159654e-06   0.000000e+00 
  1.535000e+02   1.399570e-06   0.000000e+00   1.399570e-06   0.000000e+00 
  1.537500e+02   1.626854e-06   0.000000e+00   1.626854e-06   0.000000e+00 
  1.540000e+02   1.748500e-06   0.000000e+00   1.748500e-06   0.000000e+00 
  1.542500e+02   2.043647e-06   0.000000e+00   2.043647e-06   0.000000e+00 
  1.545000e+02   1.703409e-06   0.000000e+00   1.703409e-06   0.000000e+00 
  1.547500e+02   1.650095e-06   0.000000e+00   1.650095e-06   0.000000e+00 
  1.550000e+02   1.776388e-06   0.000000e+00   1.776388e-06   0.000000e+00 
  1.552500e+02   2.052461e-06   0.000000e+00   2.052461e-06   0.000000e+00 
  1.555000e+02   1.744711e-06   0.000000e+00   1.744711e-06   0.000000e+00 
  1.557500e+02   1.563716e-06   0.000000e+00   1.563716e-06   0.000000e+00 
  1.560000e+02   1.748013e-06   0.000000e+00   1.748013e-06   0.000000e+00 
  1.562500e+02   1.474782e-06   0.000000e+00   1.474782e-06   0.000000e+00 
  1.565000e+02   1.728213e-06   0.000000e+00   1.728213e-06   0.000000e+00 
  1.567500e+02   1.991487e-06   0.000000e+00   1.991487e-06   0.000000e+00 
  1.570000e+02   1.757939e-06   0.000000e+00   1.757939e-06   0.000000e+00 
  1.572500e+02   1.551364e-06   0.000000e+00   1.551364e-06   0.000000e+00 
  1.575000e+02   1.992823e-06   0.000000e+00   1.992823e-06   0.000000e+00 
  1.577500e+02   2.211332e-06   0.000000e+00   2.211332e-06   0.000000e+00 
  1.580000e+02   2.370585e-06   0.000000e+00   2.370585e-06   0.000000e+00 
  1.582500e+02   2.318650e-06   0.000000e+00   2.318650e-06   0.000000e+00 
  1.585000e+02   2.091456e-06   0.000000e+00   2.091456e-06   0.000000e+00 
  1.587500e+02   2.276475e-06   0.000000e+00   2.276475e-06   0.000000e+00 
  1.590000e+02   2.532242e-06   0.000000e+00   2.532242e-06   0.000000e+00 
  1.592500e+02   2.419863e-06   0.000000e+00   2.419863e-06   0.000000e+00 
  1.595000e+02   2.463752e-06   0.000000e+00   2.463752e-06   0.000000e+00 
  1.597500e+02   2.030239e-06   0.000000e+00   2.030239e-06   0.000000e+00 
  1.600000e+02   2.045822e-06   0.000000e+00   2.045822e-06   0.000000e+00 
  1.602500e+02   1.921968e-06   0.000000e+00   1.921968e-06   0.000000e+00 
  1.605000e+02   2.101067e-06   0.000000e+00   2.101067e-06   0.000000e+00 
  1.607500e+02   3.061256e-06   0.000000e+00   3.061256e-06   0.000000e+00 
  1.610000e+02   3.421165e-06   0.000000e+00   3.421165e-06   0.000000e+00 
  1.612500e+02   2.179792e-06   0.000000e+00   2.179792e-06   0.000000e+00 
  1.615000e+02   2.217924e-06   0.000000e+00   2.217924e-06   0.000000e+00 
  1.617500e+02   2.006200e-06   0.000000e+00   2.006200e-06   0.000000e+00 
  1.620000e+02   1.987640e-06   0.000000e+00   1.987640e-06   0.000000e+00 
  1.622500e+02   2.012438e-06   0.000000e+00   2.012438e-06   0.000000e+00 
  1.625000e+02   1.652206e-06   0.000000e+00   1.652206e-06   0.000000e+00 
  1.627500e+02   1.969477e-06   0.000000e+00   1.969477e-06   0.000000e+00 
  1.630000e+02   2.290408e-06   0.000000e+00   2.290408e-06   0.000000e+00 
  1.632500e+02   1.860217e-06   0.000000e+00   1.860217e-06   0.000000e+00 
  1.635000e+02   1.922014e-06   0.000000e+00   1.922014e-06   0.000000e+00 
  1.637500e+02   2.088428e-06   0.000000e+00   2.088428e-06   0.000000e+00 
  1.640000e+02   1.795252e-06   0.000000e+00   1.795252e-06   0.000000e+00 
  1.642500e+02   1.732148e-06   0.000000e+00   1.732148e-06   0.000000e+00 
  1.645000e+02   1.816426e-06   0.000000e+00   1.816426e-06   0.000000e+00 
  1.647500e+02   1.954500e-06   0.000000e+00   1.954500e-06   0.000000e+00 
  1.650000e+02   1.935510e-06   0.000000e+00   1.935510e-06   0.000000e+00 
  1.652500e+02   2.861062e-06   0.000000e+00   2.861062e-06   0.000000e+00 
  1.655000e+02   1.658627e-05   0.000000e+00   1.658627e-05   0.000000e+00 
  1.657500e+02   2.189508e-05   0.000000e+00   2.189508e-05   0.000000e+00 
  1.660000e+02   7.251337e-06   0.000000e+00   7.251337e-06   0.000000e+00 
  1.662500e+02   2.069827e-06   0.000000e+00   2.069827e-06   0.000000e+00 
  1.665000e+02   1.710108e-06   0.000000e+00   1.710108e-06   0.000000e+00 
  1.667500e+02   2.076336e-06   0.000000e+00   2.076336e-06   0.000000e+00 
  1.670000e+02   1.760318e-06   0.000000e+00   1.760318e-06   0.000000e+00 
  1.672500e+02   1.818074e-06   0.000000e+00   1.818074e-06   0.000000e+00 
  1.675000e+02   1.884662e-06   0.000000e+00   1.884662e-06   0.000000e+00 
  1.677500e+02   1.607963e-06   0.000000e+00   1.607963e-06   0.000000e+00 
  1.680000e+02   1.759306e-06   0.000000e+00   1.759306e-06   0.000000e+00 
  1.682500e+02   1.860396e-06   0.000000e+00   1.860396e-06   0.000000e+00 
  1.685000e+02   1.896241e-06   0.000000e+00   1.896241e-06   0.000000e+00 
  1.687500e+02   2.173019e-06   0.000000e+00   2.173019e-06   0.000000e+00 
  1.690000e+02   2.048658e-06   0.000000e+00   2.048658e-06   0.000000e+00 
  1.692500e+02   1.927286e-06   0.000000e+00   1.927286e-06   0.000000e+00 
  1.695000e+02   2.296821e-06   0.000000e+00   2.296821e-06   0.000000e+00 
  1.697500e+02   2.350574e-06   0.000000e+00   2.350574e-06   0.000000e+00 
  1.700000e+02   1.909162e-06   0.000000e+00   1.909162e-06   0.000000e+00 
  1.702500e+02   3.602565e-06   0.000000e+00   3.602565e-06   0.000000e+00 
  1.705000e+02   4.161571e-06   0.000000e+00   4.161571e-06   0.000000e+00 
  1.707500e+02   2.164282e-06   0.000000e+00   2.164282e-06   0.000000e+00 
  1.710000e+02   1.888425e-06   0.000000e+00   1.888425e-06   0.000000e+00 
  1.712500e+02   1.604899e-06   0.000000e+00   1.604899e-06   0.000000e+00 
  1.715000e+02   1.690539e-06   0.000000e+00   1.690539e-06   0.000000e+00 
  1.717500e+02   2.090701e-06   0.000000e+00   2.090701e-06   0.000000e+00 
  1.720000e+02   2.518224e-06   0.000000e+00   2.518224e-06   0.000000e+00 
  1.722500e+02   2.008437e-06   0.000000e+00   2.008437e-06   0.000000e+00 
  1.725000e+02   1.940323e-06   0.000000e+00   1.940323e-06   0.000000e+00 
  1.727500e+02   2.144935e-06   0.000000e+00   2.144935e-06   0.000000e+00 
  1.730000e+02   2.062998e-06   0.000000e+00   2.062998e-06   0.000000e+00 
  1.732500e+02   2.152382e-06   0.000000e+00   2.152382e-06   0.000000e+00 
  1.735000e+02   2.815857e-06   0.000000e+00   2.815857e-06   0.000000e+00 
  1.737500e+02   2.624341e-06   0.000000e+00   2.624341e-06   0.000000e+00 
  1.740000e+02   2.508138e-06   0.000000e+00   2.508138e-06   0.000000e+00 
  1.742500e+02   2.634994e-06   0.000000e+00   2.634994e-06   0.000000e+00 
  1.745000e+02   3.107119e-06   0.000000e+00   3.107119e-06   0.000000e+00 
  1.747500e+02   3.313256e-06   0.000000e+00   3.313256e-06   0.000000e+00 
  1.750000e+02   3.174553e-06   0.000000e+00   3.174553e-06   0.000000e+00 
  1.752500e+02   3.121961e-06   0.000000e+00   3.121961e-06   0.000000e+00 
  1.755000e+02   2.828355e-06   0.000000e+00   2.828355e-06   0.000000e+00 
  1.757500e+02   2.810307e-06   0.000000e+00   2.810307e-06   0.000000e+00 
  1.760000e+02   2.364569e-06   0.000000e+00   2.364569e-06   0.000000e+00 
  1.762500e+02   2.911422e-06   0.000000e+00   2.911422e-06   0.000000e+00 
  1.765000e+02   3.435649e-06   0.000000e+00   3.435649e-06   0.000000e+00 
  1.767500e+02   3.316314e-06   0.000000e+00   3.316314e-06   0.000000e+00 
  1.770000e+02   3.312818e-06   0.000000e+00   3.312818e-06   0.000000e+00 
  1.772500e+02   3.992199e-06   0.000000e+00   3.992199e-06   0.000000e+00 
  1.775000e+02   5.349586e-06   0.000000e+00   5.349586e-06   0.000000e+00 
  1.777500e+02   5.583389e-06   0.000000e+00   5.583389e-06   0.000000e+00 
  1.780000e+02   4.188824e-06   0.000000e+00   4.188824e-06   0.000000e+00 
  1.782500e+02   6.157000e-06   0.000000e+00   6.157000e-06   0.000000e+00 
  1.785000e+02   6.982878e-06   0.000000e+00   6.982878e-06   0.000000e+00 
  1.787500e+02   4.411905e-06   0.000000e+00   4.411905e-06   0.000000e+00 
  1.790000e+02   3.449163e-06   0.000000e+00   3.449163e-06   0.000000e+00 
  1.792500e+02   3.100854e-06   0.000000e+00   3.100854e-06   0.000000e+00 
  1.795000e+02   4.974306e-06   0.000000e+00   4.974306e-06   0.000000e+00 
  1.797500e+02   1.556091e-05   0.000000e+00   1.556091e-05   0.000000e+00 
  1.800000e+02   2.680773e-05   0.000000e+00   2.680773e-05   0.000000e+00 
  1.802500e+02   1.475107e-05   0.000000e+00   1.475107e-05   0.000000e+00 
  1.805000e+02   4.188821e-06   0.000000e+00   4.188821e-06   0.000000e+00 
  1.807500e+02   2.763397e-06   0.000000e+00   2.763397e-06   0.000000e+00 
  1.810000e+02   3.169411e-06   0.000000e+00   3.169411e-06   0.000000e+00 
  1.812500e+02   3.555085e-06   0.000000e+00   3.555085e-06   0.000000e+00 
  1.815000e+02   2.922402e-06   0.000000e+00   2.922402e-06   0.000000e+00 
  1.817500e+02   2.962116e-06   0.000000e+00   2.962116e-06   0.000000e+00 
  1.820000e+02   3.388828e-06   0.000000e+00   3.388828e-06   0.000000e+00 
  1.822500e+02   3.327157e-06   0.000000e+00   3.327157e-06   0.000000e+00 
  1.825000e+02   2.223667e-06   0.000000e+00   2.223667e-06   0.000000e+00 
  1.827500e+02   2.079022e-06   0.000000e+00   2.079022e-06   0.000000e+00 
  1.830000e+02   2.695040e-06   0.000000e+00   2.695040e-06   0.000000e+00 
  1.832500e+02   3.473602e-06   0.000000e+00   3.473602e-06   0.000000e+00 
  1.835000e+02   3.277687e-06   0.000000e+00   3.277687e-06   0.000000e+00 
  1.837500e+02   2.350628e-06   0.000000e+00   2.350628e-06   0.000000e+00 
  1.840000e+02   2.045382e-06   0.000000e+00   2.045382e-06   0.000000e+00 
  1.842500e+02   2.596620e-06   0.000000e+00   2.596620e-06   0.000000e+00 
  1.845000e+02   2.865553e-06   0.000000e+00   2.865553e-06   0.000000e+00 
  1.847500e+02   3.001278e-06   0.000000e+00   3.001278e-06   0.000000e+00 
  1.850000e+02   2.760755e-06   0.000000e+00   2.760755e-06   0.000000e+00 
  1.852500e+02   2.996627e-06   0.000000e+00   2.996627e-06   0.000000e+00 
  1.855000e+02   3.057953e-06   0.000000e+00   3.057953e-06   0.000000e+00 
  1.857500e+02   2.803366e-06   0.000000e+00   2.803366e-06   0.000000e+00 
  1.860000e+02   2.326047e-06   0.000000e+00   2.326047e-06   0.000000e+00 
  1.862500e+02   2.526819e-06   0.000000e+00   2.526819e-06   0.000000e+00 
  1.865000e+02   2.678245e-06   0.000000e+00   2.678245e-06   0.000000e+00 
  1.867500e+02   2.624333e-06   0.000000e+00   2.624333e-06   0.000000e+00 
  1.870000e+02   2.228150e-06   0.000000e+00   2.228150e-06   0.000000e+00 
  1.872500e+02   2.694552e-06   0.000000e+00   2.694552e-06   0.000000e+00 
  1.875000e+02   2.690073e-06   0.000000e+00   2.690073e-06   0.000000e+00 
  1.877500e+02   2.590688e-06   0.000000e+00   2.590688e-06   0.000000e+00 
  1.880000e+02   2.335167e-06   0.000000e+00   2.335167e-06   0.000000e+00 
  1.882500e+02   2.828852e-06   0.000000e+00   2.828852e-06   0.000000e+00 
  1.885000e+02   2.691947e-06   0.000000e+00   2.691947e-06   0.000000e+00 
  1.887500e+02   2.854619e-06   0.000000e+00   2.854619e-06   0.000000e+00 
  1.890000e+02   3.775710e-06   0.000000e+00   3.775710e-06   0.000000e+00 
  1.892500e+02   7.480967e-06   0.000000e+00   7.480967e-06   0.000000e+00 
  1.895000e+02   5.861573e-06   0.000000e+00   5.861573e-06   0.000000e+00 
  1.897500e+02   2.832609e-06   0.000000e+00   2.832609e-06   0.000000e+00 
  1.900000e+02   2.465510e-06   0.000000e+00   2.465510e-06   0.000000e+00 
  1.902500e+02   3.131364e-06   0.000000e+00   3.131364e-06   0.000000e+00 
  1.905000e+02   3.302359e-06   0.000000e+00   3.302359e-06   0.000000e+00 
  1.907500e+02   2.389482e-06   0.000000e+00   2.389482e-06   0.000000e+00 
  1.910000e+02   2.786102e-06   0.000000e+00   2.786102e-06   0.000000e+00 
  1.912500e+02   2.651882e-06   0.000000e+00   2.651882e-06   0.000000e+00 
  1.915000e+02   2.718724e-06   0.000000e+00   2.718724e-06   0.000000e+00 
  1.917500e+02   2.657456e-06   0.000000e+00   2.657456e-06   0.000000e+00 
  1.920000e+02   3.237681e-06   0.000000e+00   3.237681e-06   0.000000e+00 
  1.922500e+02   3.310218e-06   0.000000e+00   3.310218e-06   0.000000e+00 
  1.925000e+02   2.964673e-06   0.000000e+00   2.964673e-06   0.000000e+00 
  1.927500e+02   2.883261e-06   0.000000e+00   2.883261e-06   0.000000e+00 
  1.930000e+02   2.585565e-06   0.000000e+00   2.585565e-06   0.000000e+00 
  1.932500e+02   3.327313e-06   0.000000e+00   3.327313e-06   0.000000e+00 
  1.935000e+02   2.875443e-06   0.000000e+00   2.875443e-06   0.000000e+00 
  1.937500e+02   2.387849e-06   0.000000e+00   2.387849e-06   0.000000e+00 
  1.940000e+02   2.406889e-06   0.000000e+00   2.406889e-06   0.000000e+00 
  1.942500e+02   2.510865e-06   0.000000e+00   2.510865e-06   0.000000e+00 
  1.945000e+02   2.792209e-06   0.000000e+00   2.792209e-06   0.000000e+00 
  1.947500e+02   2.853686e-06   0.000000e+00   2.853686e-06   0.000000e+00 
  1.950000e+02   2.717368e-06   0.000000e+00   2.717368e-06   0.000000e+00 
  1.952500e+02   3.178990e-06   0.000000e+00   3.178990e-06   0.000000e+00 
  1.955000e+02   3.261074e-06   0.000000e+00   3.261074e-06   0.000000e+00 
  1.957500e+02   2.929100e-06   0.000000e+00   2.929100e-06   0.000000e+00 
  1.960000e+02   2.440875e-06   0.000000e+00   2.440875e-06   0.000000e+00 
  1.962500e+02   2.999403e-06   0.000000e+00   2.999403e-06   0.000000e+00 
  1.965000e+02   2.690413e-06   0.000000e+00   2.690413e-06   0.000000e+00 
  1.967500e+02   3.207920e-06   0.000000e+00   3.207920e-06   0.000000e+00 
  1.970000e+02   3.402656e-06   0.000000e+00   3.402656e-06   0.000000e+00 
  1.972500e+02   3.079684e-06   0.000000e+00   3.079684e-06   0.000000e+00 
  1.975000e+02   2.962886e-06   0.000000e+00   2.962886e-06   0.000000e+00 
  1.977500e+02   3.147236e-06   0.000000e+00   3.147236e-06   0.000000e+00 
  1.980000e+02   3.259209e-06   0.000000e+00   3.259209e-06   0.000000e+00 
  1.982500e+02   2.328768e-06   0.000000e+00   2.328768e-06   0.000000e+00 
  1.985000e+02   2.811395e-06   0.000000e+00   2.811395e-06   0.000000e+00 
  1.987500e+02   4.513434e-06   0.000000e+00   4.513434e-06   0.000000e+00 
  1.990000e+02   4.588205e-06   0.000000e+00   4.588205e-06   0.000000e+00 
  1.992500e+02   2.965785e-06   0.000000e+00   2.965785e-06   0.000000e+00 
  1.995000e+02   2.828554e-06   0.000000e+00   2.828554e-06   0.000000e+00 
  1.997500e+02   2.426227e-06   0.000000e+00   2.426227e-06   0.000000e+00 
  2.000000e+02   2.601278e-06   0.000000e+00   2.601278e-06   0.000000e+00 
