  0.000000e+00   1.539367e-03   0.000000e+00   1.539367e-03   0.000000e+00 
  2.500000e-01   7.706926e-04   0.000000e+00   7.706926e-04   0.000000e+00 
  5.000000e-01   8.855709e-06   0.000000e+00   8.855709e-06   0.000000e+00 
  7.500000e-01   8.525677e-06   0.000000e+00   8.525677e-06   0.000000e+00 
  1.000000e+00   1.442395e-05   0.000000e+00   1.442395e-05   0.000000e+00 
  1.250000e+00   1.707954e-05   0.000000e+00   1.707954e-05   0.000000e+00 
  1.500000e+00   1.673109e-05   0.000000e+00   1.673109e-05   0.000000e+00 
  1.750000e+00   2.574589e-05   0.000000e+00   2.574589e-05   0.000000e+00 
  2.000000e+00   2.601624e-05   0.000000e+00   2.601624e-05   0.000000e+00 
  2.250000e+00   2.163201e-05   0.000000e+00   2.163201e-05   0.000000e+00 
  2.500000e+00   2.476155e-05   0.000000e+00   2.476155e-05   0.000000e+00 
  2.750000e+00   3.485143e-05   0.000000e+00   3.485143e-05   0.000000e+00 
  3.000000e+00   3.903825e-05   0.000000e+00   3.903825e-05   0.000000e+00 
  3.250000e+00   3.308721e-05   0.000000e+00   3.308721e-05   0.000000e+00 
  3.500000e+00   3.328475e-05   0.000000e+00   3.328475e-05   0.000000e+00 
  3.750000e+00   3.361002e-05   0.000000e+00   3.361002e-05   0.000000e+00 
  4.000000e+00   3.870480e-05   0.000000e+00   3.870480e-05   0.000000e+00 
  4.250000e+00   3.933665e-05   0.000000e+00   3.933665e-05   0.000000e+00 
  4.500000e+00   4.716222e-05   0.000000e+00   4.716222e-05   0.000000e+00 
  4.750000e+00   5.093621e-05   0.000000e+00   5.093621e-05   0.000000e+00 
  5.000000e+00   3.380614e-05   0.000000e+00   3.380614e-05   0.000000e+00 
  5.250000e+00   4.365013e-05   0.000000e+00   4.365013e-05   0.000000e+00 
  5.500000e+00   4.404891e-05   0.000000e+00   4.404891e-05   0.000000e+00 
  5.750000e+00   3.996703e-05   0.000000e+00   3.996703e-05   0.000000e+00 
  6.000000e+00   5.234004e-05   0.000000e+00   5.234004e-05   0.000000e+00 
  6.250000e+00   5.424396e-05   0.000000e+00   5.424396e-05   0.000000e+00 
  6.500000e+00   4.514971e-05   0.000000e+00   4.514971e-05   0.000000e+00 
  6.750000e+00   4.657443e-05   0.000000e+00   4.657443e-05   0.000000e+00 
  7.000000e+00   5.830477e-05   0.000000e+00   5.830477e-05   0.000000e+00 
  7.250000e+00   5.520045e-05   0.000000e+00   5.520045e-05   0.000000e+00 
  7.500000e+00   4.306186e-05   0.000000e+00   4.306186e-05   0.000000e+00 
  7.750000e+00   4.517441e-05   0.000000e+00   4.517441e-05   0.000000e+00 
  8.000000e+00   4.635010e-05   0.000000e+00   4.635010e-05   0.000000e+00 
  8.250000e+00   4.176667e-05   0.000000e+00   4.176667e-05   0.000000e+00 
  8.500000e+00   3.993870e-05   0.000000e+00   3.993870e-05   0.000000e+00 
  8.750000e+00   3.845547e-05   0.000000e+00   3.845547e-05   0.000000e+00 
  9.000000e+00   4.296743e-05   0.000000e+00   4.296743e-05   0.000000e+00 
  9.250000e+00   3.794460e-05   0.000000e+00   3.794460e-05   0.000000e+00 
  9.500000e+00   4.552681e-05   0.000000e+00   4.552681e-05   0.000000e+00 
  9.750000e+00   5.264933e-05   0.000000e+00   5.264933e-05   0.000000e+00 
  1.000000e+01   5.009869e-05   0.000000e+00   5.009869e-05   0.000000e+00 
  1.025000e+01   4.496214e-05   0.000000e+00   4.496214e-05   0.000000e+00 
  1.050000e+01   4.994260e-05   0.000000e+00   4.994260e-05   0.000000e+00 
  1.075000e+01   4.811176e-05   0.000000e+00   4.811176e-05   0.000000e+00 
  1.100000e+01   4.464707e-05   0.000000e+00   4.464707e-05   0.000000e+00 
  1.125000e+01   4.375788e-05   0.000000e+00   4.375788e-05   0.000000e+00 
  1.150000e+01   3.035526e-05   0.000000e+00   3.035526e-05   0.000000e+00 
  1.175000e+01   4.127467e-05   0.000000e+00   4.127467e-05   0.000000e+00 
  1.200000e+01   5.248796e-05   0.000000e+00   5.248796e-05   0.000000e+00 
  1.225000e+01   4.582857e-05   0.000000e+00   4.582857e-05   0.000000e+00 
  1.250000e+01   5.193083e-05   0.000000e+00   5.193083e-05   0.000000e+00 
  1.275000e+01   4.959305e-05   0.000000e+00   4.959305e-05   0.000000e+00 
  1.300000e+01   4.855140e-05   0.000000e+00   4.855140e-05   0.000000e+00 
  1.325000e+01   5.625272e-05   0.000000e+00   5.625272e-05   0.000000e+00 
  1.350000e+01   5.245176e-05   0.000000e+00   5.245176e-05   0.000000e+00 
  1.375000e+01   3.797219e-05   0.000000e+00   3.797219e-05   0.000000e+00 
  1.400000e+01   3.971135e-05   0.000000e+00   3.971135e-05   0.000000e+00 
  1.425000e+01   2.766306e-05   0.000000e+00   2.766306e-05   0.000000e+00 
  1.450000e+01   2.439078e-05   0.000000e+00   2.439078e-05   0.000000e+00 
  1.475000e+01   3.281288e-05   0.000000e+00   3.281288e-05   0.000000e+00 
  1.500000e+01   2.703486e-05   0.000000e+00   2.703486e-05   0.000000e+00 
  1.525000e+01   3.024787e-05   0.000000e+00   3.024787e-05   0.000000e+00 
  1.550000e+01   3.917988e-05   0.000000e+00   3.917988e-05   0.000000e+00 
  1.575000e+01   2.674552e-05   0.000000e+00   2.674552e-05   0.000000e+00 
  1.600000e+01   3.321783e-05   0.000000e+00   3.321783e-05   0.000000e+00 
  1.625000e+01   4.492883e-05   0.000000e+00   4.492883e-05   0.000000e+00 
  1.650000e+01   3.682110e-05   0.000000e+00   3.682110e-05   0.000000e+00 
  1.675000e+01   2.746189e-05   0.000000e+00   2.746189e-05   0.000000e+00 
  1.700000e+01   3.567601e-05   0.000000e+00   3.567601e-05   0.000000e+00 
  1.725000e+01   3.623883e-05   0.000000e+00   3.623883e-05   0.000000e+00 
  1.750000e+01   4.135507e-05   0.000000e+00   4.135507e-05   0.000000e+00 
  1.775000e+01   3.016206e-05   0.000000e+00   3.016206e-05   0.000000e+00 
  1.800000e+01   3.416897e-05   0.000000e+00   3.416897e-05   0.000000e+00 
  1.825000e+01   2.992684e-05   0.000000e+00   2.992684e-05   0.000000e+00 
  1.850000e+01   3.469991e-05   0.000000e+00   3.469991e-05   0.000000e+00 
  1.875000e+01   3.603503e-05   0.000000e+00   3.603503e-05   0.000000e+00 
  1.900000e+01   3.139251e-05   0.000000e+00   3.139251e-05   0.000000e+00 
  1.925000e+01   3.169643e-05   0.000000e+00   3.169643e-05   0.000000e+00 
  1.950000e+01   4.158154e-05   0.000000e+00   4.158154e-05   0.000000e+00 
  1.975000e+01   4.309034e-05   0.000000e+00   4.309034e-05   0.000000e+00 
  2.000000e+01   3.455770e-05   0.000000e+00   3.455770e-05   0.000000e+00 
  2.025000e+01   2.950492e-05   0.000000e+00   2.950492e-05   0.000000e+00 
  2.050000e+01   4.087931e-05   0.000000e+00   4.087931e-05   0.000000e+00 
  2.075000e+01   4.010124e-05   0.000000e+00   4.010124e-05   0.000000e+00 
  2.100000e+01   2.902998e-05   0.000000e+00   2.902998e-05   0.000000e+00 
  2.125000e+01   3.628172e-05   0.000000e+00   3.628172e-05   0.000000e+00 
  2.150000e+01   2.793021e-05   0.000000e+00   2.793021e-05   0.000000e+00 
  2.175000e+01   2.349858e-05   0.000000e+00   2.349858e-05   0.000000e+00 
  2.200000e+01   2.965942e-05   0.000000e+00   2.965942e-05   0.000000e+00 
  2.225000e+01   2.704261e-05   0.000000e+00   2.704261e-05   0.000000e+00 
  2.250000e+01   3.066441e-05   0.000000e+00   3.066441e-05   0.000000e+00 
  2.275000e+01   4.060552e-05   0.000000e+00   4.060552e-05   0.000000e+00 
  2.300000e+01   4.006789e-05   0.000000e+00   4.006789e-05   0.000000e+00 
  2.325000e+01   2.700230e-05   0.000000e+00   2.700230e-05   0.000000e+00 
  2.350000e+01   2.503003e-05   0.000000e+00   2.503003e-05   0.000000e+00 
  2.375000e+01   2.744793e-05   0.000000e+00   2.744793e-05   0.000000e+00 
  2.400000e+01   3.121734e-05   0.000000e+00   3.121734e-05   0.000000e+00 
  2.425000e+01   3.723644e-05   0.000000e+00   3.723644e-05   0.000000e+00 
  2.450000e+01   3.210566e-05   0.000000e+00   3.210566e-05   0.000000e+00 
  2.475000e+01   2.817391e-05   0.000000e+00   2.817391e-05   0.000000e+00 
  2.500000e+01   3.008851e-05   0.000000e+00   3.008851e-05   0.000000e+00 
  2.525000e+01   3.054780e-05   0.000000e+00   3.054780e-05   0.000000e+00 
  2.550000e+01   2.161849e-05   0.000000e+00   2.161849e-05   0.000000e+00 
  2.575000e+01   2.612173e-05   0.000000e+00   2.612173e-05   0.000000e+00 
  2.600000e+01   3.074219e-05   0.000000e+00   3.074219e-05   0.000000e+00 
  2.625000e+01   3.223072e-05   0.000000e+00   3.223072e-05   0.000000e+00 
  2.650000e+01   3.507382e-05   0.000000e+00   3.507382e-05   0.000000e+00 
  2.675000e+01   4.383183e-05   0.000000e+00   4.383183e-05   0.000000e+00 
  2.700000e+01   3.532586e-05   0.000000e+00   3.532586e-05   0.000000e+00 
  2.725000e+01   2.907943e-05   0.000000e+00   2.907943e-05   0.000000e+00 
  2.750000e+01   3.096977e-05   0.000000e+00   3.096977e-05   0.000000e+00 
  2.775000e+01   4.055620e-05   0.000000e+00   4.055620e-05   0.000000e+00 
  2.800000e+01   3.629063e-05   0.000000e+00   3.629063e-05   0.000000e+00 
  2.825000e+01   2.847257e-05   0.000000e+00   2.847257e-05   0.000000e+00 
  2.850000e+01   3.219115e-05   0.000000e+00   3.219115e-05   0.000000e+00 
  2.875000e+01   2.353873e-05   0.000000e+00   2.353873e-05   0.000000e+00 
  2.900000e+01   2.059944e-05   0.000000e+00   2.059944e-05   0.000000e+00 
  2.925000e+01   2.378364e-05   0.000000e+00   2.378364e-05   0.000000e+00 
  2.950000e+01   2.839141e-05   0.000000e+00   2.839141e-05   0.000000e+00 
  2.975000e+01   3.124651e-05   0.000000e+00   3.124651e-05   0.000000e+00 
  3.000000e+01   3.026009e-05   0.000000e+00   3.026009e-05   0.000000e+00 
  3.025000e+01   3.133885e-05   0.000000e+00   3.133885e-05   0.000000e+00 
  3.050000e+01   3.615982e-05   0.000000e+00   3.615982e-05   0.000000e+00 
  3.075000e+01   3.749437e-05   0.000000e+00   3.749437e-05   0.000000e+00 
  3.100000e+01   3.992453e-05   0.000000e+00   3.992453e-05   0.000000e+00 
  3.125000e+01   2.765483e-05   0.000000e+00   2.765483e-05   0.000000e+00 
  3.150000e+01   2.179951e-05   0.000000e+00   2.179951e-05   0.000000e+00 
  3.175000e+01   2.485726e-05   0.000000e+00   2.485726e-05   0.000000e+00 
  3.200000e+01   2.488937e-05   0.000000e+00   2.488937e-05   0.000000e+00 
  3.225000e+01   3.554241e-05   0.000000e+00   3.554241e-05   0.000000e+00 
  3.250000e+01   3.196878e-05   0.000000e+00   3.196878e-05   0.000000e+00 
  3.275000e+01   3.103804e-05   0.000000e+00   3.103804e-05   0.000000e+00 
  3.300000e+01   2.460125e-05   0.000000e+00   2.460125e-05   0.000000e+00 
  3.325000e+01   2.582015e-05   0.000000e+00   2.582015e-05   0.000000e+00 
  3.350000e+01   2.999496e-05   0.000000e+00   2.999496e-05   0.000000e+00 
  3.375000e+01   2.549606e-05   0.000000e+00   2.549606e-05   0.000000e+00 
  3.400000e+01   2.966920e-05   0.000000e+00   2.966920e-05   0.000000e+00 
  3.425000e+01   2.371939e-05   0.000000e+00   2.371939e-05   0.000000e+00 
  3.450000e+01   2.418296e-05   0.000000e+00   2.418296e-05   0.000000e+00 
  3.475000e+01   2.698558e-05   0.000000e+00   2.698558e-05   0.000000e+00 
  3.500000e+01   2.942980e-05   0.000000e+00   2.942980e-05   0.000000e+00 
  3.525000e+01   3.012200e-05   0.000000e+00   3.012200e-05   0.000000e+00 
  3.550000e+01   2.322368e-05   0.000000e+00   2.322368e-05   0.000000e+00 
  3.575000e+01   2.958375e-05   0.000000e+00   2.958375e-05   0.000000e+00 
  3.600000e+01   3.349115e-05   0.000000e+00   3.349115e-05   0.000000e+00 
  3.625000e+01   2.474380e-05   0.000000e+00   2.474380e-05   0.000000e+00 
  3.650000e+01   2.748076e-05   0.000000e+00   2.748076e-05   0.000000e+00 
  3.675000e+01   2.395141e-05   0.000000e+00   2.395141e-05   0.000000e+00 
  3.700000e+01   2.260310e-05   0.000000e+00   2.260310e-05   0.000000e+00 
  3.725000e+01   2.431136e-05   0.000000e+00   2.431136e-05   0.000000e+00 
  3.750000e+01   2.449378e-05   0.000000e+00   2.449378e-05   0.000000e+00 
  3.775000e+01   2.300737e-05   0.000000e+00   2.300737e-05   0.000000e+00 
  3.800000e+01   2.381389e-05   0.000000e+00   2.381389e-05   0.000000e+00 
  3.825000e+01   2.517441e-05   0.000000e+00   2.517441e-05   0.000000e+00 
  3.850000e+01   2.622441e-05   0.000000e+00   2.622441e-05   0.000000e+00 
  3.875000e+01   2.880637e-05   0.000000e+00   2.880637e-05   0.000000e+00 
  3.900000e+01   3.171901e-05   0.000000e+00   3.171901e-05   0.000000e+00 
  3.925000e+01   2.494849e-05   0.000000e+00   2.494849e-05   0.000000e+00 
  3.950000e+01   2.866104e-05   0.000000e+00   2.866104e-05   0.000000e+00 
  3.975000e+01   2.531104e-05   0.000000e+00   2.531104e-05   0.000000e+00 
  4.000000e+01   2.599735e-05   0.000000e+00   2.599735e-05   0.000000e+00 
  4.025000e+01   2.525380e-05   0.000000e+00   2.525380e-05   0.000000e+00 
  4.050000e+01   1.783516e-05   0.000000e+00   1.783516e-05   0.000000e+00 
  4.075000e+01   2.326253e-05   0.000000e+00   2.326253e-05   0.000000e+00 
  4.100000e+01   3.060129e-05   0.000000e+00   3.060129e-05   0.000000e+00 
  4.125000e+01   2.704797e-05   0.000000e+00   2.704797e-05   0.000000e+00 
  4.150000e+01   1.840479e-05   0.000000e+00   1.840479e-05   0.000000e+00 
  4.175000e+01   1.982291e-05   0.000000e+00   1.982291e-05   0.000000e+00 
  4.200000e+01   2.565507e-05   0.000000e+00   2.565507e-05   0.000000e+00 
  4.225000e+01   2.433254e-05   0.000000e+00   2.433254e-05   0.000000e+00 
  4.250000e+01   2.461191e-05   0.000000e+00   2.461191e-05   0.000000e+00 
  4.275000e+01   2.274332e-05   0.000000e+00   2.274332e-05   0.000000e+00 
  4.300000e+01   1.923817e-05   0.000000e+00   1.923817e-05   0.000000e+00 
  4.325000e+01   2.360161e-05   0.000000e+00   2.360161e-05   0.000000e+00 
  4.350000e+01   2.770815e-05   0.000000e+00   2.770815e-05   0.000000e+00 
  4.375000e+01   2.384044e-05   0.000000e+00   2.384044e-05   0.000000e+00 
  4.400000e+01   2.048169e-05   0.000000e+00   2.048169e-05   0.000000e+00 
  4.425000e+01   2.726001e-05   0.000000e+00   2.726001e-05   0.000000e+00 
  4.450000e+01   2.675111e-05   0.000000e+00   2.675111e-05   0.000000e+00 
  4.475000e+01   2.275356e-05   0.000000e+00   2.275356e-05   0.000000e+00 
  4.500000e+01   2.398276e-05   0.000000e+00   2.398276e-05   0.000000e+00 
  4.525000e+01   2.106463e-05   0.000000e+00   2.106463e-05   0.000000e+00 
  4.550000e+01   1.644532e-05   0.000000e+00   1.644532e-05   0.000000e+00 
  4.575000e+01   1.388776e-05   0.000000e+00   1.388776e-05   0.000000e+00 
  4.600000e+01   1.608446e-05   0.000000e+00   1.608446e-05   0.000000e+00 
  4.625000e+01   2.011185e-05   0.000000e+00   2.011185e-05   0.000000e+00 
  4.650000e+01   1.984736e-05   0.000000e+00   1.984736e-05   0.000000e+00 
  4.675000e+01   1.832224e-05   0.000000e+00   1.832224e-05   0.000000e+00 
  4.700000e+01   2.405566e-05   0.000000e+00   2.405566e-05   0.000000e+00 
  4.725000e+01   2.634876e-05   0.000000e+00   2.634876e-05   0.000000e+00 
  4.750000e+01   2.316476e-05   0.000000e+00   2.316476e-05   0.000000e+00 
  4.775000e+01   2.430512e-05   0.000000e+00   2.430512e-05   0.000000e+00 
  4.800000e+01   2.296795e-05   0.000000e+00   2.296795e-05   0.000000e+00 
  4.825000e+01   2.188318e-05   0.000000e+00   2.188318e-05   0.000000e+00 
  4.850000e+01   3.117060e-05   0.000000e+00   3.117060e-05   0.000000e+00 
  4.875000e+01   2.655825e-05   0.000000e+00   2.655825e-05   0.000000e+00 
  4.900000e+01   1.661950e-05   0.000000e+00   1.661950e-05   0.000000e+00 
  4.925000e+01   2.291327e-05   0.000000e+00   2.291327e-05   0.000000e+00 
  4.950000e+01   2.063378e-05   0.000000e+00   2.063378e-05   0.000000e+00 
  4.975000e+01   1.902071e-05   0.000000e+00   1.902071e-05   0.000000e+00 
  5.000000e+01   2.033507e-05   0.000000e+00   2.033507e-05   0.000000e+00 
  5.025000e+01   2.204722e-05   0.000000e+00   2.204722e-05   0.000000e+00 
  5.050000e+01   2.344858e-05   0.000000e+00   2.344858e-05   0.000000e+00 
  5.075000e+01   2.850678e-05   0.000000e+00   2.850678e-05   0.000000e+00 
  5.100000e+01   2.493955e-05   0.000000e+00   2.493955e-05   0.000000e+00 
  5.125000e+01   2.703341e-05   0.000000e+00   2.703341e-05   0.000000e+00 
  5.150000e+01   2.407594e-05   0.000000e+00   2.407594e-05   0.000000e+00 
  5.175000e+01   1.976701e-05   0.000000e+00   1.976701e-05   0.000000e+00 
  5.200000e+01   2.167786e-05   0.000000e+00   2.167786e-05   0.000000e+00 
  5.225000e+01   2.576129e-05   0.000000e+00   2.576129e-05   0.000000e+00 
  5.250000e+01   2.461593e-05   0.000000e+00   2.461593e-05   0.000000e+00 
  5.275000e+01   2.056283e-05   0.000000e+00   2.056283e-05   0.000000e+00 
  5.300000e+01   2.247158e-05   0.000000e+00   2.247158e-05   0.000000e+00 
  5.325000e+01   2.518383e-05   0.000000e+00   2.518383e-05   0.000000e+00 
  5.350000e+01   2.257591e-05   0.000000e+00   2.257591e-05   0.000000e+00 
  5.375000e+01   2.781922e-05   0.000000e+00   2.781922e-05   0.000000e+00 
  5.400000e+01   2.451854e-05   0.000000e+00   2.451854e-05   0.000000e+00 
  5.425000e+01   1.982270e-05   0.000000e+00   1.982270e-05   0.000000e+00 
  5.450000e+01   1.721602e-05   0.000000e+00   1.721602e-05   0.000000e+00 
  5.475000e+01   2.344212e-05   0.000000e+00   2.344212e-05   0.000000e+00 
  5.500000e+01   2.576478e-05   0.000000e+00   2.576478e-05   0.000000e+00 
  5.525000e+01   2.667536e-05   0.000000e+00   2.667536e-05   0.000000e+00 
  5.550000e+01   2.369821e-05   0.000000e+00   2.369821e-05   0.000000e+00 
  5.575000e+01   2.020129e-05   0.000000e+00   2.020129e-05   0.000000e+00 
  5.600000e+01   2.088677e-05   0.000000e+00   2.088677e-05   0.000000e+00 
  5.625000e+01   2.481938e-05   0.000000e+00   2.481938e-05   0.000000e+00 
  5.650000e+01   2.039029e-05   0.000000e+00   2.039029e-05   0.000000e+00 
  5.675000e+01   1.798717e-05   0.000000e+00   1.798717e-05   0.000000e+00 
  5.700000e+01   1.726081e-05   0.000000e+00   1.726081e-05   0.000000e+00 
  5.725000e+01   2.296839e-05   0.000000e+00   2.296839e-05   0.000000e+00 
  5.750000e+01   2.434529e-05   0.000000e+00   2.434529e-05   0.000000e+00 
  5.775000e+01   2.371768e-05   0.000000e+00   2.371768e-05   0.000000e+00 
  5.800000e+01   2.528589e-05   0.000000e+00   2.528589e-05   0.000000e+00 
  5.825000e+01   2.139459e-05   0.000000e+00   2.139459e-05   0.000000e+00 
  5.850000e+01   1.820335e-05   0.000000e+00   1.820335e-05   0.000000e+00 
  5.875000e+01   2.185280e-05   0.000000e+00   2.185280e-05   0.000000e+00 
  5.900000e+01   1.986338e-05   0.000000e+00   1.986338e-05   0.000000e+00 
  5.925000e+01   2.049114e-05   0.000000e+00   2.049114e-05   0.000000e+00 
  5.950000e+01   2.190514e-05   0.000000e+00   2.190514e-05   0.000000e+00 
  5.975000e+01   2.786354e-05   0.000000e+00   2.786354e-05   0.000000e+00 
  6.000000e+01   4.334312e-05   0.000000e+00   4.334312e-05   0.000000e+00 
  6.025000e+01   2.522365e-05   0.000000e+00   2.522365e-05   0.000000e+00 
  6.050000e+01   1.571761e-05   0.000000e+00   1.571761e-05   0.000000e+00 
  6.075000e+01   1.567263e-05   0.000000e+00   1.567263e-05   0.000000e+00 
  6.100000e+01   1.930500e-05   0.000000e+00   1.930500e-05   0.000000e+00 
  6.125000e+01   1.739436e-05   0.000000e+00   1.739436e-05   0.000000e+00 
  6.150000e+01   1.651904e-05   0.000000e+00   1.651904e-05   0.000000e+00 
  6.175000e+01   2.219121e-05   0.000000e+00   2.219121e-05   0.000000e+00 
  6.200000e+01   2.547045e-05   0.000000e+00   2.547045e-05   0.000000e+00 
  6.225000e+01   2.586375e-05   0.000000e+00   2.586375e-05   0.000000e+00 
  6.250000e+01   2.511795e-05   0.000000e+00   2.511795e-05   0.000000e+00 
  6.275000e+01   2.205338e-05   0.000000e+00   2.205338e-05   0.000000e+00 
  6.300000e+01   1.430326e-05   0.000000e+00   1.430326e-05   0.000000e+00 
  6.325000e+01   1.947445e-05   0.000000e+00   1.947445e-05   0.000000e+00 
  6.350000e+01   2.002966e-05   0.000000e+00   2.002966e-05   0.000000e+00 
  6.375000e+01   1.774072e-05   0.000000e+00   1.774072e-05   0.000000e+00 
  6.400000e+01   2.036676e-05   0.000000e+00   2.036676e-05   0.000000e+00 
  6.425000e+01   1.780791e-05   0.000000e+00   1.780791e-05   0.000000e+00 
  6.450000e+01   1.802481e-05   0.000000e+00   1.802481e-05   0.000000e+00 
  6.475000e+01   1.559390e-05   0.000000e+00   1.559390e-05   0.000000e+00 
  6.500000e+01   1.655359e-05   0.000000e+00   1.655359e-05   0.000000e+00 
  6.525000e+01   1.672714e-05   0.000000e+00   1.672714e-05   0.000000e+00 
  6.550000e+01   1.236617e-05   0.000000e+00   1.236617e-05   0.000000e+00 
  6.575000e+01   1.704794e-05   0.000000e+00   1.704794e-05   0.000000e+00 
  6.600000e+01   2.403157e-05   0.000000e+00   2.403157e-05   0.000000e+00 
  6.625000e+01   2.192469e-05   0.000000e+00   2.192469e-05   0.000000e+00 
  6.650000e+01   1.811339e-05   0.000000e+00   1.811339e-05   0.000000e+00 
  6.675000e+01   1.874366e-05   0.000000e+00   1.874366e-05   0.000000e+00 
  6.700000e+01   2.294830e-05   0.000000e+00   2.294830e-05   0.000000e+00 
  6.725000e+01   2.248653e-05   0.000000e+00   2.248653e-05   0.000000e+00 
  6.750000e+01   2.600654e-05   0.000000e+00   2.600654e-05   0.000000e+00 
  6.775000e+01   2.334293e-05   0.000000e+00   2.334293e-05   0.000000e+00 
  6.800000e+01   2.044795e-05   0.000000e+00   2.044795e-05   0.000000e+00 
  6.825000e+01   2.128220e-05   0.000000e+00   2.128220e-05   0.000000e+00 
  6.850000e+01   1.882226e-05   0.000000e+00   1.882226e-05   0.000000e+00 
  6.875000e+01   1.941461e-05   0.000000e+00   1.941461e-05   0.000000e+00 
  6.900000e+01   1.967731e-05   0.000000e+00   1.967731e-05   0.000000e+00 
  6.925000e+01   2.162817e-05   0.000000e+00   2.162817e-05   0.000000e+00 
  6.950000e+01   2.278619e-05   0.000000e+00   2.278619e-05   0.000000e+00 
  6.975000e+01   1.683902e-05   0.000000e+00   1.683902e-05   0.000000e+00 
  7.000000e+01   2.074759e-05   0.000000e+00   2.074759e-05   0.000000e+00 
  7.025000e+01   2.434129e-05   0.000000e+00   2.434129e-05   0.000000e+00 
  7.050000e+01   1.894015e-05   0.000000e+00   1.894015e-05   0.000000e+00 
  7.075000e+01   1.775110e-05   0.000000e+00   1.775110e-05   0.000000e+00 
  7.100000e+01   1.616598e-05   0.000000e+00   1.616598e-05   0.000000e+00 
  7.125000e+01   2.129790e-05   0.000000e+00   2.129790e-05   0.000000e+00 
  7.150000e+01   1.826355e-05   0.000000e+00   1.826355e-05   0.000000e+00 
  7.175000e+01   1.891681e-05   0.000000e+00   1.891681e-05   0.000000e+00 
  7.200000e+01   1.663426e-05   0.000000e+00   1.663426e-05   0.000000e+00 
  7.225000e+01   1.803945e-05   0.000000e+00   1.803945e-05   0.000000e+00 
  7.250000e+01   2.133299e-05   0.000000e+00   2.133299e-05   0.000000e+00 
  7.275000e+01   1.585221e-05   0.000000e+00   1.585221e-05   0.000000e+00 
  7.300000e+01   1.457138e-05   0.000000e+00   1.457138e-05   0.000000e+00 
  7.325000e+01   1.906964e-05   0.000000e+00   1.906964e-05   0.000000e+00 
  7.350000e+01   1.776479e-05   0.000000e+00   1.776479e-05   0.000000e+00 
  7.375000e+01   1.468712e-05   0.000000e+00   1.468712e-05   0.000000e+00 
  7.400000e+01   1.650439e-05   0.000000e+00   1.650439e-05   0.000000e+00 
  7.425000e+01   1.830296e-05   0.000000e+00   1.830296e-05   0.000000e+00 
  7.450000e+01   2.021580e-05   0.000000e+00   2.021580e-05   0.000000e+00 
  7.475000e+01   1.690887e-05   0.000000e+00   1.690887e-05   0.000000e+00 
  7.500000e+01   1.600876e-05   0.000000e+00   1.600876e-05   0.000000e+00 
  7.525000e+01   2.227087e-05   0.000000e+00   2.227087e-05   0.000000e+00 
  7.550000e+01   2.046097e-05   0.000000e+00   2.046097e-05   0.000000e+00 
  7.575000e+01   2.048936e-05   0.000000e+00   2.048936e-05   0.000000e+00 
  7.600000e+01   1.814384e-05   0.000000e+00   1.814384e-05   0.000000e+00 
  7.625000e+01   1.750064e-05   0.000000e+00   1.750064e-05   0.000000e+00 
  7.650000e+01   2.096952e-05   0.000000e+00   2.096952e-05   0.000000e+00 
  7.675000e+01   2.037329e-05   0.000000e+00   2.037329e-05   0.000000e+00 
  7.700000e+01   1.772315e-05   0.000000e+00   1.772315e-05   0.000000e+00 
  7.725000e+01   1.660657e-05   0.000000e+00   1.660657e-05   0.000000e+00 
  7.750000e+01   1.904290e-05   0.000000e+00   1.904290e-05   0.000000e+00 
  7.775000e+01   2.068156e-05   0.000000e+00   2.068156e-05   0.000000e+00 
  7.800000e+01   1.584141e-05   0.000000e+00   1.584141e-05   0.000000e+00 
  7.825000e+01   1.403151e-05   0.000000e+00   1.403151e-05   0.000000e+00 
  7.850000e+01   1.633009e-05   0.000000e+00   1.633009e-05   0.000000e+00 
  7.875000e+01   1.525373e-05   0.000000e+00   1.525373e-05   0.000000e+00 
  7.900000e+01   1.806338e-05   0.000000e+00   1.806338e-05   0.000000e+00 
  7.925000e+01   1.580702e-05   0.000000e+00   1.580702e-05   0.000000e+00 
  7.950000e+01   1.636480e-05   0.000000e+00   1.636480e-05   0.000000e+00 
  7.975000e+01   1.720099e-05   0.000000e+00   1.720099e-05   0.000000e+00 
  8.000000e+01   2.163221e-05   0.000000e+00   2.163221e-05   0.000000e+00 
  8.025000e+01   2.318333e-05   0.000000e+00   2.318333e-05   0.000000e+00 
  8.050000e+01   1.896440e-05   0.000000e+00   1.896440e-05   0.000000e+00 
  8.075000e+01   1.651838e-05   0.000000e+00   1.651838e-05   0.000000e+00 
  8.100000e+01   1.905290e-05   0.000000e+00   1.905290e-05   0.000000e+00 
  8.125000e+01   2.195503e-05   0.000000e+00   2.195503e-05   0.000000e+00 
  8.150000e+01   1.486221e-05   0.000000e+00   1.486221e-05   0.000000e+00 
  8.175000e+01   1.652895e-05   0.000000e+00   1.652895e-05   0.000000e+00 
  8.200000e+01   1.407027e-05   0.000000e+00   1.407027e-05   0.000000e+00 
  8.225000e+01   1.721719e-05   0.000000e+00   1.721719e-05   0.000000e+00 
  8.250000e+01   1.813818e-05   0.000000e+00   1.813818e-05   0.000000e+00 
  8.275000e+01   1.693241e-05   0.000000e+00   1.693241e-05   0.000000e+00 
  8.300000e+01   1.556880e-05   0.000000e+00   1.556880e-05   0.000000e+00 
  8.325000e+01   1.964344e-05   0.000000e+00   1.964344e-05   0.000000e+00 
  8.350000e+01   1.418994e-05   0.000000e+00   1.418994e-05   0.000000e+00 
  8.375000e+01   1.268187e-05   0.000000e+00   1.268187e-05   0.000000e+00 
  8.400000e+01   1.566045e-05   0.000000e+00   1.566045e-05   0.000000e+00 
  8.425000e+01   1.659738e-05   0.000000e+00   1.659738e-05   0.000000e+00 
  8.450000e+01   1.714162e-05   0.000000e+00   1.714162e-05   0.000000e+00 
  8.475000e+01   1.485888e-05   0.000000e+00   1.485888e-05   0.000000e+00 
  8.500000e+01   1.143883e-05   0.000000e+00   1.143883e-05   0.000000e+00 
  8.525000e+01   1.174844e-05   0.000000e+00   1.174844e-05   0.000000e+00 
  8.550000e+01   1.739787e-05   0.000000e+00   1.739787e-05   0.000000e+00 
  8.575000e+01   2.055915e-05   0.000000e+00   2.055915e-05   0.000000e+00 
  8.600000e+01   1.730374e-05   0.000000e+00   1.730374e-05   0.000000e+00 
  8.625000e+01   1.519614e-05   0.000000e+00   1.519614e-05   0.000000e+00 
  8.650000e+01   1.654313e-05   0.000000e+00   1.654313e-05   0.000000e+00 
  8.675000e+01   1.343654e-05   0.000000e+00   1.343654e-05   0.000000e+00 
  8.700000e+01   1.306656e-05   0.000000e+00   1.306656e-05   0.000000e+00 
  8.725000e+01   1.341091e-05   0.000000e+00   1.341091e-05   0.000000e+00 
  8.750000e+01   1.434830e-05   0.000000e+00   1.434830e-05   0.000000e+00 
  8.775000e+01   1.558794e-05   0.000000e+00   1.558794e-05   0.000000e+00 
  8.800000e+01   1.504962e-05   0.000000e+00   1.504962e-05   0.000000e+00 
  8.825000e+01   1.397927e-05   0.000000e+00   1.397927e-05   0.000000e+00 
  8.850000e+01   1.313886e-05   0.000000e+00   1.313886e-05   0.000000e+00 
  8.875000e+01   1.610544e-05   0.000000e+00   1.610544e-05   0.000000e+00 
  8.900000e+01   1.484894e-05   0.000000e+00   1.484894e-05   0.000000e+00 
  8.925000e+01   1.320309e-05   0.000000e+00   1.320309e-05   0.000000e+00 
  8.950000e+01   1.496697e-05   0.000000e+00   1.496697e-05   0.000000e+00 
  8.975000e+01   1.136483e-05   0.000000e+00   1.136483e-05   0.000000e+00 
  9.000000e+01   1.037201e-05   0.000000e+00   1.037201e-05   0.000000e+00 
  9.025000e+01   1.258937e-05   0.000000e+00   1.258937e-05   0.000000e+00 
  9.050000e+01   1.410530e-05   0.000000e+00   1.410530e-05   0.000000e+00 
  9.075000e+01   1.495117e-05   0.000000e+00   1.495117e-05   0.000000e+00 
  9.100000e+01   1.506938e-05   0.000000e+00   1.506938e-05   0.000000e+00 
  9.125000e+01   1.489563e-05   0.000000e+00   1.489563e-05   0.000000e+00 
  9.150000e+01   1.342992e-05   0.000000e+00   1.342992e-05   0.000000e+00 
  9.175000e+01   1.517806e-05   0.000000e+00   1.517806e-05   0.000000e+00 
  9.200000e+01   1.606588e-05   0.000000e+00   1.606588e-05   0.000000e+00 
  9.225000e+01   1.824208e-05   0.000000e+00   1.824208e-05   0.000000e+00 
  9.250000e+01   1.680002e-05   0.000000e+00   1.680002e-05   0.000000e+00 
  9.275000e+01   1.416504e-05   0.000000e+00   1.416504e-05   0.000000e+00 
  9.300000e+01   1.319175e-05   0.000000e+00   1.319175e-05   0.000000e+00 
  9.325000e+01   1.282012e-05   0.000000e+00   1.282012e-05   0.000000e+00 
  9.350000e+01   1.315415e-05   0.000000e+00   1.315415e-05   0.000000e+00 
  9.375000e+01   1.259770e-05   0.000000e+00   1.259770e-05   0.000000e+00 
  9.400000e+01   1.546497e-05   0.000000e+00   1.546497e-05   0.000000e+00 
  9.425000e+01   1.526945e-05   0.000000e+00   1.526945e-05   0.000000e+00 
  9.450000e+01   1.334933e-05   0.000000e+00   1.334933e-05   0.000000e+00 
  9.475000e+01   1.529114e-05   0.000000e+00   1.529114e-05   0.000000e+00 
  9.500000e+01   1.762220e-05   0.000000e+00   1.762220e-05   0.000000e+00 
  9.525000e+01   1.652421e-05   0.000000e+00   1.652421e-05   0.000000e+00 
  9.550000e+01   1.593694e-05   0.000000e+00   1.593694e-05   0.000000e+00 
  9.575000e+01   1.755091e-05   0.000000e+00   1.755091e-05   0.000000e+00 
  9.600000e+01   1.498108e-05   0.000000e+00   1.498108e-05   0.000000e+00 
  9.625000e+01   1.386546e-05   0.000000e+00   1.386546e-05   0.000000e+00 
  9.650000e+01   1.244912e-05   0.000000e+00   1.244912e-05   0.000000e+00 
  9.675000e+01   1.169596e-05   0.000000e+00   1.169596e-05   0.000000e+00 
  9.700000e+01   1.320737e-05   0.000000e+00   1.320737e-05   0.000000e+00 
  9.725000e+01   1.588121e-05   0.000000e+00   1.588121e-05   0.000000e+00 
  9.750000e+01   1.926474e-05   0.000000e+00   1.926474e-05   0.000000e+00 
  9.775000e+01   1.779485e-05   0.000000e+00   1.779485e-05   0.000000e+00 
  9.800000e+01   1.264025e-05   0.000000e+00   1.264025e-05   0.000000e+00 
  9.825000e+01   1.416127e-05   0.000000e+00   1.416127e-05   0.000000e+00 
  9.850000e+01   1.756937e-05   0.000000e+00   1.756937e-05   0.000000e+00 
  9.875000e+01   1.644596e-05   0.000000e+00   1.644596e-05   0.000000e+00 
  9.900000e+01   1.441740e-05   0.000000e+00   1.441740e-05   0.000000e+00 
  9.925000e+01   9.636990e-06   0.000000e+00   9.636990e-06   0.000000e+00 
  9.950000e+01   1.124673e-05   0.000000e+00   1.124673e-05   0.000000e+00 
  9.975000e+01   1.101266e-05   0.000000e+00   1.101266e-05   0.000000e+00 
  1.000000e+02   9.710837e-06   0.000000e+00   9.710837e-06   0.000000e+00 
  1.002500e+02   1.233876e-05   0.000000e+00   1.233876e-05   0.000000e+00 
  1.005000e+02   1.660169e-05   0.000000e+00   1.660169e-05   0.000000e+00 
  1.007500e+02   1.770372e-05   0.000000e+00   1.770372e-05   0.000000e+00 
  1.010000e+02   1.451703e-05   0.000000e+00   1.451703e-05   0.000000e+00 
  1.012500e+02   1.391172e-05   0.000000e+00   1.391172e-05   0.000000e+00 
  1.015000e+02   1.506248e-05   0.000000e+00   1.506248e-05   0.000000e+00 
  1.017500e+02   1.664536e-05   0.000000e+00   1.664536e-05   0.000000e+00 
  1.020000e+02   1.387788e-05   0.000000e+00   1.387788e-05   0.000000e+00 
  1.022500e+02   1.458282e-05   0.000000e+00   1.458282e-05   0.000000e+00 
  1.025000e+02   1.798926e-05   0.000000e+00   1.798926e-05   0.000000e+00 
  1.027500e+02   1.637334e-05   0.000000e+00   1.637334e-05   0.000000e+00 
  1.030000e+02   1.370067e-05   0.000000e+00   1.370067e-05   0.000000e+00 
  1.032500e+02   1.510876e-05   0.000000e+00   1.510876e-05   0.000000e+00 
  1.035000e+02   1.357784e-05   0.000000e+00   1.357784e-05   0.000000e+00 
  1.037500e+02   1.514828e-05   0.000000e+00   1.514828e-05   0.000000e+00 
  1.040000e+02   1.344824e-05   0.000000e+00   1.344824e-05   0.000000e+00 
  1.042500e+02   1.213030e-05   0.000000e+00   1.213030e-05   0.000000e+00 
  1.045000e+02   1.228146e-05   0.000000e+00   1.228146e-05   0.000000e+00 
  1.047500e+02   1.177831e-05   0.000000e+00   1.177831e-05   0.000000e+00 
  1.050000e+02   1.128007e-05   0.000000e+00   1.128007e-05   0.000000e+00 
  1.052500e+02   1.250615e-05   0.000000e+00   1.250615e-05   0.000000e+00 
  1.055000e+02   1.623914e-05   0.000000e+00   1.623914e-05   0.000000e+00 
  1.057500e+02   1.520345e-05   0.000000e+00   1.520345e-05   0.000000e+00 
  1.060000e+02   1.228562e-05   0.000000e+00   1.228562e-05   0.000000e+00 
  1.062500e+02   1.090389e-05   0.000000e+00   1.090389e-05   0.000000e+00 
  1.065000e+02   1.191188e-05   0.000000e+00   1.191188e-05   0.000000e+00 
  1.067500e+02   1.559635e-05   0.000000e+00   1.559635e-05   0.000000e+00 
  1.070000e+02   1.773121e-05   0.000000e+00   1.773121e-05   0.000000e+00 
  1.072500e+02   1.607590e-05   0.000000e+00   1.607590e-05   0.000000e+00 
  1.075000e+02   1.314688e-05   0.000000e+00   1.314688e-05   0.000000e+00 
  1.077500e+02   1.406897e-05   0.000000e+00   1.406897e-05   0.000000e+00 
  1.080000e+02   1.705558e-05   0.000000e+00   1.705558e-05   0.000000e+00 
  1.082500e+02   1.741813e-05   0.000000e+00   1.741813e-05   0.000000e+00 
  1.085000e+02   1.393144e-05   0.000000e+00   1.393144e-05   0.000000e+00 
  1.087500e+02   1.125857e-05   0.000000e+00   1.125857e-05   0.000000e+00 
  1.090000e+02   1.064799e-05   0.000000e+00   1.064799e-05   0.000000e+00 
  1.092500e+02   1.236033e-05   0.000000e+00   1.236033e-05   0.000000e+00 
  1.095000e+02   1.185319e-05   0.000000e+00   1.185319e-05   0.000000e+00 
  1.097500e+02   1.139520e-05   0.000000e+00   1.139520e-05   0.000000e+00 
  1.100000e+02   1.178612e-05   0.000000e+00   1.178612e-05   0.000000e+00 
  1.102500e+02   1.367215e-05   0.000000e+00   1.367215e-05   0.000000e+00 
  1.105000e+02   1.217723e-05   0.000000e+00   1.217723e-05   0.000000e+00 
  1.107500e+02   1.290345e-05   0.000000e+00   1.290345e-05   0.000000e+00 
  1.110000e+02   1.333261e-05   0.000000e+00   1.333261e-05   0.000000e+00 
  1.112500e+02   9.627853e-06   0.000000e+00   9.627853e-06   0.000000e+00 
  1.115000e+02   9.826354e-06   0.000000e+00   9.826354e-06   0.000000e+00 
  1.117500e+02   1.203017e-05   0.000000e+00   1.203017e-05   0.000000e+00 
  1.120000e+02   1.315825e-05   0.000000e+00   1.315825e-05   0.000000e+00 
  1.122500e+02   1.284527e-05   0.000000e+00   1.284527e-05   0.000000e+00 
  1.125000e+02   1.685388e-05   0.000000e+00   1.685388e-05   0.000000e+00 
  1.127500e+02   1.549422e-05   0.000000e+00   1.549422e-05   0.000000e+00 
  1.130000e+02   1.589936e-05   0.000000e+00   1.589936e-05   0.000000e+00 
  1.132500e+02   1.795532e-05   0.000000e+00   1.795532e-05   0.000000e+00 
  1.135000e+02   1.736158e-05   0.000000e+00   1.736158e-05   0.000000e+00 
  1.137500e+02   1.438439e-05   0.000000e+00   1.438439e-05   0.000000e+00 
  1.140000e+02   1.185683e-05   0.000000e+00   1.185683e-05   0.000000e+00 
  1.142500e+02   1.180628e-05   0.000000e+00   1.180628e-05   0.000000e+00 
  1.145000e+02   1.153950e-05   0.000000e+00   1.153950e-05   0.000000e+00 
  1.147500e+02   1.191317e-05   0.000000e+00   1.191317e-05   0.000000e+00 
  1.150000e+02   1.086238e-05   0.000000e+00   1.086238e-05   0.000000e+00 
  1.152500e+02   1.157828e-05   0.000000e+00   1.157828e-05   0.000000e+00 
  1.155000e+02   1.196364e-05   0.000000e+00   1.196364e-05   0.000000e+00 
  1.157500e+02   1.046020e-05   0.000000e+00   1.046020e-05   0.000000e+00 
  1.160000e+02   1.075381e-05   0.000000e+00   1.075381e-05   0.000000e+00 
  1.162500e+02   1.388271e-05   0.000000e+00   1.388271e-05   0.000000e+00 
  1.165000e+02   1.444252e-05   0.000000e+00   1.444252e-05   0.000000e+00 
  1.167500e+02   1.344497e-05   0.000000e+00   1.344497e-05   0.000000e+00 
  1.170000e+02   1.308152e-05   0.000000e+00   1.308152e-05   0.000000e+00 
  1.172500e+02   1.342966e-05   0.000000e+00   1.342966e-05   0.000000e+00 
  1.175000e+02   1.223997e-05   0.000000e+00   1.223997e-05   0.000000e+00 
  1.177500e+02   1.072932e-05   0.000000e+00   1.072932e-05   0.000000e+00 
  1.180000e+02   9.584751e-06   0.000000e+00   9.584751e-06   0.000000e+00 
  1.182500e+02   1.277682e-05   0.000000e+00   1.277682e-05   0.000000e+00 
  1.185000e+02   1.220720e-05   0.000000e+00   1.220720e-05   0.000000e+00 
  1.187500e+02   8.191870e-06   0.000000e+00   8.191870e-06   0.000000e+00 
  1.190000e+02   1.232075e-05   0.000000e+00   1.232075e-05   0.000000e+00 
  1.192500e+02   1.081110e-05   0.000000e+00   1.081110e-05   0.000000e+00 
  1.195000e+02   1.054268e-05   0.000000e+00   1.054268e-05   0.000000e+00 
  1.197500e+02   1.444500e-05   0.000000e+00   1.444500e-05   0.000000e+00 
  1.200000e+02   1.975780e-05   0.000000e+00   1.975780e-05   0.000000e+00 
  1.202500e+02   1.994253e-05   0.000000e+00   1.994253e-05   0.000000e+00 
  1.205000e+02   1.332268e-05   0.000000e+00   1.332268e-05   0.000000e+00 
  1.207500e+02   9.990167e-06   0.000000e+00   9.990167e-06   0.000000e+00 
  1.210000e+02   1.333744e-05   0.000000e+00   1.333744e-05   0.000000e+00 
  1.212500e+02   1.244314e-05   0.000000e+00   1.244314e-05   0.000000e+00 
  1.215000e+02   1.147625e-05   0.000000e+00   1.147625e-05   0.000000e+00 
  1.217500e+02   1.123748e-05   0.000000e+00   1.123748e-05   0.000000e+00 
  1.220000e+02   1.075331e-05   0.000000e+00   1.075331e-05   0.000000e+00 
  1.222500e+02   1.374068e-05   0.000000e+00   1.374068e-05   0.000000e+00 
  1.225000e+02   1.716254e-05   0.000000e+00   1.716254e-05   0.000000e+00 
  1.227500e+02   1.328159e-05   0.000000e+00   1.328159e-05   0.000000e+00 
  1.230000e+02   1.175027e-05   0.000000e+00   1.175027e-05   0.000000e+00 
  1.232500e+02   1.274405e-05   0.000000e+00   1.274405e-05   0.000000e+00 
  1.235000e+02   1.335371e-05   0.000000e+00   1.335371e-05   0.000000e+00 
  1.237500e+02   1.386062e-05   0.000000e+00   1.386062e-05   0.000000e+00 
  1.240000e+02   1.320504e-05   0.000000e+00   1.320504e-05   0.000000e+00 
  1.242500e+02   1.400605e-05   0.000000e+00   1.400605e-05   0.000000e+00 
  1.245000e+02   1.015868e-05   0.000000e+00   1.015868e-05   0.000000e+00 
  1.247500e+02   1.001115e-05   0.000000e+00   1.001115e-05   0.000000e+00 
  1.250000e+02   1.186268e-05   0.000000e+00   1.186268e-05   0.000000e+00 
  1.252500e+02   1.108858e-05   0.000000e+00   1.108858e-05   0.000000e+00 
  1.255000e+02   1.374920e-05   0.000000e+00   1.374920e-05   0.000000e+00 
  1.257500e+02   1.267584e-05   0.000000e+00   1.267584e-05   0.000000e+00 
  1.260000e+02   1.141872e-05   0.000000e+00   1.141872e-05   0.000000e+00 
  1.262500e+02   1.114921e-05   0.000000e+00   1.114921e-05   0.000000e+00 
  1.265000e+02   1.236161e-05   0.000000e+00   1.236161e-05   0.000000e+00 
  1.267500e+02   1.413766e-05   0.000000e+00   1.413766e-05   0.000000e+00 
  1.270000e+02   1.175743e-05   0.000000e+00   1.175743e-05   0.000000e+00 
  1.272500e+02   1.594217e-05   0.000000e+00   1.594217e-05   0.000000e+00 
  1.275000e+02   1.570513e-05   0.000000e+00   1.570513e-05   0.000000e+00 
  1.277500e+02   1.556420e-05   0.000000e+00   1.556420e-05   0.000000e+00 
  1.280000e+02   1.596204e-05   0.000000e+00   1.596204e-05   0.000000e+00 
  1.282500e+02   1.547225e-05   0.000000e+00   1.547225e-05   0.000000e+00 
  1.285000e+02   1.569026e-05   0.000000e+00   1.569026e-05   0.000000e+00 
  1.287500e+02   1.382515e-05   0.000000e+00   1.382515e-05   0.000000e+00 
  1.290000e+02   1.410912e-05   0.000000e+00   1.410912e-05   0.000000e+00 
  1.292500e+02   1.280180e-05   0.000000e+00   1.280180e-05   0.000000e+00 
  1.295000e+02   1.313157e-05   0.000000e+00   1.313157e-05   0.000000e+00 
  1.297500e+02   1.135498e-05   0.000000e+00   1.135498e-05   0.000000e+00 
  1.300000e+02   8.891710e-06   0.000000e+00   8.891710e-06   0.000000e+00 
  1.302500e+02   1.025985e-05   0.000000e+00   1.025985e-05   0.000000e+00 
  1.305000e+02   1.218088e-05   0.000000e+00   1.218088e-05   0.000000e+00 
  1.307500e+02   1.406594e-05   0.000000e+00   1.406594e-05   0.000000e+00 
  1.310000e+02   1.440166e-05   0.000000e+00   1.440166e-05   0.000000e+00 
  1.312500e+02   1.075343e-05   0.000000e+00   1.075343e-05   0.000000e+00 
  1.315000e+02   1.233567e-05   0.000000e+00   1.233567e-05   0.000000e+00 
  1.317500e+02   1.085411e-05   0.000000e+00   1.085411e-05   0.000000e+00 
  1.320000e+02   8.710325e-06   0.000000e+00   8.710325e-06   0.000000e+00 
  1.322500e+02   1.124315e-05   0.000000e+00   1.124315e-05   0.000000e+00 
  1.325000e+02   1.061376e-05   0.000000e+00   1.061376e-05   0.000000e+00 
  1.327500e+02   1.038687e-05   0.000000e+00   1.038687e-05   0.000000e+00 
  1.330000e+02   1.320770e-05   0.000000e+00   1.320770e-05   0.000000e+00 
  1.332500e+02   1.387239e-05   0.000000e+00   1.387239e-05   0.000000e+00 
  1.335000e+02   1.086314e-05   0.000000e+00   1.086314e-05   0.000000e+00 
  1.337500e+02   1.104690e-05   0.000000e+00   1.104690e-05   0.000000e+00 
  1.340000e+02   1.044016e-05   0.000000e+00   1.044016e-05   0.000000e+00 
  1.342500e+02   1.274523e-05   0.000000e+00   1.274523e-05   0.000000e+00 
  1.345000e+02   1.077707e-05   0.000000e+00   1.077707e-05   0.000000e+00 
  1.347500e+02   1.068570e-05   0.000000e+00   1.068570e-05   0.000000e+00 
  1.350000e+02   1.153281e-05   0.000000e+00   1.153281e-05   0.000000e+00 
  1.352500e+02   1.114970e-05   0.000000e+00   1.114970e-05   0.000000e+00 
  1.355000e+02   1.297412e-05   0.000000e+00   1.297412e-05   0.000000e+00 
  1.357500e+02   1.348781e-05   0.000000e+00   1.348781e-05   0.000000e+00 
  1.360000e+02   1.260713e-05   0.000000e+00   1.260713e-05   0.000000e+00 
  1.362500e+02   1.253058e-05   0.000000e+00   1.253058e-05   0.000000e+00 
  1.365000e+02   1.413660e-05   0.000000e+00   1.413660e-05   0.000000e+00 
  1.367500e+02   1.400991e-05   0.000000e+00   1.400991e-05   0.000000e+00 
  1.370000e+02   1.612190e-05   0.000000e+00   1.612190e-05   0.000000e+00 
  1.372500e+02   1.471479e-05   0.000000e+00   1.471479e-05   0.000000e+00 
  1.375000e+02   1.118177e-05   0.000000e+00   1.118177e-05   0.000000e+00 
  1.377500e+02   9.996743e-06   0.000000e+00   9.996743e-06   0.000000e+00 
  1.380000e+02   1.071681e-05   0.000000e+00   1.071681e-05   0.000000e+00 
  1.382500e+02   1.282611e-05   0.000000e+00   1.282611e-05   0.000000e+00 
  1.385000e+02   1.280508e-05   0.000000e+00   1.280508e-05   0.000000e+00 
  1.387500e+02   1.095211e-05   0.000000e+00   1.095211e-05   0.000000e+00 
  1.390000e+02   1.003294e-05   0.000000e+00   1.003294e-05   0.000000e+00 
  1.392500e+02   1.148341e-05   0.000000e+00   1.148341e-05   0.000000e+00 
  1.395000e+02   1.076448e-05   0.000000e+00   1.076448e-05   0.000000e+00 
  1.397500e+02   9.902760e-06   0.000000e+00   9.902760e-06   0.000000e+00 
  1.400000e+02   1.009207e-05   0.000000e+00   1.009207e-05   0.000000e+00 
  1.402500e+02   9.437143e-06   0.000000e+00   9.437143e-06   0.000000e+00 
  1.405000e+02   1.049397e-05   0.000000e+00   1.049397e-05   0.000000e+00 
  1.407500e+02   1.221303e-05   0.000000e+00   1.221303e-05   0.000000e+00 
  1.410000e+02   1.224192e-05   0.000000e+00   1.224192e-05   0.000000e+00 
  1.412500e+02   1.293690e-05   0.000000e+00   1.293690e-05   0.000000e+00 
  1.415000e+02   1.079125e-05   0.000000e+00   1.079125e-05   0.000000e+00 
  1.417500e+02   1.102401e-05   0.000000e+00   1.102401e-05   0.000000e+00 
  1.420000e+02   1.244037e-05   0.000000e+00   1.244037e-05   0.000000e+00 
  1.422500e+02   1.059918e-05   0.000000e+00   1.059918e-05   0.000000e+00 
  1.425000e+02   1.143157e-05   0.000000e+00   1.143157e-05   0.000000e+00 
  1.427500e+02   9.297711e-06   0.000000e+00   9.297711e-06   0.000000e+00 
  1.430000e+02   1.011092e-05   0.000000e+00   1.011092e-05   0.000000e+00 
  1.432500e+02   1.076076e-05   0.000000e+00   1.076076e-05   0.000000e+00 
  1.435000e+02   1.228535e-05   0.000000e+00   1.228535e-05   0.000000e+00 
  1.437500e+02   1.362865e-05   0.000000e+00   1.362865e-05   0.000000e+00 
  1.440000e+02   1.036582e-05   0.000000e+00   1.036582e-05   0.000000e+00 
  1.442500e+02   1.225626e-05   0.000000e+00   1.225626e-05   0.000000e+00 
  1.445000e+02   1.210479e-05   0.000000e+00   1.210479e-05   0.000000e+00 
  1.447500e+02   1.097322e-05   0.000000e+00   1.097322e-05   0.000000e+00 
  1.450000e+02   8.971933e-06   0.000000e+00   8.971933e-06   0.000000e+00 
  1.452500e+02   1.094625e-05   0.000000e+00   1.094625e-05   0.000000e+00 
  1.455000e+02   8.927263e-06   0.000000e+00   8.927263e-06   0.000000e+00 
  1.457500e+02   8.138383e-06   0.000000e+00   8.138383e-06   0.000000e+00 
  1.460000e+02   8.099231e-06   0.000000e+00   8.099231e-06   0.000000e+00 
  1.462500e+02   8.270468e-06   0.000000e+00   8.270468e-06   0.000000e+00 
  1.465000e+02   8.843468e-06   0.000000e+00   8.843468e-06   0.000000e+00 
  1.467500e+02   9.012049e-06   0.000000e+00   9.012049e-06   0.000000e+00 
  1.470000e+02   1.170419e-05   0.000000e+00   1.170419e-05   0.000000e+00 
  1.472500e+02   1.228628e-05   0.000000e+00   1.228628e-05   0.000000e+00 
  1.475000e+02   1.043285e-05   0.000000e+00   1.043285e-05   0.000000e+00 
  1.477500e+02   1.025651e-05   0.000000e+00   1.025651e-05   0.000000e+00 
  1.480000e+02   7.793265e-06   0.000000e+00   7.793265e-06   0.000000e+00 
  1.482500e+02   1.153997e-05   0.000000e+00   1.153997e-05   0.000000e+00 
  1.485000e+02   1.313842e-05   0.000000e+00   1.313842e-05   0.000000e+00 
  1.487500e+02   1.120223e-05   0.000000e+00   1.120223e-05   0.000000e+00 
  1.490000e+02   9.449680e-06   0.000000e+00   9.449680e-06   0.000000e+00 
  1.492500e+02   7.474111e-06   0.000000e+00   7.474111e-06   0.000000e+00 
  1.495000e+02   9.421875e-06   0.000000e+00   9.421875e-06   0.000000e+00 
  1.497500e+02   7.412352e-06   0.000000e+00   7.412352e-06   0.000000e+00 
  1.500000e+02   1.073444e-05   0.000000e+00   1.073444e-05   0.000000e+00 
  1.502500e+02   1.163251e-05   0.000000e+00   1.163251e-05   0.000000e+00 
  1.505000e+02   1.021097e-05   0.000000e+00   1.021097e-05   0.000000e+00 
  1.507500e+02   9.882298e-06   0.000000e+00   9.882298e-06   0.000000e+00 
  1.510000e+02   1.073590e-05   0.000000e+00   1.073590e-05   0.000000e+00 
  1.512500e+02   1.277932e-05   0.000000e+00   1.277932e-05   0.000000e+00 
  1.515000e+02   1.452670e-05   0.000000e+00   1.452670e-05   0.000000e+00 
  1.517500e+02   1.047157e-05   0.000000e+00   1.047157e-05   0.000000e+00 
  1.520000e+02   8.752057e-06   0.000000e+00   8.752057e-06   0.000000e+00 
  1.522500e+02   1.089554e-05   0.000000e+00   1.089554e-05   0.000000e+00 
  1.525000e+02   1.005882e-05   0.000000e+00   1.005882e-05   0.000000e+00 
  1.527500e+02   1.004103e-05   0.000000e+00   1.004103e-05   0.000000e+00 
  1.530000e+02   1.204673e-05   0.000000e+00   1.204673e-05   0.000000e+00 
  1.532500e+02   1.019019e-05   0.000000e+00   1.019019e-05   0.000000e+00 
  1.535000e+02   1.092513e-05   0.000000e+00   1.092513e-05   0.000000e+00 
  1.537500e+02   1.123511e-05   0.000000e+00   1.123511e-05   0.000000e+00 
  1.540000e+02   1.018646e-05   0.000000e+00   1.018646e-05   0.000000e+00 
  1.542500e+02   1.017136e-05   0.000000e+00   1.017136e-05   0.000000e+00 
  1.545000e+02   1.190513e-05   0.000000e+00   1.190513e-05   0.000000e+00 
  1.547500e+02   1.206943e-05   0.000000e+00   1.206943e-05   0.000000e+00 
  1.550000e+02   1.073605e-05   0.000000e+00   1.073605e-05   0.000000e+00 
  1.552500e+02   1.122496e-05   0.000000e+00   1.122496e-05   0.000000e+00 
  1.555000e+02   1.174236e-05   0.000000e+00   1.174236e-05   0.000000e+00 
  1.557500e+02   1.194139e-05   0.000000e+00   1.194139e-05   0.000000e+00 
  1.560000e+02   1.045367e-05   0.000000e+00   1.045367e-05   0.000000e+00 
  1.562500e+02   7.653106e-06   0.000000e+00   7.653106e-06   0.000000e+00 
  1.565000e+02   6.416267e-06   0.000000e+00   6.416267e-06   0.000000e+00 
  1.567500e+02   9.579189e-06   0.000000e+00   9.579189e-06   0.000000e+00 
  1.570000e+02   1.245258e-05   0.000000e+00   1.245258e-05   0.000000e+00 
  1.572500e+02   1.306551e-05   0.000000e+00   1.306551e-05   0.000000e+00 
  1.575000e+02   1.151919e-05   0.000000e+00   1.151919e-05   0.000000e+00 
  1.577500e+02   1.132838e-05   0.000000e+00   1.132838e-05   0.000000e+00 
  1.580000e+02   1.228281e-05   0.000000e+00   1.228281e-05   0.000000e+00 
  1.582500e+02   9.549054e-06   0.000000e+00   9.549054e-06   0.000000e+00 
  1.585000e+02   9.807992e-06   0.000000e+00   9.807992e-06   0.000000e+00 
  1.587500e+02   9.443964e-06   0.000000e+00   9.443964e-06   0.000000e+00 
  1.590000e+02   6.228363e-06   0.000000e+00   6.228363e-06   0.000000e+00 
  1.592500e+02   5.996744e-06   0.000000e+00   5.996744e-06   0.000000e+00 
  1.595000e+02   8.988397e-06   0.000000e+00   8.988397e-06   0.000000e+00 
  1.597500e+02   7.298062e-06   0.000000e+00   7.298062e-06   0.000000e+00 
  1.600000e+02   9.696355e-06   0.000000e+00   9.696355e-06   0.000000e+00 
  1.602500e+02   8.494608e-06   0.000000e+00   8.494608e-06   0.000000e+00 
  1.605000e+02   8.846026e-06   0.000000e+00   8.846026e-06   0.000000e+00 
  1.607500e+02   1.023409e-05   0.000000e+00   1.023409e-05   0.000000e+00 
  1.610000e+02   9.751972e-06   0.000000e+00   9.751972e-06   0.000000e+00 
  1.612500e+02   9.587010e-06   0.000000e+00   9.587010e-06   0.000000e+00 
  1.615000e+02   1.341434e-05   0.000000e+00   1.341434e-05   0.000000e+00 
  1.617500e+02   1.324432e-05   0.000000e+00   1.324432e-05   0.000000e+00 
  1.620000e+02   8.550837e-06   0.000000e+00   8.550837e-06   0.000000e+00 
  1.622500e+02   7.710526e-06   0.000000e+00   7.710526e-06   0.000000e+00 
  1.625000e+02   6.520584e-06   0.000000e+00   6.520584e-06   0.000000e+00 
  1.627500e+02   9.482046e-06   0.000000e+00   9.482046e-06   0.000000e+00 
  1.630000e+02   1.045474e-05   0.000000e+00   1.045474e-05   0.000000e+00 
  1.632500e+02   8.401405e-06   0.000000e+00   8.401405e-06   0.000000e+00 
  1.635000e+02   7.260498e-06   0.000000e+00   7.260498e-06   0.000000e+00 
  1.637500e+02   8.137632e-06   0.000000e+00   8.137632e-06   0.000000e+00 
  1.640000e+02   8.561214e-06   0.000000e+00   8.561214e-06   0.000000e+00 
  1.642500e+02   7.747584e-06   0.000000e+00   7.747584e-06   0.000000e+00 
  1.645000e+02   5.906297e-06   0.000000e+00   5.906297e-06   0.000000e+00 
  1.647500e+02   8.852868e-06   0.000000e+00   8.852868e-06   0.000000e+00 
  1.650000e+02   9.709995e-06   0.000000e+00   9.709995e-06   0.000000e+00 
  1.652500e+02   8.567253e-06   0.000000e+00   8.567253e-06   0.000000e+00 
  1.655000e+02   9.381038e-06   0.000000e+00   9.381038e-06   0.000000e+00 
  1.657500e+02   8.072494e-06   0.000000e+00   8.072494e-06   0.000000e+00 
  1.660000e+02   7.221205e-06   0.000000e+00   7.221205e-06   0.000000e+00 
  1.662500e+02   1.151484e-05   0.000000e+00   1.151484e-05   0.000000e+00 
  1.665000e+02   1.109286e-05   0.000000e+00   1.109286e-05   0.000000e+00 
  1.667500e+02   9.579263e-06   0.000000e+00   9.579263e-06   0.000000e+00 
  1.670000e+02   9.720137e-06   0.000000e+00   9.720137e-06   0.000000e+00 
  1.672500e+02   1.030554e-05   0.000000e+00   1.030554e-05   0.000000e+00 
  1.675000e+02   7.468250e-06   0.000000e+00   7.468250e-06   0.000000e+00 
  1.677500e+02   5.832601e-06   0.000000e+00   5.832601e-06   0.000000e+00 
  1.680000e+02   7.668540e-06   0.000000e+00   7.668540e-06   0.000000e+00 
  1.682500e+02   7.859997e-06   0.000000e+00   7.859997e-06   0.000000e+00 
  1.685000e+02   6.949565e-06   0.000000e+00   6.949565e-06   0.000000e+00 
  1.687500e+02   6.940274e-06   0.000000e+00   6.940274e-06   0.000000e+00 
  1.690000e+02   6.940441e-06   0.000000e+00   6.940441e-06   0.000000e+00 
  1.692500e+02   6.500510e-06   0.000000e+00   6.500510e-06   0.000000e+00 
  1.695000e+02   9.360320e-06   0.000000e+00   9.360320e-06   0.000000e+00 
  1.697500e+02   9.876198e-06   0.000000e+00   9.876198e-06   0.000000e+00 
  1.700000e+02   8.100217e-06   0.000000e+00   8.100217e-06   0.000000e+00 
  1.702500e+02   6.998908e-06   0.000000e+00   6.998908e-06   0.000000e+00 
  1.705000e+02   7.450049e-06   0.000000e+00   7.450049e-06   0.000000e+00 
  1.707500e+02   8.136662e-06   0.000000e+00   8.136662e-06   0.000000e+00 
  1.710000e+02   6.221458e-06   0.000000e+00   6.221458e-06   0.000000e+00 
  1.712500e+02   6.728232e-06   0.000000e+00   6.728232e-06   0.000000e+00 
  1.715000e+02   9.497676e-06   0.000000e+00   9.497676e-06   0.000000e+00 
  1.717500e+02   8.569125e-06   0.000000e+00   8.569125e-06   0.000000e+00 
  1.720000e+02   7.848222e-06   0.000000e+00   7.848222e-06   0.000000e+00 
  1.722500e+02   9.432692e-06   0.000000e+00   9.432692e-06   0.000000e+00 
  1.725000e+02   7.770357e-06   0.000000e+00   7.770357e-06   0.000000e+00 
  1.727500e+02   7.971770e-06   0.000000e+00   7.971770e-06   0.000000e+00 
  1.730000e+02   8.639018e-06   0.000000e+00   8.639018e-06   0.000000e+00 
  1.732500e+02   8.511513e-06   0.000000e+00   8.511513e-06   0.000000e+00 
  1.735000e+02   7.788469e-06   0.000000e+00   7.788469e-06   0.000000e+00 
  1.737500e+02   8.589733e-06   0.000000e+00   8.589733e-06   0.000000e+00 
  1.740000e+02   9.272899e-06   0.000000e+00   9.272899e-06   0.000000e+00 
  1.742500e+02   9.592689e-06   0.000000e+00   9.592689e-06   0.000000e+00 
  1.745000e+02   9.646108e-06   0.000000e+00   9.646108e-06   0.000000e+00 
  1.747500e+02   8.871228e-06   0.000000e+00   8.871228e-06   0.000000e+00 
  1.750000e+02   8.580504e-06   0.000000e+00   8.580504e-06   0.000000e+00 
  1.752500e+02   8.450829e-06   0.000000e+00   8.450829e-06   0.000000e+00 
  1.755000e+02   7.917944e-06   0.000000e+00   7.917944e-06   0.000000e+00 
  1.757500e+02   8.007447e-06   0.000000e+00   8.007447e-06   0.000000e+00 
  1.760000e+02   9.096664e-06   0.000000e+00   9.096664e-06   0.000000e+00 
  1.762500e+02   7.945219e-06   0.000000e+00   7.945219e-06   0.000000e+00 
  1.765000e+02   9.442721e-06   0.000000e+00   9.442721e-06   0.000000e+00 
  1.767500e+02   9.351652e-06   0.000000e+00   9.351652e-06   0.000000e+00 
  1.770000e+02   6.998938e-06   0.000000e+00   6.998938e-06   0.000000e+00 
  1.772500e+02   1.094208e-05   0.000000e+00   1.094208e-05   0.000000e+00 
  1.775000e+02   9.784669e-06   0.000000e+00   9.784669e-06   0.000000e+00 
  1.777500e+02   7.959603e-06   0.000000e+00   7.959603e-06   0.000000e+00 
  1.780000e+02   7.458706e-06   0.000000e+00   7.458706e-06   0.000000e+00 
  1.782500e+02   9.874445e-06   0.000000e+00   9.874445e-06   0.000000e+00 
  1.785000e+02   8.456133e-06   0.000000e+00   8.456133e-06   0.000000e+00 
  1.787500e+02   8.609056e-06   0.000000e+00   8.609056e-06   0.000000e+00 
  1.790000e+02   7.312552e-06   0.000000e+00   7.312552e-06   0.000000e+00 
  1.792500e+02   5.783881e-06   0.000000e+00   5.783881e-06   0.000000e+00 
  1.795000e+02   9.856073e-06   0.000000e+00   9.856073e-06   0.000000e+00 
  1.797500e+02   8.770849e-05   0.000000e+00   8.770849e-05   0.000000e+00 
  1.800000e+02   1.356535e-04   0.000000e+00   1.356535e-04   0.000000e+00 
  1.802500e+02   5.354242e-05   0.000000e+00   5.354242e-05   0.000000e+00 
  1.805000e+02   8.539232e-06   0.000000e+00   8.539232e-06   0.000000e+00 
  1.807500e+02   7.112485e-06   0.000000e+00   7.112485e-06   0.000000e+00 
  1.810000e+02   9.005691e-06   0.000000e+00   9.005691e-06   0.000000e+00 
  1.812500e+02   1.196293e-05   0.000000e+00   1.196293e-05   0.000000e+00 
  1.815000e+02   7.815566e-06   0.000000e+00   7.815566e-06   0.000000e+00 
  1.817500e+02   7.422291e-06   0.000000e+00   7.422291e-06   0.000000e+00 
  1.820000e+02   9.477526e-06   0.000000e+00   9.477526e-06   0.000000e+00 
  1.822500e+02   8.622974e-06   0.000000e+00   8.622974e-06   0.000000e+00 
  1.825000e+02   9.155292e-06   0.000000e+00   9.155292e-06   0.000000e+00 
  1.827500e+02   9.350595e-06   0.000000e+00   9.350595e-06   0.000000e+00 
  1.830000e+02   1.106017e-05   0.000000e+00   1.106017e-05   0.000000e+00 
  1.832500e+02   9.010193e-06   0.000000e+00   9.010193e-06   0.000000e+00 
  1.835000e+02   8.117783e-06   0.000000e+00   8.117783e-06   0.000000e+00 
  1.837500e+02   9.458024e-06   0.000000e+00   9.458024e-06   0.000000e+00 
  1.840000e+02   8.425518e-06   0.000000e+00   8.425518e-06   0.000000e+00 
  1.842500e+02   6.633199e-06   0.000000e+00   6.633199e-06   0.000000e+00 
  1.845000e+02   7.022993e-06   0.000000e+00   7.022993e-06   0.000000e+00 
  1.847500e+02   7.167776e-06   0.000000e+00   7.167776e-06   0.000000e+00 
  1.850000e+02   7.604695e-06   0.000000e+00   7.604695e-06   0.000000e+00 
  1.852500e+02   7.397181e-06   0.000000e+00   7.397181e-06   0.000000e+00 
  1.855000e+02   8.440750e-06   0.000000e+00   8.440750e-06   0.000000e+00 
  1.857500e+02   1.020801e-05   0.000000e+00   1.020801e-05   0.000000e+00 
  1.860000e+02   8.410690e-06   0.000000e+00   8.410690e-06   0.000000e+00 
  1.862500e+02   6.310119e-06   0.000000e+00   6.310119e-06   0.000000e+00 
  1.865000e+02   7.241037e-06   0.000000e+00   7.241037e-06   0.000000e+00 
  1.867500e+02   6.376676e-06   0.000000e+00   6.376676e-06   0.000000e+00 
  1.870000e+02   9.607459e-06   0.000000e+00   9.607459e-06   0.000000e+00 
  1.872500e+02   9.485488e-06   0.000000e+00   9.485488e-06   0.000000e+00 
  1.875000e+02   6.132271e-06   0.000000e+00   6.132271e-06   0.000000e+00 
  1.877500e+02   7.723969e-06   0.000000e+00   7.723969e-06   0.000000e+00 
  1.880000e+02   8.342603e-06   0.000000e+00   8.342603e-06   0.000000e+00 
  1.882500e+02   9.445447e-06   0.000000e+00   9.445447e-06   0.000000e+00 
  1.885000e+02   8.745838e-06   0.000000e+00   8.745838e-06   0.000000e+00 
  1.887500e+02   7.408841e-06   0.000000e+00   7.408841e-06   0.000000e+00 
  1.890000e+02   6.574553e-06   0.000000e+00   6.574553e-06   0.000000e+00 
  1.892500e+02   7.908597e-06   0.000000e+00   7.908597e-06   0.000000e+00 
  1.895000e+02   7.482374e-06   0.000000e+00   7.482374e-06   0.000000e+00 
  1.897500e+02   7.413385e-06   0.000000e+00   7.413385e-06   0.000000e+00 
  1.900000e+02   7.607755e-06   0.000000e+00   7.607755e-06   0.000000e+00 
  1.902500e+02   8.413767e-06   0.000000e+00   8.413767e-06   0.000000e+00 
  1.905000e+02   7.253444e-06   0.000000e+00   7.253444e-06   0.000000e+00 
  1.907500e+02   5.695658e-06   0.000000e+00   5.695658e-06   0.000000e+00 
  1.910000e+02   6.103606e-06   0.000000e+00   6.103606e-06   0.000000e+00 
  1.912500e+02   7.076046e-06   0.000000e+00   7.076046e-06   0.000000e+00 
  1.915000e+02   7.288003e-06   0.000000e+00   7.288003e-06   0.000000e+00 
  1.917500e+02   7.619768e-06   0.000000e+00   7.619768e-06   0.000000e+00 
  1.920000e+02   8.462002e-06   0.000000e+00   8.462002e-06   0.000000e+00 
  1.922500e+02   1.078961e-05   0.000000e+00   1.078961e-05   0.000000e+00 
  1.925000e+02   1.120553e-05   0.000000e+00   1.120553e-05   0.000000e+00 
  1.927500e+02   7.991127e-06   0.000000e+00   7.991127e-06   0.000000e+00 
  1.930000e+02   6.671157e-06   0.000000e+00   6.671157e-06   0.000000e+00 
  1.932500e+02   7.056607e-06   0.000000e+00   7.056607e-06   0.000000e+00 
  1.935000e+02   9.162878e-06   0.000000e+00   9.162878e-06   0.000000e+00 
  1.937500e+02   8.809843e-06   0.000000e+00   8.809843e-06   0.000000e+00 
  1.940000e+02   8.345597e-06   0.000000e+00   8.345597e-06   0.000000e+00 
  1.942500e+02   7.826395e-06   0.000000e+00   7.826395e-06   0.000000e+00 
  1.945000e+02   6.892680e-06   0.000000e+00   6.892680e-06   0.000000e+00 
  1.947500e+02   7.168562e-06   0.000000e+00   7.168562e-06   0.000000e+00 
  1.950000e+02   7.383108e-06   0.000000e+00   7.383108e-06   0.000000e+00 
  1.952500e+02   6.485056e-06   0.000000e+00   6.485056e-06   0.000000e+00 
  1.955000e+02   8.355114e-06   0.000000e+00   8.355114e-06   0.000000e+00 
  1.957500e+02   7.068577e-06   0.000000e+00   7.068577e-06   0.000000e+00 
  1.960000e+02   8.717725e-06   0.000000e+00   8.717725e-06   0.000000e+00 
  1.962500e+02   7.621201e-06   0.000000e+00   7.621201e-06   0.000000e+00 
  1.965000e+02   8.346686e-06   0.000000e+00   8.346686e-06   0.000000e+00 
  1.967500e+02   7.547331e-06   0.000000e+00   7.547331e-06   0.000000e+00 
  1.970000e+02   6.745372e-06   0.000000e+00   6.745372e-06   0.000000e+00 
  1.972500e+02   6.420625e-06   0.000000e+00   6.420625e-06   0.000000e+00 
  1.975000e+02   8.104836e-06   0.000000e+00   8.104836e-06   0.000000e+00 
  1.977500e+02   8.591519e-06   0.000000e+00   8.591519e-06   0.000000e+00 
  1.980000e+02   6.599639e-06   0.000000e+00   6.599639e-06   0.000000e+00 
  1.982500e+02   6.345083e-06   0.000000e+00   6.345083e-06   0.000000e+00 
  1.985000e+02   8.444949e-06   0.000000e+00   8.444949e-06   0.000000e+00 
  1.987500e+02   7.303894e-06   0.000000e+00   7.303894e-06   0.000000e+00 
  1.990000e+02   8.389070e-06   0.000000e+00   8.389070e-06   0.000000e+00 
  1.992500e+02   9.906306e-06   0.000000e+00   9.906306e-06   0.000000e+00 
  1.995000e+02   7.913107e-06   0.000000e+00   7.913107e-06   0.000000e+00 
  1.997500e+02   7.759729e-06   0.000000e+00   7.759729e-06   0.000000e+00 
  2.000000e+02   7.829890e-06   0.000000e+00   7.829890e-06   0.000000e+00 
