  1.000000e+03  -1.612373e+02   5.144786e+01   4.457039e+01   1.623031e+02 
  1.023533e+03  -1.399799e+02   4.625360e+01   4.337135e+01   1.617149e+02 
  1.047621e+03  -1.188834e+02   4.390865e+01   4.205779e+01   1.597287e+02 
  1.072275e+03  -1.209208e+02   5.521646e+01   4.247254e+01   1.554570e+02 
  1.097509e+03  -1.263304e+02   4.350832e+01   4.251695e+01   1.609962e+02 
  1.123337e+03  -1.122921e+02   4.198074e+01   4.157514e+01   1.595016e+02 
  1.149773e+03  -1.034168e+02   4.541772e+01   4.105776e+01   1.562903e+02 
  1.176831e+03  -9.196724e+01   3.626144e+01   3.990022e+01   1.584814e+02 
  1.204526e+03  -8.755454e+01   3.117224e+01   3.936388e+01   1.604026e+02 
  1.232872e+03  -9.586987e+01   3.327922e+01   4.012776e+01   1.608566e+02 
  1.261886e+03  -8.118471e+01   3.382441e+01   3.888463e+01   1.573817e+02 
  1.291582e+03  -8.102306e+01   2.669270e+01   3.861966e+01   1.617657e+02 
  1.321978e+03  -6.977185e+01   2.712407e+01   3.748485e+01   1.587562e+02 
  1.353088e+03  -6.883155e+01   2.480673e+01   3.728610e+01   1.601809e+02 
  1.384931e+03  -6.158307e+01   2.670651e+01   3.653764e+01   1.565552e+02 
  1.417523e+03  -5.877691e+01   2.487929e+01   3.609990e+01   1.570579e+02 
  1.450882e+03  -5.817952e+01   2.664786e+01   3.612250e+01   1.553909e+02 
  1.485026e+03  -5.364418e+01   2.162664e+01   3.524449e+01   1.580432e+02 
  1.519974e+03  -5.190815e+01   2.167099e+01   3.500249e+01   1.573401e+02 
  1.555744e+03  -4.502982e+01   2.280837e+01   3.406184e+01   1.531370e+02 
  1.592356e+03  -4.462439e+01   1.931196e+01   3.373700e+01   1.565986e+02 
  1.629830e+03  -4.035645e+01   1.705634e+01   3.283202e+01   1.570890e+02 
  1.668185e+03  -4.079575e+01   1.565248e+01   3.280873e+01   1.590092e+02 
  1.707443e+03  -3.572261e+01   1.656298e+01   3.190454e+01   1.551249e+02 
  1.747625e+03  -3.499499e+01   1.384916e+01   3.151201e+01   1.584090e+02 
  1.788752e+03  -3.247276e+01   1.355384e+01   3.092786e+01   1.573448e+02 
  1.830848e+03  -3.093899e+01   1.270721e+01   3.048712e+01   1.576711e+02 
  1.873934e+03  -2.881894e+01   1.150924e+01   2.983624e+01   1.582300e+02 
  1.918034e+03  -2.779388e+01   1.029010e+01   2.943685e+01   1.596840e+02 
  1.963172e+03  -2.652445e+01   9.369311e+00   2.898358e+01   1.605451e+02 
  2.009372e+03  -2.406225e+01   9.109242e+00   2.820839e+01   1.592648e+02 
  2.056659e+03  -2.317820e+01   7.728035e+00   2.775939e+01   1.615607e+02 
  2.105059e+03  -2.162810e+01   7.206405e+00   2.715759e+01   1.615721e+02 
  2.154598e+03  -2.020133e+01   6.405893e+00   2.652371e+01   1.624060e+02 
  2.205303e+03  -1.925327e+01   6.065943e+00   2.610110e+01   1.625124e+02 
  2.257202e+03  -1.873557e+01   5.562748e+00   2.582025e+01   1.634634e+02 
  2.310321e+03  -1.761285e+01   5.815949e+00   2.536606e+01   1.617262e+02 
  2.364691e+03  -1.682016e+01   5.179674e+00   2.491007e+01   1.628841e+02 
  2.420340e+03  -1.528374e+01   4.493823e+00   2.404470e+01   1.636153e+02 
  2.477299e+03  -1.486088e+01   4.671564e+00   2.385015e+01   1.625493e+02 
  2.535598e+03  -1.378185e+01   3.742993e+00   2.309522e+01   1.648056e+02 
  2.595269e+03  -1.305696e+01   3.415092e+00   2.260422e+01   1.653424e+02 
  2.656344e+03  -1.248575e+01   2.933797e+00   2.216169e+01   1.667770e+02 
  2.718857e+03  -1.182220e+01   2.654536e+00   2.166759e+01   1.673448e+02 
  2.782841e+03  -1.094493e+01   2.616171e+00   2.102556e+01   1.665568e+02 
  2.848331e+03  -1.078648e+01   2.320672e+00   2.085411e+01   1.678581e+02 
  2.915362e+03  -9.966620e+00   1.925609e+00   2.013012e+01   1.690648e+02 
  2.983970e+03  -9.533543e+00   1.277460e+00   1.966237e+01   1.723680e+02 
  3.054193e+03  -9.171582e+00   1.308063e+00   1.933634e+01   1.718831e+02 
  3.126068e+03  -8.618330e+00   1.022677e+00   1.876919e+01   1.732327e+02 
  3.199635e+03  -8.250127e+00   1.073720e+00   1.840216e+01   1.725849e+02 
  3.274934e+03  -7.735180e+00   8.002303e-01   1.781564e+01   1.740936e+02 
  3.352004e+03  -7.267778e+00   5.011929e-01   1.724864e+01   1.760551e+02 
  3.430888e+03  -6.970407e+00   6.005933e-01   1.689729e+01   1.750754e+02 
  3.511628e+03  -6.663449e+00   3.438279e-01   1.648553e+01   1.770462e+02 
  3.594269e+03  -6.401364e+00   2.806788e-01   1.613379e+01   1.774894e+02 
  3.678854e+03  -5.896788e+00   7.911102e-02   1.541309e+01   1.792314e+02 
  3.765430e+03  -5.700385e+00   4.035918e-02   1.511830e+01   1.795943e+02 
  3.854043e+03  -5.418760e+00  -1.162182e-02   1.467802e+01  -1.798771e+02 
  3.944742e+03  -5.089456e+00  -1.357927e-01   1.413652e+01  -1.784716e+02 
  4.037575e+03  -5.017102e+00  -2.725964e-01   1.402186e+01  -1.768900e+02 
  4.132593e+03  -4.695158e+00  -3.595263e-01   1.345840e+01  -1.756212e+02 
  4.229847e+03  -4.477327e+00  -4.301252e-01   1.306027e+01  -1.745126e+02 
  4.329389e+03  -4.247564e+00  -4.306367e-01   1.260721e+01  -1.742109e+02 
  4.431274e+03  -3.993965e+00  -4.298415e-01   1.207810e+01  -1.738573e+02 
  4.535557e+03  -3.885904e+00  -5.295792e-01   1.186976e+01  -1.722394e+02 
  4.642294e+03  -3.650892e+00  -6.196039e-01   1.137130e+01  -1.703679e+02 
  4.751543e+03  -3.503819e+00  -6.024287e-01   1.101736e+01  -1.702442e+02 
  4.863363e+03  -3.287578e+00  -6.363639e-01   1.049727e+01  -1.690450e+02 
  4.977814e+03  -3.132049e+00  -6.688579e-01   1.011025e+01  -1.679454e+02 
  5.094959e+03  -2.970901e+00  -8.292741e-01   9.783607e+00  -1.644039e+02 
  5.214860e+03  -2.888230e+00  -7.772267e-01   9.516267e+00  -1.649384e+02 
  5.337584e+03  -2.724621e+00  -7.822301e-01   9.050097e+00  -1.639814e+02 
  5.463195e+03  -2.663453e+00  -7.910986e-01   8.876070e+00  -1.634575e+02 
  5.591763e+03  -2.501221e+00  -8.013272e-01   8.387379e+00  -1.622359e+02 
  5.723355e+03  -2.390992e+00  -8.362285e-01   8.072724e+00  -1.607232e+02 
  5.858045e+03  -2.306706e+00  -8.115427e-01   7.766646e+00  -1.606172e+02 
  5.995905e+03  -2.176495e+00  -8.177497e-01   7.328638e+00  -1.594079e+02 
  6.137009e+03  -2.111744e+00  -8.320732e-01   7.119596e+00  -1.584945e+02 
  6.281434e+03  -2.011324e+00  -8.704113e-01   6.815161e+00  -1.565992e+02 
  6.429257e+03  -1.923646e+00  -8.558329e-01   6.466843e+00  -1.560156e+02 
  6.580559e+03  -1.837567e+00  -8.591406e-01   6.143462e+00  -1.549419e+02 
  6.735422e+03  -1.767190e+00  -8.581970e-01   5.865269e+00  -1.540975e+02 
  6.893929e+03  -1.678958e+00  -8.546020e-01   5.501360e+00  -1.530236e+02 
  7.056167e+03  -1.621729e+00  -8.453114e-01   5.243386e+00  -1.524696e+02 
  7.222222e+03  -1.556699e+00  -8.465739e-01   4.969294e+00  -1.514615e+02 
  7.392186e+03  -1.477534e+00  -8.337782e-01   4.591348e+00  -1.505638e+02 
  7.566148e+03  -1.419427e+00  -8.242704e-01   4.304288e+00  -1.498560e+02 
  7.744206e+03  -1.351504e+00  -8.360928e-01   4.023671e+00  -1.482575e+02 
  7.926453e+03  -1.295830e+00  -8.063751e-01   3.672471e+00  -1.481066e+02 
  8.112989e+03  -1.261330e+00  -8.088607e-01   3.512568e+00  -1.473289e+02 
  8.303915e+03  -1.200851e+00  -7.971704e-01   3.175462e+00  -1.464223e+02 
  8.499334e+03  -1.166403e+00  -7.972053e-01   3.001676e+00  -1.456484e+02 
  8.699353e+03  -1.115400e+00  -7.897167e-01   2.713235e+00  -1.447010e+02 
  8.904077e+03  -1.088964e+00  -7.693172e-01   2.498564e+00  -1.447600e+02 
  9.113620e+03  -1.030927e+00  -7.616223e-01   2.156054e+00  -1.435440e+02 
  9.328095e+03  -9.867864e-01  -7.623024e-01   1.916891e+00  -1.423135e+02 
  9.547616e+03  -9.635401e-01  -7.318589e-01   1.655491e+00  -1.427814e+02 
  9.772304e+03  -9.185938e-01  -7.269956e-01   1.374609e+00  -1.416411e+02 
  1.000228e+04  -8.841114e-01  -7.116852e-01   1.099661e+00  -1.411669e+02 
  1.023767e+04  -8.543224e-01  -7.011573e-01   8.688929e-01  -1.406237e+02 
  1.047859e+04  -8.274214e-01  -6.904060e-01   6.493948e-01  -1.401581e+02 
  1.072519e+04  -7.905850e-01  -6.791635e-01   3.594483e-01  -1.393353e+02 
  1.097759e+04  -7.608476e-01  -6.652268e-01   9.202516e-02  -1.388360e+02 
  1.123593e+04  -7.461358e-01  -6.524361e-01  -7.715412e-02  -1.388329e+02 
  1.150035e+04  -7.134696e-01  -6.204884e-01  -4.864078e-01  -1.389872e+02 
  1.177099e+04  -6.429245e-01  -6.557788e-01  -7.396761e-01  -1.344329e+02 
  1.204800e+04  -6.798843e-01  -6.421851e-01  -5.816855e-01  -1.366333e+02 
  1.233153e+04  -6.543607e-01  -6.134772e-01  -9.445117e-01  -1.368469e+02 
  1.262174e+04  -6.383904e-01  -5.975138e-01  -1.165855e+00  -1.368943e+02 
  1.291877e+04  -6.175781e-01  -5.748444e-01  -1.476122e+00  -1.370525e+02 
  1.322279e+04  -5.969509e-01  -5.614010e-01  -1.729401e+00  -1.367579e+02 
  1.353397e+04  -5.678851e-01  -5.177471e-01  -2.287392e+00  -1.376442e+02 
  1.385247e+04  -5.476130e-01  -5.379695e-01  -2.296701e+00  -1.355090e+02 
  1.417846e+04  -5.285348e-01  -5.188929e-01  -2.607451e+00  -1.355274e+02 
  1.451213e+04  -5.102169e-01  -5.141184e-01  -2.801394e+00  -1.347818e+02 
  1.485365e+04  -4.959508e-01  -5.012348e-01  -3.034658e+00  -1.346964e+02 
  1.520321e+04  -4.877077e-01  -4.920890e-01  -3.187494e+00  -1.347438e+02 
  1.556099e+04  -4.715535e-01  -4.807158e-01  -3.434702e+00  -1.344487e+02 
  1.592719e+04  -4.606884e-01  -4.648278e-01  -3.682532e+00  -1.347437e+02 
  1.630201e+04  -4.558116e-01  -4.445553e-01  -3.921230e+00  -1.357163e+02 
  1.668565e+04  -4.283732e-01  -4.278478e-01  -4.358581e+00  -1.350352e+02 
  1.707832e+04  -4.148368e-01  -4.443834e-01  -4.323078e+00  -1.330305e+02 
  1.748023e+04  -4.205912e-01  -4.298979e-01  -4.416404e+00  -1.343730e+02 
  1.789160e+04  -4.079558e-01  -4.083803e-01  -4.772919e+00  -1.349702e+02 
  1.831265e+04  -3.895976e-01  -3.910306e-01  -5.161401e+00  -1.348948e+02 
  1.874361e+04  -3.794588e-01  -3.837062e-01  -5.357796e+00  -1.346811e+02 
  1.918471e+04  -3.637733e-01  -3.712874e-01  -5.683382e+00  -1.344143e+02 
  1.963619e+04  -3.580642e-01  -3.561746e-01  -5.933401e+00  -1.351516e+02 
  2.009830e+04  -3.460900e-01  -3.496568e-01  -6.161162e+00  -1.347063e+02 
  2.057128e+04  -3.343967e-01  -3.343221e-01  -6.505429e+00  -1.350064e+02 
  2.105539e+04  -3.288462e-01  -3.271542e-01  -6.672189e+00  -1.351478e+02 
  2.155089e+04  -3.158079e-01  -3.176009e-01  -6.976583e+00  -1.348378e+02 
  2.205806e+04  -3.171485e-01  -3.138235e-01  -7.009977e+00  -1.353019e+02 
  2.257716e+04  -3.014494e-01  -3.072525e-01  -7.321812e+00  -1.344538e+02 
  2.310848e+04  -2.983093e-01  -2.957864e-01  -7.533093e+00  -1.352433e+02 
  2.365230e+04  -2.867068e-01  -2.893583e-01  -7.800777e+00  -1.347363e+02 
  2.420892e+04  -2.849217e-01  -2.804959e-01  -7.962647e+00  -1.354485e+02 
  2.477863e+04  -2.730548e-01  -2.657127e-01  -8.381465e+00  -1.357807e+02 
  2.536176e+04  -2.655510e-01  -2.640808e-01  -8.530786e+00  -1.351590e+02 
  2.595861e+04  -2.646908e-01  -2.554596e-01  -8.686353e+00  -1.360167e+02 
  2.656950e+04  -2.658596e-01  -2.499197e-01  -8.756876e+00  -1.367701e+02 
  2.719477e+04  -2.534291e-01  -2.357930e-01  -9.214538e+00  -1.370646e+02 
  2.783476e+04  -2.446343e-01  -2.303418e-01  -9.472935e+00  -1.367236e+02 
  2.848980e+04  -2.363427e-01  -2.255922e-01  -9.716332e+00  -1.363332e+02 
  2.916026e+04  -2.366057e-01  -2.098513e-01  -9.999141e+00  -1.384294e+02 
  2.984650e+04  -2.324472e-01  -2.077940e-01  -1.012289e+01  -1.382052e+02 
  3.054889e+04  -2.255313e-01  -1.966694e-01  -1.047967e+01  -1.389107e+02 
  3.126781e+04  -2.194413e-01  -1.885927e-01  -1.077162e+01  -1.393235e+02 
  3.200365e+04  -2.129009e-01  -1.811496e-01  -1.107116e+01  -1.396068e+02 
  3.275680e+04  -2.077608e-01  -1.702833e-01  -1.141698e+01  -1.406615e+02 
  3.352768e+04  -2.039909e-01  -1.643857e-01  -1.163455e+01  -1.411365e+02 
  3.431670e+04  -1.971154e-01  -1.619498e-01  -1.186538e+01  -1.405935e+02 
  3.512429e+04  -1.963455e-01  -1.571240e-01  -1.199012e+01  -1.413317e+02 
  3.595088e+04  -1.859651e-01  -1.499767e-01  -1.243546e+01  -1.411146e+02 
  3.679693e+04  -1.822488e-01  -1.414042e-01  -1.274009e+01  -1.421926e+02 
  3.766288e+04  -1.811087e-01  -1.331812e-01  -1.296385e+01  -1.436705e+02 
  3.854921e+04  -1.761677e-01  -1.318755e-01  -1.314920e+01  -1.431822e+02 
  3.945641e+04  -1.725942e-01  -1.247060e-01  -1.343515e+01  -1.441504e+02 
  4.038495e+04  -1.635444e-01  -1.198849e-01  -1.385956e+01  -1.437570e+02 
  4.133534e+04  -1.631431e-01  -1.209638e-01  -1.384598e+01  -1.434446e+02 
  4.230811e+04  -1.579114e-01  -1.109063e-01  -1.429034e+01  -1.449184e+02 
  4.330376e+04  -1.521985e-01  -1.075289e-01  -1.459335e+01  -1.447586e+02 
  4.432284e+04  -1.495073e-01  -1.062633e-01  -1.473088e+01  -1.445964e+02 
  4.536591e+04  -1.482121e-01  -9.957653e-02  -1.496450e+01  -1.461048e+02 
  4.643352e+04  -1.454920e-01  -9.607607e-02  -1.517147e+01  -1.465611e+02 
  4.752626e+04  -1.409934e-01  -9.292416e-02  -1.544941e+01  -1.466124e+02 
  4.864471e+04  -1.388508e-01  -8.844978e-02  -1.566984e+01  -1.475023e+02 
  4.978949e+04  -1.365234e-01  -8.420175e-02  -1.589584e+01  -1.483355e+02 
  5.096120e+04  -1.359062e-01  -8.005194e-02  -1.604170e+01  -1.495009e+02 
  5.216049e+04  -1.329423e-01  -7.472213e-02  -1.633445e+01  -1.506612e+02 
  5.338800e+04  -1.284683e-01  -6.978221e-02  -1.670121e+01  -1.514898e+02 
  5.464440e+04  -1.254972e-01  -6.631552e-02  -1.695783e+01  -1.521470e+02 
  5.593037e+04  -1.248596e-01  -6.247389e-02  -1.710124e+01  -1.534188e+02 
  5.724660e+04  -1.173428e-01  -5.955725e-02  -1.761543e+01  -1.530900e+02 
  5.859381e+04  -1.203190e-01  -5.353921e-02  -1.760873e+01  -1.560120e+02 
  5.997272e+04  -1.143642e-01  -5.179091e-02  -1.802403e+01  -1.556362e+02 
  6.138408e+04  -1.101394e-01  -4.654218e-02  -1.844759e+01  -1.570923e+02 
  6.282865e+04  -1.076168e-01  -4.400209e-02  -1.869102e+01  -1.577614e+02 
  6.430722e+04  -1.055828e-01  -4.223345e-02  -1.888355e+01  -1.581984e+02 
  6.582059e+04  -9.725415e-02  -3.890492e-02  -1.959716e+01  -1.581969e+02 
  6.736957e+04  -9.376805e-02  -3.708638e-02  -1.992771e+01  -1.584206e+02 
  6.895501e+04  -9.055115e-02  -3.879146e-02  -2.013036e+01  -1.568101e+02 
  7.057775e+04  -9.042392e-02  -3.788271e-02  -2.017205e+01  -1.572690e+02 
  7.223868e+04  -8.833946e-02  -3.765180e-02  -2.035198e+01  -1.569155e+02 
  7.393870e+04  -8.877692e-02  -3.500170e-02  -2.040650e+01  -1.584824e+02 
  7.567873e+04  -8.798576e-02  -3.399669e-02  -2.050743e+01  -1.588740e+02 
  7.745970e+04  -8.734019e-02  -3.149620e-02  -2.064477e+01  -1.601699e+02 
  7.928259e+04  -8.575848e-02  -2.928200e-02  -2.085554e+01  -1.611477e+02 
  8.114838e+04  -8.518878e-02  -2.645303e-02  -2.099257e+01  -1.627493e+02 
  8.305808e+04  -8.490496e-02  -2.577563e-02  -2.103847e+01  -1.631126e+02 
  8.501271e+04  -8.283073e-02  -2.277769e-02  -2.131958e+01  -1.646242e+02 
  8.701335e+04  -8.239675e-02  -2.107800e-02  -2.140651e+01  -1.656508e+02 
  8.906107e+04  -8.081032e-02  -1.776611e-02  -2.164567e+01  -1.676008e+02 
  9.115698e+04  -7.970225e-02  -1.553935e-02  -2.180856e+01  -1.689676e+02 
  9.330221e+04  -7.769834e-02  -1.330970e-02  -2.206616e+01  -1.702796e+02 
  9.549792e+04  -7.680529e-02  -9.692044e-03  -2.222357e+01  -1.728079e+02 
  9.774531e+04  -7.514045e-02  -7.582322e-03  -2.243853e+01  -1.742379e+02 
  1.000456e+05  -7.282939e-02  -4.621866e-03  -2.273641e+01  -1.763688e+02 
  1.024000e+05  -7.108743e-02  -2.848641e-03  -2.295718e+01  -1.777052e+02 
