#** Path to fil.ini is fil.ini
#** Path to opamp.lib is opamp.lib
               1      39.67671975    -0.5934599315 
     1.016248693      39.67670631    -0.6031023064 
     1.032761406      39.67669243    -0.6129013288 
     1.049542429       39.6766781    -0.6228595428 
     1.066596121      39.67666329    -0.6329795334 
     1.083926914      39.67664801    -0.6432639278 
      1.10153931      39.67663222    -0.6537153957 
     1.119437883      39.67661591    -0.6643366502 
     1.137627286      39.67659907    -0.6751304482 
     1.156112242      39.67658168    -0.6860995914 
     1.174897555      39.67656372    -0.6972469271 
     1.193988104      39.67654517    -0.7085753486 
      1.21338885      39.67652601     -0.720087796 
     1.233104833      39.67650623    -0.7317872573 
     1.253141175       39.6764858    -0.7436767689 
     1.273503081      39.67646469    -0.7557594162 
     1.294195841       39.6764429    -0.7680383348 
     1.315224832      39.67642039    -0.7805167112 
     1.336595517      39.67639715    -0.7931977833 
     1.358313447      39.67637314    -0.8060848417 
     1.380384265      39.67634835    -0.8191812301 
     1.402813705      39.67632275    -0.8324903466 
     1.425607594      39.67629631    -0.8460156441 
     1.448771854        39.676269    -0.8597606316 
     1.472312502      39.67624079     -0.873728875 
     1.496235656      39.67621167    -0.8879239977 
      1.52054753      39.67618158     -0.902349682 
      1.54525444      39.67615052    -0.9170096696 
     1.570362804      39.67611843    -0.9319077631 
     1.595879147       39.6760853    -0.9470478264 
     1.621810097      39.67605108     -0.962433786 
     1.648162392      39.67601574    -0.9780696319 
     1.674942876      39.67597924    -0.9939594187 
     1.702158508      39.67594154     -1.010107267 
     1.729816359      39.67590261     -1.026517363 
     1.757923614      39.67586241     -1.043193961 
     1.786487575      39.67582089     -1.060141386 
     1.815515663      39.67577801      -1.07736403 
     1.845015419      39.67573373     -1.094866357 
     1.874994508      39.67568799     -1.112652905 
     1.905460718      39.67564076     -1.130728282 
     1.936421964      39.67559198     -1.149097174 
      1.96788629       39.6755416      -1.16776434 
      1.99986187      39.67548957     -1.186734616 
     2.032357011      39.67543584     -1.206012919 
     2.065380156      39.67538035     -1.225604241 
     2.098939884      39.67532304     -1.245513659 
     2.133044913      39.67526386     -1.265746329 
     2.167704105      39.67520274     -1.286307491 
     2.202926463      39.67513961     -1.307202469 
     2.238721139      39.67507442     -1.328436674 
     2.275097431      39.67500709     -1.350015604 
      2.31206479      39.67493756     -1.371944845 
     2.349632821      39.67486576     -1.394230073 
     2.387811283       39.6747916     -1.416877057 
     2.426610095      39.67471501     -1.439891656 
     2.466039337      39.67463591     -1.463279826 
     2.506109253      39.67455423     -1.487047618 
     2.546830253      39.67446987      -1.51120118 
     2.588212915      39.67438275     -1.535746759 
     2.630267992      39.67429277     -1.560690703 
     2.673006409      39.67419986     -1.586039462 
     2.716439269      39.67410389     -1.611799589 
     2.760577856      39.67400479     -1.637977742 
     2.805433638      39.67390244     -1.664580688 
     2.851018268      39.67379674       -1.6916153 
     2.897343588      39.67368759     -1.719088562 
     2.944421634      39.67357485     -1.747007572 
     2.992264637      39.67345843      -1.77537954 
     3.040885026       39.6733382     -1.804211791 
     3.090295433      39.67321403     -1.833511769 
     3.140508694       39.6730858     -1.863287036 
     3.191537855      39.67295337     -1.893545276 
     3.243396173       39.6728166     -1.924294294 
     3.296097122      39.67267536     -1.955542022 
     3.349654392       39.6725295     -1.987296517 
     3.404081897      39.67237886     -2.019565966 
     3.459393778      39.67222329     -2.052358687 
     3.515604405      39.67206263     -2.085683128 
     3.572728382      39.67189672     -2.119547874 
     3.630780548      39.67172537     -2.153961647 
     3.689775986      39.67154842     -2.188933307 
     3.749730022      39.67136568     -2.224471854 
     3.810658234      39.67117696     -2.260586433 
     3.872576449      39.67098207     -2.297286334 
     3.935500755       39.6707808     -2.334580992 
     3.999447498      39.67057294     -2.372479994 
     4.064433292      39.67035829      -2.41099308 
      4.13047502      39.67013661     -2.450130141 
      4.19758984      39.66990769     -2.489901227 
     4.265795188      39.66967127     -2.530316547 
     4.335108784      39.66942713     -2.571386468 
     4.405548635        39.669175     -2.613121525 
     4.477133042      39.66891462     -2.655532416 
     4.549880602      39.66864573     -2.698630009 
     4.623810214      39.66836805     -2.742425342 
     4.698941086      39.66808129     -2.786929627 
     4.775292737      39.66778515     -2.832154252 
     4.852885002      39.66747934     -2.878110783 
      4.93173804      39.66716352     -2.924810968 
     5.011872336      39.66683738     -2.972266739 
     5.093308711      39.66650059     -3.020490212 
      5.17606832      39.66615278     -3.069493695 
     5.260172664      39.66579361     -3.119289686 
     5.345643594       39.6654227     -3.169890877 
     5.432503315      39.66503968      -3.22131016 
     5.520774393      39.66464414     -3.273560623 
      5.61047976      39.66423567      -3.32665556 
     5.701642723      39.66381387     -3.380608468 
     5.794286964      39.66337829     -3.435433054 
     5.888436554      39.66292848     -3.491143236 
     5.984115951      39.66246399     -3.547753145 
     6.081350013      39.66198432     -3.605277129 
     6.180164001        39.661489     -3.663729759 
     6.280583588      39.66097751     -3.723125823 
     6.382634862      39.66044932      -3.78348034 
     6.486344335      39.65990389     -3.844808555 
     6.591738952      39.65934067     -3.907125944 
     6.698846094      39.65875906      -3.97044822 
     6.807693587      39.65815849     -4.034791333 
     6.918309709      39.65753832     -4.100171471 
     7.030723199      39.65689792     -4.166605068 
     7.144963261      39.65623665     -4.234108804 
     7.261059574      39.65555381     -4.302699609 
     7.379042301       39.6548487     -4.372394665 
     7.498942093      39.65412062      -4.44321141 
       7.6207901      39.65336881      -4.51516754 
     7.744617978       39.6525925     -4.588281012 
     7.870457897       39.6517909     -4.662570051 
      7.99834255      39.65096318     -4.738053145 
     8.128305162      39.65010852     -4.814749056 
     8.260379496      39.64922602     -4.892676818 
     8.394599865       39.6483148     -4.971855741 
      8.53100114      39.64737392     -5.052305416 
     8.669618758      39.64640242     -5.134045715 
      8.81048873      39.64539932     -5.217096795 
     8.953647655      39.64436359     -5.301479102 
     9.099132726      39.64329418      -5.38721337 
     9.246981739         39.64219      -5.47432063 
     9.397233106      39.64104994     -5.562822206 
      9.54992586      39.63987284     -5.652739723 
     9.705099672      39.63865749     -5.744095104 
     9.862794856      39.63740268     -5.836910579 
     10.02305238      39.63610713     -5.931208682 
     10.18591388      39.63476953     -6.027012257 
     10.35142167      39.63338853     -6.124344457 
     10.51961874      39.63196273     -6.223228748 
     10.69054879      39.63049071     -6.323688913 
     10.86425624      39.62897096     -6.425749049 
      11.0407862      39.62740197     -6.529433574 
     11.22018454      39.62578216     -6.634767224 
     11.40249788       39.6241099     -6.741775059 
     11.58777356      39.62238351     -6.850482462 
     11.77605974      39.62060126      -6.96091514 
     11.96740531      39.61876138     -7.073099126 
     12.16186001      39.61686201      -7.18706078 
     12.35947433      39.61490126     -7.302826791 
     12.56029964      39.61287718     -7.420424172 
     12.76438809      39.61078776      -7.53988027 
     12.97179271      39.60863091     -7.661222756 
     13.18256739      39.60640449     -7.784479632 
     13.39676687       39.6041063     -7.909679229 
     13.61444682      39.60173406     -8.036850204 
     13.83566379      39.59928542     -8.166021541 
     14.06047524      39.59675798     -8.297222551 
     14.28893959      39.59414923     -8.430482869 
     14.52111618      39.59145662     -8.565832452 
     14.75706533       39.5886775     -8.703301578 
     14.99684836      39.58580915     -8.842920844 
     15.24052754      39.58284877      -8.98472116 
     15.48816619      39.57979346     -9.128733752 
     15.73982864      39.57664025      -9.27499015 
     15.99558029      39.57338607     -9.423522192 
     16.25548756      39.57002777     -9.574362015 
     16.51961798      39.56656211     -9.727542051 
     16.78804018      39.56298572     -9.883095022 
     17.06082389      39.55929518     -10.04105393 
     17.33803998      39.55548693     -10.20145207 
     17.61976046      39.55155733     -10.36432298 
     17.90605854      39.54750262     -10.52970048 
     18.19700859      39.54331894     -10.69761865 
     18.49268619      39.53900231     -10.86811179 
     18.79316817      39.53454864     -11.04121446 
     19.09853259      39.52995373     -11.21696145 
     19.40885878      39.52521324     -11.39538773 
     19.72422736      39.52032273      -11.5765285 
     20.04472027      39.51527762     -11.76041916 
     20.37042078       39.5100732     -11.94709527 
     20.70141349      39.50470465     -12.13659254 
      21.0377844      39.49916699     -12.32894687 
      21.3796209      39.49345511     -12.52419425 
     21.72701179      39.48756377      -12.7223708 
     22.08004733      39.48148758     -12.92351276 
     22.43881924      39.47522099     -13.12765642 
     22.80342072      39.46875832     -13.33483814 
      23.1739465      39.46209374     -13.54509432 
     23.55049284      39.45522124     -13.75846138 
     23.93315756      39.44813469     -13.97497572 
     24.32204009      39.44082776     -14.19467373 
     24.71724145      39.43329398     -14.41759172 
     25.11886432      39.42552671     -14.64376595 
     25.52701303      39.41751913     -14.87323254 
     25.94179362      39.40926427     -15.10602749 
     26.36331386      39.40075495     -15.34218662 
     26.79168325      39.39198385     -15.58174555 
     27.22701308      39.38294345     -15.82473969 
     27.66941645      39.37362605     -16.07120415 
      28.1190083      39.36402376     -16.32117375 
     28.57590543      39.35412851     -16.57468298 
     29.04022654      39.34393204     -16.83176594 
     29.51209227       39.3334259      -17.0924563 
     29.99162519      39.32260144     -17.35678731 
      30.4789499      39.31144983     -17.62479168 
     30.97419299      39.29996202     -17.89650159 
     31.47748314      39.28812878     -18.17194863 
      31.9889511      39.27594069     -18.45116374 
     32.50872974      39.26338809     -18.73417719 
      33.0369541      39.25046116      -19.0210185 
     33.57376142      39.23714987     -19.31171642 
     34.11929116      39.22344398     -19.60629883 
     34.67368505      39.20933303     -19.90479275 
      35.2370871      39.19480641     -20.20722423 
     35.80964371      39.17985326     -20.51361832 
     36.39150361      39.16446255     -20.82399902 
     36.98281798      39.14862303     -21.13838919 
     37.58374043      39.13232327     -21.45681052 
     38.19442708      39.11555164     -21.77928346 
      38.8150366      39.09829631     -22.10582715 
     39.44573021      39.08054527     -22.43645938 
     40.08667176      39.06228632     -22.77119648 
     40.73802778      39.04350707     -23.11005332 
     41.39996748      39.02419497     -23.45304321 
     42.07266284      39.00433728     -23.80017782 
     42.75628862      38.98392108     -24.15146714 
     43.45102242      38.96293331     -24.50691943 
     44.15704474      38.94136073     -24.86654112 
     44.87453899      38.91918997     -25.23033674 
      45.6036916       38.8964075      -25.5983089 
     46.34469197      38.87299966     -25.97045821 
     47.09773264      38.84895266     -26.34678317 
     47.86300923      38.82425258     -26.72728019 
     48.64072057      38.79888541     -27.11194346 
      49.4310687      38.77283701     -27.50076492 
     50.23425895      38.74609317     -27.89373419 
         51.0505      38.71863961     -28.29083855 
     51.88000389      38.69046195     -28.69206284 
     52.72298614      38.66154578     -29.09738942 
     53.57966575      38.63187664     -29.50679815 
     54.45026528      38.60144003      -29.9202663 
     55.33501092      38.57022145     -30.33776854 
     56.23413252      38.53820639      -30.7592769 
     57.14786367      38.50538034      -31.1847607 
     58.07644175      38.47172884     -31.61418657 
     59.02010802      38.43723746     -32.04751837 
     59.97910763      38.40189184     -32.48471721 
     60.95368972      38.36567769      -32.9257414 
     61.94410751       38.3285808     -33.37054644 
     62.95061829       38.2905871     -33.81908505 
     63.97348355      38.25168262      -34.2713071 
     65.01296903      38.21185356     -34.72715966 
      66.0693448      38.17108627     -35.18658702 
     67.14288529      38.12936729     -35.64953064 
     68.23386941      38.08668335     -36.11592923 
      69.3425806      38.04302141     -36.58571875 
      70.4693069      37.99836867     -37.05883246 
     71.61434102      37.95271257     -37.53520094 
     72.77798045      37.90604086     -38.01475212 
     73.96052751      37.85834155     -38.49741138 
      75.1622894      37.80960296     -38.98310159 
     76.38357836      37.75981377     -39.47174314 
     77.62471166      37.70896298     -39.96325406 
     78.88601176      37.65703997     -40.45755008 
     80.16780634      37.60403448     -40.95454469 
      81.4704284      37.54993666     -41.45414929 
     82.79421637      37.49473707     -41.95627322 
     84.13951416       37.4384267     -42.46082392 
     85.50667129      37.38099698       -42.967707 
     86.89604293      37.32243977     -43.47682638 
     88.30799004      37.26274743     -43.98808438 
     89.74287945      37.20191278      -44.5013819 
     91.20108394      37.13992912     -45.01661848 
     92.68298234      37.07679026     -45.53369249 
     94.18895965      37.01249051     -46.05250123 
     95.71940713       36.9470247     -46.57294109 
     97.27472238      36.88038816     -47.09490771 
     98.85530947      36.81257678     -47.61829609 
      100.461579      36.74358693     -48.14300076 
     102.0939484      36.67341555     -48.66891593 
     103.7528416      36.60206009     -49.19593565 
     105.4386896      36.52951855     -49.72395392 
     107.1519305      36.45578944     -50.25286492 
     108.8930093      36.38087182     -50.78256309 
     110.6623784      36.30476526     -51.31294331 
     112.4604974      36.22746986     -51.84390107 
     114.2878335      36.14898623     -52.37533257 
     116.1448614      36.06931549     -52.90713491 
     118.0320636      35.98845925     -53.43920623 
     119.9499303      35.90641962     -53.97144581 
     121.8989599      35.82319919     -54.50375425 
     123.8796587      35.73880101      -55.0360336 
     125.8925412      35.65322858     -55.56818745 
     127.9381304      35.56648586     -56.10012108 
     130.0169578       35.4785772      -56.6317416 
     132.1295634       35.3895074     -57.16295801 
     134.2764961      35.29928163     -57.69368133 
     136.4583137      35.20790544     -58.22382474 
     138.6755829      35.11538473     -58.75330358 
     140.9288798      35.02172577     -59.28203554 
     143.2187899       34.9269351     -59.80994067 
     145.5459081      34.83101961     -60.33694146 
     147.9108388      34.73398644     -60.86296296 
     150.3141966        34.635843     -61.38793276 
     152.7566058      34.53659693      -61.9117811 
      155.238701      34.43625611     -62.43444087 
      157.761127      34.33482857      -62.9558477 
     160.3245391      34.23232257     -63.47593992 
     162.9296033      34.12874649     -63.99465865 
     165.5769963      34.02410883     -64.51194776 
     168.2674061      33.91841824      -65.0277539 
     171.0015315      33.81168341      -65.5420265 
     173.7800829      33.70391313     -66.05471777 
     176.6037821      33.59511623     -66.56578266 
     179.4733627      33.48530154     -67.07517887 
     182.3895702      33.37447793     -67.58286678 
     185.3531623      33.26265423     -68.08880947 
     188.3649089      33.14983922     -68.59297264 
     191.4255925      33.03604166     -69.09532458 
     194.5360082      32.92127021     -69.59583612 
      197.696964      32.80553343     -70.09448054 
     200.9092813       32.6888398     -70.59123356 
     204.1737945      32.57119763     -71.08607326 
     207.4913517      32.45261511     -71.57897995 
      210.862815      32.33310026     -72.06993619 
     214.2890601      32.21266093      -72.5589266 
     217.7709772      32.09130475     -73.04593788 
      221.309471      31.96903917     -73.53095865 
     224.9054606       31.8458714     -74.01397937 
     228.5598803      31.72180844     -74.49499226 
     232.2736796      31.59685701      -74.9739912 
     236.0478233       31.4710236     -75.45097161 
     239.8832919      31.34431442     -75.92593035 
     243.7810818      31.21673538     -76.39886561 
     247.7422058      31.08829214     -76.86977683 
     251.7676928      30.95899003     -77.33866455 
     255.8585887      30.82883409     -77.80553028 
     260.0159563      30.69782904     -78.27037646 
     264.2408757      30.56597929     -78.73320625 
     268.5344446      30.43328891     -79.19402348 
     272.8977783      30.29976164     -79.65283248 
     277.3320105       30.1654009     -80.10963801 
     281.8382931      30.03020977     -80.56444507 
      286.417797      29.89419097     -81.01725884 
     291.0717118      29.75734689     -81.46808451 
     295.8012467      29.61967958     -81.91692718 
     300.6076303      29.48119074     -82.36379174 
     305.4921113      29.34188171     -82.80868271 
     310.4559588      29.20175351     -83.25160413 
     315.5004623      29.06080681     -83.69255947 
     320.6269325      28.91904192     -84.13155143 
      325.836701      28.77645885      -84.5685819 
     331.1311215      28.63305724     -85.00365175 
     336.5115694      28.48883642     -85.43676079 
     341.9794425      28.34379541     -85.86790756 
     347.5361614      28.19793287     -86.29708928 
     353.1831698      28.05124721     -86.72430168 
     358.9219346      27.90373648     -87.14953891 
     364.7539469      27.75539847      -87.5727934 
     370.6807218      27.60623068     -87.99405574 
      376.703799      27.45623033      -88.4133146 
     382.8247433      27.30539438     -88.83055657 
      389.045145      27.15371953     -89.24576605 
     395.3666201      27.00120225      -89.6589252 
     401.7908108      26.84783877     -90.07001376 
     408.3193863      26.69362513     -90.47900896 
     414.9540426      26.53855715     -90.88588547 
     421.6965034      26.38263046     -91.29061524 
     428.5485204      26.22584055     -91.69316743 
     435.5118737      26.06818273     -92.09350832 
     442.5883724       25.9096522     -92.49160122 
     449.7798549      25.75024402     -92.88740637 
     457.0881896      25.58995317     -93.28088089 
     464.5152752      25.42877456     -93.67197869 
     472.0630413      25.26670301     -94.06065038 
     479.7334486      25.10373334     -94.44684324 
     487.5284901      24.93986033     -94.83050114 
     495.4501908      24.77507879     -95.21156448 
     503.5006088      24.60938352     -95.58997016 
     511.6818355       24.4427694     -95.96565151 
     519.9959965       24.2752314      -96.3385383 
     528.4452518      24.10676455     -96.70855665 
     537.0317964      23.93736403     -97.07562905 
     545.7578611      23.76702515     -97.43967432 
      554.625713      23.59574342     -97.80060762 
     563.6376558      23.42351452     -98.15834045 
      572.796031      23.25033436     -98.51278061 
     582.1032178      23.07619911     -98.86383226 
     591.5616342       22.9011052     -99.21139595 
     601.1737375      22.72504938     -99.55536859 
     610.9420249      22.54802869     -99.89564354 
     620.8690342      22.37004056     -100.2321106 
     630.9573445      22.19108277     -100.5646562 
     641.2095766      22.01115352     -100.8931632 
     651.6283941      21.83025143     -101.2175112 
     662.2165037      21.64837555     -101.5375766 
     672.9766563      21.46552545     -101.8532324 
     683.9116473      21.28170116     -102.1643488 
     695.0243176      21.09690325     -102.4707927 
     706.3175543      20.91113283     -102.7724284 
     717.7942913      20.72439158     -103.0691171 
     729.4575103      20.53668177     -103.3607177 
     741.3102413      20.34800627     -103.6470863 
     753.3555637      20.15836859     -103.9280767 
     765.5966069      19.96777288     -104.2035405 
      778.036551      19.77622396     -104.4733271 
      790.678628      19.58372733      -104.737284 
     803.5261222      19.39028917     -104.9952568 
     816.5823714      19.19591642     -105.2470896 
     829.8507675      19.00061669     -105.4926251 
     843.3347578      18.80439836     -105.7317044 
     857.0378452      18.60727057     -105.9641677 
       870.96359      18.40924318     -106.1898542 
     885.1156098      18.21032687     -106.4086024 
     899.4975815      18.01053306     -106.6202501 
     914.1132415      17.80987396     -106.8246347 
     928.9663868      17.60836258     -107.0215934 
     944.0608763      17.40601272     -107.2109635 
     959.4006315      17.20283898     -107.3925822 
     974.9896377      16.99885674     -107.5662873 
     990.8319449      16.79408221      -107.731917 
     1006.931669      16.58853236     -107.8893101 
     1023.292992      16.38222498     -108.0383066 
     1039.920166      16.17517867     -108.1787472 
     1056.817509      15.96741277     -108.3104742 
     1073.989412      15.75894745     -108.4333312 
     1091.440336      15.54980365     -108.5471633 
     1109.174815      15.34000306     -108.6518176 
     1127.197456      15.12956816     -108.7471431 
     1145.512941      14.91852216     -108.8329908 
     1164.126029      14.70688905     -108.9092142 
     1183.041556      14.49469352     -108.9756691 
     1202.264435      14.28196101     -109.0322139 
      1221.79966      14.06871766     -109.0787099 
     1241.652308      13.85499031     -109.1150213 
     1261.827535       13.6408065     -109.1410152 
     1282.330583      13.42619442     -109.1565621 
     1303.166778      13.21118295     -109.1615357 
     1324.341535       12.9958016     -109.1558132 
     1345.860354      12.78008049     -109.1392756 
     1367.728826      12.56405039     -109.1118073 
     1389.952631      12.34774264     -109.0732968 
     1412.537545      12.13118919     -109.0236365 
     1435.489433      11.91442254     -108.9627229 
      1458.81426      11.69747572     -108.8904568 
     1482.518085      11.48038234     -108.8067432 
     1506.607066      11.26317647     -108.7114915 
     1531.087462      11.04589272     -108.6046157 
     1555.965632      10.82856616     -108.4860345 
     1581.248039      10.61123232     -108.3556711 
     1606.941253      10.39392718     -108.2134538 
     1633.051948      10.17668714     -108.0593156 
     1659.586907      9.959549012     -107.8931947 
     1686.553025      9.742549978     -107.7150341 
     1713.957308      9.525727601     -107.5247824 
     1741.806873      9.309119787     -107.3223931 
     1770.108958      9.092764769     -107.1078253 
     1798.870915      8.876701088     -106.8810434 
     1828.100216      8.660967569     -106.6420173 
     1857.804455      8.445603305     -106.3907227 
     1887.991349      8.230647632     -106.1271407 
     1918.668741      8.016140106     -105.8512584 
       1949.8446      7.802120487     -105.5630685 
     1981.527026       7.58862871     -105.2625698 
      2013.72425      7.375704863     -104.9497668 
     2046.444637      7.163389168     -104.6246703 
     2079.696687      6.951721951     -104.2872971 
      2113.48904       6.74074362       -103.93767 
     2147.830474      6.530494639     -103.5758182 
     2182.729912      6.321015503     -103.2017772 
      2218.19642       6.11234671     -102.8155887 
     2254.239212      5.904528735     -102.4173008 
     2290.867653         5.697602      -102.006968 
     2328.091258      5.491606849     -101.5846513 
     2365.919697      5.286583515     -101.1504182 
       2404.3628      5.082572093     -100.7043427 
     2443.430553      4.879612506     -100.2465055 
     2483.133105       4.67774448     -99.77699357 
     2523.480772      4.477007504     -99.29590076 
     2564.484037      4.277440803      -98.8033274 
      2606.15355      4.079083304     -98.29938041 
     2648.500139      3.881973602     -97.78417334 
     2691.534804      3.686149925      -97.2578263 
     2735.268726      3.491650098     -96.72046596 
     2779.713268      3.298511514     -96.17222552 
     2824.879975      3.106771089     -95.61324467 
     2870.780582      2.916465236     -95.04366951 
     2917.427014      2.727629821     -94.46365253 
      2964.83139      2.540300132     -93.87335255 
     3013.006024      2.354510839     -93.27293456 
     3061.963434       2.17029596     -92.66256973 
     3111.716337      1.987688824     -92.04243522 
      3162.27766      1.806722032     -91.41271415 
     3213.660539      1.627427427     -90.77359538 
     3265.878322      1.449836054     -90.12527346 
     3318.944576      1.273978124     -89.46794841 
     3372.873087      1.099882985     -88.80182562 
     3427.677865     0.9275790814     -88.12711563 
      3483.37315     0.7570939259     -87.44403397 
     3539.973411     0.5884540658     -86.75280095 
     3597.493352     0.4216850515     -86.05364148 
     3655.947916     0.2568114076      -85.3467848 
     3715.352291    0.09385660346      -84.6324643 
     3775.721909   -0.06715697333     -83.91091726 
     3837.072455    -0.2262080431      -83.1823846 
     3899.419867     -0.383276458     -82.44711061 
     3962.780343    -0.5383432245     -81.70534269 
     4027.170343    -0.6913905239      -80.9573311 
     4092.606597    -0.8424017311      -80.2033286 
     4159.106105    -0.9913614312     -79.44359024 
     4226.686143     -1.138255434     -78.67837301 
     4295.364268     -1.283070788     -77.90793555 
     4365.158322     -1.425795788     -77.13253782 
     4436.086439     -1.566419985     -76.35244084 
     4508.167045     -1.704934192     -75.56790629 
     4581.418867     -1.841330487     -74.77919626 
     4655.860935     -1.975602214      -73.9865729 
      4731.51259     -2.107743981     -73.19029809 
     4808.393484     -2.237751657     -72.39063314 
     4886.523593     -2.365622369     -71.58783845 
     4965.923215     -2.491354485     -70.78217319 
     5046.612976     -2.614947613     -69.97389501 
      5128.61384     -2.736402581     -69.16325969 
     5211.947111     -2.855721425     -68.35052088 
     5296.634439      -2.97290737     -67.53592976 
     5382.697825     -3.087964811     -66.71973477 
     5470.159629     -3.200899288     -65.90218131 
     5559.042573     -3.311717466     -65.08351148 
     5649.369748     -3.420427109     -64.26396377 
     5741.164622     -3.527037049     -63.44377287 
     5834.451043     -3.631557157     -62.62316936 
     5929.253246     -3.733998317     -61.80237951 
     6025.595861     -3.834372385     -60.98162501 
     6123.503917     -3.932692162     -60.16112283 
     6223.002852     -4.028971356     -59.34108494 
     6324.118514     -4.123224544     -58.52171815 
     6426.877173     -4.215467138     -57.70322398 
     6531.305526     -4.305715342     -56.88579841 
     6637.430704     -4.393986117     -56.06963181 
     6745.280277     -4.480297136     -55.25490876 
     6854.882265     -4.564666749     -54.44180794 
     6966.265141     -4.647113939     -53.63050203 
     7079.457844     -4.727658279      -52.8211576 
      7194.48978     -4.806319895     -52.01393505 
     7311.390835      -4.88311942     -51.20898851 
     7430.191379     -4.958077955     -50.40646582 
     7550.922277     -5.031217026      -49.6065085 
     7673.614894     -5.102558545     -48.80925165 
     7798.301105     -5.172124766     -48.01482401 
     7925.013305     -5.239938249     -47.22334794 
     8053.784412     -5.306021813     -46.43493939 
     8184.647881     -5.370398506     -45.64970795 
     8317.637711     -5.433091558      -44.8677569 
     8452.788452     -5.494124347     -44.08918321 
     8590.135215     -5.553520364     -43.31407759 
     8729.713684      -5.61130317     -42.54252462 
      8871.56012      -5.66749637     -41.77460271 
     9015.711376      -5.72212357     -41.01038427 
     9162.204901     -5.775208348     -40.24993576 
     9311.078755     -5.826774223     -39.49331778 
     9462.371614      -5.87684462     -38.74058517 
     9616.122784     -5.925442842     -37.99178714 
      9772.37221     -5.972592043     -37.24696735 
     9931.160484     -6.018315196     -36.50616407 
     10092.52886      -6.06263507     -35.76941024 
     10256.51926     -6.105574202     -35.03673369 
     10423.17429     -6.147154874     -34.30815717 
     10592.53725      -6.18739909     -33.58369858 
     10764.65214     -6.226328553     -32.86337105 
     10939.56366     -6.263964644     -32.14718309 
     11117.31727     -6.300328405     -31.43513878 
     11297.95915     -6.335440515     -30.72723785 
     11481.53621     -6.369321277     -30.02347588 
     11668.09617       -6.4019906     -29.32384445 
     11857.68748     -6.433467985     -28.62833124 
      12050.3594     -6.463772506     -27.93692025 
     12246.16199     -6.492922803     -27.24959192 
     12445.14612     -6.520937064     -26.56632328 
     12647.36347     -6.547833018     -25.88708813 
      12852.8666     -6.573627919     -25.21185715 
     13061.70888     -6.598338545      -24.5405981 
     13273.94458     -6.621981178     -23.87327596 
     13489.62883     -6.644571607     -23.20985306 
     13708.81766     -6.666125114     -22.55028926 
     13931.56803      -6.68665647     -21.89454209 
      14157.9378     -6.706179927      -21.2425669 
     14387.98578     -6.724709221     -20.59431702 
     14621.77174     -6.742257556     -19.94974388 
     14859.35642     -6.758837611     -19.30879719 
     15100.80154     -6.774461532     -18.67142507 
     15346.16983     -6.789140931     -18.03757419 
     15595.52503     -6.802886887      -17.4071899 
     15848.93192     -6.815709939     -16.78021644 
     16106.45635     -6.827620094     -16.15659697 
     16368.16521     -6.838626818      -15.5362738 
      16634.1265     -6.848739048     -14.91918848 
     16904.40932     -6.857965182     -14.30528197 
     17179.08387     -6.866313088     -13.69449471 
     17458.22153     -6.873790106     -13.08676683 
     17741.89481     -6.880403048     -12.48203824 
     18030.17741     -6.886158203     -11.88024875 
     18323.14422     -6.891061341     -11.28133822 
     18620.87137     -6.895117717     -10.68524668 
     18923.43619     -6.898332077     -10.09191443 
     19230.91729     -6.900708661     -9.501282222 
     19543.39456      -6.90225121     -8.913291318 
     19860.94917     -6.902962973     -8.327883645 
     20183.66364     -6.902846712     -7.745001906 
     20511.62179     -6.901904712     -7.164589696 
     20844.90883     -6.900138783      -6.58659162 
     21183.61135     -6.897550274     -6.010953405 
     21527.81735      -6.89414008     -5.437622012 
     21877.61624     -6.889908646     -4.866545751 
     22233.09891     -6.884855985     -4.297674386 
      22594.3577     -6.878981681     -3.730959245 
     22961.48648     -6.872284901     -3.166353324 
     23334.58062     -6.864764408     -2.603811396 
     23713.73706      -6.85641857     -2.043290105 
     24099.05429     -6.847245373     -1.484748074 
     24490.63242     -6.837242435    -0.9281459982 
     24888.57318     -6.826407013    -0.3734467419 
     25292.97996     -6.814736024     0.1793845664 
     25703.95783     -6.802226054     0.7303804448 
     26121.61354     -6.788873373      1.279570969 
     26546.05562      -6.77467395      1.826983686 
     26977.39432     -6.759623472      2.372643532 
     27415.74172     -6.743717353      2.916572754 
     27861.21169     -6.726950757      3.458790832 
     28313.91996     -6.709318613      3.999314403 
     28773.98415     -6.690815629        4.5381572 
     29241.52378     -6.671436314      5.075329979 
     29716.66032     -6.651174998      5.610840462 
      30199.5172     -6.630025844      6.144693276 
     30690.21988     -6.607982875      6.676889905 
     31188.89584     -6.585039988      7.207428643 
     31695.67463      -6.56119098      7.736304544 
     32210.68791     -6.536429562      8.263509394 
     32734.06949     -6.510749387      8.789031672 
     33265.95533     -6.484144065      9.312856527 
     33806.48362     -6.456607189      9.834965756 
     34355.79479     -6.428132357      10.35533779 
     34914.03155     -6.398713191       10.8739477 
     35481.33892     -6.368343362      11.39076715 
      36057.8643     -6.337016614      11.90576446 
     36643.75746     -6.304726781       12.4189046 
     37239.17063     -6.271467817      12.93014918 
     37844.25847     -6.237233814      13.43945651 
      38459.1782     -6.202019027      13.94678162 
     39084.08958     -6.165817894      14.45207629 
     39719.15495     -6.128625063      14.95528914 
      40364.5393     -6.090435408      15.45636565 
      41020.4103     -6.051244058      15.95524821 
     41686.93835     -6.011046413      16.45187624 
      42364.2966     -5.969838167      16.94618623 
     43052.66105     -5.927615331      17.43811186 
     43752.21052     -5.884374249      17.92758405 
     44463.12675     -5.840111619       18.4145311 
     45185.59444     -5.794824515      18.89887879 
     45919.80128     -5.748510398      19.38055049 
     46665.93803     -5.701167142      19.85946729 
     47424.19853      -5.65279304      20.33554811 
     48194.77976     -5.603386829      20.80870988 
     48977.88194     -5.552947696      21.27886763 
      49773.7085     -5.501475299      21.74593467 
      50582.4662     -5.448969769      22.20982275 
     51404.36516      -5.39543173      22.67044218 
      52239.6189     -5.340862302      23.12770205 
     53088.44442     -5.285263113      23.58151034 
     53951.06225       -5.2286363      24.03177412 
     54827.69649     -5.170984523      24.47839972 
     55718.57489     -5.112310957      24.92129293 
      56623.9289     -5.052619306      25.36035911 
     57543.99373     -4.991913793      25.79550345 
     58479.00841     -4.930199168      26.22663111 
     59429.21586     -4.867480696      26.65364738 
     60394.86294     -4.803764164      27.07645792 
     61376.20052     -4.739055864      27.49496889 
     62373.48355     -4.673362592      27.90908714 
     63386.97113      -4.60669164       28.3187204 
     64416.92655      -4.53905078      28.72377743 
     65463.61741     -4.470448256      29.12416822 
     66527.31562     -4.400892771      29.51980412 
     67608.29754     -4.330393467      29.91059802 
       68706.844     -4.258959914      30.29646452 
     69823.24041     -4.186602088      30.67732004 
      70957.7768     -4.113330354      31.05308302 
     72110.74792     -4.039155444      31.42367398 
     73282.45331     -3.964088434      31.78901573 
     74473.19739     -3.888140724      32.14903343 
      75683.2895      -3.81132401      32.50365474 
     76913.04403     -3.733650261      32.85280992 
     78162.78046      -3.65513169      33.19643188 
     79432.82347     -3.575780732      33.53445634 
     80723.50302     -3.495610008      33.86682185 
     82035.15443     -3.414632302      34.19346987 
     83368.11846     -3.332860531      34.51434482 
     84722.74141      -3.25030771      34.82939414 
     86099.37522     -3.166986928      35.13856832 
     87498.37752     -3.082911312      35.44182089 
     88920.11179     -2.998093997      35.73910849 
     90364.94737     -2.912548095       36.0303908 
     91833.25965     -2.826286662      36.31563059 
     93325.43008      -2.73932267      36.59479364 
     94841.84633     -2.651668969      36.86784876 
     96382.90236      -2.56333826       37.1347677 
     97948.99854     -2.474343065      37.39552512 
     99540.54174     -2.384695692      37.65009848 
     101157.9454     -2.294408207      37.89846802 
     102801.6298     -2.203492404      38.14061662 
     104472.0219     -2.111959775      38.37652973 
     106169.5557     -2.019821484      38.60619521 
     107894.6722     -1.927088335      38.82960327 
     109647.8196     -1.833770751       39.0467463 
     111429.4534     -1.739878742      39.25761873 
     113240.0363     -1.645421885      39.46221687 
     115080.0389       -1.5504093      39.66053879 
     116949.9391     -1.454849624       39.8525841 
     118850.2227     -1.358750995      40.03835382 
     120781.3835     -1.262121028      40.21785018 
     122743.9231       -1.1649668       40.3910764 
     124738.3514      -1.06729483      40.55803656 
     126765.1866    -0.9691110659      40.71873534 
     128824.9552    -0.8704208701      40.87317783 
     130918.1923    -0.7712290068      41.02136936 
     133045.4418    -0.6715396313      41.16331522 
     135207.2563    -0.5713562812      41.29902049 
     137404.1975    -0.4706818687      41.42848981 
     139636.8361    -0.3695186748      41.55172715 
     141905.7522     -0.267868345      41.66873563 
     144211.5352     -0.165731887      41.77951722 
     146554.7841   -0.06310966902      41.88407261 
     148936.1078    0.03999857877      41.98240092 
     151356.1248     0.1435937627      42.07449952 
      153815.464      0.247677422      42.16036382 
     156314.7643      0.352251723      42.23998704 
     158854.6749     0.4573194538      42.31335999 
     161435.8557     0.5628840152      42.38047091 
     164058.9773     0.6689494125      42.44130524 
     166724.7213     0.7755202448      42.49584543 
       169433.78     0.8826016935      42.54407077 
     172186.8575     0.9901995101       42.5859572 
     174984.6689      1.098320003      42.62147714 
      177827.941      1.206970022      42.65059931 
     180717.4126      1.316156946      42.67328859 
     183653.8343      1.425888665      42.68950589 
     186637.9691      1.536173565      42.69920795 
     189670.5921      1.647020511      42.70234726 
     192752.4913      1.758438834       42.6988719 
     195884.4674      1.870438306      42.68872546 
     199067.3339      1.983029134       42.6718469 
     202301.9179      2.096221934      42.64817044 
     205589.0596      2.210027719      42.61762552 
     208929.6131      2.324457884      42.58013666 
     212324.4462      2.439524186      42.53562341 
     215774.4409      2.555238734      42.48400027 
     219280.4935       2.67161397      42.42517663 
     222843.5149      2.788662658      42.35905671 
     226464.4308      2.906397872      42.28553951 
     230144.1817      3.024832983      42.20451878 
     233883.7239      3.143981648      42.11588294 
     237684.0287      3.263857801      42.01951505 
     241546.0834      3.384475648      41.91529282 
     245470.8916      3.505849655      41.80308851 
     249459.4727      3.627994547      41.68276894 
      253512.863        3.7509253      41.55419544 
     257632.1157      3.874657145      41.41722383 
     261818.3008      3.999205559      41.27170437 
      266072.506      4.124586275      41.11748174 
     270395.8364      4.250815277      40.95439499 
     274789.4153      4.377908809       40.7822775 
     279254.3841      4.505883377      40.60095692 
     283791.9028      4.634755761      40.41025514 
     288403.1503      4.764543021       40.2099882 
     293089.3245       4.89526251      39.99996622 
     297851.6429      5.026931886      39.77999335 
     302691.3428      5.159569126      39.54986766 
     307609.6815      5.293192543        39.309381 
     312607.9367      5.427820805      39.05831894 
     317687.4071      5.563472952      38.79646063 
     322849.4122      5.700168416       38.5235786 
     328095.2931      5.837927051      38.23943869 
     333426.4128      5.976769146      37.94379978 
     338844.1561      6.116715459      37.63641363 
     344349.9308      6.257787243      37.31702469 
      349945.167      6.400006269       36.9853698 
     355631.3186      6.543394861      36.64117796 
     361409.8626      6.687975925      36.28417005 
     367282.3005       6.83377298       35.9140585 
     373250.1578      6.980810194      35.53054693 
      379314.985      7.129112412      35.13332983 
     385478.3577      7.278705198       34.7220921 
     391741.8771      7.429614867      34.29650865 
     398107.1706       7.58186852      33.85624394 
     404575.8917      7.735494084      33.40095142 
     411149.7211      7.890520349      32.93027306 
     417830.3666      8.046977005      32.44383869 
     424619.5639      8.204894679      31.94126543 
     431519.0768      8.364304976      31.42215697 
     438530.6978      8.525240512      30.88610286 
     445656.2484      8.687734958      30.33267773 
     452897.5799      8.851823072      29.76144045 
     460256.5736      9.017540737      29.17193326 
     467735.1413      9.184924996      28.56368076 
     475335.2259      9.354014085      27.93618894 
      483058.802      9.524847466      27.28894405 
     490907.8762      9.697465855      26.62141145 
     498884.4875      9.871911251      25.93303431 
     506990.7083      10.04822696      25.22323232 
     515228.6446       10.2264576      24.49140023 
     523600.4366      10.40664915      23.73690631 
     532108.2593      10.58884893       22.9590907 
     540754.3229      10.77310562      22.15726369 
     549540.8739      10.95946924      21.33070381 
     558470.1947      11.14799115      20.47865581 
     567544.6054      11.33872405      19.60032857 
     576766.4634      11.53172191      18.69489274 
     586138.1645      11.72703993      17.76147833 
     595662.1435      11.92473451      16.79917206 
     605340.8748      12.12486315      15.80701461 
     615176.8727      12.32748435      14.78399755 
     625172.6928       12.5326575       13.7290602 
     635330.9319      12.74044273      12.64108621 
      645654.229      12.95090075       11.5188999 
     656145.2663      13.16409263      10.36126241 
     666806.7692      13.38007953      9.166867544 
     677641.5076      13.59892248      7.934337377 
     688652.2963      13.82068196      6.662217581 
      699841.996      14.04541757      5.348972462 
     711213.5137      14.27318752      3.992979698 
     722769.8036      14.50404815      2.592524777 
     734513.8682      14.73805328      1.145795122 
     746448.7584      14.97525351    -0.3491260847 
      758577.575      15.21569543     -1.894266385 
     770903.4691      15.45942066     -3.491770824 
     783429.6428      15.70646483     -5.143908995 
     796159.3504      15.95685633     -6.853082343 
     809095.8992      16.21061498     -8.621831665 
     822242.6499      16.46775042     -10.45284477 
     835603.0182      16.72826041     -12.34896423 
      849180.475      16.99212876     -14.31319511 
     862978.5478      17.25932319     -16.34871262 
     877000.8211      17.52979273     -18.45886947 
     891250.9381      17.80346493     -20.64720284 
     905732.6009      18.08024276      -22.9174407 
     920449.5718       18.3600011     -25.27350735 
     935405.6741      18.64258287     -27.71952774 
     950604.7937      18.92779483     -30.25983042 
      966050.879      19.21540291     -32.89894866 
      981747.943       19.5051271      -35.6416194 
     997700.0638        19.796636     -38.49277958 
     1013911.386      20.08954082     -41.45755941 
      1030386.12      20.38338901     -44.54127202 
     1047128.548      20.67765744     -47.74939911 
     1064143.018       20.9717451     -51.08757188 
     1081433.951      21.26496544     -54.56154694 
     1099005.839      21.55653825     -58.17717633 
     1116863.248      21.84558101     -61.94037119 
     1135010.816      22.13109988     -65.85705815 
     1153453.258         22.41198     -69.93312732 
     1172195.366      22.68697525     -74.17437036 
     1191242.008      22.95469721     -78.58640635 
     1210598.134      23.21360328      -83.1745922 
     1230268.771        23.461984     -87.94391289 
      1250259.03      23.69794963     -92.89884548 
     1270574.105      23.91941645     -98.04318848 
     1291219.274      24.12409376     -103.3798472 
     1312199.899      24.30947333     -108.9105644 
     1333521.432      24.47282371     -114.6355858 
     1355189.412      24.61119368     -120.5532565 
     1377209.469      24.72142954     -126.6595472 
     1399587.323       24.8002126     -132.9475294 
     1422328.787       24.8441231     -139.4068306 
     1445439.771      24.84973561     -146.0231313 
     1468926.278      24.81374833     -152.7777813 
      1492794.41      24.73314299     -159.6476357 
     1517050.367       24.6053654     -166.6052066 
     1541700.453      24.42850929      -173.619203 
      1566751.07      24.20148007      179.3445171 
     1592208.727      23.92411383      172.3216328 
     1618080.038      23.59723071      165.3478063 
     1644371.723      23.22261147      158.4570667 
     1671090.614      22.80289893      151.6803283 
     1698243.652       22.3414386      145.0442117 
     1725837.892      21.84208126      138.5702765 
     1753880.502      21.30897374      132.2746986 
     1782378.767      20.74636114      126.1683517 
     1811340.093      20.15841746      120.2572076 
     1840772.001      19.54911396      114.5429488 
      1870682.14      18.92212721      109.0236862 
      1901078.28      18.28078387      103.6946986 
     1931968.317        17.628036      98.54912986 
     1963360.277       16.9664598       93.5786076 
     1995262.315       16.2982707      88.77376572 
      2027682.72      15.62534884       84.1246681 
     2060629.913      14.94927021      79.62113982 
     2094112.456      14.27133992      75.25301726 
     2128139.046      13.59262528       71.0103301 
     2162718.524      12.91398713      66.88342835 
     2197859.873      12.23610853      62.86306612 
     2233572.223      11.55952058       58.9404522 
     2269864.852      10.88462505      55.10727615 
     2306747.189      10.21171418      51.35571623 
     2344228.815      9.540987588      47.67843468 
     2382319.469      8.872566853      44.06856435 
     2421029.047      8.206507784      40.51968967 
     2460367.604      7.542810844      37.02582424 
     2500345.362      6.881429896      33.58138669 
     2540972.706      6.222279545       30.1811761 
     2582260.191      5.565241273      26.82034754 
     2624218.543      4.910168555      23.49438864 
     2666858.665      4.256891116      20.19909728 
     2710191.632      3.605218465       16.9305608 
     2754228.703      2.954942825      13.68513678 
      2798981.32       2.30584156      10.45943551 
     2844461.107       1.65767918      7.250304055 
     2890679.882      1.010209005      4.054811997 
     2937649.652     0.3631745431     0.8702387611 
     2985382.619    -0.2836893585     -2.305937578 
     3033891.184    -0.9306555466     -5.476050035 
      3083187.95     -1.578003734     -8.642251108 
     3133285.724      -2.22601978     -11.80651992 
     3184197.522     -2.874995044     -14.97066818 
     3235936.569     -3.525225791     -18.13634507 
     3288516.309     -4.177012616      -21.3050412 
       3341950.4     -4.830659871     -24.47809161 
     3396252.726     -5.486475076     -27.65667809 
     3451437.393     -6.144768293     -30.84183076 
      3507518.74     -6.805851452     -34.03442923 
     3564511.334     -7.470037612     -37.23520316 
     3622429.984     -8.137640154     -40.44473274 
     3681289.736     -8.808971885     -43.66344881 
     3741105.883     -9.484344068     -46.89163311 
     3801893.963     -10.16406535     -50.12941852 
     3863669.771     -10.84844061     -53.37678971 
     3926449.354     -11.53776974       -56.633584 
     3990249.024     -12.23234629     -59.89949292 
     4055085.354     -12.93245614     -63.17406438 
     4120975.191     -13.63837605     -66.45670559 
     4187935.651     -14.35037217     -69.74668694 
     4255984.131     -15.06869861      -73.0431468 
      4325138.31     -15.79359596     -76.34509747 
     4395416.154     -16.52528982     -79.65143207 
     4466835.922     -17.26398951     -82.96093264 
     4539416.167     -18.00988671     -86.27227926 
     4613175.746     -18.76315437     -89.58406021 
     4688133.821     -19.52394563     -92.89478303 
     4764309.868     -20.29239304      -96.2028864 
     4841723.676     -21.06860781     -99.50675269 
     4920395.357     -21.85267943      -102.804721 
      5000345.35     -22.64467539     -106.0951004 
     5081594.426     -23.44464113     -109.3761835 
     5164163.693      -24.2526003     -112.6462597 
     5248074.602     -25.06855513      -115.903628 
     5333348.955     -25.89248707     -119.1466097 
     5420008.904     -26.72435766     -122.3735601 
     5508076.964     -27.56410944     -125.5828793 
     5597576.015     -28.41166719     -128.7730219 
     5688529.308     -29.26693918     -131.9425064 
     5780960.474     -30.12981854     -135.0899218 
     5874893.525     -31.00018475     -138.2139349 
     5970352.866     -31.87790514     -141.3132945 
     6067363.296     -32.76283639     -144.3868359 
     6165950.019     -33.65482609      -147.433483 
     6266138.647     -34.55371422     -150.4522498 
     6367955.209     -35.45933458     -153.4422413 
     6471426.157     -36.37151621     -156.4026522 
     6576578.374     -37.29008463     -159.3327659 
     6683439.176     -38.21486315     -162.2319521 
     6792036.326     -39.14567386      -165.099664 
     6902398.038     -40.08233878      -167.935435 
     7014552.984     -41.02468064     -170.7388748 
     7128530.301     -41.97252378     -173.5096652 
     7244359.601      -42.9256948     -176.2475562 
     7362070.975     -43.88402314     -178.9523608 
     7481695.005     -44.84734166      178.3760489 
     7603262.769     -45.81548699      175.7377464 
     7726805.851     -46.78829989      173.1327554 
     7852356.346     -47.76562548      170.5610539 
     7979946.873      -48.7473135      168.0225786 
     8109610.579     -49.73321836      165.5172288 
      8241381.15     -50.72319926      163.0448701 
     8375292.821     -51.71712022      160.6053381 
     8511380.382     -52.71485005      158.1984419 
     8649679.188     -53.71626234      155.8239669 
     8790225.168     -54.72123532      153.4816777 
     8933054.837     -55.72965186      151.1713212 
     9078205.302     -56.74139925      148.8926284 
     9225714.272     -57.75636917      146.6453171 
     9375620.069     -58.77445746      144.4290934 
      9527961.64     -59.79556404      142.2436543 
     9682778.563      -60.8195927      140.0886885 
     9840111.058     -61.84645099      137.9638782 
        10000000     -62.87605003      135.8689005 
#LISO analog circuit simulation 1.98 (Nov  5 2008) gerhard.heinzel@aei.mpg.de
#  Input file ISSservo.fil, Output file ISSTF02.out, Gnuplot file ISSservo.gnu
#<Username cannot be obtained>@ Thu Nov 21 00:55:01 2019
#
#4 capacitors:
#  0 C104 270 pF n0 n1 
#  1 C38 15 nF n2 n5 
#  2 C105 270 pF n8 n9 
#  3 C39 15 nF n10 n13 
#4 op-amps:
#  0 N22 op27 '+'=GND '-'=n2 'out'=n6 a0=1.5M gbw=8 MHz 
#       un=3.2 nV/sqrt(Hz) uc=2.7 Hz in=400 fA/sqrt(Hz) ic=140 Hz 
#       umax=12 V imax=20 mA sr=2.8 V/us delay=0 s***DEFAULT   
#       pole at 6 MHz (real) 
#  1 N31 op27 '+'=GND '-'=n10 'out'=n14 a0=1.5M gbw=8 MHz 
#       un=3.2 nV/sqrt(Hz) uc=2.7 Hz in=400 fA/sqrt(Hz) ic=140 Hz 
#       umax=12 V imax=20 mA sr=2.8 V/us delay=0 s***DEFAULT   
#       pole at 6 MHz (real) 
#  2 N39 op27 '+'=GND '-'=n15 'out'=n16 a0=1.5M gbw=8 MHz 
#       un=3.2 nV/sqrt(Hz) uc=2.7 Hz in=400 fA/sqrt(Hz) ic=140 Hz 
#       umax=12 V imax=20 mA sr=2.8 V/us delay=0 s***DEFAULT   
#       pole at 6 MHz (real) 
#  3 N30 op27 '+'=GND '-'=n17 'out'=n18 a0=1.5M gbw=8 MHz 
#       un=3.2 nV/sqrt(Hz) uc=2.7 Hz in=400 fA/sqrt(Hz) ic=140 Hz 
#       umax=12 V imax=20 mA sr=2.8 V/us delay=0 s***DEFAULT   
#       pole at 6 MHz (real) 
#19 resistors:
#  0 R66 10 kOhm n0 n2
#  1 R113 200 Ohm n1 n2
#  2 R69 2.2 kOhm n5 n6
#  3 R68 5 kOhm n2 n3
#  4 N23A 0 Ohm n3 n4
#  5 R67 5 kOhm n4 n6
#  6 R110 100 Ohm n6 n8
#  7 R114 200 Ohm n9 n10
#  8 R70 2.4 kOhm n8 n10
#  9 R73 2.4 kOhm n13 n14
#  10 R72 50 kOhm n10 n11
#  11 N26A 0 Ohm n11 n12
#  12 R71 50 kOhm n12 n14
#  13 R112 1 kOhm n14 n15
#  14 R111 1 kOhm n15 n16
#  15 R93 200 Ohm n16 n17
#  16 R85 10 kOhm n17 n18
#  17 R88 16.2 kOhm n18 n19
#  18 R116 820 Ohm n19 GND
#19 nodes:
#  0 n0
#  1 n2
#  2 n1
#  3 n5
#  4 n6
#  5 n3
#  6 n4
#  7 n8
#  8 n9
#  9 n10
#  10 n13
#  11 n14
#  12 n11
#  13 n12
#  14 n15
#  15 n16
#  16 n17
#  17 n18
#  18 n19
#Logarithmic frequency scale from 1 Hz to 10 MHz in 1000 steps.
#Resistor scale factor is 2.2312 kOhm
#Capacitor scale factor is 2.01246 nF
#Inductance scale factor is 10.0185 mH
#Voltage scale factor is 1 V
#Current scale factor is 448.19 uA
#Frequency scale factor is 222.707 kHz
#Voltage input at node n0, impedance 0 Ohm
#OUTPUT 1 voltage outputs:
#  0 node: n19 dB Degrees
#1 GNUPLOT terminals:
# no.0 (fil.ini no.0) file=0 
# command=set term x11 persist
#set size ratio .5
#set key below
#set grid xtics ytics
#