  0.000000e+00   2.069899e-06   0.000000e+00   2.069899e-06   0.000000e+00 
  1.600000e+01   1.040688e-06   0.000000e+00   1.040688e-06   0.000000e+00 
  3.200000e+01   1.274692e-07   0.000000e+00   1.274692e-07   0.000000e+00 
  4.800000e+01   1.448258e-07   0.000000e+00   1.448258e-07   0.000000e+00 
  6.400000e+01   1.455285e-07   0.000000e+00   1.455285e-07   0.000000e+00 
  8.000000e+01   1.269646e-07   0.000000e+00   1.269646e-07   0.000000e+00 
  9.600000e+01   1.560756e-07   0.000000e+00   1.560756e-07   0.000000e+00 
  1.120000e+02   2.305823e-07   0.000000e+00   2.305823e-07   0.000000e+00 
  1.280000e+02   3.273355e-07   0.000000e+00   3.273355e-07   0.000000e+00 
  1.440000e+02   4.743560e-07   0.000000e+00   4.743560e-07   0.000000e+00 
  1.600000e+02   9.188640e-07   0.000000e+00   9.188640e-07   0.000000e+00 
  1.760000e+02   1.596724e-06   0.000000e+00   1.596724e-06   0.000000e+00 
  1.920000e+02   1.382489e-06   0.000000e+00   1.382489e-06   0.000000e+00 
  2.080000e+02   1.095028e-06   0.000000e+00   1.095028e-06   0.000000e+00 
  2.240000e+02   1.122290e-06   0.000000e+00   1.122290e-06   0.000000e+00 
  2.400000e+02   1.351372e-06   0.000000e+00   1.351372e-06   0.000000e+00 
  2.560000e+02   1.323716e-06   0.000000e+00   1.323716e-06   0.000000e+00 
  2.720000e+02   1.467567e-06   0.000000e+00   1.467567e-06   0.000000e+00 
  2.880000e+02   2.010492e-06   0.000000e+00   2.010492e-06   0.000000e+00 
  3.040000e+02   2.387151e-06   0.000000e+00   2.387151e-06   0.000000e+00 
  3.200000e+02   2.217438e-06   0.000000e+00   2.217438e-06   0.000000e+00 
  3.360000e+02   2.430612e-06   0.000000e+00   2.430612e-06   0.000000e+00 
  3.520000e+02   1.974050e-06   0.000000e+00   1.974050e-06   0.000000e+00 
  3.680000e+02   2.042615e-06   0.000000e+00   2.042615e-06   0.000000e+00 
  3.840000e+02   2.467577e-06   0.000000e+00   2.467577e-06   0.000000e+00 
  4.000000e+02   2.896645e-06   0.000000e+00   2.896645e-06   0.000000e+00 
  4.160000e+02   4.760232e-06   0.000000e+00   4.760232e-06   0.000000e+00 
  4.320000e+02   3.678841e-06   0.000000e+00   3.678841e-06   0.000000e+00 
  4.480000e+02   2.259728e-06   0.000000e+00   2.259728e-06   0.000000e+00 
  4.640000e+02   2.838949e-06   0.000000e+00   2.838949e-06   0.000000e+00 
  4.800000e+02   3.377886e-06   0.000000e+00   3.377886e-06   0.000000e+00 
  4.960000e+02   3.570680e-06   0.000000e+00   3.570680e-06   0.000000e+00 
  5.120000e+02   3.175747e-06   0.000000e+00   3.175747e-06   0.000000e+00 
  5.280000e+02   7.565014e-06   0.000000e+00   7.565014e-06   0.000000e+00 
  5.440000e+02   1.233773e-05   0.000000e+00   1.233773e-05   0.000000e+00 
  5.600000e+02   8.246782e-06   0.000000e+00   8.246782e-06   0.000000e+00 
  5.760000e+02   3.234557e-06   0.000000e+00   3.234557e-06   0.000000e+00 
  5.920000e+02   3.116745e-06   0.000000e+00   3.116745e-06   0.000000e+00 
  6.080000e+02   3.397280e-06   0.000000e+00   3.397280e-06   0.000000e+00 
  6.240000e+02   3.402522e-06   0.000000e+00   3.402522e-06   0.000000e+00 
  6.400000e+02   3.071956e-06   0.000000e+00   3.071956e-06   0.000000e+00 
  6.560000e+02   3.546262e-06   0.000000e+00   3.546262e-06   0.000000e+00 
  6.720000e+02   3.713785e-06   0.000000e+00   3.713785e-06   0.000000e+00 
  6.880000e+02   3.785269e-06   0.000000e+00   3.785269e-06   0.000000e+00 
  7.040000e+02   3.651450e-06   0.000000e+00   3.651450e-06   0.000000e+00 
  7.200000e+02   2.955977e-06   0.000000e+00   2.955977e-06   0.000000e+00 
  7.360000e+02   2.640514e-06   0.000000e+00   2.640514e-06   0.000000e+00 
  7.520000e+02   3.428514e-06   0.000000e+00   3.428514e-06   0.000000e+00 
  7.680000e+02   4.982472e-06   0.000000e+00   4.982472e-06   0.000000e+00 
  7.840000e+02   6.372075e-06   0.000000e+00   6.372075e-06   0.000000e+00 
  8.000000e+02   5.913840e-06   0.000000e+00   5.913840e-06   0.000000e+00 
  8.160000e+02   8.493559e-06   0.000000e+00   8.493559e-06   0.000000e+00 
  8.320000e+02   9.732328e-06   0.000000e+00   9.732328e-06   0.000000e+00 
  8.480000e+02   5.858969e-06   0.000000e+00   5.858969e-06   0.000000e+00 
  8.640000e+02   4.433188e-06   0.000000e+00   4.433188e-06   0.000000e+00 
  8.800000e+02   6.021872e-06   0.000000e+00   6.021872e-06   0.000000e+00 
  8.960000e+02   1.272163e-05   0.000000e+00   1.272163e-05   0.000000e+00 
  9.120000e+02   9.476412e-06   0.000000e+00   9.476412e-06   0.000000e+00 
  9.280000e+02   4.694198e-06   0.000000e+00   4.694198e-06   0.000000e+00 
  9.440000e+02   4.650164e-06   0.000000e+00   4.650164e-06   0.000000e+00 
  9.600000e+02   4.846891e-06   0.000000e+00   4.846891e-06   0.000000e+00 
  9.760000e+02   4.736280e-06   0.000000e+00   4.736280e-06   0.000000e+00 
  9.920000e+02   7.835565e-06   0.000000e+00   7.835565e-06   0.000000e+00 
  1.008000e+03   8.407949e-06   0.000000e+00   8.407949e-06   0.000000e+00 
  1.024000e+03   9.984745e-06   0.000000e+00   9.984745e-06   0.000000e+00 
  1.040000e+03   1.115079e-05   0.000000e+00   1.115079e-05   0.000000e+00 
  1.056000e+03   6.622817e-06   0.000000e+00   6.622817e-06   0.000000e+00 
  1.072000e+03   5.327911e-06   0.000000e+00   5.327911e-06   0.000000e+00 
  1.088000e+03   6.176708e-06   0.000000e+00   6.176708e-06   0.000000e+00 
  1.104000e+03   6.688420e-06   0.000000e+00   6.688420e-06   0.000000e+00 
  1.120000e+03   6.489193e-06   0.000000e+00   6.489193e-06   0.000000e+00 
  1.136000e+03   1.289061e-05   0.000000e+00   1.289061e-05   0.000000e+00 
  1.152000e+03   1.004098e-05   0.000000e+00   1.004098e-05   0.000000e+00 
  1.168000e+03   5.407740e-06   0.000000e+00   5.407740e-06   0.000000e+00 
  1.184000e+03   4.563644e-06   0.000000e+00   4.563644e-06   0.000000e+00 
  1.200000e+03   4.516606e-06   0.000000e+00   4.516606e-06   0.000000e+00 
  1.216000e+03   4.550051e-06   0.000000e+00   4.550051e-06   0.000000e+00 
  1.232000e+03   4.838340e-06   0.000000e+00   4.838340e-06   0.000000e+00 
  1.248000e+03   1.604840e-05   0.000000e+00   1.604840e-05   0.000000e+00 
  1.264000e+03   2.186090e-05   0.000000e+00   2.186090e-05   0.000000e+00 
  1.280000e+03   8.370034e-06   0.000000e+00   8.370034e-06   0.000000e+00 
  1.296000e+03   4.934620e-06   0.000000e+00   4.934620e-06   0.000000e+00 
  1.312000e+03   5.099443e-06   0.000000e+00   5.099443e-06   0.000000e+00 
  1.328000e+03   5.851508e-06   0.000000e+00   5.851508e-06   0.000000e+00 
  1.344000e+03   6.730234e-06   0.000000e+00   6.730234e-06   0.000000e+00 
  1.360000e+03   1.032781e-05   0.000000e+00   1.032781e-05   0.000000e+00 
  1.376000e+03   1.201285e-05   0.000000e+00   1.201285e-05   0.000000e+00 
  1.392000e+03   8.642324e-06   0.000000e+00   8.642324e-06   0.000000e+00 
  1.408000e+03   6.777885e-06   0.000000e+00   6.777885e-06   0.000000e+00 
  1.424000e+03   7.840472e-06   0.000000e+00   7.840472e-06   0.000000e+00 
  1.440000e+03   9.890078e-06   0.000000e+00   9.890078e-06   0.000000e+00 
  1.456000e+03   9.785846e-06   0.000000e+00   9.785846e-06   0.000000e+00 
  1.472000e+03   8.855301e-06   0.000000e+00   8.855301e-06   0.000000e+00 
  1.488000e+03   1.302029e-05   0.000000e+00   1.302029e-05   0.000000e+00 
  1.504000e+03   1.487930e-05   0.000000e+00   1.487930e-05   0.000000e+00 
  1.520000e+03   8.251959e-06   0.000000e+00   8.251959e-06   0.000000e+00 
  1.536000e+03   7.189710e-06   0.000000e+00   7.189710e-06   0.000000e+00 
  1.552000e+03   7.425052e-06   0.000000e+00   7.425052e-06   0.000000e+00 
  1.568000e+03   7.547604e-06   0.000000e+00   7.547604e-06   0.000000e+00 
  1.584000e+03   7.020984e-06   0.000000e+00   7.020984e-06   0.000000e+00 
  1.600000e+03   9.304904e-06   0.000000e+00   9.304904e-06   0.000000e+00 
  1.616000e+03   1.878300e-05   0.000000e+00   1.878300e-05   0.000000e+00 
  1.632000e+03   1.376270e-05   0.000000e+00   1.376270e-05   0.000000e+00 
  1.648000e+03   7.908970e-06   0.000000e+00   7.908970e-06   0.000000e+00 
  1.664000e+03   8.316669e-06   0.000000e+00   8.316669e-06   0.000000e+00 
  1.680000e+03   7.214732e-06   0.000000e+00   7.214732e-06   0.000000e+00 
  1.696000e+03   6.745076e-06   0.000000e+00   6.745076e-06   0.000000e+00 
  1.712000e+03   6.863602e-06   0.000000e+00   6.863602e-06   0.000000e+00 
  1.728000e+03   7.236555e-06   0.000000e+00   7.236555e-06   0.000000e+00 
  1.744000e+03   7.227634e-06   0.000000e+00   7.227634e-06   0.000000e+00 
  1.760000e+03   6.837353e-06   0.000000e+00   6.837353e-06   0.000000e+00 
  1.776000e+03   7.161174e-06   0.000000e+00   7.161174e-06   0.000000e+00 
  1.792000e+03   7.506498e-06   0.000000e+00   7.506498e-06   0.000000e+00 
  1.808000e+03   8.495230e-06   0.000000e+00   8.495230e-06   0.000000e+00 
  1.824000e+03   1.076441e-05   0.000000e+00   1.076441e-05   0.000000e+00 
  1.840000e+03   1.253717e-05   0.000000e+00   1.253717e-05   0.000000e+00 
  1.856000e+03   2.152409e-05   0.000000e+00   2.152409e-05   0.000000e+00 
  1.872000e+03   1.598143e-05   0.000000e+00   1.598143e-05   0.000000e+00 
  1.888000e+03   1.071547e-05   0.000000e+00   1.071547e-05   0.000000e+00 
  1.904000e+03   9.893217e-06   0.000000e+00   9.893217e-06   0.000000e+00 
  1.920000e+03   9.052329e-06   0.000000e+00   9.052329e-06   0.000000e+00 
  1.936000e+03   9.237846e-06   0.000000e+00   9.237846e-06   0.000000e+00 
  1.952000e+03   1.004824e-05   0.000000e+00   1.004824e-05   0.000000e+00 
  1.968000e+03   2.191314e-05   0.000000e+00   2.191314e-05   0.000000e+00 
  1.984000e+03   2.878332e-05   0.000000e+00   2.878332e-05   0.000000e+00 
  2.000000e+03   1.543040e-05   0.000000e+00   1.543040e-05   0.000000e+00 
  2.016000e+03   9.723945e-06   0.000000e+00   9.723945e-06   0.000000e+00 
  2.032000e+03   8.428343e-06   0.000000e+00   8.428343e-06   0.000000e+00 
  2.048000e+03   8.754381e-06   0.000000e+00   8.754381e-06   0.000000e+00 
  2.064000e+03   8.772609e-06   0.000000e+00   8.772609e-06   0.000000e+00 
  2.080000e+03   8.813089e-06   0.000000e+00   8.813089e-06   0.000000e+00 
  2.096000e+03   8.781160e-06   0.000000e+00   8.781160e-06   0.000000e+00 
  2.112000e+03   8.837617e-06   0.000000e+00   8.837617e-06   0.000000e+00 
  2.128000e+03   8.982475e-06   0.000000e+00   8.982475e-06   0.000000e+00 
  2.144000e+03   9.271821e-06   0.000000e+00   9.271821e-06   0.000000e+00 
  2.160000e+03   1.030769e-05   0.000000e+00   1.030769e-05   0.000000e+00 
  2.176000e+03   1.165065e-05   0.000000e+00   1.165065e-05   0.000000e+00 
  2.192000e+03   1.204156e-05   0.000000e+00   1.204156e-05   0.000000e+00 
  2.208000e+03   2.212536e-05   0.000000e+00   2.212536e-05   0.000000e+00 
  2.224000e+03   2.780255e-05   0.000000e+00   2.780255e-05   0.000000e+00 
  2.240000e+03   1.325321e-05   0.000000e+00   1.325321e-05   0.000000e+00 
  2.256000e+03   1.038448e-05   0.000000e+00   1.038448e-05   0.000000e+00 
  2.272000e+03   1.009911e-05   0.000000e+00   1.009911e-05   0.000000e+00 
  2.288000e+03   1.066590e-05   0.000000e+00   1.066590e-05   0.000000e+00 
  2.304000e+03   1.031923e-05   0.000000e+00   1.031923e-05   0.000000e+00 
  2.320000e+03   1.604435e-05   0.000000e+00   1.604435e-05   0.000000e+00 
  2.336000e+03   3.520217e-05   0.000000e+00   3.520217e-05   0.000000e+00 
  2.352000e+03   2.578413e-05   0.000000e+00   2.578413e-05   0.000000e+00 
  2.368000e+03   1.136978e-05   0.000000e+00   1.136978e-05   0.000000e+00 
  2.384000e+03   1.129302e-05   0.000000e+00   1.129302e-05   0.000000e+00 
  2.400000e+03   1.144617e-05   0.000000e+00   1.144617e-05   0.000000e+00 
  2.416000e+03   1.170082e-05   0.000000e+00   1.170082e-05   0.000000e+00 
  2.432000e+03   1.271255e-05   0.000000e+00   1.271255e-05   0.000000e+00 
  2.448000e+03   1.476028e-05   0.000000e+00   1.476028e-05   0.000000e+00 
  2.464000e+03   1.579980e-05   0.000000e+00   1.579980e-05   0.000000e+00 
  2.480000e+03   1.413231e-05   0.000000e+00   1.413231e-05   0.000000e+00 
  2.496000e+03   1.417675e-05   0.000000e+00   1.417675e-05   0.000000e+00 
  2.512000e+03   1.511000e-05   0.000000e+00   1.511000e-05   0.000000e+00 
  2.528000e+03   1.575206e-05   0.000000e+00   1.575206e-05   0.000000e+00 
  2.544000e+03   1.638860e-05   0.000000e+00   1.638860e-05   0.000000e+00 
  2.560000e+03   1.962307e-05   0.000000e+00   1.962307e-05   0.000000e+00 
  2.576000e+03   3.254175e-05   0.000000e+00   3.254175e-05   0.000000e+00 
  2.592000e+03   2.869391e-05   0.000000e+00   2.869391e-05   0.000000e+00 
  2.608000e+03   2.507584e-05   0.000000e+00   2.507584e-05   0.000000e+00 
  2.624000e+03   2.714184e-05   0.000000e+00   2.714184e-05   0.000000e+00 
  2.640000e+03   3.118404e-05   0.000000e+00   3.118404e-05   0.000000e+00 
  2.656000e+03   3.518849e-05   0.000000e+00   3.518849e-05   0.000000e+00 
  2.672000e+03   3.471610e-05   0.000000e+00   3.471610e-05   0.000000e+00 
  2.688000e+03   3.946979e-05   0.000000e+00   3.946979e-05   0.000000e+00 
  2.704000e+03   4.397742e-05   0.000000e+00   4.397742e-05   0.000000e+00 
  2.720000e+03   3.285392e-05   0.000000e+00   3.285392e-05   0.000000e+00 
  2.736000e+03   3.032825e-05   0.000000e+00   3.032825e-05   0.000000e+00 
  2.752000e+03   3.213066e-05   0.000000e+00   3.213066e-05   0.000000e+00 
  2.768000e+03   3.338251e-05   0.000000e+00   3.338251e-05   0.000000e+00 
  2.784000e+03   3.373784e-05   0.000000e+00   3.373784e-05   0.000000e+00 
  2.800000e+03   3.336573e-05   0.000000e+00   3.336573e-05   0.000000e+00 
  2.816000e+03   3.472511e-05   0.000000e+00   3.472511e-05   0.000000e+00 
  2.832000e+03   3.343999e-05   0.000000e+00   3.343999e-05   0.000000e+00 
  2.848000e+03   3.077721e-05   0.000000e+00   3.077721e-05   0.000000e+00 
  2.864000e+03   2.664065e-05   0.000000e+00   2.664065e-05   0.000000e+00 
  2.880000e+03   2.489528e-05   0.000000e+00   2.489528e-05   0.000000e+00 
  2.896000e+03   2.362637e-05   0.000000e+00   2.362637e-05   0.000000e+00 
  2.912000e+03   2.270542e-05   0.000000e+00   2.270542e-05   0.000000e+00 
  2.928000e+03   3.086366e-05   0.000000e+00   3.086366e-05   0.000000e+00 
  2.944000e+03   3.704448e-05   0.000000e+00   3.704448e-05   0.000000e+00 
  2.960000e+03   2.116356e-05   0.000000e+00   2.116356e-05   0.000000e+00 
  2.976000e+03   1.877795e-05   0.000000e+00   1.877795e-05   0.000000e+00 
  2.992000e+03   2.312312e-05   0.000000e+00   2.312312e-05   0.000000e+00 
  3.008000e+03   2.215148e-05   0.000000e+00   2.215148e-05   0.000000e+00 
  3.024000e+03   1.785764e-05   0.000000e+00   1.785764e-05   0.000000e+00 
  3.040000e+03   1.912631e-05   0.000000e+00   1.912631e-05   0.000000e+00 
  3.056000e+03   2.180219e-05   0.000000e+00   2.180219e-05   0.000000e+00 
  3.072000e+03   2.400185e-05   0.000000e+00   2.400185e-05   0.000000e+00 
  3.088000e+03   3.096221e-05   0.000000e+00   3.096221e-05   0.000000e+00 
  3.104000e+03   3.398024e-05   0.000000e+00   3.398024e-05   0.000000e+00 
  3.120000e+03   2.814392e-05   0.000000e+00   2.814392e-05   0.000000e+00 
  3.136000e+03   2.193766e-05   0.000000e+00   2.193766e-05   0.000000e+00 
  3.152000e+03   1.897303e-05   0.000000e+00   1.897303e-05   0.000000e+00 
  3.168000e+03   1.985551e-05   0.000000e+00   1.985551e-05   0.000000e+00 
  3.184000e+03   2.072274e-05   0.000000e+00   2.072274e-05   0.000000e+00 
  3.200000e+03   1.717089e-05   0.000000e+00   1.717089e-05   0.000000e+00 
  3.216000e+03   1.708276e-05   0.000000e+00   1.708276e-05   0.000000e+00 
  3.232000e+03   1.825642e-05   0.000000e+00   1.825642e-05   0.000000e+00 
  3.248000e+03   1.743047e-05   0.000000e+00   1.743047e-05   0.000000e+00 
  3.264000e+03   1.734103e-05   0.000000e+00   1.734103e-05   0.000000e+00 
  3.280000e+03   2.128729e-05   0.000000e+00   2.128729e-05   0.000000e+00 
  3.296000e+03   3.662801e-05   0.000000e+00   3.662801e-05   0.000000e+00 
  3.312000e+03   2.818067e-05   0.000000e+00   2.818067e-05   0.000000e+00 
  3.328000e+03   1.882906e-05   0.000000e+00   1.882906e-05   0.000000e+00 
  3.344000e+03   1.795910e-05   0.000000e+00   1.795910e-05   0.000000e+00 
  3.360000e+03   1.786715e-05   0.000000e+00   1.786715e-05   0.000000e+00 
  3.376000e+03   1.886638e-05   0.000000e+00   1.886638e-05   0.000000e+00 
  3.392000e+03   1.842306e-05   0.000000e+00   1.842306e-05   0.000000e+00 
  3.408000e+03   2.432791e-05   0.000000e+00   2.432791e-05   0.000000e+00 
  3.424000e+03   2.983455e-05   0.000000e+00   2.983455e-05   0.000000e+00 
  3.440000e+03   2.177305e-05   0.000000e+00   2.177305e-05   0.000000e+00 
  3.456000e+03   1.919771e-05   0.000000e+00   1.919771e-05   0.000000e+00 
  3.472000e+03   1.942243e-05   0.000000e+00   1.942243e-05   0.000000e+00 
  3.488000e+03   1.997207e-05   0.000000e+00   1.997207e-05   0.000000e+00 
  3.504000e+03   1.987350e-05   0.000000e+00   1.987350e-05   0.000000e+00 
  3.520000e+03   1.972646e-05   0.000000e+00   1.972646e-05   0.000000e+00 
  3.536000e+03   2.051219e-05   0.000000e+00   2.051219e-05   0.000000e+00 
  3.552000e+03   2.138327e-05   0.000000e+00   2.138327e-05   0.000000e+00 
  3.568000e+03   2.231684e-05   0.000000e+00   2.231684e-05   0.000000e+00 
  3.584000e+03   2.238754e-05   0.000000e+00   2.238754e-05   0.000000e+00 
  3.600000e+03   2.263466e-05   0.000000e+00   2.263466e-05   0.000000e+00 
  3.616000e+03   2.269932e-05   0.000000e+00   2.269932e-05   0.000000e+00 
  3.632000e+03   2.270902e-05   0.000000e+00   2.270902e-05   0.000000e+00 
  3.648000e+03   2.340513e-05   0.000000e+00   2.340513e-05   0.000000e+00 
  3.664000e+03   2.485833e-05   0.000000e+00   2.485833e-05   0.000000e+00 
  3.680000e+03   2.426161e-05   0.000000e+00   2.426161e-05   0.000000e+00 
  3.696000e+03   2.477868e-05   0.000000e+00   2.477868e-05   0.000000e+00 
  3.712000e+03   2.468603e-05   0.000000e+00   2.468603e-05   0.000000e+00 
  3.728000e+03   2.542410e-05   0.000000e+00   2.542410e-05   0.000000e+00 
  3.744000e+03   2.609986e-05   0.000000e+00   2.609986e-05   0.000000e+00 
  3.760000e+03   2.714261e-05   0.000000e+00   2.714261e-05   0.000000e+00 
  3.776000e+03   2.907555e-05   0.000000e+00   2.907555e-05   0.000000e+00 
  3.792000e+03   2.762903e-05   0.000000e+00   2.762903e-05   0.000000e+00 
  3.808000e+03   2.682936e-05   0.000000e+00   2.682936e-05   0.000000e+00 
  3.824000e+03   2.692432e-05   0.000000e+00   2.692432e-05   0.000000e+00 
  3.840000e+03   3.003870e-05   0.000000e+00   3.003870e-05   0.000000e+00 
  3.856000e+03   2.956456e-05   0.000000e+00   2.956456e-05   0.000000e+00 
  3.872000e+03   2.889790e-05   0.000000e+00   2.889790e-05   0.000000e+00 
  3.888000e+03   3.095744e-05   0.000000e+00   3.095744e-05   0.000000e+00 
  3.904000e+03   3.326513e-05   0.000000e+00   3.326513e-05   0.000000e+00 
  3.920000e+03   3.094952e-05   0.000000e+00   3.094952e-05   0.000000e+00 
  3.936000e+03   3.084253e-05   0.000000e+00   3.084253e-05   0.000000e+00 
  3.952000e+03   3.227163e-05   0.000000e+00   3.227163e-05   0.000000e+00 
  3.968000e+03   3.484122e-05   0.000000e+00   3.484122e-05   0.000000e+00 
  3.984000e+03   3.509918e-05   0.000000e+00   3.509918e-05   0.000000e+00 
  4.000000e+03   3.914070e-05   0.000000e+00   3.914070e-05   0.000000e+00 
  4.016000e+03   4.825725e-05   0.000000e+00   4.825725e-05   0.000000e+00 
  4.032000e+03   4.132514e-05   0.000000e+00   4.132514e-05   0.000000e+00 
  4.048000e+03   3.646794e-05   0.000000e+00   3.646794e-05   0.000000e+00 
  4.064000e+03   3.901683e-05   0.000000e+00   3.901683e-05   0.000000e+00 
  4.080000e+03   4.347970e-05   0.000000e+00   4.347970e-05   0.000000e+00 
  4.096000e+03   4.775286e-05   0.000000e+00   4.775286e-05   0.000000e+00 
  4.112000e+03   5.544971e-05   0.000000e+00   5.544971e-05   0.000000e+00 
  4.128000e+03   5.821012e-05   0.000000e+00   5.821012e-05   0.000000e+00 
  4.144000e+03   5.584558e-05   0.000000e+00   5.584558e-05   0.000000e+00 
  4.160000e+03   4.966603e-05   0.000000e+00   4.966603e-05   0.000000e+00 
  4.176000e+03   4.404541e-05   0.000000e+00   4.404541e-05   0.000000e+00 
  4.192000e+03   4.073080e-05   0.000000e+00   4.073080e-05   0.000000e+00 
  4.208000e+03   3.927112e-05   0.000000e+00   3.927112e-05   0.000000e+00 
  4.224000e+03   3.764297e-05   0.000000e+00   3.764297e-05   0.000000e+00 
  4.240000e+03   3.670448e-05   0.000000e+00   3.670448e-05   0.000000e+00 
  4.256000e+03   3.626596e-05   0.000000e+00   3.626596e-05   0.000000e+00 
  4.272000e+03   3.442305e-05   0.000000e+00   3.442305e-05   0.000000e+00 
  4.288000e+03   3.427631e-05   0.000000e+00   3.427631e-05   0.000000e+00 
  4.304000e+03   3.469432e-05   0.000000e+00   3.469432e-05   0.000000e+00 
  4.320000e+03   3.601280e-05   0.000000e+00   3.601280e-05   0.000000e+00 
  4.336000e+03   3.465783e-05   0.000000e+00   3.465783e-05   0.000000e+00 
  4.352000e+03   3.370768e-05   0.000000e+00   3.370768e-05   0.000000e+00 
  4.368000e+03   4.403438e-05   0.000000e+00   4.403438e-05   0.000000e+00 
  4.384000e+03   4.870058e-05   0.000000e+00   4.870058e-05   0.000000e+00 
  4.400000e+03   3.402746e-05   0.000000e+00   3.402746e-05   0.000000e+00 
  4.416000e+03   3.302110e-05   0.000000e+00   3.302110e-05   0.000000e+00 
  4.432000e+03   3.408654e-05   0.000000e+00   3.408654e-05   0.000000e+00 
  4.448000e+03   3.389550e-05   0.000000e+00   3.389550e-05   0.000000e+00 
  4.464000e+03   3.282808e-05   0.000000e+00   3.282808e-05   0.000000e+00 
  4.480000e+03   3.102162e-05   0.000000e+00   3.102162e-05   0.000000e+00 
  4.496000e+03   3.128598e-05   0.000000e+00   3.128598e-05   0.000000e+00 
  4.512000e+03   3.126367e-05   0.000000e+00   3.126367e-05   0.000000e+00 
  4.528000e+03   3.222727e-05   0.000000e+00   3.222727e-05   0.000000e+00 
  4.544000e+03   3.299029e-05   0.000000e+00   3.299029e-05   0.000000e+00 
  4.560000e+03   3.638918e-05   0.000000e+00   3.638918e-05   0.000000e+00 
  4.576000e+03   3.609108e-05   0.000000e+00   3.609108e-05   0.000000e+00 
  4.592000e+03   3.110063e-05   0.000000e+00   3.110063e-05   0.000000e+00 
  4.608000e+03   3.201766e-05   0.000000e+00   3.201766e-05   0.000000e+00 
  4.624000e+03   3.271385e-05   0.000000e+00   3.271385e-05   0.000000e+00 
  4.640000e+03   3.033160e-05   0.000000e+00   3.033160e-05   0.000000e+00 
  4.656000e+03   2.989628e-05   0.000000e+00   2.989628e-05   0.000000e+00 
  4.672000e+03   3.040009e-05   0.000000e+00   3.040009e-05   0.000000e+00 
  4.688000e+03   3.122302e-05   0.000000e+00   3.122302e-05   0.000000e+00 
  4.704000e+03   3.155315e-05   0.000000e+00   3.155315e-05   0.000000e+00 
  4.720000e+03   3.109893e-05   0.000000e+00   3.109893e-05   0.000000e+00 
  4.736000e+03   3.128342e-05   0.000000e+00   3.128342e-05   0.000000e+00 
  4.752000e+03   3.020771e-05   0.000000e+00   3.020771e-05   0.000000e+00 
  4.768000e+03   2.802108e-05   0.000000e+00   2.802108e-05   0.000000e+00 
  4.784000e+03   2.888073e-05   0.000000e+00   2.888073e-05   0.000000e+00 
  4.800000e+03   2.874169e-05   0.000000e+00   2.874169e-05   0.000000e+00 
  4.816000e+03   2.927491e-05   0.000000e+00   2.927491e-05   0.000000e+00 
  4.832000e+03   2.917196e-05   0.000000e+00   2.917196e-05   0.000000e+00 
  4.848000e+03   3.288624e-05   0.000000e+00   3.288624e-05   0.000000e+00 
  4.864000e+03   3.239375e-05   0.000000e+00   3.239375e-05   0.000000e+00 
  4.880000e+03   2.915480e-05   0.000000e+00   2.915480e-05   0.000000e+00 
  4.896000e+03   3.183384e-05   0.000000e+00   3.183384e-05   0.000000e+00 
  4.912000e+03   3.243159e-05   0.000000e+00   3.243159e-05   0.000000e+00 
  4.928000e+03   2.976111e-05   0.000000e+00   2.976111e-05   0.000000e+00 
  4.944000e+03   2.878684e-05   0.000000e+00   2.878684e-05   0.000000e+00 
  4.960000e+03   3.002173e-05   0.000000e+00   3.002173e-05   0.000000e+00 
  4.976000e+03   3.719539e-05   0.000000e+00   3.719539e-05   0.000000e+00 
  4.992000e+03   4.111305e-05   0.000000e+00   4.111305e-05   0.000000e+00 
  5.008000e+03   3.790728e-05   0.000000e+00   3.790728e-05   0.000000e+00 
  5.024000e+03   3.251100e-05   0.000000e+00   3.251100e-05   0.000000e+00 
  5.040000e+03   3.386828e-05   0.000000e+00   3.386828e-05   0.000000e+00 
  5.056000e+03   3.907275e-05   0.000000e+00   3.907275e-05   0.000000e+00 
  5.072000e+03   4.883843e-05   0.000000e+00   4.883843e-05   0.000000e+00 
  5.088000e+03   5.723819e-05   0.000000e+00   5.723819e-05   0.000000e+00 
  5.104000e+03   5.115326e-05   0.000000e+00   5.115326e-05   0.000000e+00 
  5.120000e+03   4.425133e-05   0.000000e+00   4.425133e-05   0.000000e+00 
  5.136000e+03   4.720149e-05   0.000000e+00   4.720149e-05   0.000000e+00 
  5.152000e+03   5.131634e-05   0.000000e+00   5.131634e-05   0.000000e+00 
  5.168000e+03   4.991139e-05   0.000000e+00   4.991139e-05   0.000000e+00 
  5.184000e+03   4.514523e-05   0.000000e+00   4.514523e-05   0.000000e+00 
  5.200000e+03   4.299534e-05   0.000000e+00   4.299534e-05   0.000000e+00 
  5.216000e+03   4.234126e-05   0.000000e+00   4.234126e-05   0.000000e+00 
  5.232000e+03   3.766843e-05   0.000000e+00   3.766843e-05   0.000000e+00 
  5.248000e+03   3.530271e-05   0.000000e+00   3.530271e-05   0.000000e+00 
  5.264000e+03   3.445803e-05   0.000000e+00   3.445803e-05   0.000000e+00 
  5.280000e+03   3.350518e-05   0.000000e+00   3.350518e-05   0.000000e+00 
  5.296000e+03   3.285944e-05   0.000000e+00   3.285944e-05   0.000000e+00 
  5.312000e+03   3.327184e-05   0.000000e+00   3.327184e-05   0.000000e+00 
  5.328000e+03   3.601254e-05   0.000000e+00   3.601254e-05   0.000000e+00 
  5.344000e+03   3.620533e-05   0.000000e+00   3.620533e-05   0.000000e+00 
  5.360000e+03   3.212169e-05   0.000000e+00   3.212169e-05   0.000000e+00 
  5.376000e+03   3.170495e-05   0.000000e+00   3.170495e-05   0.000000e+00 
  5.392000e+03   3.202419e-05   0.000000e+00   3.202419e-05   0.000000e+00 
  5.408000e+03   3.145008e-05   0.000000e+00   3.145008e-05   0.000000e+00 
  5.424000e+03   2.939494e-05   0.000000e+00   2.939494e-05   0.000000e+00 
  5.440000e+03   3.004693e-05   0.000000e+00   3.004693e-05   0.000000e+00 
  5.456000e+03   3.731925e-05   0.000000e+00   3.731925e-05   0.000000e+00 
  5.472000e+03   3.323877e-05   0.000000e+00   3.323877e-05   0.000000e+00 
  5.488000e+03   2.919403e-05   0.000000e+00   2.919403e-05   0.000000e+00 
  5.504000e+03   2.949835e-05   0.000000e+00   2.949835e-05   0.000000e+00 
  5.520000e+03   2.990916e-05   0.000000e+00   2.990916e-05   0.000000e+00 
  5.536000e+03   2.788741e-05   0.000000e+00   2.788741e-05   0.000000e+00 
  5.552000e+03   2.835373e-05   0.000000e+00   2.835373e-05   0.000000e+00 
  5.568000e+03   3.157368e-05   0.000000e+00   3.157368e-05   0.000000e+00 
  5.584000e+03   3.114291e-05   0.000000e+00   3.114291e-05   0.000000e+00 
  5.600000e+03   2.776609e-05   0.000000e+00   2.776609e-05   0.000000e+00 
  5.616000e+03   2.635094e-05   0.000000e+00   2.635094e-05   0.000000e+00 
  5.632000e+03   2.785935e-05   0.000000e+00   2.785935e-05   0.000000e+00 
  5.648000e+03   2.766882e-05   0.000000e+00   2.766882e-05   0.000000e+00 
  5.664000e+03   2.626896e-05   0.000000e+00   2.626896e-05   0.000000e+00 
  5.680000e+03   2.706728e-05   0.000000e+00   2.706728e-05   0.000000e+00 
  5.696000e+03   2.817438e-05   0.000000e+00   2.817438e-05   0.000000e+00 
  5.712000e+03   2.572932e-05   0.000000e+00   2.572932e-05   0.000000e+00 
  5.728000e+03   2.631186e-05   0.000000e+00   2.631186e-05   0.000000e+00 
  5.744000e+03   2.686665e-05   0.000000e+00   2.686665e-05   0.000000e+00 
  5.760000e+03   2.578141e-05   0.000000e+00   2.578141e-05   0.000000e+00 
  5.776000e+03   2.522653e-05   0.000000e+00   2.522653e-05   0.000000e+00 
  5.792000e+03   2.458361e-05   0.000000e+00   2.458361e-05   0.000000e+00 
  5.808000e+03   2.490230e-05   0.000000e+00   2.490230e-05   0.000000e+00 
  5.824000e+03   2.450522e-05   0.000000e+00   2.450522e-05   0.000000e+00 
  5.840000e+03   2.416881e-05   0.000000e+00   2.416881e-05   0.000000e+00 
  5.856000e+03   2.406689e-05   0.000000e+00   2.406689e-05   0.000000e+00 
  5.872000e+03   2.335771e-05   0.000000e+00   2.335771e-05   0.000000e+00 
  5.888000e+03   2.328500e-05   0.000000e+00   2.328500e-05   0.000000e+00 
  5.904000e+03   2.372907e-05   0.000000e+00   2.372907e-05   0.000000e+00 
  5.920000e+03   2.756488e-05   0.000000e+00   2.756488e-05   0.000000e+00 
  5.936000e+03   3.063140e-05   0.000000e+00   3.063140e-05   0.000000e+00 
  5.952000e+03   2.685766e-05   0.000000e+00   2.685766e-05   0.000000e+00 
  5.968000e+03   2.789739e-05   0.000000e+00   2.789739e-05   0.000000e+00 
  5.984000e+03   3.437430e-05   0.000000e+00   3.437430e-05   0.000000e+00 
  6.000000e+03   4.425979e-05   0.000000e+00   4.425979e-05   0.000000e+00 
  6.016000e+03   3.923888e-05   0.000000e+00   3.923888e-05   0.000000e+00 
  6.032000e+03   3.366958e-05   0.000000e+00   3.366958e-05   0.000000e+00 
  6.048000e+03   3.129624e-05   0.000000e+00   3.129624e-05   0.000000e+00 
  6.064000e+03   3.116566e-05   0.000000e+00   3.116566e-05   0.000000e+00 
  6.080000e+03   2.439833e-05   0.000000e+00   2.439833e-05   0.000000e+00 
  6.096000e+03   2.494647e-05   0.000000e+00   2.494647e-05   0.000000e+00 
  6.112000e+03   2.342200e-05   0.000000e+00   2.342200e-05   0.000000e+00 
  6.128000e+03   2.293952e-05   0.000000e+00   2.293952e-05   0.000000e+00 
  6.144000e+03   2.273620e-05   0.000000e+00   2.273620e-05   0.000000e+00 
  6.160000e+03   2.402972e-05   0.000000e+00   2.402972e-05   0.000000e+00 
  6.176000e+03   2.613966e-05   0.000000e+00   2.613966e-05   0.000000e+00 
  6.192000e+03   2.387247e-05   0.000000e+00   2.387247e-05   0.000000e+00 
  6.208000e+03   2.299032e-05   0.000000e+00   2.299032e-05   0.000000e+00 
  6.224000e+03   2.326423e-05   0.000000e+00   2.326423e-05   0.000000e+00 
  6.240000e+03   2.226465e-05   0.000000e+00   2.226465e-05   0.000000e+00 
  6.256000e+03   2.078595e-05   0.000000e+00   2.078595e-05   0.000000e+00 
  6.272000e+03   2.167177e-05   0.000000e+00   2.167177e-05   0.000000e+00 
  6.288000e+03   2.450156e-05   0.000000e+00   2.450156e-05   0.000000e+00 
  6.304000e+03   2.244376e-05   0.000000e+00   2.244376e-05   0.000000e+00 
  6.320000e+03   1.962901e-05   0.000000e+00   1.962901e-05   0.000000e+00 
  6.336000e+03   2.153074e-05   0.000000e+00   2.153074e-05   0.000000e+00 
  6.352000e+03   2.130945e-05   0.000000e+00   2.130945e-05   0.000000e+00 
  6.368000e+03   2.026339e-05   0.000000e+00   2.026339e-05   0.000000e+00 
  6.384000e+03   2.035673e-05   0.000000e+00   2.035673e-05   0.000000e+00 
  6.400000e+03   2.253270e-05   0.000000e+00   2.253270e-05   0.000000e+00 
  6.416000e+03   2.646241e-05   0.000000e+00   2.646241e-05   0.000000e+00 
  6.432000e+03   2.170437e-05   0.000000e+00   2.170437e-05   0.000000e+00 
  6.448000e+03   2.020874e-05   0.000000e+00   2.020874e-05   0.000000e+00 
  6.464000e+03   2.035654e-05   0.000000e+00   2.035654e-05   0.000000e+00 
  6.480000e+03   2.004535e-05   0.000000e+00   2.004535e-05   0.000000e+00 
  6.496000e+03   1.883671e-05   0.000000e+00   1.883671e-05   0.000000e+00 
  6.512000e+03   1.928448e-05   0.000000e+00   1.928448e-05   0.000000e+00 
  6.528000e+03   2.102640e-05   0.000000e+00   2.102640e-05   0.000000e+00 
  6.544000e+03   2.260396e-05   0.000000e+00   2.260396e-05   0.000000e+00 
  6.560000e+03   2.132863e-05   0.000000e+00   2.132863e-05   0.000000e+00 
  6.576000e+03   2.060277e-05   0.000000e+00   2.060277e-05   0.000000e+00 
  6.592000e+03   1.955628e-05   0.000000e+00   1.955628e-05   0.000000e+00 
  6.608000e+03   1.956380e-05   0.000000e+00   1.956380e-05   0.000000e+00 
  6.624000e+03   1.850877e-05   0.000000e+00   1.850877e-05   0.000000e+00 
  6.640000e+03   1.967334e-05   0.000000e+00   1.967334e-05   0.000000e+00 
  6.656000e+03   2.056420e-05   0.000000e+00   2.056420e-05   0.000000e+00 
  6.672000e+03   1.871668e-05   0.000000e+00   1.871668e-05   0.000000e+00 
  6.688000e+03   1.946473e-05   0.000000e+00   1.946473e-05   0.000000e+00 
  6.704000e+03   2.052662e-05   0.000000e+00   2.052662e-05   0.000000e+00 
  6.720000e+03   1.898140e-05   0.000000e+00   1.898140e-05   0.000000e+00 
  6.736000e+03   1.907663e-05   0.000000e+00   1.907663e-05   0.000000e+00 
  6.752000e+03   2.107170e-05   0.000000e+00   2.107170e-05   0.000000e+00 
  6.768000e+03   2.201660e-05   0.000000e+00   2.201660e-05   0.000000e+00 
  6.784000e+03   1.986297e-05   0.000000e+00   1.986297e-05   0.000000e+00 
  6.800000e+03   1.896146e-05   0.000000e+00   1.896146e-05   0.000000e+00 
  6.816000e+03   1.878983e-05   0.000000e+00   1.878983e-05   0.000000e+00 
  6.832000e+03   1.840782e-05   0.000000e+00   1.840782e-05   0.000000e+00 
  6.848000e+03   1.839702e-05   0.000000e+00   1.839702e-05   0.000000e+00 
  6.864000e+03   1.869822e-05   0.000000e+00   1.869822e-05   0.000000e+00 
  6.880000e+03   1.947868e-05   0.000000e+00   1.947868e-05   0.000000e+00 
  6.896000e+03   2.155201e-05   0.000000e+00   2.155201e-05   0.000000e+00 
  6.912000e+03   1.987101e-05   0.000000e+00   1.987101e-05   0.000000e+00 
  6.928000e+03   1.910929e-05   0.000000e+00   1.910929e-05   0.000000e+00 
  6.944000e+03   1.976158e-05   0.000000e+00   1.976158e-05   0.000000e+00 
  6.960000e+03   1.848729e-05   0.000000e+00   1.848729e-05   0.000000e+00 
  6.976000e+03   1.930482e-05   0.000000e+00   1.930482e-05   0.000000e+00 
  6.992000e+03   2.617880e-05   0.000000e+00   2.617880e-05   0.000000e+00 
  7.008000e+03   2.675451e-05   0.000000e+00   2.675451e-05   0.000000e+00 
  7.024000e+03   2.192037e-05   0.000000e+00   2.192037e-05   0.000000e+00 
  7.040000e+03   1.891177e-05   0.000000e+00   1.891177e-05   0.000000e+00 
  7.056000e+03   1.908853e-05   0.000000e+00   1.908853e-05   0.000000e+00 
  7.072000e+03   1.897748e-05   0.000000e+00   1.897748e-05   0.000000e+00 
  7.088000e+03   1.871440e-05   0.000000e+00   1.871440e-05   0.000000e+00 
  7.104000e+03   1.945101e-05   0.000000e+00   1.945101e-05   0.000000e+00 
  7.120000e+03   2.095624e-05   0.000000e+00   2.095624e-05   0.000000e+00 
  7.136000e+03   2.270589e-05   0.000000e+00   2.270589e-05   0.000000e+00 
  7.152000e+03   2.249183e-05   0.000000e+00   2.249183e-05   0.000000e+00 
  7.168000e+03   2.388155e-05   0.000000e+00   2.388155e-05   0.000000e+00 
  7.184000e+03   2.487664e-05   0.000000e+00   2.487664e-05   0.000000e+00 
  7.200000e+03   2.434345e-05   0.000000e+00   2.434345e-05   0.000000e+00 
  7.216000e+03   2.389587e-05   0.000000e+00   2.389587e-05   0.000000e+00 
  7.232000e+03   2.426339e-05   0.000000e+00   2.426339e-05   0.000000e+00 
  7.248000e+03   2.247931e-05   0.000000e+00   2.247931e-05   0.000000e+00 
  7.264000e+03   2.174730e-05   0.000000e+00   2.174730e-05   0.000000e+00 
  7.280000e+03   2.168123e-05   0.000000e+00   2.168123e-05   0.000000e+00 
  7.296000e+03   2.191268e-05   0.000000e+00   2.191268e-05   0.000000e+00 
  7.312000e+03   2.142299e-05   0.000000e+00   2.142299e-05   0.000000e+00 
  7.328000e+03   2.070721e-05   0.000000e+00   2.070721e-05   0.000000e+00 
  7.344000e+03   1.966215e-05   0.000000e+00   1.966215e-05   0.000000e+00 
  7.360000e+03   1.994201e-05   0.000000e+00   1.994201e-05   0.000000e+00 
  7.376000e+03   2.443893e-05   0.000000e+00   2.443893e-05   0.000000e+00 
  7.392000e+03   2.158685e-05   0.000000e+00   2.158685e-05   0.000000e+00 
  7.408000e+03   1.985353e-05   0.000000e+00   1.985353e-05   0.000000e+00 
  7.424000e+03   2.042543e-05   0.000000e+00   2.042543e-05   0.000000e+00 
  7.440000e+03   2.029434e-05   0.000000e+00   2.029434e-05   0.000000e+00 
  7.456000e+03   2.105006e-05   0.000000e+00   2.105006e-05   0.000000e+00 
  7.472000e+03   2.102729e-05   0.000000e+00   2.102729e-05   0.000000e+00 
  7.488000e+03   2.171756e-05   0.000000e+00   2.171756e-05   0.000000e+00 
  7.504000e+03   2.237739e-05   0.000000e+00   2.237739e-05   0.000000e+00 
  7.520000e+03   2.129671e-05   0.000000e+00   2.129671e-05   0.000000e+00 
  7.536000e+03   2.324667e-05   0.000000e+00   2.324667e-05   0.000000e+00 
  7.552000e+03   2.520827e-05   0.000000e+00   2.520827e-05   0.000000e+00 
  7.568000e+03   2.750976e-05   0.000000e+00   2.750976e-05   0.000000e+00 
  7.584000e+03   2.920784e-05   0.000000e+00   2.920784e-05   0.000000e+00 
  7.600000e+03   3.356274e-05   0.000000e+00   3.356274e-05   0.000000e+00 
  7.616000e+03   3.912607e-05   0.000000e+00   3.912607e-05   0.000000e+00 
  7.632000e+03   4.044872e-05   0.000000e+00   4.044872e-05   0.000000e+00 
  7.648000e+03   3.974402e-05   0.000000e+00   3.974402e-05   0.000000e+00 
  7.664000e+03   3.595568e-05   0.000000e+00   3.595568e-05   0.000000e+00 
  7.680000e+03   3.217230e-05   0.000000e+00   3.217230e-05   0.000000e+00 
  7.696000e+03   2.807637e-05   0.000000e+00   2.807637e-05   0.000000e+00 
  7.712000e+03   2.684982e-05   0.000000e+00   2.684982e-05   0.000000e+00 
  7.728000e+03   2.673923e-05   0.000000e+00   2.673923e-05   0.000000e+00 
  7.744000e+03   2.598573e-05   0.000000e+00   2.598573e-05   0.000000e+00 
  7.760000e+03   2.291524e-05   0.000000e+00   2.291524e-05   0.000000e+00 
  7.776000e+03   2.199663e-05   0.000000e+00   2.199663e-05   0.000000e+00 
  7.792000e+03   2.073673e-05   0.000000e+00   2.073673e-05   0.000000e+00 
  7.808000e+03   2.093878e-05   0.000000e+00   2.093878e-05   0.000000e+00 
  7.824000e+03   2.119006e-05   0.000000e+00   2.119006e-05   0.000000e+00 
  7.840000e+03   2.244896e-05   0.000000e+00   2.244896e-05   0.000000e+00 
  7.856000e+03   6.663794e-05   0.000000e+00   6.663794e-05   0.000000e+00 
  7.872000e+03   8.640417e-05   0.000000e+00   8.640417e-05   0.000000e+00 
  7.888000e+03   3.453701e-05   0.000000e+00   3.453701e-05   0.000000e+00 
  7.904000e+03   2.314350e-05   0.000000e+00   2.314350e-05   0.000000e+00 
  7.920000e+03   2.421140e-05   0.000000e+00   2.421140e-05   0.000000e+00 
  7.936000e+03   2.168876e-05   0.000000e+00   2.168876e-05   0.000000e+00 
  7.952000e+03   2.223504e-05   0.000000e+00   2.223504e-05   0.000000e+00 
  7.968000e+03   2.420601e-05   0.000000e+00   2.420601e-05   0.000000e+00 
  7.984000e+03   2.756148e-05   0.000000e+00   2.756148e-05   0.000000e+00 
  8.000000e+03   2.721314e-05   0.000000e+00   2.721314e-05   0.000000e+00 
  8.016000e+03   2.831038e-05   0.000000e+00   2.831038e-05   0.000000e+00 
  8.032000e+03   3.358826e-05   0.000000e+00   3.358826e-05   0.000000e+00 
  8.048000e+03   2.342782e-05   0.000000e+00   2.342782e-05   0.000000e+00 
  8.064000e+03   2.116258e-05   0.000000e+00   2.116258e-05   0.000000e+00 
  8.080000e+03   2.201559e-05   0.000000e+00   2.201559e-05   0.000000e+00 
  8.096000e+03   2.342437e-05   0.000000e+00   2.342437e-05   0.000000e+00 
  8.112000e+03   2.281400e-05   0.000000e+00   2.281400e-05   0.000000e+00 
  8.128000e+03   2.395086e-05   0.000000e+00   2.395086e-05   0.000000e+00 
  8.144000e+03   2.606681e-05   0.000000e+00   2.606681e-05   0.000000e+00 
  8.160000e+03   2.745213e-05   0.000000e+00   2.745213e-05   0.000000e+00 
  8.176000e+03   2.957371e-05   0.000000e+00   2.957371e-05   0.000000e+00 
  8.192000e+03   3.362520e-05   0.000000e+00   3.362520e-05   0.000000e+00 
  8.208000e+03   3.390071e-05   0.000000e+00   3.390071e-05   0.000000e+00 
  8.224000e+03   3.511784e-05   0.000000e+00   3.511784e-05   0.000000e+00 
  8.240000e+03   3.246037e-05   0.000000e+00   3.246037e-05   0.000000e+00 
  8.256000e+03   3.052338e-05   0.000000e+00   3.052338e-05   0.000000e+00 
  8.272000e+03   2.901470e-05   0.000000e+00   2.901470e-05   0.000000e+00 
  8.288000e+03   2.610270e-05   0.000000e+00   2.610270e-05   0.000000e+00 
  8.304000e+03   2.533476e-05   0.000000e+00   2.533476e-05   0.000000e+00 
  8.320000e+03   2.532243e-05   0.000000e+00   2.532243e-05   0.000000e+00 
  8.336000e+03   2.721606e-05   0.000000e+00   2.721606e-05   0.000000e+00 
  8.352000e+03   2.531584e-05   0.000000e+00   2.531584e-05   0.000000e+00 
  8.368000e+03   2.238636e-05   0.000000e+00   2.238636e-05   0.000000e+00 
  8.384000e+03   2.144580e-05   0.000000e+00   2.144580e-05   0.000000e+00 
  8.400000e+03   2.131722e-05   0.000000e+00   2.131722e-05   0.000000e+00 
  8.416000e+03   2.094540e-05   0.000000e+00   2.094540e-05   0.000000e+00 
  8.432000e+03   2.082285e-05   0.000000e+00   2.082285e-05   0.000000e+00 
  8.448000e+03   2.420523e-05   0.000000e+00   2.420523e-05   0.000000e+00 
  8.464000e+03   2.497168e-05   0.000000e+00   2.497168e-05   0.000000e+00 
  8.480000e+03   2.045682e-05   0.000000e+00   2.045682e-05   0.000000e+00 
  8.496000e+03   2.020761e-05   0.000000e+00   2.020761e-05   0.000000e+00 
  8.512000e+03   1.939613e-05   0.000000e+00   1.939613e-05   0.000000e+00 
  8.528000e+03   1.972711e-05   0.000000e+00   1.972711e-05   0.000000e+00 
  8.544000e+03   2.033631e-05   0.000000e+00   2.033631e-05   0.000000e+00 
  8.560000e+03   2.016082e-05   0.000000e+00   2.016082e-05   0.000000e+00 
  8.576000e+03   2.076611e-05   0.000000e+00   2.076611e-05   0.000000e+00 
  8.592000e+03   1.966847e-05   0.000000e+00   1.966847e-05   0.000000e+00 
  8.608000e+03   1.885351e-05   0.000000e+00   1.885351e-05   0.000000e+00 
  8.624000e+03   1.940755e-05   0.000000e+00   1.940755e-05   0.000000e+00 
  8.640000e+03   1.968393e-05   0.000000e+00   1.968393e-05   0.000000e+00 
  8.656000e+03   1.905131e-05   0.000000e+00   1.905131e-05   0.000000e+00 
  8.672000e+03   1.975359e-05   0.000000e+00   1.975359e-05   0.000000e+00 
  8.688000e+03   2.121308e-05   0.000000e+00   2.121308e-05   0.000000e+00 
  8.704000e+03   2.194685e-05   0.000000e+00   2.194685e-05   0.000000e+00 
  8.720000e+03   2.055260e-05   0.000000e+00   2.055260e-05   0.000000e+00 
  8.736000e+03   2.052150e-05   0.000000e+00   2.052150e-05   0.000000e+00 
  8.752000e+03   2.315815e-05   0.000000e+00   2.315815e-05   0.000000e+00 
  8.768000e+03   2.146476e-05   0.000000e+00   2.146476e-05   0.000000e+00 
  8.784000e+03   2.011460e-05   0.000000e+00   2.011460e-05   0.000000e+00 
  8.800000e+03   2.123701e-05   0.000000e+00   2.123701e-05   0.000000e+00 
  8.816000e+03   2.639669e-05   0.000000e+00   2.639669e-05   0.000000e+00 
  8.832000e+03   2.223814e-05   0.000000e+00   2.223814e-05   0.000000e+00 
  8.848000e+03   1.946153e-05   0.000000e+00   1.946153e-05   0.000000e+00 
  8.864000e+03   1.931829e-05   0.000000e+00   1.931829e-05   0.000000e+00 
  8.880000e+03   2.034343e-05   0.000000e+00   2.034343e-05   0.000000e+00 
  8.896000e+03   1.912827e-05   0.000000e+00   1.912827e-05   0.000000e+00 
  8.912000e+03   1.875048e-05   0.000000e+00   1.875048e-05   0.000000e+00 
  8.928000e+03   1.910470e-05   0.000000e+00   1.910470e-05   0.000000e+00 
  8.944000e+03   1.940229e-05   0.000000e+00   1.940229e-05   0.000000e+00 
  8.960000e+03   1.853733e-05   0.000000e+00   1.853733e-05   0.000000e+00 
  8.976000e+03   1.900357e-05   0.000000e+00   1.900357e-05   0.000000e+00 
  8.992000e+03   2.503358e-05   0.000000e+00   2.503358e-05   0.000000e+00 
  9.008000e+03   2.400324e-05   0.000000e+00   2.400324e-05   0.000000e+00 
  9.024000e+03   2.095779e-05   0.000000e+00   2.095779e-05   0.000000e+00 
  9.040000e+03   2.083372e-05   0.000000e+00   2.083372e-05   0.000000e+00 
  9.056000e+03   2.215802e-05   0.000000e+00   2.215802e-05   0.000000e+00 
  9.072000e+03   2.091774e-05   0.000000e+00   2.091774e-05   0.000000e+00 
  9.088000e+03   2.058420e-05   0.000000e+00   2.058420e-05   0.000000e+00 
  9.104000e+03   2.101242e-05   0.000000e+00   2.101242e-05   0.000000e+00 
  9.120000e+03   2.236174e-05   0.000000e+00   2.236174e-05   0.000000e+00 
  9.136000e+03   2.382773e-05   0.000000e+00   2.382773e-05   0.000000e+00 
  9.152000e+03   2.482080e-05   0.000000e+00   2.482080e-05   0.000000e+00 
  9.168000e+03   2.724896e-05   0.000000e+00   2.724896e-05   0.000000e+00 
  9.184000e+03   3.044116e-05   0.000000e+00   3.044116e-05   0.000000e+00 
  9.200000e+03   2.963373e-05   0.000000e+00   2.963373e-05   0.000000e+00 
  9.216000e+03   3.214107e-05   0.000000e+00   3.214107e-05   0.000000e+00 
  9.232000e+03   3.562352e-05   0.000000e+00   3.562352e-05   0.000000e+00 
  9.248000e+03   3.544107e-05   0.000000e+00   3.544107e-05   0.000000e+00 
  9.264000e+03   3.425175e-05   0.000000e+00   3.425175e-05   0.000000e+00 
  9.280000e+03   3.606883e-05   0.000000e+00   3.606883e-05   0.000000e+00 
  9.296000e+03   3.577538e-05   0.000000e+00   3.577538e-05   0.000000e+00 
  9.312000e+03   3.307280e-05   0.000000e+00   3.307280e-05   0.000000e+00 
  9.328000e+03   3.095968e-05   0.000000e+00   3.095968e-05   0.000000e+00 
  9.344000e+03   3.057753e-05   0.000000e+00   3.057753e-05   0.000000e+00 
  9.360000e+03   3.165543e-05   0.000000e+00   3.165543e-05   0.000000e+00 
  9.376000e+03   3.111303e-05   0.000000e+00   3.111303e-05   0.000000e+00 
  9.392000e+03   3.024724e-05   0.000000e+00   3.024724e-05   0.000000e+00 
  9.408000e+03   3.257697e-05   0.000000e+00   3.257697e-05   0.000000e+00 
  9.424000e+03   3.374568e-05   0.000000e+00   3.374568e-05   0.000000e+00 
  9.440000e+03   3.172289e-05   0.000000e+00   3.172289e-05   0.000000e+00 
  9.456000e+03   3.187744e-05   0.000000e+00   3.187744e-05   0.000000e+00 
  9.472000e+03   3.400220e-05   0.000000e+00   3.400220e-05   0.000000e+00 
  9.488000e+03   3.676432e-05   0.000000e+00   3.676432e-05   0.000000e+00 
  9.504000e+03   3.883854e-05   0.000000e+00   3.883854e-05   0.000000e+00 
  9.520000e+03   4.078859e-05   0.000000e+00   4.078859e-05   0.000000e+00 
  9.536000e+03   4.006684e-05   0.000000e+00   4.006684e-05   0.000000e+00 
  9.552000e+03   3.751604e-05   0.000000e+00   3.751604e-05   0.000000e+00 
  9.568000e+03   3.636981e-05   0.000000e+00   3.636981e-05   0.000000e+00 
  9.584000e+03   3.638241e-05   0.000000e+00   3.638241e-05   0.000000e+00 
  9.600000e+03   3.480569e-05   0.000000e+00   3.480569e-05   0.000000e+00 
  9.616000e+03   3.036366e-05   0.000000e+00   3.036366e-05   0.000000e+00 
  9.632000e+03   2.988612e-05   0.000000e+00   2.988612e-05   0.000000e+00 
  9.648000e+03   3.098474e-05   0.000000e+00   3.098474e-05   0.000000e+00 
  9.664000e+03   2.890901e-05   0.000000e+00   2.890901e-05   0.000000e+00 
  9.680000e+03   2.702336e-05   0.000000e+00   2.702336e-05   0.000000e+00 
  9.696000e+03   2.601777e-05   0.000000e+00   2.601777e-05   0.000000e+00 
  9.712000e+03   2.532625e-05   0.000000e+00   2.532625e-05   0.000000e+00 
  9.728000e+03   2.413039e-05   0.000000e+00   2.413039e-05   0.000000e+00 
  9.744000e+03   2.338781e-05   0.000000e+00   2.338781e-05   0.000000e+00 
  9.760000e+03   2.406763e-05   0.000000e+00   2.406763e-05   0.000000e+00 
  9.776000e+03   2.402066e-05   0.000000e+00   2.402066e-05   0.000000e+00 
  9.792000e+03   2.229908e-05   0.000000e+00   2.229908e-05   0.000000e+00 
  9.808000e+03   2.136758e-05   0.000000e+00   2.136758e-05   0.000000e+00 
  9.824000e+03   2.060402e-05   0.000000e+00   2.060402e-05   0.000000e+00 
  9.840000e+03   2.040538e-05   0.000000e+00   2.040538e-05   0.000000e+00 
  9.856000e+03   2.024441e-05   0.000000e+00   2.024441e-05   0.000000e+00 
  9.872000e+03   1.992013e-05   0.000000e+00   1.992013e-05   0.000000e+00 
  9.888000e+03   2.076176e-05   0.000000e+00   2.076176e-05   0.000000e+00 
  9.904000e+03   2.055649e-05   0.000000e+00   2.055649e-05   0.000000e+00 
  9.920000e+03   1.901977e-05   0.000000e+00   1.901977e-05   0.000000e+00 
  9.936000e+03   1.881601e-05   0.000000e+00   1.881601e-05   0.000000e+00 
  9.952000e+03   1.793196e-05   0.000000e+00   1.793196e-05   0.000000e+00 
  9.968000e+03   1.770916e-05   0.000000e+00   1.770916e-05   0.000000e+00 
  9.984000e+03   1.934673e-05   0.000000e+00   1.934673e-05   0.000000e+00 
  1.000000e+04   2.211740e-05   0.000000e+00   2.211740e-05   0.000000e+00 
  1.001600e+04   1.956458e-05   0.000000e+00   1.956458e-05   0.000000e+00 
  1.003200e+04   1.831137e-05   0.000000e+00   1.831137e-05   0.000000e+00 
  1.004800e+04   1.858613e-05   0.000000e+00   1.858613e-05   0.000000e+00 
  1.006400e+04   1.836900e-05   0.000000e+00   1.836900e-05   0.000000e+00 
  1.008000e+04   1.790129e-05   0.000000e+00   1.790129e-05   0.000000e+00 
  1.009600e+04   1.712469e-05   0.000000e+00   1.712469e-05   0.000000e+00 
  1.011200e+04   1.774604e-05   0.000000e+00   1.774604e-05   0.000000e+00 
  1.012800e+04   1.916238e-05   0.000000e+00   1.916238e-05   0.000000e+00 
  1.014400e+04   1.990490e-05   0.000000e+00   1.990490e-05   0.000000e+00 
  1.016000e+04   1.764794e-05   0.000000e+00   1.764794e-05   0.000000e+00 
  1.017600e+04   1.776593e-05   0.000000e+00   1.776593e-05   0.000000e+00 
  1.019200e+04   1.825173e-05   0.000000e+00   1.825173e-05   0.000000e+00 
  1.020800e+04   1.847250e-05   0.000000e+00   1.847250e-05   0.000000e+00 
  1.022400e+04   2.044521e-05   0.000000e+00   2.044521e-05   0.000000e+00 
  1.024000e+04   2.069903e-05   0.000000e+00   2.069903e-05   0.000000e+00 
  1.025600e+04   2.248927e-05   0.000000e+00   2.248927e-05   0.000000e+00 
  1.027200e+04   1.987730e-05   0.000000e+00   1.987730e-05   0.000000e+00 
  1.028800e+04   1.741450e-05   0.000000e+00   1.741450e-05   0.000000e+00 
  1.030400e+04   1.719093e-05   0.000000e+00   1.719093e-05   0.000000e+00 
  1.032000e+04   1.811274e-05   0.000000e+00   1.811274e-05   0.000000e+00 
  1.033600e+04   1.709306e-05   0.000000e+00   1.709306e-05   0.000000e+00 
  1.035200e+04   1.731073e-05   0.000000e+00   1.731073e-05   0.000000e+00 
  1.036800e+04   1.847659e-05   0.000000e+00   1.847659e-05   0.000000e+00 
  1.038400e+04   1.787690e-05   0.000000e+00   1.787690e-05   0.000000e+00 
  1.040000e+04   1.709547e-05   0.000000e+00   1.709547e-05   0.000000e+00 
  1.041600e+04   1.673549e-05   0.000000e+00   1.673549e-05   0.000000e+00 
  1.043200e+04   1.710618e-05   0.000000e+00   1.710618e-05   0.000000e+00 
  1.044800e+04   1.659542e-05   0.000000e+00   1.659542e-05   0.000000e+00 
  1.046400e+04   1.607310e-05   0.000000e+00   1.607310e-05   0.000000e+00 
  1.048000e+04   1.699052e-05   0.000000e+00   1.699052e-05   0.000000e+00 
  1.049600e+04   1.956463e-05   0.000000e+00   1.956463e-05   0.000000e+00 
  1.051200e+04   1.735580e-05   0.000000e+00   1.735580e-05   0.000000e+00 
  1.052800e+04   1.611746e-05   0.000000e+00   1.611746e-05   0.000000e+00 
  1.054400e+04   1.611021e-05   0.000000e+00   1.611021e-05   0.000000e+00 
  1.056000e+04   1.567181e-05   0.000000e+00   1.567181e-05   0.000000e+00 
  1.057600e+04   1.588411e-05   0.000000e+00   1.588411e-05   0.000000e+00 
  1.059200e+04   1.613527e-05   0.000000e+00   1.613527e-05   0.000000e+00 
  1.060800e+04   1.850697e-05   0.000000e+00   1.850697e-05   0.000000e+00 
  1.062400e+04   1.964306e-05   0.000000e+00   1.964306e-05   0.000000e+00 
  1.064000e+04   1.663485e-05   0.000000e+00   1.663485e-05   0.000000e+00 
  1.065600e+04   1.625105e-05   0.000000e+00   1.625105e-05   0.000000e+00 
  1.067200e+04   1.684924e-05   0.000000e+00   1.684924e-05   0.000000e+00 
  1.068800e+04   1.712725e-05   0.000000e+00   1.712725e-05   0.000000e+00 
  1.070400e+04   1.703130e-05   0.000000e+00   1.703130e-05   0.000000e+00 
  1.072000e+04   1.823202e-05   0.000000e+00   1.823202e-05   0.000000e+00 
  1.073600e+04   1.813823e-05   0.000000e+00   1.813823e-05   0.000000e+00 
  1.075200e+04   1.716326e-05   0.000000e+00   1.716326e-05   0.000000e+00 
  1.076800e+04   1.820989e-05   0.000000e+00   1.820989e-05   0.000000e+00 
  1.078400e+04   1.745530e-05   0.000000e+00   1.745530e-05   0.000000e+00 
  1.080000e+04   1.714825e-05   0.000000e+00   1.714825e-05   0.000000e+00 
  1.081600e+04   1.658977e-05   0.000000e+00   1.658977e-05   0.000000e+00 
  1.083200e+04   1.678012e-05   0.000000e+00   1.678012e-05   0.000000e+00 
  1.084800e+04   1.951676e-05   0.000000e+00   1.951676e-05   0.000000e+00 
  1.086400e+04   1.976056e-05   0.000000e+00   1.976056e-05   0.000000e+00 
  1.088000e+04   1.669661e-05   0.000000e+00   1.669661e-05   0.000000e+00 
  1.089600e+04   1.744546e-05   0.000000e+00   1.744546e-05   0.000000e+00 
  1.091200e+04   1.679846e-05   0.000000e+00   1.679846e-05   0.000000e+00 
  1.092800e+04   1.677400e-05   0.000000e+00   1.677400e-05   0.000000e+00 
  1.094400e+04   1.634372e-05   0.000000e+00   1.634372e-05   0.000000e+00 
  1.096000e+04   1.629948e-05   0.000000e+00   1.629948e-05   0.000000e+00 
  1.097600e+04   1.768665e-05   0.000000e+00   1.768665e-05   0.000000e+00 
  1.099200e+04   1.885386e-05   0.000000e+00   1.885386e-05   0.000000e+00 
  1.100800e+04   1.999249e-05   0.000000e+00   1.999249e-05   0.000000e+00 
  1.102400e+04   1.774953e-05   0.000000e+00   1.774953e-05   0.000000e+00 
  1.104000e+04   1.709890e-05   0.000000e+00   1.709890e-05   0.000000e+00 
  1.105600e+04   1.677310e-05   0.000000e+00   1.677310e-05   0.000000e+00 
  1.107200e+04   1.688003e-05   0.000000e+00   1.688003e-05   0.000000e+00 
  1.108800e+04   1.768397e-05   0.000000e+00   1.768397e-05   0.000000e+00 
  1.110400e+04   1.847512e-05   0.000000e+00   1.847512e-05   0.000000e+00 
  1.112000e+04   1.719673e-05   0.000000e+00   1.719673e-05   0.000000e+00 
  1.113600e+04   1.708698e-05   0.000000e+00   1.708698e-05   0.000000e+00 
  1.115200e+04   1.665507e-05   0.000000e+00   1.665507e-05   0.000000e+00 
  1.116800e+04   1.707683e-05   0.000000e+00   1.707683e-05   0.000000e+00 
  1.118400e+04   1.743464e-05   0.000000e+00   1.743464e-05   0.000000e+00 
  1.120000e+04   1.797997e-05   0.000000e+00   1.797997e-05   0.000000e+00 
  1.121600e+04   1.889131e-05   0.000000e+00   1.889131e-05   0.000000e+00 
  1.123200e+04   1.876858e-05   0.000000e+00   1.876858e-05   0.000000e+00 
  1.124800e+04   1.951281e-05   0.000000e+00   1.951281e-05   0.000000e+00 
  1.126400e+04   1.913146e-05   0.000000e+00   1.913146e-05   0.000000e+00 
  1.128000e+04   1.889831e-05   0.000000e+00   1.889831e-05   0.000000e+00 
  1.129600e+04   1.913922e-05   0.000000e+00   1.913922e-05   0.000000e+00 
  1.131200e+04   1.898734e-05   0.000000e+00   1.898734e-05   0.000000e+00 
  1.132800e+04   1.964895e-05   0.000000e+00   1.964895e-05   0.000000e+00 
  1.134400e+04   2.057005e-05   0.000000e+00   2.057005e-05   0.000000e+00 
  1.136000e+04   1.848351e-05   0.000000e+00   1.848351e-05   0.000000e+00 
  1.137600e+04   1.809592e-05   0.000000e+00   1.809592e-05   0.000000e+00 
  1.139200e+04   1.762634e-05   0.000000e+00   1.762634e-05   0.000000e+00 
  1.140800e+04   1.784413e-05   0.000000e+00   1.784413e-05   0.000000e+00 
  1.142400e+04   1.791735e-05   0.000000e+00   1.791735e-05   0.000000e+00 
  1.144000e+04   1.856875e-05   0.000000e+00   1.856875e-05   0.000000e+00 
  1.145600e+04   2.046883e-05   0.000000e+00   2.046883e-05   0.000000e+00 
  1.147200e+04   1.897975e-05   0.000000e+00   1.897975e-05   0.000000e+00 
  1.148800e+04   1.688911e-05   0.000000e+00   1.688911e-05   0.000000e+00 
  1.150400e+04   1.747671e-05   0.000000e+00   1.747671e-05   0.000000e+00 
  1.152000e+04   1.795303e-05   0.000000e+00   1.795303e-05   0.000000e+00 
  1.153600e+04   1.766095e-05   0.000000e+00   1.766095e-05   0.000000e+00 
  1.155200e+04   1.801934e-05   0.000000e+00   1.801934e-05   0.000000e+00 
  1.156800e+04   1.837139e-05   0.000000e+00   1.837139e-05   0.000000e+00 
  1.158400e+04   1.768281e-05   0.000000e+00   1.768281e-05   0.000000e+00 
  1.160000e+04   1.839919e-05   0.000000e+00   1.839919e-05   0.000000e+00 
  1.161600e+04   1.925874e-05   0.000000e+00   1.925874e-05   0.000000e+00 
  1.163200e+04   1.961827e-05   0.000000e+00   1.961827e-05   0.000000e+00 
  1.164800e+04   2.024355e-05   0.000000e+00   2.024355e-05   0.000000e+00 
  1.166400e+04   1.993913e-05   0.000000e+00   1.993913e-05   0.000000e+00 
  1.168000e+04   1.908239e-05   0.000000e+00   1.908239e-05   0.000000e+00 
  1.169600e+04   2.088171e-05   0.000000e+00   2.088171e-05   0.000000e+00 
  1.171200e+04   1.995627e-05   0.000000e+00   1.995627e-05   0.000000e+00 
  1.172800e+04   1.866271e-05   0.000000e+00   1.866271e-05   0.000000e+00 
  1.174400e+04   1.905848e-05   0.000000e+00   1.905848e-05   0.000000e+00 
  1.176000e+04   1.916427e-05   0.000000e+00   1.916427e-05   0.000000e+00 
  1.177600e+04   1.915864e-05   0.000000e+00   1.915864e-05   0.000000e+00 
  1.179200e+04   1.863866e-05   0.000000e+00   1.863866e-05   0.000000e+00 
  1.180800e+04   1.854695e-05   0.000000e+00   1.854695e-05   0.000000e+00 
  1.182400e+04   1.856578e-05   0.000000e+00   1.856578e-05   0.000000e+00 
  1.184000e+04   1.821945e-05   0.000000e+00   1.821945e-05   0.000000e+00 
  1.185600e+04   1.827180e-05   0.000000e+00   1.827180e-05   0.000000e+00 
  1.187200e+04   1.828588e-05   0.000000e+00   1.828588e-05   0.000000e+00 
  1.188800e+04   1.761749e-05   0.000000e+00   1.761749e-05   0.000000e+00 
  1.190400e+04   1.759191e-05   0.000000e+00   1.759191e-05   0.000000e+00 
  1.192000e+04   1.772021e-05   0.000000e+00   1.772021e-05   0.000000e+00 
  1.193600e+04   1.796438e-05   0.000000e+00   1.796438e-05   0.000000e+00 
  1.195200e+04   1.775420e-05   0.000000e+00   1.775420e-05   0.000000e+00 
  1.196800e+04   1.747198e-05   0.000000e+00   1.747198e-05   0.000000e+00 
  1.198400e+04   1.834277e-05   0.000000e+00   1.834277e-05   0.000000e+00 
  1.200000e+04   2.014968e-05   0.000000e+00   2.014968e-05   0.000000e+00 
  1.201600e+04   1.879632e-05   0.000000e+00   1.879632e-05   0.000000e+00 
  1.203200e+04   2.155993e-05   0.000000e+00   2.155993e-05   0.000000e+00 
  1.204800e+04   2.434783e-05   0.000000e+00   2.434783e-05   0.000000e+00 
  1.206400e+04   1.920080e-05   0.000000e+00   1.920080e-05   0.000000e+00 
  1.208000e+04   1.828273e-05   0.000000e+00   1.828273e-05   0.000000e+00 
  1.209600e+04   1.901959e-05   0.000000e+00   1.901959e-05   0.000000e+00 
  1.211200e+04   1.983175e-05   0.000000e+00   1.983175e-05   0.000000e+00 
  1.212800e+04   2.185269e-05   0.000000e+00   2.185269e-05   0.000000e+00 
  1.214400e+04   2.508716e-05   0.000000e+00   2.508716e-05   0.000000e+00 
  1.216000e+04   2.619610e-05   0.000000e+00   2.619610e-05   0.000000e+00 
  1.217600e+04   2.298944e-05   0.000000e+00   2.298944e-05   0.000000e+00 
  1.219200e+04   2.024090e-05   0.000000e+00   2.024090e-05   0.000000e+00 
  1.220800e+04   1.972258e-05   0.000000e+00   1.972258e-05   0.000000e+00 
  1.222400e+04   2.003250e-05   0.000000e+00   2.003250e-05   0.000000e+00 
  1.224000e+04   2.185572e-05   0.000000e+00   2.185572e-05   0.000000e+00 
  1.225600e+04   2.490587e-05   0.000000e+00   2.490587e-05   0.000000e+00 
  1.227200e+04   2.736599e-05   0.000000e+00   2.736599e-05   0.000000e+00 
  1.228800e+04   2.652540e-05   0.000000e+00   2.652540e-05   0.000000e+00 
  1.230400e+04   2.539567e-05   0.000000e+00   2.539567e-05   0.000000e+00 
  1.232000e+04   2.576969e-05   0.000000e+00   2.576969e-05   0.000000e+00 
  1.233600e+04   2.492992e-05   0.000000e+00   2.492992e-05   0.000000e+00 
  1.235200e+04   2.321290e-05   0.000000e+00   2.321290e-05   0.000000e+00 
  1.236800e+04   2.233616e-05   0.000000e+00   2.233616e-05   0.000000e+00 
  1.238400e+04   2.240814e-05   0.000000e+00   2.240814e-05   0.000000e+00 
  1.240000e+04   2.159949e-05   0.000000e+00   2.159949e-05   0.000000e+00 
  1.241600e+04   2.149182e-05   0.000000e+00   2.149182e-05   0.000000e+00 
  1.243200e+04   2.123705e-05   0.000000e+00   2.123705e-05   0.000000e+00 
  1.244800e+04   2.097008e-05   0.000000e+00   2.097008e-05   0.000000e+00 
  1.246400e+04   2.109918e-05   0.000000e+00   2.109918e-05   0.000000e+00 
  1.248000e+04   2.042466e-05   0.000000e+00   2.042466e-05   0.000000e+00 
  1.249600e+04   2.074037e-05   0.000000e+00   2.074037e-05   0.000000e+00 
  1.251200e+04   2.120076e-05   0.000000e+00   2.120076e-05   0.000000e+00 
  1.252800e+04   2.208673e-05   0.000000e+00   2.208673e-05   0.000000e+00 
  1.254400e+04   2.401264e-05   0.000000e+00   2.401264e-05   0.000000e+00 
  1.256000e+04   2.627232e-05   0.000000e+00   2.627232e-05   0.000000e+00 
  1.257600e+04   2.777986e-05   0.000000e+00   2.777986e-05   0.000000e+00 
  1.259200e+04   2.751648e-05   0.000000e+00   2.751648e-05   0.000000e+00 
  1.260800e+04   2.548246e-05   0.000000e+00   2.548246e-05   0.000000e+00 
  1.262400e+04   2.322964e-05   0.000000e+00   2.322964e-05   0.000000e+00 
  1.264000e+04   2.239504e-05   0.000000e+00   2.239504e-05   0.000000e+00 
  1.265600e+04   2.240710e-05   0.000000e+00   2.240710e-05   0.000000e+00 
  1.267200e+04   2.094520e-05   0.000000e+00   2.094520e-05   0.000000e+00 
  1.268800e+04   2.119025e-05   0.000000e+00   2.119025e-05   0.000000e+00 
  1.270400e+04   2.098200e-05   0.000000e+00   2.098200e-05   0.000000e+00 
  1.272000e+04   2.072041e-05   0.000000e+00   2.072041e-05   0.000000e+00 
  1.273600e+04   2.026486e-05   0.000000e+00   2.026486e-05   0.000000e+00 
  1.275200e+04   2.121053e-05   0.000000e+00   2.121053e-05   0.000000e+00 
  1.276800e+04   2.103496e-05   0.000000e+00   2.103496e-05   0.000000e+00 
  1.278400e+04   2.165100e-05   0.000000e+00   2.165100e-05   0.000000e+00 
  1.280000e+04   2.116313e-05   0.000000e+00   2.116313e-05   0.000000e+00 
