  0.000000e+00   6.162016e-03   0.000000e+00   6.162016e-03   0.000000e+00 
  8.000000e+00   4.057614e-03   0.000000e+00   4.057614e-03   0.000000e+00 
  1.600000e+01   1.862251e-03   0.000000e+00   1.862251e-03   0.000000e+00 
  2.400000e+01   1.108387e-03   0.000000e+00   1.108387e-03   0.000000e+00 
  3.200000e+01   7.089039e-04   0.000000e+00   7.089039e-04   0.000000e+00 
  4.000000e+01   4.465692e-04   0.000000e+00   4.465692e-04   0.000000e+00 
  4.800000e+01   3.120728e-04   0.000000e+00   3.120728e-04   0.000000e+00 
  5.600000e+01   2.357443e-04   0.000000e+00   2.357443e-04   0.000000e+00 
  6.400000e+01   1.677271e-04   0.000000e+00   1.677271e-04   0.000000e+00 
  7.200000e+01   1.259665e-04   0.000000e+00   1.259665e-04   0.000000e+00 
  8.000000e+01   9.933538e-05   0.000000e+00   9.933538e-05   0.000000e+00 
  8.800000e+01   9.547878e-05   0.000000e+00   9.547878e-05   0.000000e+00 
  9.600000e+01   1.687597e-04   0.000000e+00   1.687597e-04   0.000000e+00 
  1.040000e+02   1.610150e-04   0.000000e+00   1.610150e-04   0.000000e+00 
  1.120000e+02   7.772430e-05   0.000000e+00   7.772430e-05   0.000000e+00 
  1.200000e+02   7.697782e-05   0.000000e+00   7.697782e-05   0.000000e+00 
  1.280000e+02   6.911509e-05   0.000000e+00   6.911509e-05   0.000000e+00 
  1.360000e+02   6.084172e-05   0.000000e+00   6.084172e-05   0.000000e+00 
  1.440000e+02   6.082538e-05   0.000000e+00   6.082538e-05   0.000000e+00 
  1.520000e+02   6.378735e-05   0.000000e+00   6.378735e-05   0.000000e+00 
  1.600000e+02   6.041952e-05   0.000000e+00   6.041952e-05   0.000000e+00 
  1.680000e+02   5.497396e-05   0.000000e+00   5.497396e-05   0.000000e+00 
  1.760000e+02   5.720155e-05   0.000000e+00   5.720155e-05   0.000000e+00 
  1.840000e+02   6.205618e-05   0.000000e+00   6.205618e-05   0.000000e+00 
  1.920000e+02   6.874714e-05   0.000000e+00   6.874714e-05   0.000000e+00 
  2.000000e+02   8.229013e-05   0.000000e+00   8.229013e-05   0.000000e+00 
  2.080000e+02   6.338713e-05   0.000000e+00   6.338713e-05   0.000000e+00 
  2.160000e+02   5.155891e-05   0.000000e+00   5.155891e-05   0.000000e+00 
  2.240000e+02   5.120185e-05   0.000000e+00   5.120185e-05   0.000000e+00 
  2.320000e+02   5.750117e-05   0.000000e+00   5.750117e-05   0.000000e+00 
  2.400000e+02   5.743157e-05   0.000000e+00   5.743157e-05   0.000000e+00 
  2.480000e+02   5.782307e-05   0.000000e+00   5.782307e-05   0.000000e+00 
  2.560000e+02   6.168343e-05   0.000000e+00   6.168343e-05   0.000000e+00 
  2.640000e+02   6.362625e-05   0.000000e+00   6.362625e-05   0.000000e+00 
  2.720000e+02   6.516937e-05   0.000000e+00   6.516937e-05   0.000000e+00 
  2.800000e+02   6.962982e-05   0.000000e+00   6.962982e-05   0.000000e+00 
  2.880000e+02   7.423500e-05   0.000000e+00   7.423500e-05   0.000000e+00 
  2.960000e+02   6.801855e-05   0.000000e+00   6.801855e-05   0.000000e+00 
  3.040000e+02   6.541572e-05   0.000000e+00   6.541572e-05   0.000000e+00 
  3.120000e+02   6.457647e-05   0.000000e+00   6.457647e-05   0.000000e+00 
  3.200000e+02   6.223226e-05   0.000000e+00   6.223226e-05   0.000000e+00 
  3.280000e+02   6.860472e-05   0.000000e+00   6.860472e-05   0.000000e+00 
  3.360000e+02   6.199338e-05   0.000000e+00   6.199338e-05   0.000000e+00 
  3.440000e+02   7.300873e-05   0.000000e+00   7.300873e-05   0.000000e+00 
  3.520000e+02   8.108985e-05   0.000000e+00   8.108985e-05   0.000000e+00 
  3.600000e+02   7.847531e-05   0.000000e+00   7.847531e-05   0.000000e+00 
  3.680000e+02   7.994821e-05   0.000000e+00   7.994821e-05   0.000000e+00 
  3.760000e+02   7.911248e-05   0.000000e+00   7.911248e-05   0.000000e+00 
  3.840000e+02   8.007204e-05   0.000000e+00   8.007204e-05   0.000000e+00 
  3.920000e+02   7.404864e-05   0.000000e+00   7.404864e-05   0.000000e+00 
  4.000000e+02   7.545948e-05   0.000000e+00   7.545948e-05   0.000000e+00 
  4.080000e+02   7.936405e-05   0.000000e+00   7.936405e-05   0.000000e+00 
  4.160000e+02   7.121211e-05   0.000000e+00   7.121211e-05   0.000000e+00 
  4.240000e+02   6.546841e-05   0.000000e+00   6.546841e-05   0.000000e+00 
  4.320000e+02   7.601213e-05   0.000000e+00   7.601213e-05   0.000000e+00 
  4.400000e+02   8.085524e-05   0.000000e+00   8.085524e-05   0.000000e+00 
  4.480000e+02   7.618701e-05   0.000000e+00   7.618701e-05   0.000000e+00 
  4.560000e+02   8.157163e-05   0.000000e+00   8.157163e-05   0.000000e+00 
  4.640000e+02   9.408627e-05   0.000000e+00   9.408627e-05   0.000000e+00 
  4.720000e+02   1.032935e-04   0.000000e+00   1.032935e-04   0.000000e+00 
  4.800000e+02   9.725275e-05   0.000000e+00   9.725275e-05   0.000000e+00 
  4.880000e+02   9.906122e-05   0.000000e+00   9.906122e-05   0.000000e+00 
  4.960000e+02   9.804531e-05   0.000000e+00   9.804531e-05   0.000000e+00 
  5.040000e+02   1.122440e-04   0.000000e+00   1.122440e-04   0.000000e+00 
  5.120000e+02   1.098981e-04   0.000000e+00   1.098981e-04   0.000000e+00 
  5.200000e+02   8.010376e-05   0.000000e+00   8.010376e-05   0.000000e+00 
  5.280000e+02   6.451784e-05   0.000000e+00   6.451784e-05   0.000000e+00 
  5.360000e+02   6.100862e-05   0.000000e+00   6.100862e-05   0.000000e+00 
  5.440000e+02   5.929541e-05   0.000000e+00   5.929541e-05   0.000000e+00 
  5.520000e+02   7.409143e-05   0.000000e+00   7.409143e-05   0.000000e+00 
  5.600000e+02   4.672200e-05   0.000000e+00   4.672200e-05   0.000000e+00 
  5.680000e+02   3.104305e-05   0.000000e+00   3.104305e-05   0.000000e+00 
  5.760000e+02   2.658511e-05   0.000000e+00   2.658511e-05   0.000000e+00 
  5.840000e+02   2.504571e-05   0.000000e+00   2.504571e-05   0.000000e+00 
  5.920000e+02   2.224169e-05   0.000000e+00   2.224169e-05   0.000000e+00 
  6.000000e+02   2.273740e-05   0.000000e+00   2.273740e-05   0.000000e+00 
  6.080000e+02   2.760648e-05   0.000000e+00   2.760648e-05   0.000000e+00 
  6.160000e+02   2.389531e-05   0.000000e+00   2.389531e-05   0.000000e+00 
  6.240000e+02   1.864211e-05   0.000000e+00   1.864211e-05   0.000000e+00 
  6.320000e+02   1.840394e-05   0.000000e+00   1.840394e-05   0.000000e+00 
  6.400000e+02   1.794955e-05   0.000000e+00   1.794955e-05   0.000000e+00 
  6.480000e+02   1.590373e-05   0.000000e+00   1.590373e-05   0.000000e+00 
  6.560000e+02   1.757396e-05   0.000000e+00   1.757396e-05   0.000000e+00 
  6.640000e+02   2.049867e-04   0.000000e+00   2.049867e-04   0.000000e+00 
  6.720000e+02   4.067074e-04   0.000000e+00   4.067074e-04   0.000000e+00 
  6.800000e+02   2.031599e-04   0.000000e+00   2.031599e-04   0.000000e+00 
  6.880000e+02   1.709299e-05   0.000000e+00   1.709299e-05   0.000000e+00 
  6.960000e+02   1.597041e-05   0.000000e+00   1.597041e-05   0.000000e+00 
  7.040000e+02   1.798339e-05   0.000000e+00   1.798339e-05   0.000000e+00 
  7.120000e+02   1.697843e-05   0.000000e+00   1.697843e-05   0.000000e+00 
  7.200000e+02   1.823307e-05   0.000000e+00   1.823307e-05   0.000000e+00 
  7.280000e+02   1.864487e-05   0.000000e+00   1.864487e-05   0.000000e+00 
  7.360000e+02   2.014866e-05   0.000000e+00   2.014866e-05   0.000000e+00 
  7.440000e+02   2.118368e-05   0.000000e+00   2.118368e-05   0.000000e+00 
  7.520000e+02   2.242901e-05   0.000000e+00   2.242901e-05   0.000000e+00 
  7.600000e+02   2.749002e-05   0.000000e+00   2.749002e-05   0.000000e+00 
  7.680000e+02   3.077230e-05   0.000000e+00   3.077230e-05   0.000000e+00 
  7.760000e+02   3.218273e-05   0.000000e+00   3.218273e-05   0.000000e+00 
  7.840000e+02   4.742326e-05   0.000000e+00   4.742326e-05   0.000000e+00 
  7.920000e+02   7.169853e-05   0.000000e+00   7.169853e-05   0.000000e+00 
  8.000000e+02   5.917587e-05   0.000000e+00   5.917587e-05   0.000000e+00 
  8.080000e+02   6.519269e-05   0.000000e+00   6.519269e-05   0.000000e+00 
  8.160000e+02   6.728944e-05   0.000000e+00   6.728944e-05   0.000000e+00 
  8.240000e+02   8.109870e-05   0.000000e+00   8.109870e-05   0.000000e+00 
  8.320000e+02   1.099942e-04   0.000000e+00   1.099942e-04   0.000000e+00 
  8.400000e+02   1.130591e-04   0.000000e+00   1.130591e-04   0.000000e+00 
  8.480000e+02   9.674390e-05   0.000000e+00   9.674390e-05   0.000000e+00 
  8.560000e+02   9.545146e-05   0.000000e+00   9.545146e-05   0.000000e+00 
  8.640000e+02   9.635468e-05   0.000000e+00   9.635468e-05   0.000000e+00 
  8.720000e+02   9.973499e-05   0.000000e+00   9.973499e-05   0.000000e+00 
  8.800000e+02   8.830008e-05   0.000000e+00   8.830008e-05   0.000000e+00 
  8.880000e+02   7.894530e-05   0.000000e+00   7.894530e-05   0.000000e+00 
  8.960000e+02   7.417504e-05   0.000000e+00   7.417504e-05   0.000000e+00 
  9.040000e+02   7.790895e-05   0.000000e+00   7.790895e-05   0.000000e+00 
  9.120000e+02   7.223152e-05   0.000000e+00   7.223152e-05   0.000000e+00 
  9.200000e+02   6.155832e-05   0.000000e+00   6.155832e-05   0.000000e+00 
  9.280000e+02   6.817822e-05   0.000000e+00   6.817822e-05   0.000000e+00 
  9.360000e+02   7.054133e-05   0.000000e+00   7.054133e-05   0.000000e+00 
  9.440000e+02   6.931119e-05   0.000000e+00   6.931119e-05   0.000000e+00 
  9.520000e+02   7.353439e-05   0.000000e+00   7.353439e-05   0.000000e+00 
  9.600000e+02   7.731996e-05   0.000000e+00   7.731996e-05   0.000000e+00 
  9.680000e+02   7.351554e-05   0.000000e+00   7.351554e-05   0.000000e+00 
  9.760000e+02   7.481300e-05   0.000000e+00   7.481300e-05   0.000000e+00 
  9.840000e+02   7.576216e-05   0.000000e+00   7.576216e-05   0.000000e+00 
  9.920000e+02   7.777391e-05   0.000000e+00   7.777391e-05   0.000000e+00 
  1.000000e+03   7.092285e-05   0.000000e+00   7.092285e-05   0.000000e+00 
  1.008000e+03   5.911741e-05   0.000000e+00   5.911741e-05   0.000000e+00 
  1.016000e+03   6.474486e-05   0.000000e+00   6.474486e-05   0.000000e+00 
  1.024000e+03   5.915776e-05   0.000000e+00   5.915776e-05   0.000000e+00 
  1.032000e+03   6.016089e-05   0.000000e+00   6.016089e-05   0.000000e+00 
  1.040000e+03   5.429617e-05   0.000000e+00   5.429617e-05   0.000000e+00 
  1.048000e+03   5.931759e-05   0.000000e+00   5.931759e-05   0.000000e+00 
  1.056000e+03   6.398021e-05   0.000000e+00   6.398021e-05   0.000000e+00 
  1.064000e+03   6.469579e-05   0.000000e+00   6.469579e-05   0.000000e+00 
  1.072000e+03   6.115698e-05   0.000000e+00   6.115698e-05   0.000000e+00 
  1.080000e+03   5.884198e-05   0.000000e+00   5.884198e-05   0.000000e+00 
  1.088000e+03   5.822433e-05   0.000000e+00   5.822433e-05   0.000000e+00 
  1.096000e+03   5.280949e-05   0.000000e+00   5.280949e-05   0.000000e+00 
  1.104000e+03   4.776317e-05   0.000000e+00   4.776317e-05   0.000000e+00 
  1.112000e+03   4.550208e-05   0.000000e+00   4.550208e-05   0.000000e+00 
  1.120000e+03   4.208720e-05   0.000000e+00   4.208720e-05   0.000000e+00 
  1.128000e+03   4.402358e-05   0.000000e+00   4.402358e-05   0.000000e+00 
  1.136000e+03   4.885864e-05   0.000000e+00   4.885864e-05   0.000000e+00 
  1.144000e+03   5.172076e-05   0.000000e+00   5.172076e-05   0.000000e+00 
  1.152000e+03   5.106444e-05   0.000000e+00   5.106444e-05   0.000000e+00 
  1.160000e+03   4.513010e-05   0.000000e+00   4.513010e-05   0.000000e+00 
  1.168000e+03   4.267033e-05   0.000000e+00   4.267033e-05   0.000000e+00 
  1.176000e+03   3.848985e-05   0.000000e+00   3.848985e-05   0.000000e+00 
  1.184000e+03   3.884072e-05   0.000000e+00   3.884072e-05   0.000000e+00 
  1.192000e+03   4.436621e-05   0.000000e+00   4.436621e-05   0.000000e+00 
  1.200000e+03   4.415185e-05   0.000000e+00   4.415185e-05   0.000000e+00 
  1.208000e+03   4.252790e-05   0.000000e+00   4.252790e-05   0.000000e+00 
  1.216000e+03   5.023034e-05   0.000000e+00   5.023034e-05   0.000000e+00 
  1.224000e+03   5.182989e-05   0.000000e+00   5.182989e-05   0.000000e+00 
  1.232000e+03   4.010551e-05   0.000000e+00   4.010551e-05   0.000000e+00 
  1.240000e+03   3.642183e-05   0.000000e+00   3.642183e-05   0.000000e+00 
  1.248000e+03   3.029872e-05   0.000000e+00   3.029872e-05   0.000000e+00 
  1.256000e+03   2.927954e-05   0.000000e+00   2.927954e-05   0.000000e+00 
  1.264000e+03   3.168411e-05   0.000000e+00   3.168411e-05   0.000000e+00 
  1.272000e+03   3.571054e-05   0.000000e+00   3.571054e-05   0.000000e+00 
  1.280000e+03   5.261941e-05   0.000000e+00   5.261941e-05   0.000000e+00 
  1.288000e+03   4.856183e-05   0.000000e+00   4.856183e-05   0.000000e+00 
  1.296000e+03   3.542859e-05   0.000000e+00   3.542859e-05   0.000000e+00 
  1.304000e+03   3.256390e-05   0.000000e+00   3.256390e-05   0.000000e+00 
  1.312000e+03   3.025643e-05   0.000000e+00   3.025643e-05   0.000000e+00 
  1.320000e+03   2.952430e-05   0.000000e+00   2.952430e-05   0.000000e+00 
  1.328000e+03   2.780152e-05   0.000000e+00   2.780152e-05   0.000000e+00 
  1.336000e+03   4.511219e-04   0.000000e+00   4.511219e-04   0.000000e+00 
  1.344000e+03   8.985171e-04   0.000000e+00   8.985171e-04   0.000000e+00 
  1.352000e+03   4.488166e-04   0.000000e+00   4.488166e-04   0.000000e+00 
  1.360000e+03   2.726443e-05   0.000000e+00   2.726443e-05   0.000000e+00 
  1.368000e+03   2.626038e-05   0.000000e+00   2.626038e-05   0.000000e+00 
  1.376000e+03   2.450754e-05   0.000000e+00   2.450754e-05   0.000000e+00 
  1.384000e+03   2.298691e-05   0.000000e+00   2.298691e-05   0.000000e+00 
  1.392000e+03   2.095383e-05   0.000000e+00   2.095383e-05   0.000000e+00 
  1.400000e+03   1.926357e-05   0.000000e+00   1.926357e-05   0.000000e+00 
  1.408000e+03   1.742188e-05   0.000000e+00   1.742188e-05   0.000000e+00 
  1.416000e+03   1.983975e-05   0.000000e+00   1.983975e-05   0.000000e+00 
  1.424000e+03   2.357387e-05   0.000000e+00   2.357387e-05   0.000000e+00 
  1.432000e+03   2.568393e-05   0.000000e+00   2.568393e-05   0.000000e+00 
  1.440000e+03   2.521487e-05   0.000000e+00   2.521487e-05   0.000000e+00 
  1.448000e+03   2.860793e-05   0.000000e+00   2.860793e-05   0.000000e+00 
  1.456000e+03   3.872348e-05   0.000000e+00   3.872348e-05   0.000000e+00 
  1.464000e+03   4.533246e-05   0.000000e+00   4.533246e-05   0.000000e+00 
  1.472000e+03   4.309725e-05   0.000000e+00   4.309725e-05   0.000000e+00 
  1.480000e+03   3.826586e-05   0.000000e+00   3.826586e-05   0.000000e+00 
  1.488000e+03   3.517817e-05   0.000000e+00   3.517817e-05   0.000000e+00 
  1.496000e+03   3.227666e-05   0.000000e+00   3.227666e-05   0.000000e+00 
  1.504000e+03   3.071217e-05   0.000000e+00   3.071217e-05   0.000000e+00 
  1.512000e+03   3.422494e-05   0.000000e+00   3.422494e-05   0.000000e+00 
  1.520000e+03   2.765322e-05   0.000000e+00   2.765322e-05   0.000000e+00 
  1.528000e+03   2.767797e-05   0.000000e+00   2.767797e-05   0.000000e+00 
  1.536000e+03   2.613866e-05   0.000000e+00   2.613866e-05   0.000000e+00 
  1.544000e+03   2.331065e-05   0.000000e+00   2.331065e-05   0.000000e+00 
  1.552000e+03   2.190119e-05   0.000000e+00   2.190119e-05   0.000000e+00 
  1.560000e+03   2.149407e-05   0.000000e+00   2.149407e-05   0.000000e+00 
  1.568000e+03   2.370066e-05   0.000000e+00   2.370066e-05   0.000000e+00 
  1.576000e+03   2.516875e-05   0.000000e+00   2.516875e-05   0.000000e+00 
  1.584000e+03   2.240546e-05   0.000000e+00   2.240546e-05   0.000000e+00 
  1.592000e+03   2.217222e-05   0.000000e+00   2.217222e-05   0.000000e+00 
  1.600000e+03   2.165898e-05   0.000000e+00   2.165898e-05   0.000000e+00 
  1.608000e+03   2.064001e-05   0.000000e+00   2.064001e-05   0.000000e+00 
  1.616000e+03   1.895301e-05   0.000000e+00   1.895301e-05   0.000000e+00 
  1.624000e+03   2.140600e-05   0.000000e+00   2.140600e-05   0.000000e+00 
  1.632000e+03   2.951505e-05   0.000000e+00   2.951505e-05   0.000000e+00 
  1.640000e+03   2.234993e-05   0.000000e+00   2.234993e-05   0.000000e+00 
  1.648000e+03   1.919154e-05   0.000000e+00   1.919154e-05   0.000000e+00 
  1.656000e+03   1.987433e-05   0.000000e+00   1.987433e-05   0.000000e+00 
  1.664000e+03   2.064005e-05   0.000000e+00   2.064005e-05   0.000000e+00 
  1.672000e+03   1.870477e-05   0.000000e+00   1.870477e-05   0.000000e+00 
  1.680000e+03   1.739754e-05   0.000000e+00   1.739754e-05   0.000000e+00 
  1.688000e+03   1.948799e-05   0.000000e+00   1.948799e-05   0.000000e+00 
  1.696000e+03   1.952209e-05   0.000000e+00   1.952209e-05   0.000000e+00 
  1.704000e+03   1.845858e-05   0.000000e+00   1.845858e-05   0.000000e+00 
  1.712000e+03   1.900800e-05   0.000000e+00   1.900800e-05   0.000000e+00 
  1.720000e+03   2.116392e-05   0.000000e+00   2.116392e-05   0.000000e+00 
  1.728000e+03   1.932203e-05   0.000000e+00   1.932203e-05   0.000000e+00 
  1.736000e+03   1.851577e-05   0.000000e+00   1.851577e-05   0.000000e+00 
  1.744000e+03   2.015883e-05   0.000000e+00   2.015883e-05   0.000000e+00 
  1.752000e+03   1.918009e-05   0.000000e+00   1.918009e-05   0.000000e+00 
  1.760000e+03   1.688194e-05   0.000000e+00   1.688194e-05   0.000000e+00 
  1.768000e+03   1.664853e-05   0.000000e+00   1.664853e-05   0.000000e+00 
  1.776000e+03   1.617680e-05   0.000000e+00   1.617680e-05   0.000000e+00 
  1.784000e+03   1.481321e-05   0.000000e+00   1.481321e-05   0.000000e+00 
  1.792000e+03   1.476914e-05   0.000000e+00   1.476914e-05   0.000000e+00 
  1.800000e+03   1.580498e-05   0.000000e+00   1.580498e-05   0.000000e+00 
  1.808000e+03   1.502902e-05   0.000000e+00   1.502902e-05   0.000000e+00 
  1.816000e+03   1.369939e-05   0.000000e+00   1.369939e-05   0.000000e+00 
  1.824000e+03   1.508739e-05   0.000000e+00   1.508739e-05   0.000000e+00 
  1.832000e+03   1.612584e-05   0.000000e+00   1.612584e-05   0.000000e+00 
  1.840000e+03   1.435620e-05   0.000000e+00   1.435620e-05   0.000000e+00 
  1.848000e+03   1.361206e-05   0.000000e+00   1.361206e-05   0.000000e+00 
  1.856000e+03   1.384276e-05   0.000000e+00   1.384276e-05   0.000000e+00 
  1.864000e+03   1.367848e-05   0.000000e+00   1.367848e-05   0.000000e+00 
  1.872000e+03   1.288948e-05   0.000000e+00   1.288948e-05   0.000000e+00 
  1.880000e+03   1.372053e-05   0.000000e+00   1.372053e-05   0.000000e+00 
  1.888000e+03   1.571632e-05   0.000000e+00   1.571632e-05   0.000000e+00 
  1.896000e+03   1.456541e-05   0.000000e+00   1.456541e-05   0.000000e+00 
  1.904000e+03   1.268240e-05   0.000000e+00   1.268240e-05   0.000000e+00 
  1.912000e+03   1.274687e-05   0.000000e+00   1.274687e-05   0.000000e+00 
  1.920000e+03   1.181349e-05   0.000000e+00   1.181349e-05   0.000000e+00 
  1.928000e+03   1.203053e-05   0.000000e+00   1.203053e-05   0.000000e+00 
  1.936000e+03   1.222786e-05   0.000000e+00   1.222786e-05   0.000000e+00 
  1.944000e+03   1.179429e-05   0.000000e+00   1.179429e-05   0.000000e+00 
  1.952000e+03   1.210755e-05   0.000000e+00   1.210755e-05   0.000000e+00 
  1.960000e+03   1.146431e-05   0.000000e+00   1.146431e-05   0.000000e+00 
  1.968000e+03   1.283127e-05   0.000000e+00   1.283127e-05   0.000000e+00 
  1.976000e+03   1.150289e-05   0.000000e+00   1.150289e-05   0.000000e+00 
  1.984000e+03   1.182694e-05   0.000000e+00   1.182694e-05   0.000000e+00 
  1.992000e+03   1.201867e-05   0.000000e+00   1.201867e-05   0.000000e+00 
  2.000000e+03   1.221714e-05   0.000000e+00   1.221714e-05   0.000000e+00 
  2.008000e+03   1.604935e-05   0.000000e+00   1.604935e-05   0.000000e+00 
  2.016000e+03   2.304649e-05   0.000000e+00   2.304649e-05   0.000000e+00 
  2.024000e+03   1.549842e-05   0.000000e+00   1.549842e-05   0.000000e+00 
  2.032000e+03   1.331075e-05   0.000000e+00   1.331075e-05   0.000000e+00 
  2.040000e+03   1.178834e-05   0.000000e+00   1.178834e-05   0.000000e+00 
  2.048000e+03   1.158780e-05   0.000000e+00   1.158780e-05   0.000000e+00 
  2.056000e+03   1.236823e-05   0.000000e+00   1.236823e-05   0.000000e+00 
  2.064000e+03   1.234207e-05   0.000000e+00   1.234207e-05   0.000000e+00 
  2.072000e+03   1.300097e-05   0.000000e+00   1.300097e-05   0.000000e+00 
  2.080000e+03   1.308599e-05   0.000000e+00   1.308599e-05   0.000000e+00 
  2.088000e+03   1.375895e-05   0.000000e+00   1.375895e-05   0.000000e+00 
  2.096000e+03   1.522649e-05   0.000000e+00   1.522649e-05   0.000000e+00 
  2.104000e+03   1.905410e-05   0.000000e+00   1.905410e-05   0.000000e+00 
  2.112000e+03   2.180519e-05   0.000000e+00   2.180519e-05   0.000000e+00 
  2.120000e+03   1.836834e-05   0.000000e+00   1.836834e-05   0.000000e+00 
  2.128000e+03   1.676020e-05   0.000000e+00   1.676020e-05   0.000000e+00 
  2.136000e+03   1.607246e-05   0.000000e+00   1.607246e-05   0.000000e+00 
  2.144000e+03   1.651682e-05   0.000000e+00   1.651682e-05   0.000000e+00 
  2.152000e+03   1.514291e-05   0.000000e+00   1.514291e-05   0.000000e+00 
  2.160000e+03   1.492612e-05   0.000000e+00   1.492612e-05   0.000000e+00 
  2.168000e+03   1.468878e-05   0.000000e+00   1.468878e-05   0.000000e+00 
  2.176000e+03   1.374561e-05   0.000000e+00   1.374561e-05   0.000000e+00 
  2.184000e+03   1.332460e-05   0.000000e+00   1.332460e-05   0.000000e+00 
  2.192000e+03   1.366816e-05   0.000000e+00   1.366816e-05   0.000000e+00 
  2.200000e+03   1.196692e-05   0.000000e+00   1.196692e-05   0.000000e+00 
  2.208000e+03   1.144792e-05   0.000000e+00   1.144792e-05   0.000000e+00 
  2.216000e+03   1.183075e-05   0.000000e+00   1.183075e-05   0.000000e+00 
  2.224000e+03   1.108435e-05   0.000000e+00   1.108435e-05   0.000000e+00 
  2.232000e+03   1.122600e-05   0.000000e+00   1.122600e-05   0.000000e+00 
  2.240000e+03   1.188423e-05   0.000000e+00   1.188423e-05   0.000000e+00 
  2.248000e+03   1.092848e-05   0.000000e+00   1.092848e-05   0.000000e+00 
  2.256000e+03   9.527084e-06   0.000000e+00   9.527084e-06   0.000000e+00 
  2.264000e+03   1.010331e-05   0.000000e+00   1.010331e-05   0.000000e+00 
  2.272000e+03   1.029334e-05   0.000000e+00   1.029334e-05   0.000000e+00 
  2.280000e+03   1.100537e-05   0.000000e+00   1.100537e-05   0.000000e+00 
  2.288000e+03   1.228138e-05   0.000000e+00   1.228138e-05   0.000000e+00 
  2.296000e+03   1.012343e-05   0.000000e+00   1.012343e-05   0.000000e+00 
  2.304000e+03   9.265857e-06   0.000000e+00   9.265857e-06   0.000000e+00 
  2.312000e+03   9.475380e-06   0.000000e+00   9.475380e-06   0.000000e+00 
  2.320000e+03   9.468612e-06   0.000000e+00   9.468612e-06   0.000000e+00 
  2.328000e+03   9.837822e-06   0.000000e+00   9.837822e-06   0.000000e+00 
  2.336000e+03   1.224520e-05   0.000000e+00   1.224520e-05   0.000000e+00 
  2.344000e+03   1.003627e-05   0.000000e+00   1.003627e-05   0.000000e+00 
  2.352000e+03   9.044766e-06   0.000000e+00   9.044766e-06   0.000000e+00 
  2.360000e+03   9.382912e-06   0.000000e+00   9.382912e-06   0.000000e+00 
  2.368000e+03   1.049424e-05   0.000000e+00   1.049424e-05   0.000000e+00 
  2.376000e+03   9.676852e-06   0.000000e+00   9.676852e-06   0.000000e+00 
  2.384000e+03   1.058775e-05   0.000000e+00   1.058775e-05   0.000000e+00 
  2.392000e+03   9.891954e-06   0.000000e+00   9.891954e-06   0.000000e+00 
  2.400000e+03   9.454780e-06   0.000000e+00   9.454780e-06   0.000000e+00 
  2.408000e+03   9.349403e-06   0.000000e+00   9.349403e-06   0.000000e+00 
  2.416000e+03   9.921369e-06   0.000000e+00   9.921369e-06   0.000000e+00 
  2.424000e+03   1.065262e-05   0.000000e+00   1.065262e-05   0.000000e+00 
  2.432000e+03   9.671355e-06   0.000000e+00   9.671355e-06   0.000000e+00 
  2.440000e+03   9.199593e-06   0.000000e+00   9.199593e-06   0.000000e+00 
  2.448000e+03   8.471588e-06   0.000000e+00   8.471588e-06   0.000000e+00 
  2.456000e+03   7.765429e-06   0.000000e+00   7.765429e-06   0.000000e+00 
  2.464000e+03   8.046810e-06   0.000000e+00   8.046810e-06   0.000000e+00 
  2.472000e+03   9.341318e-06   0.000000e+00   9.341318e-06   0.000000e+00 
  2.480000e+03   9.135189e-06   0.000000e+00   9.135189e-06   0.000000e+00 
  2.488000e+03   8.585206e-06   0.000000e+00   8.585206e-06   0.000000e+00 
  2.496000e+03   9.332386e-06   0.000000e+00   9.332386e-06   0.000000e+00 
  2.504000e+03   1.019497e-05   0.000000e+00   1.019497e-05   0.000000e+00 
  2.512000e+03   1.003976e-05   0.000000e+00   1.003976e-05   0.000000e+00 
  2.520000e+03   1.048321e-05   0.000000e+00   1.048321e-05   0.000000e+00 
  2.528000e+03   9.872990e-06   0.000000e+00   9.872990e-06   0.000000e+00 
  2.536000e+03   8.954331e-06   0.000000e+00   8.954331e-06   0.000000e+00 
  2.544000e+03   8.626159e-06   0.000000e+00   8.626159e-06   0.000000e+00 
  2.552000e+03   8.998372e-06   0.000000e+00   8.998372e-06   0.000000e+00 
  2.560000e+03   9.577438e-06   0.000000e+00   9.577438e-06   0.000000e+00 
  2.568000e+03   9.195353e-06   0.000000e+00   9.195353e-06   0.000000e+00 
  2.576000e+03   9.207098e-06   0.000000e+00   9.207098e-06   0.000000e+00 
  2.584000e+03   9.525601e-06   0.000000e+00   9.525601e-06   0.000000e+00 
  2.592000e+03   9.534161e-06   0.000000e+00   9.534161e-06   0.000000e+00 
  2.600000e+03   9.545416e-06   0.000000e+00   9.545416e-06   0.000000e+00 
  2.608000e+03   9.615808e-06   0.000000e+00   9.615808e-06   0.000000e+00 
  2.616000e+03   9.819361e-06   0.000000e+00   9.819361e-06   0.000000e+00 
  2.624000e+03   9.611013e-06   0.000000e+00   9.611013e-06   0.000000e+00 
  2.632000e+03   8.982296e-06   0.000000e+00   8.982296e-06   0.000000e+00 
  2.640000e+03   8.988020e-06   0.000000e+00   8.988020e-06   0.000000e+00 
  2.648000e+03   9.484259e-06   0.000000e+00   9.484259e-06   0.000000e+00 
  2.656000e+03   8.423015e-06   0.000000e+00   8.423015e-06   0.000000e+00 
  2.664000e+03   7.324745e-06   0.000000e+00   7.324745e-06   0.000000e+00 
  2.672000e+03   7.542523e-06   0.000000e+00   7.542523e-06   0.000000e+00 
  2.680000e+03   7.787886e-06   0.000000e+00   7.787886e-06   0.000000e+00 
  2.688000e+03   7.772117e-06   0.000000e+00   7.772117e-06   0.000000e+00 
  2.696000e+03   8.472588e-06   0.000000e+00   8.472588e-06   0.000000e+00 
  2.704000e+03   7.915020e-06   0.000000e+00   7.915020e-06   0.000000e+00 
  2.712000e+03   7.620230e-06   0.000000e+00   7.620230e-06   0.000000e+00 
  2.720000e+03   7.602504e-06   0.000000e+00   7.602504e-06   0.000000e+00 
  2.728000e+03   7.736791e-06   0.000000e+00   7.736791e-06   0.000000e+00 
  2.736000e+03   7.591163e-06   0.000000e+00   7.591163e-06   0.000000e+00 
  2.744000e+03   7.496230e-06   0.000000e+00   7.496230e-06   0.000000e+00 
  2.752000e+03   7.338504e-06   0.000000e+00   7.338504e-06   0.000000e+00 
  2.760000e+03   7.928440e-06   0.000000e+00   7.928440e-06   0.000000e+00 
  2.768000e+03   8.161394e-06   0.000000e+00   8.161394e-06   0.000000e+00 
  2.776000e+03   7.652933e-06   0.000000e+00   7.652933e-06   0.000000e+00 
  2.784000e+03   7.058731e-06   0.000000e+00   7.058731e-06   0.000000e+00 
  2.792000e+03   8.039411e-06   0.000000e+00   8.039411e-06   0.000000e+00 
  2.800000e+03   7.793528e-06   0.000000e+00   7.793528e-06   0.000000e+00 
  2.808000e+03   7.660735e-06   0.000000e+00   7.660735e-06   0.000000e+00 
  2.816000e+03   7.818376e-06   0.000000e+00   7.818376e-06   0.000000e+00 
  2.824000e+03   8.175513e-06   0.000000e+00   8.175513e-06   0.000000e+00 
  2.832000e+03   9.637122e-06   0.000000e+00   9.637122e-06   0.000000e+00 
  2.840000e+03   9.636485e-06   0.000000e+00   9.636485e-06   0.000000e+00 
  2.848000e+03   9.712544e-06   0.000000e+00   9.712544e-06   0.000000e+00 
  2.856000e+03   9.163206e-06   0.000000e+00   9.163206e-06   0.000000e+00 
  2.864000e+03   8.725527e-06   0.000000e+00   8.725527e-06   0.000000e+00 
  2.872000e+03   8.337734e-06   0.000000e+00   8.337734e-06   0.000000e+00 
  2.880000e+03   9.156840e-06   0.000000e+00   9.156840e-06   0.000000e+00 
  2.888000e+03   8.203785e-06   0.000000e+00   8.203785e-06   0.000000e+00 
  2.896000e+03   7.671321e-06   0.000000e+00   7.671321e-06   0.000000e+00 
  2.904000e+03   7.461840e-06   0.000000e+00   7.461840e-06   0.000000e+00 
  2.912000e+03   7.741833e-06   0.000000e+00   7.741833e-06   0.000000e+00 
  2.920000e+03   7.977421e-06   0.000000e+00   7.977421e-06   0.000000e+00 
  2.928000e+03   7.863277e-06   0.000000e+00   7.863277e-06   0.000000e+00 
  2.936000e+03   7.609330e-06   0.000000e+00   7.609330e-06   0.000000e+00 
  2.944000e+03   7.459737e-06   0.000000e+00   7.459737e-06   0.000000e+00 
  2.952000e+03   7.265548e-06   0.000000e+00   7.265548e-06   0.000000e+00 
  2.960000e+03   6.848159e-06   0.000000e+00   6.848159e-06   0.000000e+00 
  2.968000e+03   7.413953e-06   0.000000e+00   7.413953e-06   0.000000e+00 
  2.976000e+03   7.502591e-06   0.000000e+00   7.502591e-06   0.000000e+00 
  2.984000e+03   6.965459e-06   0.000000e+00   6.965459e-06   0.000000e+00 
  2.992000e+03   7.711450e-06   0.000000e+00   7.711450e-06   0.000000e+00 
  3.000000e+03   8.295153e-06   0.000000e+00   8.295153e-06   0.000000e+00 
  3.008000e+03   8.001804e-06   0.000000e+00   8.001804e-06   0.000000e+00 
  3.016000e+03   7.616698e-06   0.000000e+00   7.616698e-06   0.000000e+00 
  3.024000e+03   7.141739e-06   0.000000e+00   7.141739e-06   0.000000e+00 
  3.032000e+03   6.703980e-06   0.000000e+00   6.703980e-06   0.000000e+00 
  3.040000e+03   6.849082e-06   0.000000e+00   6.849082e-06   0.000000e+00 
  3.048000e+03   7.013178e-06   0.000000e+00   7.013178e-06   0.000000e+00 
  3.056000e+03   7.398950e-06   0.000000e+00   7.398950e-06   0.000000e+00 
  3.064000e+03   7.753478e-06   0.000000e+00   7.753478e-06   0.000000e+00 
  3.072000e+03   7.153041e-06   0.000000e+00   7.153041e-06   0.000000e+00 
  3.080000e+03   6.831948e-06   0.000000e+00   6.831948e-06   0.000000e+00 
  3.088000e+03   6.738657e-06   0.000000e+00   6.738657e-06   0.000000e+00 
  3.096000e+03   6.222992e-06   0.000000e+00   6.222992e-06   0.000000e+00 
  3.104000e+03   7.499826e-06   0.000000e+00   7.499826e-06   0.000000e+00 
  3.112000e+03   7.477973e-06   0.000000e+00   7.477973e-06   0.000000e+00 
  3.120000e+03   7.448046e-06   0.000000e+00   7.448046e-06   0.000000e+00 
  3.128000e+03   7.048594e-06   0.000000e+00   7.048594e-06   0.000000e+00 
  3.136000e+03   5.985793e-06   0.000000e+00   5.985793e-06   0.000000e+00 
  3.144000e+03   6.598030e-06   0.000000e+00   6.598030e-06   0.000000e+00 
  3.152000e+03   6.819176e-06   0.000000e+00   6.819176e-06   0.000000e+00 
  3.160000e+03   6.897307e-06   0.000000e+00   6.897307e-06   0.000000e+00 
  3.168000e+03   6.667124e-06   0.000000e+00   6.667124e-06   0.000000e+00 
  3.176000e+03   6.520372e-06   0.000000e+00   6.520372e-06   0.000000e+00 
  3.184000e+03   7.064843e-06   0.000000e+00   7.064843e-06   0.000000e+00 
  3.192000e+03   7.199376e-06   0.000000e+00   7.199376e-06   0.000000e+00 
  3.200000e+03   6.401019e-06   0.000000e+00   6.401019e-06   0.000000e+00 
  3.208000e+03   6.836092e-06   0.000000e+00   6.836092e-06   0.000000e+00 
  3.216000e+03   6.650518e-06   0.000000e+00   6.650518e-06   0.000000e+00 
  3.224000e+03   6.178771e-06   0.000000e+00   6.178771e-06   0.000000e+00 
  3.232000e+03   7.288155e-06   0.000000e+00   7.288155e-06   0.000000e+00 
  3.240000e+03   8.833735e-06   0.000000e+00   8.833735e-06   0.000000e+00 
  3.248000e+03   7.064815e-06   0.000000e+00   7.064815e-06   0.000000e+00 
  3.256000e+03   7.327853e-06   0.000000e+00   7.327853e-06   0.000000e+00 
  3.264000e+03   6.343198e-06   0.000000e+00   6.343198e-06   0.000000e+00 
  3.272000e+03   6.308058e-06   0.000000e+00   6.308058e-06   0.000000e+00 
  3.280000e+03   6.827153e-06   0.000000e+00   6.827153e-06   0.000000e+00 
  3.288000e+03   7.327857e-06   0.000000e+00   7.327857e-06   0.000000e+00 
  3.296000e+03   7.001037e-06   0.000000e+00   7.001037e-06   0.000000e+00 
  3.304000e+03   6.975188e-06   0.000000e+00   6.975188e-06   0.000000e+00 
  3.312000e+03   7.386412e-06   0.000000e+00   7.386412e-06   0.000000e+00 
  3.320000e+03   6.961517e-06   0.000000e+00   6.961517e-06   0.000000e+00 
  3.328000e+03   7.035028e-06   0.000000e+00   7.035028e-06   0.000000e+00 
  3.336000e+03   6.674295e-06   0.000000e+00   6.674295e-06   0.000000e+00 
  3.344000e+03   6.810437e-06   0.000000e+00   6.810437e-06   0.000000e+00 
  3.352000e+03   6.763664e-06   0.000000e+00   6.763664e-06   0.000000e+00 
  3.360000e+03   6.853555e-06   0.000000e+00   6.853555e-06   0.000000e+00 
  3.368000e+03   7.158367e-06   0.000000e+00   7.158367e-06   0.000000e+00 
  3.376000e+03   7.274049e-06   0.000000e+00   7.274049e-06   0.000000e+00 
  3.384000e+03   6.862045e-06   0.000000e+00   6.862045e-06   0.000000e+00 
  3.392000e+03   6.589198e-06   0.000000e+00   6.589198e-06   0.000000e+00 
  3.400000e+03   6.794708e-06   0.000000e+00   6.794708e-06   0.000000e+00 
  3.408000e+03   8.385614e-06   0.000000e+00   8.385614e-06   0.000000e+00 
  3.416000e+03   7.818020e-06   0.000000e+00   7.818020e-06   0.000000e+00 
  3.424000e+03   7.008973e-06   0.000000e+00   7.008973e-06   0.000000e+00 
  3.432000e+03   7.667533e-06   0.000000e+00   7.667533e-06   0.000000e+00 
  3.440000e+03   8.636509e-06   0.000000e+00   8.636509e-06   0.000000e+00 
  3.448000e+03   8.629739e-06   0.000000e+00   8.629739e-06   0.000000e+00 
  3.456000e+03   8.442964e-06   0.000000e+00   8.442964e-06   0.000000e+00 
  3.464000e+03   8.661805e-06   0.000000e+00   8.661805e-06   0.000000e+00 
  3.472000e+03   9.285191e-06   0.000000e+00   9.285191e-06   0.000000e+00 
  3.480000e+03   9.854451e-06   0.000000e+00   9.854451e-06   0.000000e+00 
  3.488000e+03   1.029635e-05   0.000000e+00   1.029635e-05   0.000000e+00 
  3.496000e+03   1.627375e-05   0.000000e+00   1.627375e-05   0.000000e+00 
  3.504000e+03   3.938067e-05   0.000000e+00   3.938067e-05   0.000000e+00 
  3.512000e+03   2.982673e-05   0.000000e+00   2.982673e-05   0.000000e+00 
  3.520000e+03   8.334306e-06   0.000000e+00   8.334306e-06   0.000000e+00 
  3.528000e+03   7.198298e-06   0.000000e+00   7.198298e-06   0.000000e+00 
  3.536000e+03   6.543803e-06   0.000000e+00   6.543803e-06   0.000000e+00 
  3.544000e+03   6.049230e-06   0.000000e+00   6.049230e-06   0.000000e+00 
  3.552000e+03   6.050798e-06   0.000000e+00   6.050798e-06   0.000000e+00 
  3.560000e+03   5.795328e-06   0.000000e+00   5.795328e-06   0.000000e+00 
  3.568000e+03   5.481244e-06   0.000000e+00   5.481244e-06   0.000000e+00 
  3.576000e+03   6.016378e-06   0.000000e+00   6.016378e-06   0.000000e+00 
  3.584000e+03   7.544399e-06   0.000000e+00   7.544399e-06   0.000000e+00 
  3.592000e+03   7.890510e-06   0.000000e+00   7.890510e-06   0.000000e+00 
  3.600000e+03   9.080974e-06   0.000000e+00   9.080974e-06   0.000000e+00 
  3.608000e+03   6.842065e-06   0.000000e+00   6.842065e-06   0.000000e+00 
  3.616000e+03   5.887931e-06   0.000000e+00   5.887931e-06   0.000000e+00 
  3.624000e+03   5.749045e-06   0.000000e+00   5.749045e-06   0.000000e+00 
  3.632000e+03   5.729173e-06   0.000000e+00   5.729173e-06   0.000000e+00 
  3.640000e+03   5.780135e-06   0.000000e+00   5.780135e-06   0.000000e+00 
  3.648000e+03   5.392886e-06   0.000000e+00   5.392886e-06   0.000000e+00 
  3.656000e+03   5.216562e-06   0.000000e+00   5.216562e-06   0.000000e+00 
  3.664000e+03   5.213981e-06   0.000000e+00   5.213981e-06   0.000000e+00 
  3.672000e+03   5.438972e-06   0.000000e+00   5.438972e-06   0.000000e+00 
  3.680000e+03   5.640586e-06   0.000000e+00   5.640586e-06   0.000000e+00 
  3.688000e+03   5.182128e-06   0.000000e+00   5.182128e-06   0.000000e+00 
  3.696000e+03   4.981292e-06   0.000000e+00   4.981292e-06   0.000000e+00 
  3.704000e+03   5.896053e-06   0.000000e+00   5.896053e-06   0.000000e+00 
  3.712000e+03   5.715383e-06   0.000000e+00   5.715383e-06   0.000000e+00 
  3.720000e+03   5.369131e-06   0.000000e+00   5.369131e-06   0.000000e+00 
  3.728000e+03   5.210426e-06   0.000000e+00   5.210426e-06   0.000000e+00 
  3.736000e+03   5.198796e-06   0.000000e+00   5.198796e-06   0.000000e+00 
  3.744000e+03   5.213425e-06   0.000000e+00   5.213425e-06   0.000000e+00 
  3.752000e+03   5.306730e-06   0.000000e+00   5.306730e-06   0.000000e+00 
  3.760000e+03   5.150777e-06   0.000000e+00   5.150777e-06   0.000000e+00 
  3.768000e+03   4.995048e-06   0.000000e+00   4.995048e-06   0.000000e+00 
  3.776000e+03   4.955999e-06   0.000000e+00   4.955999e-06   0.000000e+00 
  3.784000e+03   5.302722e-06   0.000000e+00   5.302722e-06   0.000000e+00 
  3.792000e+03   5.550005e-06   0.000000e+00   5.550005e-06   0.000000e+00 
  3.800000e+03   5.328099e-06   0.000000e+00   5.328099e-06   0.000000e+00 
  3.808000e+03   5.129273e-06   0.000000e+00   5.129273e-06   0.000000e+00 
  3.816000e+03   5.179379e-06   0.000000e+00   5.179379e-06   0.000000e+00 
  3.824000e+03   5.114997e-06   0.000000e+00   5.114997e-06   0.000000e+00 
  3.832000e+03   4.924751e-06   0.000000e+00   4.924751e-06   0.000000e+00 
  3.840000e+03   5.213253e-06   0.000000e+00   5.213253e-06   0.000000e+00 
  3.848000e+03   5.554519e-06   0.000000e+00   5.554519e-06   0.000000e+00 
  3.856000e+03   5.532481e-06   0.000000e+00   5.532481e-06   0.000000e+00 
  3.864000e+03   5.077021e-06   0.000000e+00   5.077021e-06   0.000000e+00 
  3.872000e+03   4.912803e-06   0.000000e+00   4.912803e-06   0.000000e+00 
  3.880000e+03   4.574310e-06   0.000000e+00   4.574310e-06   0.000000e+00 
  3.888000e+03   4.757913e-06   0.000000e+00   4.757913e-06   0.000000e+00 
  3.896000e+03   5.200775e-06   0.000000e+00   5.200775e-06   0.000000e+00 
  3.904000e+03   5.506498e-06   0.000000e+00   5.506498e-06   0.000000e+00 
  3.912000e+03   5.291140e-06   0.000000e+00   5.291140e-06   0.000000e+00 
  3.920000e+03   5.590899e-06   0.000000e+00   5.590899e-06   0.000000e+00 
  3.928000e+03   5.308159e-06   0.000000e+00   5.308159e-06   0.000000e+00 
  3.936000e+03   4.874239e-06   0.000000e+00   4.874239e-06   0.000000e+00 
  3.944000e+03   4.708970e-06   0.000000e+00   4.708970e-06   0.000000e+00 
  3.952000e+03   5.693535e-06   0.000000e+00   5.693535e-06   0.000000e+00 
  3.960000e+03   7.690027e-06   0.000000e+00   7.690027e-06   0.000000e+00 
  3.968000e+03   5.837764e-06   0.000000e+00   5.837764e-06   0.000000e+00 
  3.976000e+03   5.021343e-06   0.000000e+00   5.021343e-06   0.000000e+00 
  3.984000e+03   5.232224e-06   0.000000e+00   5.232224e-06   0.000000e+00 
  3.992000e+03   5.101097e-06   0.000000e+00   5.101097e-06   0.000000e+00 
  4.000000e+03   4.801090e-06   0.000000e+00   4.801090e-06   0.000000e+00 
  4.008000e+03   4.979200e-06   0.000000e+00   4.979200e-06   0.000000e+00 
  4.016000e+03   5.037676e-06   0.000000e+00   5.037676e-06   0.000000e+00 
  4.024000e+03   5.143876e-06   0.000000e+00   5.143876e-06   0.000000e+00 
  4.032000e+03   4.753104e-06   0.000000e+00   4.753104e-06   0.000000e+00 
  4.040000e+03   4.690520e-06   0.000000e+00   4.690520e-06   0.000000e+00 
  4.048000e+03   4.532170e-06   0.000000e+00   4.532170e-06   0.000000e+00 
  4.056000e+03   4.640045e-06   0.000000e+00   4.640045e-06   0.000000e+00 
  4.064000e+03   4.980720e-06   0.000000e+00   4.980720e-06   0.000000e+00 
  4.072000e+03   4.591336e-06   0.000000e+00   4.591336e-06   0.000000e+00 
  4.080000e+03   4.816995e-06   0.000000e+00   4.816995e-06   0.000000e+00 
  4.088000e+03   4.583719e-06   0.000000e+00   4.583719e-06   0.000000e+00 
  4.096000e+03   4.664305e-06   0.000000e+00   4.664305e-06   0.000000e+00 
  4.104000e+03   5.212416e-06   0.000000e+00   5.212416e-06   0.000000e+00 
  4.112000e+03   5.453647e-06   0.000000e+00   5.453647e-06   0.000000e+00 
  4.120000e+03   4.966584e-06   0.000000e+00   4.966584e-06   0.000000e+00 
  4.128000e+03   4.639824e-06   0.000000e+00   4.639824e-06   0.000000e+00 
  4.136000e+03   4.190439e-06   0.000000e+00   4.190439e-06   0.000000e+00 
  4.144000e+03   4.733933e-06   0.000000e+00   4.733933e-06   0.000000e+00 
  4.152000e+03   4.833384e-06   0.000000e+00   4.833384e-06   0.000000e+00 
  4.160000e+03   4.505172e-06   0.000000e+00   4.505172e-06   0.000000e+00 
  4.168000e+03   4.104668e-06   0.000000e+00   4.104668e-06   0.000000e+00 
  4.176000e+03   4.910719e-06   0.000000e+00   4.910719e-06   0.000000e+00 
  4.184000e+03   4.845444e-06   0.000000e+00   4.845444e-06   0.000000e+00 
  4.192000e+03   5.367419e-06   0.000000e+00   5.367419e-06   0.000000e+00 
  4.200000e+03   6.144327e-06   0.000000e+00   6.144327e-06   0.000000e+00 
  4.208000e+03   4.691032e-06   0.000000e+00   4.691032e-06   0.000000e+00 
  4.216000e+03   4.403972e-06   0.000000e+00   4.403972e-06   0.000000e+00 
  4.224000e+03   4.472678e-06   0.000000e+00   4.472678e-06   0.000000e+00 
  4.232000e+03   4.623681e-06   0.000000e+00   4.623681e-06   0.000000e+00 
  4.240000e+03   4.565792e-06   0.000000e+00   4.565792e-06   0.000000e+00 
  4.248000e+03   4.507864e-06   0.000000e+00   4.507864e-06   0.000000e+00 
  4.256000e+03   4.637973e-06   0.000000e+00   4.637973e-06   0.000000e+00 
  4.264000e+03   4.402405e-06   0.000000e+00   4.402405e-06   0.000000e+00 
  4.272000e+03   4.531775e-06   0.000000e+00   4.531775e-06   0.000000e+00 
  4.280000e+03   4.516117e-06   0.000000e+00   4.516117e-06   0.000000e+00 
  4.288000e+03   4.538774e-06   0.000000e+00   4.538774e-06   0.000000e+00 
  4.296000e+03   4.460613e-06   0.000000e+00   4.460613e-06   0.000000e+00 
  4.304000e+03   4.632836e-06   0.000000e+00   4.632836e-06   0.000000e+00 
  4.312000e+03   5.365217e-06   0.000000e+00   5.365217e-06   0.000000e+00 
  4.320000e+03   6.962820e-06   0.000000e+00   6.962820e-06   0.000000e+00 
  4.328000e+03   5.227947e-06   0.000000e+00   5.227947e-06   0.000000e+00 
  4.336000e+03   4.299460e-06   0.000000e+00   4.299460e-06   0.000000e+00 
  4.344000e+03   4.319641e-06   0.000000e+00   4.319641e-06   0.000000e+00 
  4.352000e+03   4.603799e-06   0.000000e+00   4.603799e-06   0.000000e+00 
  4.360000e+03   4.741736e-06   0.000000e+00   4.741736e-06   0.000000e+00 
  4.368000e+03   4.754960e-06   0.000000e+00   4.754960e-06   0.000000e+00 
  4.376000e+03   4.696504e-06   0.000000e+00   4.696504e-06   0.000000e+00 
  4.384000e+03   5.002304e-06   0.000000e+00   5.002304e-06   0.000000e+00 
  4.392000e+03   5.455993e-06   0.000000e+00   5.455993e-06   0.000000e+00 
  4.400000e+03   5.918426e-06   0.000000e+00   5.918426e-06   0.000000e+00 
  4.408000e+03   5.935031e-06   0.000000e+00   5.935031e-06   0.000000e+00 
  4.416000e+03   6.140307e-06   0.000000e+00   6.140307e-06   0.000000e+00 
  4.424000e+03   5.914500e-06   0.000000e+00   5.914500e-06   0.000000e+00 
  4.432000e+03   5.698270e-06   0.000000e+00   5.698270e-06   0.000000e+00 
  4.440000e+03   5.874492e-06   0.000000e+00   5.874492e-06   0.000000e+00 
  4.448000e+03   5.564169e-06   0.000000e+00   5.564169e-06   0.000000e+00 
  4.456000e+03   5.107111e-06   0.000000e+00   5.107111e-06   0.000000e+00 
  4.464000e+03   4.773731e-06   0.000000e+00   4.773731e-06   0.000000e+00 
  4.472000e+03   4.694018e-06   0.000000e+00   4.694018e-06   0.000000e+00 
  4.480000e+03   4.578818e-06   0.000000e+00   4.578818e-06   0.000000e+00 
  4.488000e+03   4.519144e-06   0.000000e+00   4.519144e-06   0.000000e+00 
  4.496000e+03   4.417554e-06   0.000000e+00   4.417554e-06   0.000000e+00 
  4.504000e+03   4.527280e-06   0.000000e+00   4.527280e-06   0.000000e+00 
  4.512000e+03   4.072750e-06   0.000000e+00   4.072750e-06   0.000000e+00 
  4.520000e+03   4.086106e-06   0.000000e+00   4.086106e-06   0.000000e+00 
  4.528000e+03   3.959492e-06   0.000000e+00   3.959492e-06   0.000000e+00 
  4.536000e+03   3.913246e-06   0.000000e+00   3.913246e-06   0.000000e+00 
  4.544000e+03   4.345195e-06   0.000000e+00   4.345195e-06   0.000000e+00 
  4.552000e+03   4.048500e-06   0.000000e+00   4.048500e-06   0.000000e+00 
  4.560000e+03   4.227468e-06   0.000000e+00   4.227468e-06   0.000000e+00 
  4.568000e+03   4.402002e-06   0.000000e+00   4.402002e-06   0.000000e+00 
  4.576000e+03   4.248288e-06   0.000000e+00   4.248288e-06   0.000000e+00 
  4.584000e+03   4.317448e-06   0.000000e+00   4.317448e-06   0.000000e+00 
  4.592000e+03   4.356503e-06   0.000000e+00   4.356503e-06   0.000000e+00 
  4.600000e+03   4.231590e-06   0.000000e+00   4.231590e-06   0.000000e+00 
  4.608000e+03   4.107695e-06   0.000000e+00   4.107695e-06   0.000000e+00 
  4.616000e+03   4.557052e-06   0.000000e+00   4.557052e-06   0.000000e+00 
  4.624000e+03   4.572432e-06   0.000000e+00   4.572432e-06   0.000000e+00 
  4.632000e+03   4.589741e-06   0.000000e+00   4.589741e-06   0.000000e+00 
  4.640000e+03   4.787469e-06   0.000000e+00   4.787469e-06   0.000000e+00 
  4.648000e+03   4.394421e-06   0.000000e+00   4.394421e-06   0.000000e+00 
  4.656000e+03   3.944620e-06   0.000000e+00   3.944620e-06   0.000000e+00 
  4.664000e+03   4.006493e-06   0.000000e+00   4.006493e-06   0.000000e+00 
  4.672000e+03   4.271217e-06   0.000000e+00   4.271217e-06   0.000000e+00 
  4.680000e+03   4.922022e-06   0.000000e+00   4.922022e-06   0.000000e+00 
  4.688000e+03   4.327724e-06   0.000000e+00   4.327724e-06   0.000000e+00 
  4.696000e+03   3.908947e-06   0.000000e+00   3.908947e-06   0.000000e+00 
  4.704000e+03   3.643424e-06   0.000000e+00   3.643424e-06   0.000000e+00 
  4.712000e+03   3.645769e-06   0.000000e+00   3.645769e-06   0.000000e+00 
  4.720000e+03   3.964029e-06   0.000000e+00   3.964029e-06   0.000000e+00 
  4.728000e+03   4.599479e-06   0.000000e+00   4.599479e-06   0.000000e+00 
  4.736000e+03   4.577334e-06   0.000000e+00   4.577334e-06   0.000000e+00 
  4.744000e+03   4.089793e-06   0.000000e+00   4.089793e-06   0.000000e+00 
  4.752000e+03   3.519996e-06   0.000000e+00   3.519996e-06   0.000000e+00 
  4.760000e+03   3.758999e-06   0.000000e+00   3.758999e-06   0.000000e+00 
  4.768000e+03   4.305842e-06   0.000000e+00   4.305842e-06   0.000000e+00 
  4.776000e+03   4.091087e-06   0.000000e+00   4.091087e-06   0.000000e+00 
  4.784000e+03   3.567283e-06   0.000000e+00   3.567283e-06   0.000000e+00 
  4.792000e+03   3.765887e-06   0.000000e+00   3.765887e-06   0.000000e+00 
  4.800000e+03   4.517320e-06   0.000000e+00   4.517320e-06   0.000000e+00 
  4.808000e+03   4.518590e-06   0.000000e+00   4.518590e-06   0.000000e+00 
  4.816000e+03   4.975620e-06   0.000000e+00   4.975620e-06   0.000000e+00 
  4.824000e+03   4.695622e-06   0.000000e+00   4.695622e-06   0.000000e+00 
  4.832000e+03   4.561866e-06   0.000000e+00   4.561866e-06   0.000000e+00 
  4.840000e+03   4.490812e-06   0.000000e+00   4.490812e-06   0.000000e+00 
  4.848000e+03   3.967478e-06   0.000000e+00   3.967478e-06   0.000000e+00 
  4.856000e+03   3.897806e-06   0.000000e+00   3.897806e-06   0.000000e+00 
  4.864000e+03   3.774785e-06   0.000000e+00   3.774785e-06   0.000000e+00 
  4.872000e+03   4.008196e-06   0.000000e+00   4.008196e-06   0.000000e+00 
  4.880000e+03   5.575566e-06   0.000000e+00   5.575566e-06   0.000000e+00 
  4.888000e+03   6.088457e-06   0.000000e+00   6.088457e-06   0.000000e+00 
  4.896000e+03   4.315200e-06   0.000000e+00   4.315200e-06   0.000000e+00 
  4.904000e+03   3.941617e-06   0.000000e+00   3.941617e-06   0.000000e+00 
  4.912000e+03   4.087040e-06   0.000000e+00   4.087040e-06   0.000000e+00 
  4.920000e+03   4.663530e-06   0.000000e+00   4.663530e-06   0.000000e+00 
  4.928000e+03   4.120742e-06   0.000000e+00   4.120742e-06   0.000000e+00 
  4.936000e+03   4.238185e-06   0.000000e+00   4.238185e-06   0.000000e+00 
  4.944000e+03   3.963035e-06   0.000000e+00   3.963035e-06   0.000000e+00 
  4.952000e+03   3.602267e-06   0.000000e+00   3.602267e-06   0.000000e+00 
  4.960000e+03   3.610247e-06   0.000000e+00   3.610247e-06   0.000000e+00 
  4.968000e+03   3.897540e-06   0.000000e+00   3.897540e-06   0.000000e+00 
  4.976000e+03   4.157383e-06   0.000000e+00   4.157383e-06   0.000000e+00 
  4.984000e+03   4.281865e-06   0.000000e+00   4.281865e-06   0.000000e+00 
  4.992000e+03   4.173259e-06   0.000000e+00   4.173259e-06   0.000000e+00 
  5.000000e+03   3.971963e-06   0.000000e+00   3.971963e-06   0.000000e+00 
  5.008000e+03   3.667970e-06   0.000000e+00   3.667970e-06   0.000000e+00 
  5.016000e+03   3.732337e-06   0.000000e+00   3.732337e-06   0.000000e+00 
  5.024000e+03   3.834982e-06   0.000000e+00   3.834982e-06   0.000000e+00 
  5.032000e+03   4.354448e-06   0.000000e+00   4.354448e-06   0.000000e+00 
  5.040000e+03   5.507610e-06   0.000000e+00   5.507610e-06   0.000000e+00 
  5.048000e+03   4.409213e-06   0.000000e+00   4.409213e-06   0.000000e+00 
  5.056000e+03   4.095090e-06   0.000000e+00   4.095090e-06   0.000000e+00 
  5.064000e+03   4.041263e-06   0.000000e+00   4.041263e-06   0.000000e+00 
  5.072000e+03   4.109877e-06   0.000000e+00   4.109877e-06   0.000000e+00 
  5.080000e+03   4.102670e-06   0.000000e+00   4.102670e-06   0.000000e+00 
  5.088000e+03   4.221840e-06   0.000000e+00   4.221840e-06   0.000000e+00 
  5.096000e+03   4.191369e-06   0.000000e+00   4.191369e-06   0.000000e+00 
  5.104000e+03   4.169410e-06   0.000000e+00   4.169410e-06   0.000000e+00 
  5.112000e+03   3.935957e-06   0.000000e+00   3.935957e-06   0.000000e+00 
  5.120000e+03   3.771954e-06   0.000000e+00   3.771954e-06   0.000000e+00 
  5.128000e+03   3.747346e-06   0.000000e+00   3.747346e-06   0.000000e+00 
  5.136000e+03   4.058981e-06   0.000000e+00   4.058981e-06   0.000000e+00 
  5.144000e+03   4.089257e-06   0.000000e+00   4.089257e-06   0.000000e+00 
  5.152000e+03   4.276792e-06   0.000000e+00   4.276792e-06   0.000000e+00 
  5.160000e+03   5.083279e-06   0.000000e+00   5.083279e-06   0.000000e+00 
  5.168000e+03   4.073464e-06   0.000000e+00   4.073464e-06   0.000000e+00 
  5.176000e+03   3.740118e-06   0.000000e+00   3.740118e-06   0.000000e+00 
  5.184000e+03   3.905155e-06   0.000000e+00   3.905155e-06   0.000000e+00 
  5.192000e+03   3.885899e-06   0.000000e+00   3.885899e-06   0.000000e+00 
  5.200000e+03   3.973682e-06   0.000000e+00   3.973682e-06   0.000000e+00 
  5.208000e+03   3.720997e-06   0.000000e+00   3.720997e-06   0.000000e+00 
  5.216000e+03   3.785491e-06   0.000000e+00   3.785491e-06   0.000000e+00 
  5.224000e+03   3.688014e-06   0.000000e+00   3.688014e-06   0.000000e+00 
  5.232000e+03   3.501771e-06   0.000000e+00   3.501771e-06   0.000000e+00 
  5.240000e+03   3.662071e-06   0.000000e+00   3.662071e-06   0.000000e+00 
  5.248000e+03   3.715354e-06   0.000000e+00   3.715354e-06   0.000000e+00 
  5.256000e+03   3.593436e-06   0.000000e+00   3.593436e-06   0.000000e+00 
  5.264000e+03   3.683956e-06   0.000000e+00   3.683956e-06   0.000000e+00 
  5.272000e+03   3.880350e-06   0.000000e+00   3.880350e-06   0.000000e+00 
  5.280000e+03   3.618861e-06   0.000000e+00   3.618861e-06   0.000000e+00 
  5.288000e+03   3.666868e-06   0.000000e+00   3.666868e-06   0.000000e+00 
  5.296000e+03   3.547905e-06   0.000000e+00   3.547905e-06   0.000000e+00 
  5.304000e+03   3.857192e-06   0.000000e+00   3.857192e-06   0.000000e+00 
  5.312000e+03   4.046753e-06   0.000000e+00   4.046753e-06   0.000000e+00 
  5.320000e+03   3.846408e-06   0.000000e+00   3.846408e-06   0.000000e+00 
  5.328000e+03   3.703667e-06   0.000000e+00   3.703667e-06   0.000000e+00 
  5.336000e+03   3.803324e-06   0.000000e+00   3.803324e-06   0.000000e+00 
  5.344000e+03   3.792542e-06   0.000000e+00   3.792542e-06   0.000000e+00 
  5.352000e+03   3.710053e-06   0.000000e+00   3.710053e-06   0.000000e+00 
  5.360000e+03   3.400273e-06   0.000000e+00   3.400273e-06   0.000000e+00 
  5.368000e+03   3.426119e-06   0.000000e+00   3.426119e-06   0.000000e+00 
  5.376000e+03   3.439191e-06   0.000000e+00   3.439191e-06   0.000000e+00 
  5.384000e+03   3.546271e-06   0.000000e+00   3.546271e-06   0.000000e+00 
  5.392000e+03   3.643908e-06   0.000000e+00   3.643908e-06   0.000000e+00 
  5.400000e+03   4.109025e-06   0.000000e+00   4.109025e-06   0.000000e+00 
  5.408000e+03   3.984228e-06   0.000000e+00   3.984228e-06   0.000000e+00 
  5.416000e+03   3.908669e-06   0.000000e+00   3.908669e-06   0.000000e+00 
  5.424000e+03   4.151711e-06   0.000000e+00   4.151711e-06   0.000000e+00 
  5.432000e+03   3.740191e-06   0.000000e+00   3.740191e-06   0.000000e+00 
  5.440000e+03   3.413724e-06   0.000000e+00   3.413724e-06   0.000000e+00 
  5.448000e+03   3.774024e-06   0.000000e+00   3.774024e-06   0.000000e+00 
  5.456000e+03   3.954353e-06   0.000000e+00   3.954353e-06   0.000000e+00 
  5.464000e+03   3.536776e-06   0.000000e+00   3.536776e-06   0.000000e+00 
  5.472000e+03   3.222799e-06   0.000000e+00   3.222799e-06   0.000000e+00 
  5.480000e+03   3.493650e-06   0.000000e+00   3.493650e-06   0.000000e+00 
  5.488000e+03   3.909108e-06   0.000000e+00   3.909108e-06   0.000000e+00 
  5.496000e+03   4.006644e-06   0.000000e+00   4.006644e-06   0.000000e+00 
  5.504000e+03   3.630081e-06   0.000000e+00   3.630081e-06   0.000000e+00 
  5.512000e+03   3.773905e-06   0.000000e+00   3.773905e-06   0.000000e+00 
  5.520000e+03   4.449971e-06   0.000000e+00   4.449971e-06   0.000000e+00 
  5.528000e+03   4.146683e-06   0.000000e+00   4.146683e-06   0.000000e+00 
  5.536000e+03   3.687001e-06   0.000000e+00   3.687001e-06   0.000000e+00 
  5.544000e+03   3.501184e-06   0.000000e+00   3.501184e-06   0.000000e+00 
  5.552000e+03   3.531977e-06   0.000000e+00   3.531977e-06   0.000000e+00 
  5.560000e+03   3.743741e-06   0.000000e+00   3.743741e-06   0.000000e+00 
  5.568000e+03   3.554487e-06   0.000000e+00   3.554487e-06   0.000000e+00 
  5.576000e+03   3.559790e-06   0.000000e+00   3.559790e-06   0.000000e+00 
  5.584000e+03   3.783023e-06   0.000000e+00   3.783023e-06   0.000000e+00 
  5.592000e+03   3.564989e-06   0.000000e+00   3.564989e-06   0.000000e+00 
  5.600000e+03   3.670945e-06   0.000000e+00   3.670945e-06   0.000000e+00 
  5.608000e+03   3.654101e-06   0.000000e+00   3.654101e-06   0.000000e+00 
  5.616000e+03   3.648306e-06   0.000000e+00   3.648306e-06   0.000000e+00 
  5.624000e+03   3.577004e-06   0.000000e+00   3.577004e-06   0.000000e+00 
  5.632000e+03   3.992208e-06   0.000000e+00   3.992208e-06   0.000000e+00 
  5.640000e+03   4.292835e-06   0.000000e+00   4.292835e-06   0.000000e+00 
  5.648000e+03   3.851308e-06   0.000000e+00   3.851308e-06   0.000000e+00 
  5.656000e+03   3.625456e-06   0.000000e+00   3.625456e-06   0.000000e+00 
  5.664000e+03   3.672506e-06   0.000000e+00   3.672506e-06   0.000000e+00 
  5.672000e+03   3.756180e-06   0.000000e+00   3.756180e-06   0.000000e+00 
  5.680000e+03   3.767024e-06   0.000000e+00   3.767024e-06   0.000000e+00 
  5.688000e+03   3.792102e-06   0.000000e+00   3.792102e-06   0.000000e+00 
  5.696000e+03   3.447029e-06   0.000000e+00   3.447029e-06   0.000000e+00 
  5.704000e+03   3.672860e-06   0.000000e+00   3.672860e-06   0.000000e+00 
  5.712000e+03   4.159376e-06   0.000000e+00   4.159376e-06   0.000000e+00 
  5.720000e+03   4.235170e-06   0.000000e+00   4.235170e-06   0.000000e+00 
  5.728000e+03   4.576887e-06   0.000000e+00   4.576887e-06   0.000000e+00 
  5.736000e+03   4.971976e-06   0.000000e+00   4.971976e-06   0.000000e+00 
  5.744000e+03   5.477562e-06   0.000000e+00   5.477562e-06   0.000000e+00 
  5.752000e+03   5.644839e-06   0.000000e+00   5.644839e-06   0.000000e+00 
  5.760000e+03   6.310174e-06   0.000000e+00   6.310174e-06   0.000000e+00 
  5.768000e+03   5.813160e-06   0.000000e+00   5.813160e-06   0.000000e+00 
  5.776000e+03   5.503236e-06   0.000000e+00   5.503236e-06   0.000000e+00 
  5.784000e+03   5.021602e-06   0.000000e+00   5.021602e-06   0.000000e+00 
  5.792000e+03   4.880723e-06   0.000000e+00   4.880723e-06   0.000000e+00 
  5.800000e+03   4.293787e-06   0.000000e+00   4.293787e-06   0.000000e+00 
  5.808000e+03   3.666652e-06   0.000000e+00   3.666652e-06   0.000000e+00 
  5.816000e+03   3.724638e-06   0.000000e+00   3.724638e-06   0.000000e+00 
  5.824000e+03   3.890073e-06   0.000000e+00   3.890073e-06   0.000000e+00 
  5.832000e+03   3.936784e-06   0.000000e+00   3.936784e-06   0.000000e+00 
  5.840000e+03   3.885628e-06   0.000000e+00   3.885628e-06   0.000000e+00 
  5.848000e+03   3.872273e-06   0.000000e+00   3.872273e-06   0.000000e+00 
  5.856000e+03   3.858975e-06   0.000000e+00   3.858975e-06   0.000000e+00 
  5.864000e+03   3.669852e-06   0.000000e+00   3.669852e-06   0.000000e+00 
  5.872000e+03   3.984619e-06   0.000000e+00   3.984619e-06   0.000000e+00 
  5.880000e+03   4.979308e-06   0.000000e+00   4.979308e-06   0.000000e+00 
  5.888000e+03   3.954328e-06   0.000000e+00   3.954328e-06   0.000000e+00 
  5.896000e+03   3.586769e-06   0.000000e+00   3.586769e-06   0.000000e+00 
  5.904000e+03   3.413444e-06   0.000000e+00   3.413444e-06   0.000000e+00 
  5.912000e+03   3.208841e-06   0.000000e+00   3.208841e-06   0.000000e+00 
  5.920000e+03   3.358957e-06   0.000000e+00   3.358957e-06   0.000000e+00 
  5.928000e+03   3.373116e-06   0.000000e+00   3.373116e-06   0.000000e+00 
  5.936000e+03   3.209740e-06   0.000000e+00   3.209740e-06   0.000000e+00 
  5.944000e+03   3.419392e-06   0.000000e+00   3.419392e-06   0.000000e+00 
  5.952000e+03   3.437722e-06   0.000000e+00   3.437722e-06   0.000000e+00 
  5.960000e+03   3.431447e-06   0.000000e+00   3.431447e-06   0.000000e+00 
  5.968000e+03   3.550714e-06   0.000000e+00   3.550714e-06   0.000000e+00 
  5.976000e+03   3.405356e-06   0.000000e+00   3.405356e-06   0.000000e+00 
  5.984000e+03   3.357568e-06   0.000000e+00   3.357568e-06   0.000000e+00 
  5.992000e+03   3.688071e-06   0.000000e+00   3.688071e-06   0.000000e+00 
  6.000000e+03   3.873654e-06   0.000000e+00   3.873654e-06   0.000000e+00 
  6.008000e+03   3.545531e-06   0.000000e+00   3.545531e-06   0.000000e+00 
  6.016000e+03   3.469783e-06   0.000000e+00   3.469783e-06   0.000000e+00 
  6.024000e+03   3.083857e-06   0.000000e+00   3.083857e-06   0.000000e+00 
  6.032000e+03   3.006406e-06   0.000000e+00   3.006406e-06   0.000000e+00 
  6.040000e+03   3.342916e-06   0.000000e+00   3.342916e-06   0.000000e+00 
  6.048000e+03   3.534358e-06   0.000000e+00   3.534358e-06   0.000000e+00 
  6.056000e+03   3.621263e-06   0.000000e+00   3.621263e-06   0.000000e+00 
  6.064000e+03   3.843432e-06   0.000000e+00   3.843432e-06   0.000000e+00 
  6.072000e+03   3.513952e-06   0.000000e+00   3.513952e-06   0.000000e+00 
  6.080000e+03   3.581889e-06   0.000000e+00   3.581889e-06   0.000000e+00 
  6.088000e+03   3.457687e-06   0.000000e+00   3.457687e-06   0.000000e+00 
  6.096000e+03   3.603811e-06   0.000000e+00   3.603811e-06   0.000000e+00 
  6.104000e+03   3.591856e-06   0.000000e+00   3.591856e-06   0.000000e+00 
  6.112000e+03   3.522386e-06   0.000000e+00   3.522386e-06   0.000000e+00 
  6.120000e+03   3.750829e-06   0.000000e+00   3.750829e-06   0.000000e+00 
  6.128000e+03   3.510417e-06   0.000000e+00   3.510417e-06   0.000000e+00 
  6.136000e+03   3.832301e-06   0.000000e+00   3.832301e-06   0.000000e+00 
  6.144000e+03   3.389736e-06   0.000000e+00   3.389736e-06   0.000000e+00 
  6.152000e+03   3.299100e-06   0.000000e+00   3.299100e-06   0.000000e+00 
  6.160000e+03   3.501268e-06   0.000000e+00   3.501268e-06   0.000000e+00 
  6.168000e+03   3.633842e-06   0.000000e+00   3.633842e-06   0.000000e+00 
  6.176000e+03   3.554362e-06   0.000000e+00   3.554362e-06   0.000000e+00 
  6.184000e+03   3.727548e-06   0.000000e+00   3.727548e-06   0.000000e+00 
  6.192000e+03   3.682179e-06   0.000000e+00   3.682179e-06   0.000000e+00 
  6.200000e+03   3.520002e-06   0.000000e+00   3.520002e-06   0.000000e+00 
  6.208000e+03   3.766110e-06   0.000000e+00   3.766110e-06   0.000000e+00 
  6.216000e+03   3.664924e-06   0.000000e+00   3.664924e-06   0.000000e+00 
  6.224000e+03   3.363334e-06   0.000000e+00   3.363334e-06   0.000000e+00 
  6.232000e+03   3.197932e-06   0.000000e+00   3.197932e-06   0.000000e+00 
  6.240000e+03   3.446756e-06   0.000000e+00   3.446756e-06   0.000000e+00 
  6.248000e+03   3.351725e-06   0.000000e+00   3.351725e-06   0.000000e+00 
  6.256000e+03   3.608851e-06   0.000000e+00   3.608851e-06   0.000000e+00 
  6.264000e+03   3.721521e-06   0.000000e+00   3.721521e-06   0.000000e+00 
  6.272000e+03   3.472573e-06   0.000000e+00   3.472573e-06   0.000000e+00 
  6.280000e+03   3.340330e-06   0.000000e+00   3.340330e-06   0.000000e+00 
  6.288000e+03   3.417569e-06   0.000000e+00   3.417569e-06   0.000000e+00 
  6.296000e+03   3.395615e-06   0.000000e+00   3.395615e-06   0.000000e+00 
  6.304000e+03   3.439797e-06   0.000000e+00   3.439797e-06   0.000000e+00 
  6.312000e+03   3.145525e-06   0.000000e+00   3.145525e-06   0.000000e+00 
  6.320000e+03   3.285874e-06   0.000000e+00   3.285874e-06   0.000000e+00 
  6.328000e+03   3.294818e-06   0.000000e+00   3.294818e-06   0.000000e+00 
  6.336000e+03   3.062914e-06   0.000000e+00   3.062914e-06   0.000000e+00 
  6.344000e+03   3.321447e-06   0.000000e+00   3.321447e-06   0.000000e+00 
  6.352000e+03   3.474725e-06   0.000000e+00   3.474725e-06   0.000000e+00 
  6.360000e+03   3.977097e-06   0.000000e+00   3.977097e-06   0.000000e+00 
  6.368000e+03   3.751283e-06   0.000000e+00   3.751283e-06   0.000000e+00 
  6.376000e+03   3.647938e-06   0.000000e+00   3.647938e-06   0.000000e+00 
  6.384000e+03   3.713964e-06   0.000000e+00   3.713964e-06   0.000000e+00 
  6.392000e+03   3.469094e-06   0.000000e+00   3.469094e-06   0.000000e+00 
  6.400000e+03   3.194223e-06   0.000000e+00   3.194223e-06   0.000000e+00 
