"CHANNEL: 2"
"MEASURE TYPE: A/R"
"FORMAT TYPE: PHASE (DEG)"
"NUMBER of POINTS: 201"
"SWEEP TIME:  11.82 s"
"SWEEP TYPE: LIN FREQ"
"SOURCE POWER:  .8 dBm"
"IF BANDWIDTH:  100 Hz"

"Frequency"	"Data Trace Real"	"Data Trace Imag"	"Memory Trace Real"	"Memory Trace Imag"
2.000000000000E+02	-9.717166E+01	0.000000E+00	0.000000E+00	0.000000E+00
1.199000000000E+03	-3.077593E+01	0.000000E+00	0.000000E+00	0.000000E+00
2.198000000000E+03	-1.453330E+02	0.000000E+00	0.000000E+00	0.000000E+00
3.197000000000E+03	1.286140E+02	0.000000E+00	0.000000E+00	0.000000E+00
4.196000000000E+03	1.216866E+02	0.000000E+00	0.000000E+00	0.000000E+00
5.195000000000E+03	1.585991E+02	0.000000E+00	0.000000E+00	0.000000E+00
6.194000000000E+03	1.617175E+02	0.000000E+00	0.000000E+00	0.000000E+00
7.193000000000E+03	1.687883E+02	0.000000E+00	0.000000E+00	0.000000E+00
8.192000000000E+03	-1.770407E+02	0.000000E+00	0.000000E+00	0.000000E+00
9.191000000000E+03	-1.726593E+02	0.000000E+00	0.000000E+00	0.000000E+00
1.019000000000E+04	-1.641164E+02	0.000000E+00	0.000000E+00	0.000000E+00
1.118900000000E+04	-1.590027E+02	0.000000E+00	0.000000E+00	0.000000E+00
1.218800000000E+04	-1.536528E+02	0.000000E+00	0.000000E+00	0.000000E+00
1.318700000000E+04	-1.439909E+02	0.000000E+00	0.000000E+00	0.000000E+00
1.418600000000E+04	-1.440034E+02	0.000000E+00	0.000000E+00	0.000000E+00
1.518500000000E+04	-1.369354E+02	0.000000E+00	0.000000E+00	0.000000E+00
1.618400000000E+04	-1.396551E+02	0.000000E+00	0.000000E+00	0.000000E+00
1.718300000000E+04	-1.334329E+02	0.000000E+00	0.000000E+00	0.000000E+00
1.818200000000E+04	-1.313282E+02	0.000000E+00	0.000000E+00	0.000000E+00
1.918100000000E+04	-1.324451E+02	0.000000E+00	0.000000E+00	0.000000E+00
2.018000000000E+04	-1.289855E+02	0.000000E+00	0.000000E+00	0.000000E+00
2.117900000000E+04	-1.259787E+02	0.000000E+00	0.000000E+00	0.000000E+00
2.217800000000E+04	-1.282052E+02	0.000000E+00	0.000000E+00	0.000000E+00
2.317700000000E+04	-1.237942E+02	0.000000E+00	0.000000E+00	0.000000E+00
2.417600000000E+04	-1.219335E+02	0.000000E+00	0.000000E+00	0.000000E+00
2.517500000000E+04	-1.213218E+02	0.000000E+00	0.000000E+00	0.000000E+00
2.617400000000E+04	-1.202345E+02	0.000000E+00	0.000000E+00	0.000000E+00
2.717300000000E+04	-1.216374E+02	0.000000E+00	0.000000E+00	0.000000E+00
2.817200000000E+04	-1.194858E+02	0.000000E+00	0.000000E+00	0.000000E+00
2.917100000000E+04	-1.224376E+02	0.000000E+00	0.000000E+00	0.000000E+00
3.017000000000E+04	-1.245716E+02	0.000000E+00	0.000000E+00	0.000000E+00
3.116900000000E+04	-1.229745E+02	0.000000E+00	0.000000E+00	0.000000E+00
3.216800000000E+04	-1.230667E+02	0.000000E+00	0.000000E+00	0.000000E+00
3.316700000000E+04	-1.217938E+02	0.000000E+00	0.000000E+00	0.000000E+00
3.416600000000E+04	-1.212539E+02	0.000000E+00	0.000000E+00	0.000000E+00
3.516500000000E+04	-1.223386E+02	0.000000E+00	0.000000E+00	0.000000E+00
3.616400000000E+04	-1.226952E+02	0.000000E+00	0.000000E+00	0.000000E+00
3.716300000000E+04	-1.198901E+02	0.000000E+00	0.000000E+00	0.000000E+00
3.816200000000E+04	-1.194902E+02	0.000000E+00	0.000000E+00	0.000000E+00
3.916100000000E+04	-1.193382E+02	0.000000E+00	0.000000E+00	0.000000E+00
4.016000000000E+04	-1.200909E+02	0.000000E+00	0.000000E+00	0.000000E+00
4.115900000000E+04	-1.188290E+02	0.000000E+00	0.000000E+00	0.000000E+00
4.215800000000E+04	-1.192420E+02	0.000000E+00	0.000000E+00	0.000000E+00
4.315700000000E+04	-1.186335E+02	0.000000E+00	0.000000E+00	0.000000E+00
4.415600000000E+04	-1.180312E+02	0.000000E+00	0.000000E+00	0.000000E+00
4.515500000000E+04	-1.187085E+02	0.000000E+00	0.000000E+00	0.000000E+00
4.615400000000E+04	-1.192228E+02	0.000000E+00	0.000000E+00	0.000000E+00
4.715300000000E+04	-1.231970E+02	0.000000E+00	0.000000E+00	0.000000E+00
4.815200000000E+04	-1.210289E+02	0.000000E+00	0.000000E+00	0.000000E+00
4.915100000000E+04	-1.213088E+02	0.000000E+00	0.000000E+00	0.000000E+00
5.015000000000E+04	-1.202361E+02	0.000000E+00	0.000000E+00	0.000000E+00
5.114900000000E+04	-1.204748E+02	0.000000E+00	0.000000E+00	0.000000E+00
5.214800000000E+04	-1.213007E+02	0.000000E+00	0.000000E+00	0.000000E+00
5.314700000000E+04	-1.224530E+02	0.000000E+00	0.000000E+00	0.000000E+00
5.414600000000E+04	-1.227010E+02	0.000000E+00	0.000000E+00	0.000000E+00
5.514500000000E+04	-1.221805E+02	0.000000E+00	0.000000E+00	0.000000E+00
5.614400000000E+04	-1.229029E+02	0.000000E+00	0.000000E+00	0.000000E+00
5.714300000000E+04	-1.244108E+02	0.000000E+00	0.000000E+00	0.000000E+00
5.814200000000E+04	-1.224832E+02	0.000000E+00	0.000000E+00	0.000000E+00
5.914100000000E+04	-1.234797E+02	0.000000E+00	0.000000E+00	0.000000E+00
6.014000000000E+04	-1.244414E+02	0.000000E+00	0.000000E+00	0.000000E+00
6.113900000000E+04	-1.257511E+02	0.000000E+00	0.000000E+00	0.000000E+00
6.213800000000E+04	-1.269822E+02	0.000000E+00	0.000000E+00	0.000000E+00
6.313700000000E+04	-1.274660E+02	0.000000E+00	0.000000E+00	0.000000E+00
6.413600000000E+04	-1.288373E+02	0.000000E+00	0.000000E+00	0.000000E+00
6.513500000000E+04	-1.270698E+02	0.000000E+00	0.000000E+00	0.000000E+00
6.613400000000E+04	-1.272758E+02	0.000000E+00	0.000000E+00	0.000000E+00
6.713300000000E+04	-1.306004E+02	0.000000E+00	0.000000E+00	0.000000E+00
6.813200000000E+04	-1.309807E+02	0.000000E+00	0.000000E+00	0.000000E+00
6.913100000000E+04	-1.287206E+02	0.000000E+00	0.000000E+00	0.000000E+00
7.013000000000E+04	-1.302045E+02	0.000000E+00	0.000000E+00	0.000000E+00
7.112900000000E+04	-1.313877E+02	0.000000E+00	0.000000E+00	0.000000E+00
7.212800000000E+04	-1.335321E+02	0.000000E+00	0.000000E+00	0.000000E+00
7.312700000000E+04	-1.336446E+02	0.000000E+00	0.000000E+00	0.000000E+00
7.412600000000E+04	-1.342498E+02	0.000000E+00	0.000000E+00	0.000000E+00
7.512500000000E+04	-1.347433E+02	0.000000E+00	0.000000E+00	0.000000E+00
7.612400000000E+04	-1.349513E+02	0.000000E+00	0.000000E+00	0.000000E+00
7.712300000000E+04	-1.361874E+02	0.000000E+00	0.000000E+00	0.000000E+00
7.812200000000E+04	-1.379741E+02	0.000000E+00	0.000000E+00	0.000000E+00
7.912100000000E+04	-1.383038E+02	0.000000E+00	0.000000E+00	0.000000E+00
8.012000000000E+04	-1.400070E+02	0.000000E+00	0.000000E+00	0.000000E+00
8.111900000000E+04	-1.393313E+02	0.000000E+00	0.000000E+00	0.000000E+00
8.211800000000E+04	-1.379545E+02	0.000000E+00	0.000000E+00	0.000000E+00
8.311700000000E+04	-1.414560E+02	0.000000E+00	0.000000E+00	0.000000E+00
8.411600000000E+04	-1.413747E+02	0.000000E+00	0.000000E+00	0.000000E+00
8.511500000000E+04	-1.416523E+02	0.000000E+00	0.000000E+00	0.000000E+00
8.611400000000E+04	-1.426092E+02	0.000000E+00	0.000000E+00	0.000000E+00
8.711300000000E+04	-1.444960E+02	0.000000E+00	0.000000E+00	0.000000E+00
8.811200000000E+04	-1.464532E+02	0.000000E+00	0.000000E+00	0.000000E+00
8.911100000000E+04	-1.466604E+02	0.000000E+00	0.000000E+00	0.000000E+00
9.011000000000E+04	-1.459223E+02	0.000000E+00	0.000000E+00	0.000000E+00
9.110900000000E+04	-1.486192E+02	0.000000E+00	0.000000E+00	0.000000E+00
9.210800000000E+04	-1.459704E+02	0.000000E+00	0.000000E+00	0.000000E+00
9.310700000000E+04	-1.472466E+02	0.000000E+00	0.000000E+00	0.000000E+00
9.410600000000E+04	-1.479458E+02	0.000000E+00	0.000000E+00	0.000000E+00
9.510500000000E+04	-1.471078E+02	0.000000E+00	0.000000E+00	0.000000E+00
9.610400000000E+04	-1.491081E+02	0.000000E+00	0.000000E+00	0.000000E+00
9.710300000000E+04	-1.492915E+02	0.000000E+00	0.000000E+00	0.000000E+00
9.810200000000E+04	-1.523987E+02	0.000000E+00	0.000000E+00	0.000000E+00
9.910100000000E+04	-1.524300E+02	0.000000E+00	0.000000E+00	0.000000E+00
1.001000000000E+05	-1.544772E+02	0.000000E+00	0.000000E+00	0.000000E+00
1.010990000000E+05	-1.524735E+02	0.000000E+00	0.000000E+00	0.000000E+00
1.020980000000E+05	-1.535181E+02	0.000000E+00	0.000000E+00	0.000000E+00
1.030970000000E+05	-1.534305E+02	0.000000E+00	0.000000E+00	0.000000E+00
1.040960000000E+05	-1.555184E+02	0.000000E+00	0.000000E+00	0.000000E+00
1.050950000000E+05	-1.573513E+02	0.000000E+00	0.000000E+00	0.000000E+00
1.060940000000E+05	-1.541190E+02	0.000000E+00	0.000000E+00	0.000000E+00
1.070930000000E+05	-1.541562E+02	0.000000E+00	0.000000E+00	0.000000E+00
1.080920000000E+05	-1.552459E+02	0.000000E+00	0.000000E+00	0.000000E+00
1.090910000000E+05	-1.551793E+02	0.000000E+00	0.000000E+00	0.000000E+00
1.100900000000E+05	-1.569601E+02	0.000000E+00	0.000000E+00	0.000000E+00
1.110890000000E+05	-1.599224E+02	0.000000E+00	0.000000E+00	0.000000E+00
1.120880000000E+05	-1.617797E+02	0.000000E+00	0.000000E+00	0.000000E+00
1.130870000000E+05	-1.585874E+02	0.000000E+00	0.000000E+00	0.000000E+00
1.140860000000E+05	-1.624532E+02	0.000000E+00	0.000000E+00	0.000000E+00
1.150850000000E+05	-1.608319E+02	0.000000E+00	0.000000E+00	0.000000E+00
1.160840000000E+05	-1.652316E+02	0.000000E+00	0.000000E+00	0.000000E+00
1.170830000000E+05	-1.637134E+02	0.000000E+00	0.000000E+00	0.000000E+00
1.180820000000E+05	-1.617856E+02	0.000000E+00	0.000000E+00	0.000000E+00
1.190810000000E+05	-1.651346E+02	0.000000E+00	0.000000E+00	0.000000E+00
1.200800000000E+05	-1.627958E+02	0.000000E+00	0.000000E+00	0.000000E+00
1.210790000000E+05	-1.647520E+02	0.000000E+00	0.000000E+00	0.000000E+00
1.220780000000E+05	-1.647488E+02	0.000000E+00	0.000000E+00	0.000000E+00
1.230770000000E+05	-1.655441E+02	0.000000E+00	0.000000E+00	0.000000E+00
1.240760000000E+05	-1.652416E+02	0.000000E+00	0.000000E+00	0.000000E+00
1.250750000000E+05	-1.670359E+02	0.000000E+00	0.000000E+00	0.000000E+00
1.260740000000E+05	-1.671367E+02	0.000000E+00	0.000000E+00	0.000000E+00
1.270730000000E+05	-1.624361E+02	0.000000E+00	0.000000E+00	0.000000E+00
1.280720000000E+05	-1.645358E+02	0.000000E+00	0.000000E+00	0.000000E+00
1.290710000000E+05	1.761139E+02	0.000000E+00	0.000000E+00	0.000000E+00
1.300700000000E+05	-1.715242E+02	0.000000E+00	0.000000E+00	0.000000E+00
1.310690000000E+05	-1.713758E+02	0.000000E+00	0.000000E+00	0.000000E+00
1.320680000000E+05	-1.732888E+02	0.000000E+00	0.000000E+00	0.000000E+00
1.330670000000E+05	1.740034E+02	0.000000E+00	0.000000E+00	0.000000E+00
1.340660000000E+05	-1.664333E+02	0.000000E+00	0.000000E+00	0.000000E+00
1.350650000000E+05	1.784946E+02	0.000000E+00	0.000000E+00	0.000000E+00
1.360640000000E+05	1.774692E+02	0.000000E+00	0.000000E+00	0.000000E+00
1.370630000000E+05	1.798481E+02	0.000000E+00	0.000000E+00	0.000000E+00
1.380620000000E+05	-1.712219E+02	0.000000E+00	0.000000E+00	0.000000E+00
1.390610000000E+05	1.695107E+02	0.000000E+00	0.000000E+00	0.000000E+00
1.400600000000E+05	-1.765783E+02	0.000000E+00	0.000000E+00	0.000000E+00
1.410590000000E+05	-1.776808E+02	0.000000E+00	0.000000E+00	0.000000E+00
1.420580000000E+05	1.771635E+02	0.000000E+00	0.000000E+00	0.000000E+00
1.430570000000E+05	-1.779289E+02	0.000000E+00	0.000000E+00	0.000000E+00
1.440560000000E+05	-1.781306E+02	0.000000E+00	0.000000E+00	0.000000E+00
1.450550000000E+05	1.796836E+02	0.000000E+00	0.000000E+00	0.000000E+00
1.460540000000E+05	1.774332E+02	0.000000E+00	0.000000E+00	0.000000E+00
1.470530000000E+05	1.799981E+02	0.000000E+00	0.000000E+00	0.000000E+00
1.480520000000E+05	1.785924E+02	0.000000E+00	0.000000E+00	0.000000E+00
1.490510000000E+05	1.793970E+02	0.000000E+00	0.000000E+00	0.000000E+00
1.500500000000E+05	1.777115E+02	0.000000E+00	0.000000E+00	0.000000E+00
1.510490000000E+05	1.784403E+02	0.000000E+00	0.000000E+00	0.000000E+00
1.520480000000E+05	1.769039E+02	0.000000E+00	0.000000E+00	0.000000E+00
1.530470000000E+05	1.749467E+02	0.000000E+00	0.000000E+00	0.000000E+00
1.540460000000E+05	1.780439E+02	0.000000E+00	0.000000E+00	0.000000E+00
1.550450000000E+05	1.748120E+02	0.000000E+00	0.000000E+00	0.000000E+00
1.560440000000E+05	1.768371E+02	0.000000E+00	0.000000E+00	0.000000E+00
1.570430000000E+05	1.764512E+02	0.000000E+00	0.000000E+00	0.000000E+00
1.580420000000E+05	1.736780E+02	0.000000E+00	0.000000E+00	0.000000E+00
1.590410000000E+05	1.741901E+02	0.000000E+00	0.000000E+00	0.000000E+00
1.600400000000E+05	1.747930E+02	0.000000E+00	0.000000E+00	0.000000E+00
1.610390000000E+05	1.718683E+02	0.000000E+00	0.000000E+00	0.000000E+00
1.620380000000E+05	1.723307E+02	0.000000E+00	0.000000E+00	0.000000E+00
1.630370000000E+05	1.726217E+02	0.000000E+00	0.000000E+00	0.000000E+00
1.640360000000E+05	1.703597E+02	0.000000E+00	0.000000E+00	0.000000E+00
1.650350000000E+05	1.672045E+02	0.000000E+00	0.000000E+00	0.000000E+00
1.660340000000E+05	1.657701E+02	0.000000E+00	0.000000E+00	0.000000E+00
1.670330000000E+05	1.592072E+02	0.000000E+00	0.000000E+00	0.000000E+00
1.680320000000E+05	1.576972E+02	0.000000E+00	0.000000E+00	0.000000E+00
1.690310000000E+05	1.541758E+02	0.000000E+00	0.000000E+00	0.000000E+00
1.700300000000E+05	1.435154E+02	0.000000E+00	0.000000E+00	0.000000E+00
1.710290000000E+05	1.293484E+02	0.000000E+00	0.000000E+00	0.000000E+00
1.720280000000E+05	1.304500E+02	0.000000E+00	0.000000E+00	0.000000E+00
1.730270000000E+05	1.161841E+02	0.000000E+00	0.000000E+00	0.000000E+00
1.740260000000E+05	1.242331E+02	0.000000E+00	0.000000E+00	0.000000E+00
1.750250000000E+05	1.160817E+02	0.000000E+00	0.000000E+00	0.000000E+00
1.760240000000E+05	1.114678E+02	0.000000E+00	0.000000E+00	0.000000E+00
1.770230000000E+05	1.060709E+02	0.000000E+00	0.000000E+00	0.000000E+00
1.780220000000E+05	1.087337E+02	0.000000E+00	0.000000E+00	0.000000E+00
1.790210000000E+05	1.037967E+02	0.000000E+00	0.000000E+00	0.000000E+00
1.800200000000E+05	1.062512E+02	0.000000E+00	0.000000E+00	0.000000E+00
1.810190000000E+05	1.130661E+02	0.000000E+00	0.000000E+00	0.000000E+00
1.820180000000E+05	1.011892E+02	0.000000E+00	0.000000E+00	0.000000E+00
1.830170000000E+05	1.019496E+02	0.000000E+00	0.000000E+00	0.000000E+00
1.840160000000E+05	1.103750E+02	0.000000E+00	0.000000E+00	0.000000E+00
1.850150000000E+05	1.092090E+02	0.000000E+00	0.000000E+00	0.000000E+00
1.860140000000E+05	1.061148E+02	0.000000E+00	0.000000E+00	0.000000E+00
1.870130000000E+05	1.108468E+02	0.000000E+00	0.000000E+00	0.000000E+00
1.880120000000E+05	1.078685E+02	0.000000E+00	0.000000E+00	0.000000E+00
1.890110000000E+05	1.116331E+02	0.000000E+00	0.000000E+00	0.000000E+00
1.900100000000E+05	1.037941E+02	0.000000E+00	0.000000E+00	0.000000E+00
1.910090000000E+05	1.074709E+02	0.000000E+00	0.000000E+00	0.000000E+00
1.920080000000E+05	1.069515E+02	0.000000E+00	0.000000E+00	0.000000E+00
1.930070000000E+05	1.079444E+02	0.000000E+00	0.000000E+00	0.000000E+00
1.940060000000E+05	1.045746E+02	0.000000E+00	0.000000E+00	0.000000E+00
1.950050000000E+05	1.058627E+02	0.000000E+00	0.000000E+00	0.000000E+00
1.960040000000E+05	9.813245E+01	0.000000E+00	0.000000E+00	0.000000E+00
1.970030000000E+05	9.831684E+01	0.000000E+00	0.000000E+00	0.000000E+00
1.980020000000E+05	9.727402E+01	0.000000E+00	0.000000E+00	0.000000E+00
1.990010000000E+05	9.847848E+01	0.000000E+00	0.000000E+00	0.000000E+00
2.000000000000E+05	9.906755E+01	0.000000E+00	0.000000E+00	0.000000E+00