  0.000000e+00   4.490855e-05   0.000000e+00   4.490855e-05   0.000000e+00 
  2.500000e-01   4.349524e-05   0.000000e+00   4.349524e-05   0.000000e+00 
  5.000000e-01   4.660935e-05   0.000000e+00   4.660935e-05   0.000000e+00 
  7.500000e-01   3.689265e-05   0.000000e+00   3.689265e-05   0.000000e+00 
  1.000000e+00   3.367658e-05   0.000000e+00   3.367658e-05   0.000000e+00 
  1.250000e+00   3.483226e-05   0.000000e+00   3.483226e-05   0.000000e+00 
  1.500000e+00   3.501247e-05   0.000000e+00   3.501247e-05   0.000000e+00 
  1.750000e+00   3.612887e-05   0.000000e+00   3.612887e-05   0.000000e+00 
  2.000000e+00   3.593745e-05   0.000000e+00   3.593745e-05   0.000000e+00 
  2.250000e+00   3.631314e-05   0.000000e+00   3.631314e-05   0.000000e+00 
  2.500000e+00   3.479775e-05   0.000000e+00   3.479775e-05   0.000000e+00 
  2.750000e+00   3.220618e-05   0.000000e+00   3.220618e-05   0.000000e+00 
  3.000000e+00   3.226761e-05   0.000000e+00   3.226761e-05   0.000000e+00 
  3.250000e+00   3.137213e-05   0.000000e+00   3.137213e-05   0.000000e+00 
  3.500000e+00   3.196152e-05   0.000000e+00   3.196152e-05   0.000000e+00 
  3.750000e+00   3.664415e-05   0.000000e+00   3.664415e-05   0.000000e+00 
  4.000000e+00   3.464162e-05   0.000000e+00   3.464162e-05   0.000000e+00 
  4.250000e+00   3.360980e-05   0.000000e+00   3.360980e-05   0.000000e+00 
  4.500000e+00   3.608900e-05   0.000000e+00   3.608900e-05   0.000000e+00 
  4.750000e+00   3.260916e-05   0.000000e+00   3.260916e-05   0.000000e+00 
  5.000000e+00   3.566228e-05   0.000000e+00   3.566228e-05   0.000000e+00 
  5.250000e+00   3.845150e-05   0.000000e+00   3.845150e-05   0.000000e+00 
  5.500000e+00   3.516272e-05   0.000000e+00   3.516272e-05   0.000000e+00 
  5.750000e+00   3.343031e-05   0.000000e+00   3.343031e-05   0.000000e+00 
  6.000000e+00   3.141699e-05   0.000000e+00   3.141699e-05   0.000000e+00 
  6.250000e+00   3.591030e-05   0.000000e+00   3.591030e-05   0.000000e+00 
  6.500000e+00   3.701902e-05   0.000000e+00   3.701902e-05   0.000000e+00 
  6.750000e+00   3.288849e-05   0.000000e+00   3.288849e-05   0.000000e+00 
  7.000000e+00   3.462839e-05   0.000000e+00   3.462839e-05   0.000000e+00 
  7.250000e+00   3.446636e-05   0.000000e+00   3.446636e-05   0.000000e+00 
  7.500000e+00   3.319018e-05   0.000000e+00   3.319018e-05   0.000000e+00 
  7.750000e+00   3.778686e-05   0.000000e+00   3.778686e-05   0.000000e+00 
  8.000000e+00   3.596442e-05   0.000000e+00   3.596442e-05   0.000000e+00 
  8.250000e+00   3.414404e-05   0.000000e+00   3.414404e-05   0.000000e+00 
  8.500000e+00   3.964103e-05   0.000000e+00   3.964103e-05   0.000000e+00 
  8.750000e+00   3.765725e-05   0.000000e+00   3.765725e-05   0.000000e+00 
  9.000000e+00   3.298345e-05   0.000000e+00   3.298345e-05   0.000000e+00 
  9.250000e+00   3.800658e-05   0.000000e+00   3.800658e-05   0.000000e+00 
  9.500000e+00   3.655176e-05   0.000000e+00   3.655176e-05   0.000000e+00 
  9.750000e+00   3.084823e-05   0.000000e+00   3.084823e-05   0.000000e+00 
  1.000000e+01   3.627102e-05   0.000000e+00   3.627102e-05   0.000000e+00 
  1.025000e+01   4.013312e-05   0.000000e+00   4.013312e-05   0.000000e+00 
  1.050000e+01   3.957830e-05   0.000000e+00   3.957830e-05   0.000000e+00 
  1.075000e+01   3.819988e-05   0.000000e+00   3.819988e-05   0.000000e+00 
  1.100000e+01   3.284980e-05   0.000000e+00   3.284980e-05   0.000000e+00 
  1.125000e+01   3.013399e-05   0.000000e+00   3.013399e-05   0.000000e+00 
  1.150000e+01   2.920353e-05   0.000000e+00   2.920353e-05   0.000000e+00 
  1.175000e+01   3.140727e-05   0.000000e+00   3.140727e-05   0.000000e+00 
  1.200000e+01   3.712097e-05   0.000000e+00   3.712097e-05   0.000000e+00 
  1.225000e+01   3.562907e-05   0.000000e+00   3.562907e-05   0.000000e+00 
  1.250000e+01   3.234648e-05   0.000000e+00   3.234648e-05   0.000000e+00 
  1.275000e+01   3.235569e-05   0.000000e+00   3.235569e-05   0.000000e+00 
  1.300000e+01   3.717984e-05   0.000000e+00   3.717984e-05   0.000000e+00 
  1.325000e+01   3.911793e-05   0.000000e+00   3.911793e-05   0.000000e+00 
  1.350000e+01   3.436686e-05   0.000000e+00   3.436686e-05   0.000000e+00 
  1.375000e+01   3.526518e-05   0.000000e+00   3.526518e-05   0.000000e+00 
  1.400000e+01   3.534744e-05   0.000000e+00   3.534744e-05   0.000000e+00 
  1.425000e+01   3.614992e-05   0.000000e+00   3.614992e-05   0.000000e+00 
  1.450000e+01   3.340491e-05   0.000000e+00   3.340491e-05   0.000000e+00 
  1.475000e+01   3.266546e-05   0.000000e+00   3.266546e-05   0.000000e+00 
  1.500000e+01   3.450987e-05   0.000000e+00   3.450987e-05   0.000000e+00 
  1.525000e+01   3.928706e-05   0.000000e+00   3.928706e-05   0.000000e+00 
  1.550000e+01   3.428842e-05   0.000000e+00   3.428842e-05   0.000000e+00 
  1.575000e+01   3.371844e-05   0.000000e+00   3.371844e-05   0.000000e+00 
  1.600000e+01   4.129879e-05   0.000000e+00   4.129879e-05   0.000000e+00 
  1.625000e+01   3.823183e-05   0.000000e+00   3.823183e-05   0.000000e+00 
  1.650000e+01   3.133912e-05   0.000000e+00   3.133912e-05   0.000000e+00 
  1.675000e+01   3.594104e-05   0.000000e+00   3.594104e-05   0.000000e+00 
  1.700000e+01   3.722828e-05   0.000000e+00   3.722828e-05   0.000000e+00 
  1.725000e+01   3.547770e-05   0.000000e+00   3.547770e-05   0.000000e+00 
  1.750000e+01   3.094273e-05   0.000000e+00   3.094273e-05   0.000000e+00 
  1.775000e+01   3.378564e-05   0.000000e+00   3.378564e-05   0.000000e+00 
  1.800000e+01   3.240680e-05   0.000000e+00   3.240680e-05   0.000000e+00 
  1.825000e+01   3.205560e-05   0.000000e+00   3.205560e-05   0.000000e+00 
  1.850000e+01   3.312808e-05   0.000000e+00   3.312808e-05   0.000000e+00 
  1.875000e+01   3.546859e-05   0.000000e+00   3.546859e-05   0.000000e+00 
  1.900000e+01   3.266253e-05   0.000000e+00   3.266253e-05   0.000000e+00 
  1.925000e+01   3.328065e-05   0.000000e+00   3.328065e-05   0.000000e+00 
  1.950000e+01   2.960427e-05   0.000000e+00   2.960427e-05   0.000000e+00 
  1.975000e+01   3.126481e-05   0.000000e+00   3.126481e-05   0.000000e+00 
  2.000000e+01   3.221676e-05   0.000000e+00   3.221676e-05   0.000000e+00 
  2.025000e+01   3.228200e-05   0.000000e+00   3.228200e-05   0.000000e+00 
  2.050000e+01   3.491927e-05   0.000000e+00   3.491927e-05   0.000000e+00 
  2.075000e+01   3.323707e-05   0.000000e+00   3.323707e-05   0.000000e+00 
  2.100000e+01   3.304893e-05   0.000000e+00   3.304893e-05   0.000000e+00 
  2.125000e+01   3.404659e-05   0.000000e+00   3.404659e-05   0.000000e+00 
  2.150000e+01   4.212710e-05   0.000000e+00   4.212710e-05   0.000000e+00 
  2.175000e+01   3.672820e-05   0.000000e+00   3.672820e-05   0.000000e+00 
  2.200000e+01   3.153787e-05   0.000000e+00   3.153787e-05   0.000000e+00 
  2.225000e+01   3.530205e-05   0.000000e+00   3.530205e-05   0.000000e+00 
  2.250000e+01   3.347319e-05   0.000000e+00   3.347319e-05   0.000000e+00 
  2.275000e+01   3.478412e-05   0.000000e+00   3.478412e-05   0.000000e+00 
  2.300000e+01   3.884894e-05   0.000000e+00   3.884894e-05   0.000000e+00 
  2.325000e+01   4.065458e-05   0.000000e+00   4.065458e-05   0.000000e+00 
  2.350000e+01   3.372795e-05   0.000000e+00   3.372795e-05   0.000000e+00 
  2.375000e+01   3.360953e-05   0.000000e+00   3.360953e-05   0.000000e+00 
  2.400000e+01   3.250186e-05   0.000000e+00   3.250186e-05   0.000000e+00 
  2.425000e+01   3.200591e-05   0.000000e+00   3.200591e-05   0.000000e+00 
  2.450000e+01   3.184388e-05   0.000000e+00   3.184388e-05   0.000000e+00 
  2.475000e+01   3.268297e-05   0.000000e+00   3.268297e-05   0.000000e+00 
  2.500000e+01   3.177990e-05   0.000000e+00   3.177990e-05   0.000000e+00 
  2.525000e+01   3.313510e-05   0.000000e+00   3.313510e-05   0.000000e+00 
  2.550000e+01   3.494370e-05   0.000000e+00   3.494370e-05   0.000000e+00 
  2.575000e+01   3.835996e-05   0.000000e+00   3.835996e-05   0.000000e+00 
  2.600000e+01   4.234227e-05   0.000000e+00   4.234227e-05   0.000000e+00 
  2.625000e+01   3.996119e-05   0.000000e+00   3.996119e-05   0.000000e+00 
  2.650000e+01   3.237714e-05   0.000000e+00   3.237714e-05   0.000000e+00 
  2.675000e+01   3.505933e-05   0.000000e+00   3.505933e-05   0.000000e+00 
  2.700000e+01   3.158220e-05   0.000000e+00   3.158220e-05   0.000000e+00 
  2.725000e+01   3.128128e-05   0.000000e+00   3.128128e-05   0.000000e+00 
  2.750000e+01   3.498578e-05   0.000000e+00   3.498578e-05   0.000000e+00 
  2.775000e+01   3.919738e-05   0.000000e+00   3.919738e-05   0.000000e+00 
  2.800000e+01   3.638900e-05   0.000000e+00   3.638900e-05   0.000000e+00 
  2.825000e+01   3.600520e-05   0.000000e+00   3.600520e-05   0.000000e+00 
  2.850000e+01   3.632400e-05   0.000000e+00   3.632400e-05   0.000000e+00 
  2.875000e+01   3.523308e-05   0.000000e+00   3.523308e-05   0.000000e+00 
  2.900000e+01   3.150813e-05   0.000000e+00   3.150813e-05   0.000000e+00 
  2.925000e+01   3.287683e-05   0.000000e+00   3.287683e-05   0.000000e+00 
  2.950000e+01   3.595700e-05   0.000000e+00   3.595700e-05   0.000000e+00 
  2.975000e+01   3.228845e-05   0.000000e+00   3.228845e-05   0.000000e+00 
  3.000000e+01   3.160454e-05   0.000000e+00   3.160454e-05   0.000000e+00 
  3.025000e+01   3.505133e-05   0.000000e+00   3.505133e-05   0.000000e+00 
  3.050000e+01   3.941719e-05   0.000000e+00   3.941719e-05   0.000000e+00 
  3.075000e+01   3.781684e-05   0.000000e+00   3.781684e-05   0.000000e+00 
  3.100000e+01   3.607116e-05   0.000000e+00   3.607116e-05   0.000000e+00 
  3.125000e+01   3.513773e-05   0.000000e+00   3.513773e-05   0.000000e+00 
  3.150000e+01   3.273273e-05   0.000000e+00   3.273273e-05   0.000000e+00 
  3.175000e+01   3.449982e-05   0.000000e+00   3.449982e-05   0.000000e+00 
  3.200000e+01   3.491620e-05   0.000000e+00   3.491620e-05   0.000000e+00 
  3.225000e+01   3.353782e-05   0.000000e+00   3.353782e-05   0.000000e+00 
  3.250000e+01   3.658042e-05   0.000000e+00   3.658042e-05   0.000000e+00 
  3.275000e+01   3.220934e-05   0.000000e+00   3.220934e-05   0.000000e+00 
  3.300000e+01   3.433935e-05   0.000000e+00   3.433935e-05   0.000000e+00 
  3.325000e+01   3.548412e-05   0.000000e+00   3.548412e-05   0.000000e+00 
  3.350000e+01   3.353854e-05   0.000000e+00   3.353854e-05   0.000000e+00 
  3.375000e+01   3.354310e-05   0.000000e+00   3.354310e-05   0.000000e+00 
  3.400000e+01   3.303521e-05   0.000000e+00   3.303521e-05   0.000000e+00 
  3.425000e+01   3.395832e-05   0.000000e+00   3.395832e-05   0.000000e+00 
  3.450000e+01   3.877046e-05   0.000000e+00   3.877046e-05   0.000000e+00 
  3.475000e+01   4.074527e-05   0.000000e+00   4.074527e-05   0.000000e+00 
  3.500000e+01   3.738890e-05   0.000000e+00   3.738890e-05   0.000000e+00 
  3.525000e+01   3.356342e-05   0.000000e+00   3.356342e-05   0.000000e+00 
  3.550000e+01   3.179272e-05   0.000000e+00   3.179272e-05   0.000000e+00 
  3.575000e+01   3.745363e-05   0.000000e+00   3.745363e-05   0.000000e+00 
  3.600000e+01   3.528889e-05   0.000000e+00   3.528889e-05   0.000000e+00 
  3.625000e+01   3.425499e-05   0.000000e+00   3.425499e-05   0.000000e+00 
  3.650000e+01   3.369522e-05   0.000000e+00   3.369522e-05   0.000000e+00 
  3.675000e+01   3.419055e-05   0.000000e+00   3.419055e-05   0.000000e+00 
  3.700000e+01   3.224436e-05   0.000000e+00   3.224436e-05   0.000000e+00 
  3.725000e+01   3.077287e-05   0.000000e+00   3.077287e-05   0.000000e+00 
  3.750000e+01   3.411795e-05   0.000000e+00   3.411795e-05   0.000000e+00 
  3.775000e+01   4.104715e-05   0.000000e+00   4.104715e-05   0.000000e+00 
  3.800000e+01   3.226642e-05   0.000000e+00   3.226642e-05   0.000000e+00 
  3.825000e+01   3.272065e-05   0.000000e+00   3.272065e-05   0.000000e+00 
  3.850000e+01   3.628729e-05   0.000000e+00   3.628729e-05   0.000000e+00 
  3.875000e+01   3.770381e-05   0.000000e+00   3.770381e-05   0.000000e+00 
  3.900000e+01   4.185602e-05   0.000000e+00   4.185602e-05   0.000000e+00 
  3.925000e+01   3.731304e-05   0.000000e+00   3.731304e-05   0.000000e+00 
  3.950000e+01   3.457404e-05   0.000000e+00   3.457404e-05   0.000000e+00 
  3.975000e+01   3.261284e-05   0.000000e+00   3.261284e-05   0.000000e+00 
  4.000000e+01   3.777544e-05   0.000000e+00   3.777544e-05   0.000000e+00 
  4.025000e+01   3.781868e-05   0.000000e+00   3.781868e-05   0.000000e+00 
  4.050000e+01   3.297099e-05   0.000000e+00   3.297099e-05   0.000000e+00 
  4.075000e+01   3.425159e-05   0.000000e+00   3.425159e-05   0.000000e+00 
  4.100000e+01   3.167339e-05   0.000000e+00   3.167339e-05   0.000000e+00 
  4.125000e+01   3.303427e-05   0.000000e+00   3.303427e-05   0.000000e+00 
  4.150000e+01   3.609063e-05   0.000000e+00   3.609063e-05   0.000000e+00 
  4.175000e+01   3.272588e-05   0.000000e+00   3.272588e-05   0.000000e+00 
  4.200000e+01   3.453101e-05   0.000000e+00   3.453101e-05   0.000000e+00 
  4.225000e+01   3.105832e-05   0.000000e+00   3.105832e-05   0.000000e+00 
  4.250000e+01   3.235348e-05   0.000000e+00   3.235348e-05   0.000000e+00 
  4.275000e+01   3.569426e-05   0.000000e+00   3.569426e-05   0.000000e+00 
  4.300000e+01   3.810263e-05   0.000000e+00   3.810263e-05   0.000000e+00 
  4.325000e+01   3.293592e-05   0.000000e+00   3.293592e-05   0.000000e+00 
  4.350000e+01   3.091479e-05   0.000000e+00   3.091479e-05   0.000000e+00 
  4.375000e+01   2.989156e-05   0.000000e+00   2.989156e-05   0.000000e+00 
  4.400000e+01   3.740068e-05   0.000000e+00   3.740068e-05   0.000000e+00 
  4.425000e+01   3.628535e-05   0.000000e+00   3.628535e-05   0.000000e+00 
  4.450000e+01   3.504803e-05   0.000000e+00   3.504803e-05   0.000000e+00 
  4.475000e+01   4.024309e-05   0.000000e+00   4.024309e-05   0.000000e+00 
  4.500000e+01   3.426782e-05   0.000000e+00   3.426782e-05   0.000000e+00 
  4.525000e+01   3.304999e-05   0.000000e+00   3.304999e-05   0.000000e+00 
  4.550000e+01   3.055405e-05   0.000000e+00   3.055405e-05   0.000000e+00 
  4.575000e+01   3.262347e-05   0.000000e+00   3.262347e-05   0.000000e+00 
  4.600000e+01   3.432457e-05   0.000000e+00   3.432457e-05   0.000000e+00 
  4.625000e+01   3.325403e-05   0.000000e+00   3.325403e-05   0.000000e+00 
  4.650000e+01   3.083142e-05   0.000000e+00   3.083142e-05   0.000000e+00 
  4.675000e+01   3.315029e-05   0.000000e+00   3.315029e-05   0.000000e+00 
  4.700000e+01   3.578072e-05   0.000000e+00   3.578072e-05   0.000000e+00 
  4.725000e+01   3.698952e-05   0.000000e+00   3.698952e-05   0.000000e+00 
  4.750000e+01   3.590017e-05   0.000000e+00   3.590017e-05   0.000000e+00 
  4.775000e+01   2.950756e-05   0.000000e+00   2.950756e-05   0.000000e+00 
  4.800000e+01   3.515134e-05   0.000000e+00   3.515134e-05   0.000000e+00 
  4.825000e+01   3.566828e-05   0.000000e+00   3.566828e-05   0.000000e+00 
  4.850000e+01   3.752859e-05   0.000000e+00   3.752859e-05   0.000000e+00 
  4.875000e+01   3.846006e-05   0.000000e+00   3.846006e-05   0.000000e+00 
  4.900000e+01   3.288342e-05   0.000000e+00   3.288342e-05   0.000000e+00 
  4.925000e+01   3.199062e-05   0.000000e+00   3.199062e-05   0.000000e+00 
  4.950000e+01   3.231896e-05   0.000000e+00   3.231896e-05   0.000000e+00 
  4.975000e+01   3.258056e-05   0.000000e+00   3.258056e-05   0.000000e+00 
  5.000000e+01   3.973398e-05   0.000000e+00   3.973398e-05   0.000000e+00 
  5.025000e+01   3.850134e-05   0.000000e+00   3.850134e-05   0.000000e+00 
  5.050000e+01   3.604327e-05   0.000000e+00   3.604327e-05   0.000000e+00 
  5.075000e+01   3.522443e-05   0.000000e+00   3.522443e-05   0.000000e+00 
  5.100000e+01   3.460485e-05   0.000000e+00   3.460485e-05   0.000000e+00 
  5.125000e+01   3.299479e-05   0.000000e+00   3.299479e-05   0.000000e+00 
  5.150000e+01   3.244643e-05   0.000000e+00   3.244643e-05   0.000000e+00 
  5.175000e+01   3.260657e-05   0.000000e+00   3.260657e-05   0.000000e+00 
  5.200000e+01   3.337364e-05   0.000000e+00   3.337364e-05   0.000000e+00 
  5.225000e+01   3.155519e-05   0.000000e+00   3.155519e-05   0.000000e+00 
  5.250000e+01   2.969733e-05   0.000000e+00   2.969733e-05   0.000000e+00 
  5.275000e+01   3.241658e-05   0.000000e+00   3.241658e-05   0.000000e+00 
  5.300000e+01   3.063309e-05   0.000000e+00   3.063309e-05   0.000000e+00 
  5.325000e+01   3.262038e-05   0.000000e+00   3.262038e-05   0.000000e+00 
  5.350000e+01   3.123521e-05   0.000000e+00   3.123521e-05   0.000000e+00 
  5.375000e+01   3.066467e-05   0.000000e+00   3.066467e-05   0.000000e+00 
  5.400000e+01   3.265408e-05   0.000000e+00   3.265408e-05   0.000000e+00 
  5.425000e+01   3.111282e-05   0.000000e+00   3.111282e-05   0.000000e+00 
  5.450000e+01   3.863753e-05   0.000000e+00   3.863753e-05   0.000000e+00 
  5.475000e+01   3.930536e-05   0.000000e+00   3.930536e-05   0.000000e+00 
  5.500000e+01   3.312856e-05   0.000000e+00   3.312856e-05   0.000000e+00 
  5.525000e+01   3.458334e-05   0.000000e+00   3.458334e-05   0.000000e+00 
  5.550000e+01   3.625904e-05   0.000000e+00   3.625904e-05   0.000000e+00 
  5.575000e+01   3.582067e-05   0.000000e+00   3.582067e-05   0.000000e+00 
  5.600000e+01   3.565356e-05   0.000000e+00   3.565356e-05   0.000000e+00 
  5.625000e+01   3.586411e-05   0.000000e+00   3.586411e-05   0.000000e+00 
  5.650000e+01   2.978837e-05   0.000000e+00   2.978837e-05   0.000000e+00 
  5.675000e+01   2.992347e-05   0.000000e+00   2.992347e-05   0.000000e+00 
  5.700000e+01   3.155318e-05   0.000000e+00   3.155318e-05   0.000000e+00 
  5.725000e+01   3.135756e-05   0.000000e+00   3.135756e-05   0.000000e+00 
  5.750000e+01   3.611715e-05   0.000000e+00   3.611715e-05   0.000000e+00 
  5.775000e+01   3.190169e-05   0.000000e+00   3.190169e-05   0.000000e+00 
  5.800000e+01   2.912543e-05   0.000000e+00   2.912543e-05   0.000000e+00 
  5.825000e+01   3.392630e-05   0.000000e+00   3.392630e-05   0.000000e+00 
  5.850000e+01   3.225225e-05   0.000000e+00   3.225225e-05   0.000000e+00 
  5.875000e+01   3.271924e-05   0.000000e+00   3.271924e-05   0.000000e+00 
  5.900000e+01   3.409374e-05   0.000000e+00   3.409374e-05   0.000000e+00 
  5.925000e+01   2.853010e-05   0.000000e+00   2.853010e-05   0.000000e+00 
  5.950000e+01   2.807281e-05   0.000000e+00   2.807281e-05   0.000000e+00 
  5.975000e+01   2.760378e-05   0.000000e+00   2.760378e-05   0.000000e+00 
  6.000000e+01   3.055048e-05   0.000000e+00   3.055048e-05   0.000000e+00 
  6.025000e+01   2.868120e-05   0.000000e+00   2.868120e-05   0.000000e+00 
  6.050000e+01   3.007498e-05   0.000000e+00   3.007498e-05   0.000000e+00 
  6.075000e+01   3.195670e-05   0.000000e+00   3.195670e-05   0.000000e+00 
  6.100000e+01   3.558721e-05   0.000000e+00   3.558721e-05   0.000000e+00 
  6.125000e+01   3.572063e-05   0.000000e+00   3.572063e-05   0.000000e+00 
  6.150000e+01   3.522108e-05   0.000000e+00   3.522108e-05   0.000000e+00 
  6.175000e+01   3.638180e-05   0.000000e+00   3.638180e-05   0.000000e+00 
  6.200000e+01   3.758688e-05   0.000000e+00   3.758688e-05   0.000000e+00 
  6.225000e+01   3.437908e-05   0.000000e+00   3.437908e-05   0.000000e+00 
  6.250000e+01   3.329173e-05   0.000000e+00   3.329173e-05   0.000000e+00 
  6.275000e+01   3.282321e-05   0.000000e+00   3.282321e-05   0.000000e+00 
  6.300000e+01   3.295997e-05   0.000000e+00   3.295997e-05   0.000000e+00 
  6.325000e+01   3.723743e-05   0.000000e+00   3.723743e-05   0.000000e+00 
  6.350000e+01   3.683385e-05   0.000000e+00   3.683385e-05   0.000000e+00 
  6.375000e+01   3.515509e-05   0.000000e+00   3.515509e-05   0.000000e+00 
  6.400000e+01   3.333477e-05   0.000000e+00   3.333477e-05   0.000000e+00 
  6.425000e+01   2.928701e-05   0.000000e+00   2.928701e-05   0.000000e+00 
  6.450000e+01   3.408218e-05   0.000000e+00   3.408218e-05   0.000000e+00 
  6.475000e+01   3.702476e-05   0.000000e+00   3.702476e-05   0.000000e+00 
  6.500000e+01   3.469633e-05   0.000000e+00   3.469633e-05   0.000000e+00 
  6.525000e+01   3.267702e-05   0.000000e+00   3.267702e-05   0.000000e+00 
  6.550000e+01   2.787447e-05   0.000000e+00   2.787447e-05   0.000000e+00 
  6.575000e+01   3.054843e-05   0.000000e+00   3.054843e-05   0.000000e+00 
  6.600000e+01   3.483045e-05   0.000000e+00   3.483045e-05   0.000000e+00 
  6.625000e+01   2.915407e-05   0.000000e+00   2.915407e-05   0.000000e+00 
  6.650000e+01   3.370519e-05   0.000000e+00   3.370519e-05   0.000000e+00 
  6.675000e+01   4.160759e-05   0.000000e+00   4.160759e-05   0.000000e+00 
  6.700000e+01   3.951976e-05   0.000000e+00   3.951976e-05   0.000000e+00 
  6.725000e+01   3.393230e-05   0.000000e+00   3.393230e-05   0.000000e+00 
  6.750000e+01   3.166712e-05   0.000000e+00   3.166712e-05   0.000000e+00 
  6.775000e+01   3.085415e-05   0.000000e+00   3.085415e-05   0.000000e+00 
  6.800000e+01   3.472057e-05   0.000000e+00   3.472057e-05   0.000000e+00 
  6.825000e+01   3.593568e-05   0.000000e+00   3.593568e-05   0.000000e+00 
  6.850000e+01   3.826535e-05   0.000000e+00   3.826535e-05   0.000000e+00 
  6.875000e+01   3.409184e-05   0.000000e+00   3.409184e-05   0.000000e+00 
  6.900000e+01   3.346333e-05   0.000000e+00   3.346333e-05   0.000000e+00 
  6.925000e+01   3.438795e-05   0.000000e+00   3.438795e-05   0.000000e+00 
  6.950000e+01   2.950846e-05   0.000000e+00   2.950846e-05   0.000000e+00 
  6.975000e+01   3.065615e-05   0.000000e+00   3.065615e-05   0.000000e+00 
  7.000000e+01   3.594607e-05   0.000000e+00   3.594607e-05   0.000000e+00 
  7.025000e+01   3.388208e-05   0.000000e+00   3.388208e-05   0.000000e+00 
  7.050000e+01   3.759392e-05   0.000000e+00   3.759392e-05   0.000000e+00 
  7.075000e+01   3.739867e-05   0.000000e+00   3.739867e-05   0.000000e+00 
  7.100000e+01   3.103883e-05   0.000000e+00   3.103883e-05   0.000000e+00 
  7.125000e+01   3.270923e-05   0.000000e+00   3.270923e-05   0.000000e+00 
  7.150000e+01   3.370477e-05   0.000000e+00   3.370477e-05   0.000000e+00 
  7.175000e+01   3.374241e-05   0.000000e+00   3.374241e-05   0.000000e+00 
  7.200000e+01   2.720846e-05   0.000000e+00   2.720846e-05   0.000000e+00 
  7.225000e+01   3.388173e-05   0.000000e+00   3.388173e-05   0.000000e+00 
  7.250000e+01   3.262749e-05   0.000000e+00   3.262749e-05   0.000000e+00 
  7.275000e+01   3.368448e-05   0.000000e+00   3.368448e-05   0.000000e+00 
  7.300000e+01   3.773882e-05   0.000000e+00   3.773882e-05   0.000000e+00 
  7.325000e+01   3.608792e-05   0.000000e+00   3.608792e-05   0.000000e+00 
  7.350000e+01   3.087403e-05   0.000000e+00   3.087403e-05   0.000000e+00 
  7.375000e+01   3.319519e-05   0.000000e+00   3.319519e-05   0.000000e+00 
  7.400000e+01   3.566973e-05   0.000000e+00   3.566973e-05   0.000000e+00 
  7.425000e+01   3.405672e-05   0.000000e+00   3.405672e-05   0.000000e+00 
  7.450000e+01   3.620249e-05   0.000000e+00   3.620249e-05   0.000000e+00 
  7.475000e+01   3.209004e-05   0.000000e+00   3.209004e-05   0.000000e+00 
  7.500000e+01   3.237173e-05   0.000000e+00   3.237173e-05   0.000000e+00 
  7.525000e+01   3.371953e-05   0.000000e+00   3.371953e-05   0.000000e+00 
  7.550000e+01   3.592838e-05   0.000000e+00   3.592838e-05   0.000000e+00 
  7.575000e+01   3.813980e-05   0.000000e+00   3.813980e-05   0.000000e+00 
  7.600000e+01   3.815008e-05   0.000000e+00   3.815008e-05   0.000000e+00 
  7.625000e+01   3.837567e-05   0.000000e+00   3.837567e-05   0.000000e+00 
  7.650000e+01   3.489869e-05   0.000000e+00   3.489869e-05   0.000000e+00 
  7.675000e+01   3.309580e-05   0.000000e+00   3.309580e-05   0.000000e+00 
  7.700000e+01   3.402429e-05   0.000000e+00   3.402429e-05   0.000000e+00 
  7.725000e+01   3.332971e-05   0.000000e+00   3.332971e-05   0.000000e+00 
  7.750000e+01   3.175229e-05   0.000000e+00   3.175229e-05   0.000000e+00 
  7.775000e+01   3.817863e-05   0.000000e+00   3.817863e-05   0.000000e+00 
  7.800000e+01   3.632310e-05   0.000000e+00   3.632310e-05   0.000000e+00 
  7.825000e+01   3.636355e-05   0.000000e+00   3.636355e-05   0.000000e+00 
  7.850000e+01   3.781394e-05   0.000000e+00   3.781394e-05   0.000000e+00 
  7.875000e+01   3.369716e-05   0.000000e+00   3.369716e-05   0.000000e+00 
  7.900000e+01   3.359784e-05   0.000000e+00   3.359784e-05   0.000000e+00 
  7.925000e+01   3.101566e-05   0.000000e+00   3.101566e-05   0.000000e+00 
  7.950000e+01   3.059072e-05   0.000000e+00   3.059072e-05   0.000000e+00 
  7.975000e+01   3.471327e-05   0.000000e+00   3.471327e-05   0.000000e+00 
  8.000000e+01   3.517085e-05   0.000000e+00   3.517085e-05   0.000000e+00 
  8.025000e+01   3.179661e-05   0.000000e+00   3.179661e-05   0.000000e+00 
  8.050000e+01   2.649551e-05   0.000000e+00   2.649551e-05   0.000000e+00 
  8.075000e+01   3.739914e-05   0.000000e+00   3.739914e-05   0.000000e+00 
  8.100000e+01   3.722320e-05   0.000000e+00   3.722320e-05   0.000000e+00 
  8.125000e+01   3.153876e-05   0.000000e+00   3.153876e-05   0.000000e+00 
  8.150000e+01   3.254930e-05   0.000000e+00   3.254930e-05   0.000000e+00 
  8.175000e+01   3.243949e-05   0.000000e+00   3.243949e-05   0.000000e+00 
  8.200000e+01   3.124279e-05   0.000000e+00   3.124279e-05   0.000000e+00 
  8.225000e+01   2.930600e-05   0.000000e+00   2.930600e-05   0.000000e+00 
  8.250000e+01   3.632819e-05   0.000000e+00   3.632819e-05   0.000000e+00 
  8.275000e+01   3.736481e-05   0.000000e+00   3.736481e-05   0.000000e+00 
  8.300000e+01   3.640910e-05   0.000000e+00   3.640910e-05   0.000000e+00 
  8.325000e+01   3.582264e-05   0.000000e+00   3.582264e-05   0.000000e+00 
  8.350000e+01   2.775709e-05   0.000000e+00   2.775709e-05   0.000000e+00 
  8.375000e+01   3.596122e-05   0.000000e+00   3.596122e-05   0.000000e+00 
  8.400000e+01   3.580133e-05   0.000000e+00   3.580133e-05   0.000000e+00 
  8.425000e+01   3.270620e-05   0.000000e+00   3.270620e-05   0.000000e+00 
  8.450000e+01   3.530040e-05   0.000000e+00   3.530040e-05   0.000000e+00 
  8.475000e+01   3.610821e-05   0.000000e+00   3.610821e-05   0.000000e+00 
  8.500000e+01   3.770730e-05   0.000000e+00   3.770730e-05   0.000000e+00 
  8.525000e+01   3.925727e-05   0.000000e+00   3.925727e-05   0.000000e+00 
  8.550000e+01   3.940114e-05   0.000000e+00   3.940114e-05   0.000000e+00 
  8.575000e+01   3.102788e-05   0.000000e+00   3.102788e-05   0.000000e+00 
  8.600000e+01   3.025444e-05   0.000000e+00   3.025444e-05   0.000000e+00 
  8.625000e+01   3.250888e-05   0.000000e+00   3.250888e-05   0.000000e+00 
  8.650000e+01   3.111250e-05   0.000000e+00   3.111250e-05   0.000000e+00 
  8.675000e+01   3.827169e-05   0.000000e+00   3.827169e-05   0.000000e+00 
  8.700000e+01   3.867923e-05   0.000000e+00   3.867923e-05   0.000000e+00 
  8.725000e+01   3.471109e-05   0.000000e+00   3.471109e-05   0.000000e+00 
  8.750000e+01   3.805415e-05   0.000000e+00   3.805415e-05   0.000000e+00 
  8.775000e+01   3.283823e-05   0.000000e+00   3.283823e-05   0.000000e+00 
  8.800000e+01   3.294360e-05   0.000000e+00   3.294360e-05   0.000000e+00 
  8.825000e+01   3.461146e-05   0.000000e+00   3.461146e-05   0.000000e+00 
  8.850000e+01   3.352420e-05   0.000000e+00   3.352420e-05   0.000000e+00 
  8.875000e+01   3.304353e-05   0.000000e+00   3.304353e-05   0.000000e+00 
  8.900000e+01   3.160076e-05   0.000000e+00   3.160076e-05   0.000000e+00 
  8.925000e+01   3.551037e-05   0.000000e+00   3.551037e-05   0.000000e+00 
  8.950000e+01   3.304092e-05   0.000000e+00   3.304092e-05   0.000000e+00 
  8.975000e+01   3.506066e-05   0.000000e+00   3.506066e-05   0.000000e+00 
  9.000000e+01   3.339020e-05   0.000000e+00   3.339020e-05   0.000000e+00 
  9.025000e+01   3.197283e-05   0.000000e+00   3.197283e-05   0.000000e+00 
  9.050000e+01   3.477479e-05   0.000000e+00   3.477479e-05   0.000000e+00 
  9.075000e+01   3.626263e-05   0.000000e+00   3.626263e-05   0.000000e+00 
  9.100000e+01   3.689868e-05   0.000000e+00   3.689868e-05   0.000000e+00 
  9.125000e+01   3.327759e-05   0.000000e+00   3.327759e-05   0.000000e+00 
  9.150000e+01   3.365306e-05   0.000000e+00   3.365306e-05   0.000000e+00 
  9.175000e+01   3.080835e-05   0.000000e+00   3.080835e-05   0.000000e+00 
  9.200000e+01   3.656770e-05   0.000000e+00   3.656770e-05   0.000000e+00 
  9.225000e+01   3.136855e-05   0.000000e+00   3.136855e-05   0.000000e+00 
  9.250000e+01   3.015708e-05   0.000000e+00   3.015708e-05   0.000000e+00 
  9.275000e+01   2.983321e-05   0.000000e+00   2.983321e-05   0.000000e+00 
  9.300000e+01   2.794886e-05   0.000000e+00   2.794886e-05   0.000000e+00 
  9.325000e+01   3.202113e-05   0.000000e+00   3.202113e-05   0.000000e+00 
  9.350000e+01   3.360880e-05   0.000000e+00   3.360880e-05   0.000000e+00 
  9.375000e+01   3.442884e-05   0.000000e+00   3.442884e-05   0.000000e+00 
  9.400000e+01   3.771084e-05   0.000000e+00   3.771084e-05   0.000000e+00 
  9.425000e+01   3.501177e-05   0.000000e+00   3.501177e-05   0.000000e+00 
  9.450000e+01   3.116570e-05   0.000000e+00   3.116570e-05   0.000000e+00 
  9.475000e+01   3.409269e-05   0.000000e+00   3.409269e-05   0.000000e+00 
  9.500000e+01   3.329772e-05   0.000000e+00   3.329772e-05   0.000000e+00 
  9.525000e+01   3.441019e-05   0.000000e+00   3.441019e-05   0.000000e+00 
  9.550000e+01   3.828956e-05   0.000000e+00   3.828956e-05   0.000000e+00 
  9.575000e+01   3.535647e-05   0.000000e+00   3.535647e-05   0.000000e+00 
  9.600000e+01   3.773614e-05   0.000000e+00   3.773614e-05   0.000000e+00 
  9.625000e+01   3.477428e-05   0.000000e+00   3.477428e-05   0.000000e+00 
  9.650000e+01   3.537757e-05   0.000000e+00   3.537757e-05   0.000000e+00 
  9.675000e+01   3.744242e-05   0.000000e+00   3.744242e-05   0.000000e+00 
  9.700000e+01   3.727437e-05   0.000000e+00   3.727437e-05   0.000000e+00 
  9.725000e+01   3.611909e-05   0.000000e+00   3.611909e-05   0.000000e+00 
  9.750000e+01   3.337015e-05   0.000000e+00   3.337015e-05   0.000000e+00 
  9.775000e+01   3.147223e-05   0.000000e+00   3.147223e-05   0.000000e+00 
  9.800000e+01   2.946963e-05   0.000000e+00   2.946963e-05   0.000000e+00 
  9.825000e+01   3.369564e-05   0.000000e+00   3.369564e-05   0.000000e+00 
  9.850000e+01   3.258727e-05   0.000000e+00   3.258727e-05   0.000000e+00 
  9.875000e+01   3.039306e-05   0.000000e+00   3.039306e-05   0.000000e+00 
  9.900000e+01   3.293358e-05   0.000000e+00   3.293358e-05   0.000000e+00 
  9.925000e+01   4.019143e-05   0.000000e+00   4.019143e-05   0.000000e+00 
  9.950000e+01   3.662586e-05   0.000000e+00   3.662586e-05   0.000000e+00 
  9.975000e+01   3.286430e-05   0.000000e+00   3.286430e-05   0.000000e+00 
  1.000000e+02   3.589232e-05   0.000000e+00   3.589232e-05   0.000000e+00 
  1.002500e+02   3.562983e-05   0.000000e+00   3.562983e-05   0.000000e+00 
  1.005000e+02   4.185208e-05   0.000000e+00   4.185208e-05   0.000000e+00 
  1.007500e+02   4.032613e-05   0.000000e+00   4.032613e-05   0.000000e+00 
  1.010000e+02   3.689475e-05   0.000000e+00   3.689475e-05   0.000000e+00 
  1.012500e+02   3.528270e-05   0.000000e+00   3.528270e-05   0.000000e+00 
  1.015000e+02   3.288084e-05   0.000000e+00   3.288084e-05   0.000000e+00 
  1.017500e+02   3.348718e-05   0.000000e+00   3.348718e-05   0.000000e+00 
  1.020000e+02   3.413008e-05   0.000000e+00   3.413008e-05   0.000000e+00 
  1.022500e+02   3.353302e-05   0.000000e+00   3.353302e-05   0.000000e+00 
  1.025000e+02   3.602520e-05   0.000000e+00   3.602520e-05   0.000000e+00 
  1.027500e+02   3.575367e-05   0.000000e+00   3.575367e-05   0.000000e+00 
  1.030000e+02   3.480527e-05   0.000000e+00   3.480527e-05   0.000000e+00 
  1.032500e+02   3.529318e-05   0.000000e+00   3.529318e-05   0.000000e+00 
  1.035000e+02   3.272688e-05   0.000000e+00   3.272688e-05   0.000000e+00 
  1.037500e+02   3.512572e-05   0.000000e+00   3.512572e-05   0.000000e+00 
  1.040000e+02   3.352222e-05   0.000000e+00   3.352222e-05   0.000000e+00 
  1.042500e+02   3.329231e-05   0.000000e+00   3.329231e-05   0.000000e+00 
  1.045000e+02   3.367459e-05   0.000000e+00   3.367459e-05   0.000000e+00 
  1.047500e+02   3.595978e-05   0.000000e+00   3.595978e-05   0.000000e+00 
  1.050000e+02   3.516707e-05   0.000000e+00   3.516707e-05   0.000000e+00 
  1.052500e+02   3.010358e-05   0.000000e+00   3.010358e-05   0.000000e+00 
  1.055000e+02   2.916638e-05   0.000000e+00   2.916638e-05   0.000000e+00 
  1.057500e+02   3.089142e-05   0.000000e+00   3.089142e-05   0.000000e+00 
  1.060000e+02   3.137365e-05   0.000000e+00   3.137365e-05   0.000000e+00 
  1.062500e+02   3.405980e-05   0.000000e+00   3.405980e-05   0.000000e+00 
  1.065000e+02   3.084618e-05   0.000000e+00   3.084618e-05   0.000000e+00 
  1.067500e+02   3.000294e-05   0.000000e+00   3.000294e-05   0.000000e+00 
  1.070000e+02   3.134365e-05   0.000000e+00   3.134365e-05   0.000000e+00 
  1.072500e+02   3.228394e-05   0.000000e+00   3.228394e-05   0.000000e+00 
  1.075000e+02   3.127996e-05   0.000000e+00   3.127996e-05   0.000000e+00 
  1.077500e+02   3.271781e-05   0.000000e+00   3.271781e-05   0.000000e+00 
  1.080000e+02   3.393410e-05   0.000000e+00   3.393410e-05   0.000000e+00 
  1.082500e+02   2.988559e-05   0.000000e+00   2.988559e-05   0.000000e+00 
  1.085000e+02   3.356001e-05   0.000000e+00   3.356001e-05   0.000000e+00 
  1.087500e+02   3.713558e-05   0.000000e+00   3.713558e-05   0.000000e+00 
  1.090000e+02   3.174331e-05   0.000000e+00   3.174331e-05   0.000000e+00 
  1.092500e+02   3.439206e-05   0.000000e+00   3.439206e-05   0.000000e+00 
  1.095000e+02   3.307229e-05   0.000000e+00   3.307229e-05   0.000000e+00 
  1.097500e+02   3.376749e-05   0.000000e+00   3.376749e-05   0.000000e+00 
  1.100000e+02   3.403209e-05   0.000000e+00   3.403209e-05   0.000000e+00 
  1.102500e+02   3.312204e-05   0.000000e+00   3.312204e-05   0.000000e+00 
  1.105000e+02   3.265729e-05   0.000000e+00   3.265729e-05   0.000000e+00 
  1.107500e+02   3.545636e-05   0.000000e+00   3.545636e-05   0.000000e+00 
  1.110000e+02   2.837734e-05   0.000000e+00   2.837734e-05   0.000000e+00 
  1.112500e+02   3.085973e-05   0.000000e+00   3.085973e-05   0.000000e+00 
  1.115000e+02   3.182361e-05   0.000000e+00   3.182361e-05   0.000000e+00 
  1.117500e+02   3.091756e-05   0.000000e+00   3.091756e-05   0.000000e+00 
  1.120000e+02   3.032553e-05   0.000000e+00   3.032553e-05   0.000000e+00 
  1.122500e+02   2.790340e-05   0.000000e+00   2.790340e-05   0.000000e+00 
  1.125000e+02   3.415499e-05   0.000000e+00   3.415499e-05   0.000000e+00 
  1.127500e+02   3.922338e-05   0.000000e+00   3.922338e-05   0.000000e+00 
  1.130000e+02   3.469413e-05   0.000000e+00   3.469413e-05   0.000000e+00 
  1.132500e+02   3.531600e-05   0.000000e+00   3.531600e-05   0.000000e+00 
  1.135000e+02   3.427121e-05   0.000000e+00   3.427121e-05   0.000000e+00 
  1.137500e+02   3.437808e-05   0.000000e+00   3.437808e-05   0.000000e+00 
  1.140000e+02   3.567787e-05   0.000000e+00   3.567787e-05   0.000000e+00 
  1.142500e+02   3.190756e-05   0.000000e+00   3.190756e-05   0.000000e+00 
  1.145000e+02   3.132420e-05   0.000000e+00   3.132420e-05   0.000000e+00 
  1.147500e+02   3.627965e-05   0.000000e+00   3.627965e-05   0.000000e+00 
  1.150000e+02   3.218469e-05   0.000000e+00   3.218469e-05   0.000000e+00 
  1.152500e+02   2.762973e-05   0.000000e+00   2.762973e-05   0.000000e+00 
  1.155000e+02   2.982511e-05   0.000000e+00   2.982511e-05   0.000000e+00 
  1.157500e+02   3.335666e-05   0.000000e+00   3.335666e-05   0.000000e+00 
  1.160000e+02   3.452821e-05   0.000000e+00   3.452821e-05   0.000000e+00 
  1.162500e+02   2.945017e-05   0.000000e+00   2.945017e-05   0.000000e+00 
  1.165000e+02   3.668285e-05   0.000000e+00   3.668285e-05   0.000000e+00 
  1.167500e+02   3.697893e-05   0.000000e+00   3.697893e-05   0.000000e+00 
  1.170000e+02   3.198829e-05   0.000000e+00   3.198829e-05   0.000000e+00 
  1.172500e+02   2.926940e-05   0.000000e+00   2.926940e-05   0.000000e+00 
  1.175000e+02   3.145655e-05   0.000000e+00   3.145655e-05   0.000000e+00 
  1.177500e+02   3.682397e-05   0.000000e+00   3.682397e-05   0.000000e+00 
  1.180000e+02   3.509253e-05   0.000000e+00   3.509253e-05   0.000000e+00 
  1.182500e+02   3.347646e-05   0.000000e+00   3.347646e-05   0.000000e+00 
  1.185000e+02   3.022343e-05   0.000000e+00   3.022343e-05   0.000000e+00 
  1.187500e+02   3.090074e-05   0.000000e+00   3.090074e-05   0.000000e+00 
  1.190000e+02   3.132622e-05   0.000000e+00   3.132622e-05   0.000000e+00 
  1.192500e+02   3.357871e-05   0.000000e+00   3.357871e-05   0.000000e+00 
  1.195000e+02   3.505296e-05   0.000000e+00   3.505296e-05   0.000000e+00 
  1.197500e+02   3.862520e-05   0.000000e+00   3.862520e-05   0.000000e+00 
  1.200000e+02   3.709971e-05   0.000000e+00   3.709971e-05   0.000000e+00 
  1.202500e+02   3.102810e-05   0.000000e+00   3.102810e-05   0.000000e+00 
  1.205000e+02   3.261300e-05   0.000000e+00   3.261300e-05   0.000000e+00 
  1.207500e+02   3.528309e-05   0.000000e+00   3.528309e-05   0.000000e+00 
  1.210000e+02   3.333308e-05   0.000000e+00   3.333308e-05   0.000000e+00 
  1.212500e+02   2.917920e-05   0.000000e+00   2.917920e-05   0.000000e+00 
  1.215000e+02   3.461196e-05   0.000000e+00   3.461196e-05   0.000000e+00 
  1.217500e+02   3.316168e-05   0.000000e+00   3.316168e-05   0.000000e+00 
  1.220000e+02   3.650975e-05   0.000000e+00   3.650975e-05   0.000000e+00 
  1.222500e+02   3.531203e-05   0.000000e+00   3.531203e-05   0.000000e+00 
  1.225000e+02   3.642119e-05   0.000000e+00   3.642119e-05   0.000000e+00 
  1.227500e+02   3.777387e-05   0.000000e+00   3.777387e-05   0.000000e+00 
  1.230000e+02   3.476657e-05   0.000000e+00   3.476657e-05   0.000000e+00 
  1.232500e+02   3.427950e-05   0.000000e+00   3.427950e-05   0.000000e+00 
  1.235000e+02   3.667760e-05   0.000000e+00   3.667760e-05   0.000000e+00 
  1.237500e+02   3.708358e-05   0.000000e+00   3.708358e-05   0.000000e+00 
  1.240000e+02   3.978415e-05   0.000000e+00   3.978415e-05   0.000000e+00 
  1.242500e+02   4.515043e-05   0.000000e+00   4.515043e-05   0.000000e+00 
  1.245000e+02   4.011413e-05   0.000000e+00   4.011413e-05   0.000000e+00 
  1.247500e+02   3.657720e-05   0.000000e+00   3.657720e-05   0.000000e+00 
  1.250000e+02   3.448275e-05   0.000000e+00   3.448275e-05   0.000000e+00 
  1.252500e+02   3.685733e-05   0.000000e+00   3.685733e-05   0.000000e+00 
  1.255000e+02   2.913560e-05   0.000000e+00   2.913560e-05   0.000000e+00 
  1.257500e+02   2.909948e-05   0.000000e+00   2.909948e-05   0.000000e+00 
  1.260000e+02   3.034280e-05   0.000000e+00   3.034280e-05   0.000000e+00 
  1.262500e+02   3.860990e-05   0.000000e+00   3.860990e-05   0.000000e+00 
  1.265000e+02   4.036828e-05   0.000000e+00   4.036828e-05   0.000000e+00 
  1.267500e+02   3.730181e-05   0.000000e+00   3.730181e-05   0.000000e+00 
  1.270000e+02   3.997071e-05   0.000000e+00   3.997071e-05   0.000000e+00 
  1.272500e+02   3.792885e-05   0.000000e+00   3.792885e-05   0.000000e+00 
  1.275000e+02   3.612579e-05   0.000000e+00   3.612579e-05   0.000000e+00 
  1.277500e+02   3.649643e-05   0.000000e+00   3.649643e-05   0.000000e+00 
  1.280000e+02   3.201001e-05   0.000000e+00   3.201001e-05   0.000000e+00 
  1.282500e+02   3.282020e-05   0.000000e+00   3.282020e-05   0.000000e+00 
  1.285000e+02   3.348098e-05   0.000000e+00   3.348098e-05   0.000000e+00 
  1.287500e+02   3.985491e-05   0.000000e+00   3.985491e-05   0.000000e+00 
  1.290000e+02   3.870632e-05   0.000000e+00   3.870632e-05   0.000000e+00 
  1.292500e+02   3.866238e-05   0.000000e+00   3.866238e-05   0.000000e+00 
  1.295000e+02   3.618792e-05   0.000000e+00   3.618792e-05   0.000000e+00 
  1.297500e+02   3.332891e-05   0.000000e+00   3.332891e-05   0.000000e+00 
  1.300000e+02   3.493578e-05   0.000000e+00   3.493578e-05   0.000000e+00 
  1.302500e+02   3.951628e-05   0.000000e+00   3.951628e-05   0.000000e+00 
  1.305000e+02   3.291037e-05   0.000000e+00   3.291037e-05   0.000000e+00 
  1.307500e+02   3.230044e-05   0.000000e+00   3.230044e-05   0.000000e+00 
  1.310000e+02   3.446800e-05   0.000000e+00   3.446800e-05   0.000000e+00 
  1.312500e+02   3.503498e-05   0.000000e+00   3.503498e-05   0.000000e+00 
  1.315000e+02   3.686388e-05   0.000000e+00   3.686388e-05   0.000000e+00 
  1.317500e+02   4.179769e-05   0.000000e+00   4.179769e-05   0.000000e+00 
  1.320000e+02   3.540024e-05   0.000000e+00   3.540024e-05   0.000000e+00 
  1.322500e+02   2.840656e-05   0.000000e+00   2.840656e-05   0.000000e+00 
  1.325000e+02   3.028278e-05   0.000000e+00   3.028278e-05   0.000000e+00 
  1.327500e+02   3.392094e-05   0.000000e+00   3.392094e-05   0.000000e+00 
  1.330000e+02   3.875607e-05   0.000000e+00   3.875607e-05   0.000000e+00 
  1.332500e+02   3.951374e-05   0.000000e+00   3.951374e-05   0.000000e+00 
  1.335000e+02   3.555545e-05   0.000000e+00   3.555545e-05   0.000000e+00 
  1.337500e+02   2.846476e-05   0.000000e+00   2.846476e-05   0.000000e+00 
  1.340000e+02   2.988921e-05   0.000000e+00   2.988921e-05   0.000000e+00 
  1.342500e+02   3.181675e-05   0.000000e+00   3.181675e-05   0.000000e+00 
  1.345000e+02   3.508134e-05   0.000000e+00   3.508134e-05   0.000000e+00 
  1.347500e+02   3.906319e-05   0.000000e+00   3.906319e-05   0.000000e+00 
  1.350000e+02   4.159950e-05   0.000000e+00   4.159950e-05   0.000000e+00 
  1.352500e+02   3.255430e-05   0.000000e+00   3.255430e-05   0.000000e+00 
  1.355000e+02   3.339471e-05   0.000000e+00   3.339471e-05   0.000000e+00 
  1.357500e+02   3.700480e-05   0.000000e+00   3.700480e-05   0.000000e+00 
  1.360000e+02   3.620138e-05   0.000000e+00   3.620138e-05   0.000000e+00 
  1.362500e+02   3.489883e-05   0.000000e+00   3.489883e-05   0.000000e+00 
  1.365000e+02   3.052927e-05   0.000000e+00   3.052927e-05   0.000000e+00 
  1.367500e+02   3.070723e-05   0.000000e+00   3.070723e-05   0.000000e+00 
  1.370000e+02   2.721224e-05   0.000000e+00   2.721224e-05   0.000000e+00 
  1.372500e+02   2.828053e-05   0.000000e+00   2.828053e-05   0.000000e+00 
  1.375000e+02   3.246642e-05   0.000000e+00   3.246642e-05   0.000000e+00 
  1.377500e+02   3.727812e-05   0.000000e+00   3.727812e-05   0.000000e+00 
  1.380000e+02   3.584599e-05   0.000000e+00   3.584599e-05   0.000000e+00 
  1.382500e+02   3.584591e-05   0.000000e+00   3.584591e-05   0.000000e+00 
  1.385000e+02   3.392711e-05   0.000000e+00   3.392711e-05   0.000000e+00 
  1.387500e+02   3.423727e-05   0.000000e+00   3.423727e-05   0.000000e+00 
  1.390000e+02   3.673647e-05   0.000000e+00   3.673647e-05   0.000000e+00 
  1.392500e+02   3.986746e-05   0.000000e+00   3.986746e-05   0.000000e+00 
  1.395000e+02   3.726624e-05   0.000000e+00   3.726624e-05   0.000000e+00 
  1.397500e+02   3.507702e-05   0.000000e+00   3.507702e-05   0.000000e+00 
  1.400000e+02   3.657710e-05   0.000000e+00   3.657710e-05   0.000000e+00 
  1.402500e+02   3.875240e-05   0.000000e+00   3.875240e-05   0.000000e+00 
  1.405000e+02   3.648086e-05   0.000000e+00   3.648086e-05   0.000000e+00 
  1.407500e+02   3.673365e-05   0.000000e+00   3.673365e-05   0.000000e+00 
  1.410000e+02   3.666299e-05   0.000000e+00   3.666299e-05   0.000000e+00 
  1.412500e+02   3.186721e-05   0.000000e+00   3.186721e-05   0.000000e+00 
  1.415000e+02   3.851397e-05   0.000000e+00   3.851397e-05   0.000000e+00 
  1.417500e+02   3.642699e-05   0.000000e+00   3.642699e-05   0.000000e+00 
  1.420000e+02   3.218530e-05   0.000000e+00   3.218530e-05   0.000000e+00 
  1.422500e+02   3.201117e-05   0.000000e+00   3.201117e-05   0.000000e+00 
  1.425000e+02   3.673322e-05   0.000000e+00   3.673322e-05   0.000000e+00 
  1.427500e+02   3.628280e-05   0.000000e+00   3.628280e-05   0.000000e+00 
  1.430000e+02   3.423439e-05   0.000000e+00   3.423439e-05   0.000000e+00 
  1.432500e+02   2.851343e-05   0.000000e+00   2.851343e-05   0.000000e+00 
  1.435000e+02   3.253837e-05   0.000000e+00   3.253837e-05   0.000000e+00 
  1.437500e+02   3.604729e-05   0.000000e+00   3.604729e-05   0.000000e+00 
  1.440000e+02   3.664647e-05   0.000000e+00   3.664647e-05   0.000000e+00 
  1.442500e+02   3.505529e-05   0.000000e+00   3.505529e-05   0.000000e+00 
  1.445000e+02   3.152841e-05   0.000000e+00   3.152841e-05   0.000000e+00 
  1.447500e+02   3.109422e-05   0.000000e+00   3.109422e-05   0.000000e+00 
  1.450000e+02   3.444111e-05   0.000000e+00   3.444111e-05   0.000000e+00 
  1.452500e+02   3.467836e-05   0.000000e+00   3.467836e-05   0.000000e+00 
  1.455000e+02   3.356325e-05   0.000000e+00   3.356325e-05   0.000000e+00 
  1.457500e+02   3.315957e-05   0.000000e+00   3.315957e-05   0.000000e+00 
  1.460000e+02   3.352308e-05   0.000000e+00   3.352308e-05   0.000000e+00 
  1.462500e+02   3.821202e-05   0.000000e+00   3.821202e-05   0.000000e+00 
  1.465000e+02   3.830313e-05   0.000000e+00   3.830313e-05   0.000000e+00 
  1.467500e+02   3.362258e-05   0.000000e+00   3.362258e-05   0.000000e+00 
  1.470000e+02   3.580970e-05   0.000000e+00   3.580970e-05   0.000000e+00 
  1.472500e+02   3.496193e-05   0.000000e+00   3.496193e-05   0.000000e+00 
  1.475000e+02   3.769318e-05   0.000000e+00   3.769318e-05   0.000000e+00 
  1.477500e+02   3.666328e-05   0.000000e+00   3.666328e-05   0.000000e+00 
  1.480000e+02   3.390444e-05   0.000000e+00   3.390444e-05   0.000000e+00 
  1.482500e+02   3.148095e-05   0.000000e+00   3.148095e-05   0.000000e+00 
  1.485000e+02   2.744804e-05   0.000000e+00   2.744804e-05   0.000000e+00 
  1.487500e+02   3.718756e-05   0.000000e+00   3.718756e-05   0.000000e+00 
  1.490000e+02   3.072289e-05   0.000000e+00   3.072289e-05   0.000000e+00 
  1.492500e+02   2.781279e-05   0.000000e+00   2.781279e-05   0.000000e+00 
  1.495000e+02   3.442081e-05   0.000000e+00   3.442081e-05   0.000000e+00 
  1.497500e+02   3.310097e-05   0.000000e+00   3.310097e-05   0.000000e+00 
  1.500000e+02   3.486884e-05   0.000000e+00   3.486884e-05   0.000000e+00 
  1.502500e+02   3.366865e-05   0.000000e+00   3.366865e-05   0.000000e+00 
  1.505000e+02   3.104388e-05   0.000000e+00   3.104388e-05   0.000000e+00 
  1.507500e+02   3.136310e-05   0.000000e+00   3.136310e-05   0.000000e+00 
  1.510000e+02   3.173689e-05   0.000000e+00   3.173689e-05   0.000000e+00 
  1.512500e+02   3.525048e-05   0.000000e+00   3.525048e-05   0.000000e+00 
  1.515000e+02   3.739130e-05   0.000000e+00   3.739130e-05   0.000000e+00 
  1.517500e+02   3.082565e-05   0.000000e+00   3.082565e-05   0.000000e+00 
  1.520000e+02   3.472001e-05   0.000000e+00   3.472001e-05   0.000000e+00 
  1.522500e+02   3.964082e-05   0.000000e+00   3.964082e-05   0.000000e+00 
  1.525000e+02   3.199447e-05   0.000000e+00   3.199447e-05   0.000000e+00 
  1.527500e+02   3.554543e-05   0.000000e+00   3.554543e-05   0.000000e+00 
  1.530000e+02   3.820443e-05   0.000000e+00   3.820443e-05   0.000000e+00 
  1.532500e+02   3.713430e-05   0.000000e+00   3.713430e-05   0.000000e+00 
  1.535000e+02   2.779617e-05   0.000000e+00   2.779617e-05   0.000000e+00 
  1.537500e+02   3.229489e-05   0.000000e+00   3.229489e-05   0.000000e+00 
  1.540000e+02   3.480498e-05   0.000000e+00   3.480498e-05   0.000000e+00 
  1.542500e+02   3.225274e-05   0.000000e+00   3.225274e-05   0.000000e+00 
  1.545000e+02   3.287296e-05   0.000000e+00   3.287296e-05   0.000000e+00 
  1.547500e+02   3.963360e-05   0.000000e+00   3.963360e-05   0.000000e+00 
  1.550000e+02   3.720466e-05   0.000000e+00   3.720466e-05   0.000000e+00 
  1.552500e+02   3.961425e-05   0.000000e+00   3.961425e-05   0.000000e+00 
  1.555000e+02   3.949550e-05   0.000000e+00   3.949550e-05   0.000000e+00 
  1.557500e+02   3.133248e-05   0.000000e+00   3.133248e-05   0.000000e+00 
  1.560000e+02   3.378984e-05   0.000000e+00   3.378984e-05   0.000000e+00 
  1.562500e+02   3.552872e-05   0.000000e+00   3.552872e-05   0.000000e+00 
  1.565000e+02   3.240078e-05   0.000000e+00   3.240078e-05   0.000000e+00 
  1.567500e+02   3.285433e-05   0.000000e+00   3.285433e-05   0.000000e+00 
  1.570000e+02   3.684567e-05   0.000000e+00   3.684567e-05   0.000000e+00 
  1.572500e+02   4.203997e-05   0.000000e+00   4.203997e-05   0.000000e+00 
  1.575000e+02   3.713734e-05   0.000000e+00   3.713734e-05   0.000000e+00 
  1.577500e+02   3.358168e-05   0.000000e+00   3.358168e-05   0.000000e+00 
  1.580000e+02   3.621837e-05   0.000000e+00   3.621837e-05   0.000000e+00 
  1.582500e+02   3.431506e-05   0.000000e+00   3.431506e-05   0.000000e+00 
  1.585000e+02   3.163904e-05   0.000000e+00   3.163904e-05   0.000000e+00 
  1.587500e+02   3.666518e-05   0.000000e+00   3.666518e-05   0.000000e+00 
  1.590000e+02   3.305955e-05   0.000000e+00   3.305955e-05   0.000000e+00 
  1.592500e+02   3.265486e-05   0.000000e+00   3.265486e-05   0.000000e+00 
  1.595000e+02   3.611979e-05   0.000000e+00   3.611979e-05   0.000000e+00 
  1.597500e+02   3.218301e-05   0.000000e+00   3.218301e-05   0.000000e+00 
  1.600000e+02   3.070801e-05   0.000000e+00   3.070801e-05   0.000000e+00 
  1.602500e+02   3.359994e-05   0.000000e+00   3.359994e-05   0.000000e+00 
  1.605000e+02   3.670993e-05   0.000000e+00   3.670993e-05   0.000000e+00 
  1.607500e+02   3.617747e-05   0.000000e+00   3.617747e-05   0.000000e+00 
  1.610000e+02   3.885724e-05   0.000000e+00   3.885724e-05   0.000000e+00 
  1.612500e+02   3.892154e-05   0.000000e+00   3.892154e-05   0.000000e+00 
  1.615000e+02   3.557730e-05   0.000000e+00   3.557730e-05   0.000000e+00 
  1.617500e+02   3.167576e-05   0.000000e+00   3.167576e-05   0.000000e+00 
  1.620000e+02   3.421609e-05   0.000000e+00   3.421609e-05   0.000000e+00 
  1.622500e+02   3.612359e-05   0.000000e+00   3.612359e-05   0.000000e+00 
  1.625000e+02   3.555790e-05   0.000000e+00   3.555790e-05   0.000000e+00 
  1.627500e+02   3.422911e-05   0.000000e+00   3.422911e-05   0.000000e+00 
  1.630000e+02   3.765272e-05   0.000000e+00   3.765272e-05   0.000000e+00 
  1.632500e+02   3.759197e-05   0.000000e+00   3.759197e-05   0.000000e+00 
  1.635000e+02   3.891926e-05   0.000000e+00   3.891926e-05   0.000000e+00 
  1.637500e+02   3.970299e-05   0.000000e+00   3.970299e-05   0.000000e+00 
  1.640000e+02   4.215062e-05   0.000000e+00   4.215062e-05   0.000000e+00 
  1.642500e+02   4.129133e-05   0.000000e+00   4.129133e-05   0.000000e+00 
  1.645000e+02   3.700592e-05   0.000000e+00   3.700592e-05   0.000000e+00 
  1.647500e+02   3.349921e-05   0.000000e+00   3.349921e-05   0.000000e+00 
  1.650000e+02   3.942665e-05   0.000000e+00   3.942665e-05   0.000000e+00 
  1.652500e+02   4.204838e-05   0.000000e+00   4.204838e-05   0.000000e+00 
  1.655000e+02   3.940196e-05   0.000000e+00   3.940196e-05   0.000000e+00 
  1.657500e+02   3.207302e-05   0.000000e+00   3.207302e-05   0.000000e+00 
  1.660000e+02   3.668268e-05   0.000000e+00   3.668268e-05   0.000000e+00 
  1.662500e+02   3.594833e-05   0.000000e+00   3.594833e-05   0.000000e+00 
  1.665000e+02   3.357240e-05   0.000000e+00   3.357240e-05   0.000000e+00 
  1.667500e+02   3.378043e-05   0.000000e+00   3.378043e-05   0.000000e+00 
  1.670000e+02   3.228738e-05   0.000000e+00   3.228738e-05   0.000000e+00 
  1.672500e+02   3.129777e-05   0.000000e+00   3.129777e-05   0.000000e+00 
  1.675000e+02   3.166487e-05   0.000000e+00   3.166487e-05   0.000000e+00 
  1.677500e+02   3.520134e-05   0.000000e+00   3.520134e-05   0.000000e+00 
  1.680000e+02   3.280148e-05   0.000000e+00   3.280148e-05   0.000000e+00 
  1.682500e+02   3.878583e-05   0.000000e+00   3.878583e-05   0.000000e+00 
  1.685000e+02   4.406187e-05   0.000000e+00   4.406187e-05   0.000000e+00 
  1.687500e+02   3.676458e-05   0.000000e+00   3.676458e-05   0.000000e+00 
  1.690000e+02   4.109250e-05   0.000000e+00   4.109250e-05   0.000000e+00 
  1.692500e+02   4.182492e-05   0.000000e+00   4.182492e-05   0.000000e+00 
  1.695000e+02   3.887525e-05   0.000000e+00   3.887525e-05   0.000000e+00 
  1.697500e+02   3.981540e-05   0.000000e+00   3.981540e-05   0.000000e+00 
  1.700000e+02   3.861063e-05   0.000000e+00   3.861063e-05   0.000000e+00 
  1.702500e+02   2.971342e-05   0.000000e+00   2.971342e-05   0.000000e+00 
  1.705000e+02   2.884931e-05   0.000000e+00   2.884931e-05   0.000000e+00 
  1.707500e+02   3.450404e-05   0.000000e+00   3.450404e-05   0.000000e+00 
  1.710000e+02   3.701398e-05   0.000000e+00   3.701398e-05   0.000000e+00 
  1.712500e+02   3.741696e-05   0.000000e+00   3.741696e-05   0.000000e+00 
  1.715000e+02   3.973664e-05   0.000000e+00   3.973664e-05   0.000000e+00 
  1.717500e+02   3.715255e-05   0.000000e+00   3.715255e-05   0.000000e+00 
  1.720000e+02   3.534801e-05   0.000000e+00   3.534801e-05   0.000000e+00 
  1.722500e+02   3.985101e-05   0.000000e+00   3.985101e-05   0.000000e+00 
  1.725000e+02   4.275695e-05   0.000000e+00   4.275695e-05   0.000000e+00 
  1.727500e+02   3.383067e-05   0.000000e+00   3.383067e-05   0.000000e+00 
  1.730000e+02   3.330516e-05   0.000000e+00   3.330516e-05   0.000000e+00 
  1.732500e+02   3.479300e-05   0.000000e+00   3.479300e-05   0.000000e+00 
  1.735000e+02   3.187313e-05   0.000000e+00   3.187313e-05   0.000000e+00 
  1.737500e+02   3.040763e-05   0.000000e+00   3.040763e-05   0.000000e+00 
  1.740000e+02   3.733465e-05   0.000000e+00   3.733465e-05   0.000000e+00 
  1.742500e+02   3.648647e-05   0.000000e+00   3.648647e-05   0.000000e+00 
  1.745000e+02   3.248909e-05   0.000000e+00   3.248909e-05   0.000000e+00 
  1.747500e+02   3.490752e-05   0.000000e+00   3.490752e-05   0.000000e+00 
  1.750000e+02   3.631413e-05   0.000000e+00   3.631413e-05   0.000000e+00 
  1.752500e+02   3.835542e-05   0.000000e+00   3.835542e-05   0.000000e+00 
  1.755000e+02   3.454095e-05   0.000000e+00   3.454095e-05   0.000000e+00 
  1.757500e+02   2.940887e-05   0.000000e+00   2.940887e-05   0.000000e+00 
  1.760000e+02   3.304898e-05   0.000000e+00   3.304898e-05   0.000000e+00 
  1.762500e+02   3.411259e-05   0.000000e+00   3.411259e-05   0.000000e+00 
  1.765000e+02   3.362097e-05   0.000000e+00   3.362097e-05   0.000000e+00 
  1.767500e+02   3.231977e-05   0.000000e+00   3.231977e-05   0.000000e+00 
  1.770000e+02   3.672322e-05   0.000000e+00   3.672322e-05   0.000000e+00 
  1.772500e+02   3.941458e-05   0.000000e+00   3.941458e-05   0.000000e+00 
  1.775000e+02   3.574069e-05   0.000000e+00   3.574069e-05   0.000000e+00 
  1.777500e+02   3.313654e-05   0.000000e+00   3.313654e-05   0.000000e+00 
  1.780000e+02   3.369589e-05   0.000000e+00   3.369589e-05   0.000000e+00 
  1.782500e+02   3.091758e-05   0.000000e+00   3.091758e-05   0.000000e+00 
  1.785000e+02   3.806325e-05   0.000000e+00   3.806325e-05   0.000000e+00 
  1.787500e+02   3.088817e-05   0.000000e+00   3.088817e-05   0.000000e+00 
  1.790000e+02   3.406719e-05   0.000000e+00   3.406719e-05   0.000000e+00 
  1.792500e+02   3.776510e-05   0.000000e+00   3.776510e-05   0.000000e+00 
  1.795000e+02   3.895828e-05   0.000000e+00   3.895828e-05   0.000000e+00 
  1.797500e+02   3.599882e-05   0.000000e+00   3.599882e-05   0.000000e+00 
  1.800000e+02   3.867761e-05   0.000000e+00   3.867761e-05   0.000000e+00 
  1.802500e+02   4.080757e-05   0.000000e+00   4.080757e-05   0.000000e+00 
  1.805000e+02   3.451986e-05   0.000000e+00   3.451986e-05   0.000000e+00 
  1.807500e+02   3.276671e-05   0.000000e+00   3.276671e-05   0.000000e+00 
  1.810000e+02   3.005941e-05   0.000000e+00   3.005941e-05   0.000000e+00 
  1.812500e+02   3.363742e-05   0.000000e+00   3.363742e-05   0.000000e+00 
  1.815000e+02   3.800029e-05   0.000000e+00   3.800029e-05   0.000000e+00 
  1.817500e+02   3.502185e-05   0.000000e+00   3.502185e-05   0.000000e+00 
  1.820000e+02   3.421740e-05   0.000000e+00   3.421740e-05   0.000000e+00 
  1.822500e+02   3.873249e-05   0.000000e+00   3.873249e-05   0.000000e+00 
  1.825000e+02   3.851646e-05   0.000000e+00   3.851646e-05   0.000000e+00 
  1.827500e+02   3.077794e-05   0.000000e+00   3.077794e-05   0.000000e+00 
  1.830000e+02   3.417047e-05   0.000000e+00   3.417047e-05   0.000000e+00 
  1.832500e+02   3.461889e-05   0.000000e+00   3.461889e-05   0.000000e+00 
  1.835000e+02   3.579037e-05   0.000000e+00   3.579037e-05   0.000000e+00 
  1.837500e+02   3.272463e-05   0.000000e+00   3.272463e-05   0.000000e+00 
  1.840000e+02   3.323813e-05   0.000000e+00   3.323813e-05   0.000000e+00 
  1.842500e+02   3.598627e-05   0.000000e+00   3.598627e-05   0.000000e+00 
  1.845000e+02   3.088596e-05   0.000000e+00   3.088596e-05   0.000000e+00 
  1.847500e+02   3.087468e-05   0.000000e+00   3.087468e-05   0.000000e+00 
  1.850000e+02   3.210386e-05   0.000000e+00   3.210386e-05   0.000000e+00 
  1.852500e+02   3.075337e-05   0.000000e+00   3.075337e-05   0.000000e+00 
  1.855000e+02   3.509283e-05   0.000000e+00   3.509283e-05   0.000000e+00 
  1.857500e+02   3.677838e-05   0.000000e+00   3.677838e-05   0.000000e+00 
  1.860000e+02   3.770356e-05   0.000000e+00   3.770356e-05   0.000000e+00 
  1.862500e+02   3.246826e-05   0.000000e+00   3.246826e-05   0.000000e+00 
  1.865000e+02   3.736001e-05   0.000000e+00   3.736001e-05   0.000000e+00 
  1.867500e+02   3.804800e-05   0.000000e+00   3.804800e-05   0.000000e+00 
  1.870000e+02   3.311393e-05   0.000000e+00   3.311393e-05   0.000000e+00 
  1.872500e+02   3.121549e-05   0.000000e+00   3.121549e-05   0.000000e+00 
  1.875000e+02   3.242227e-05   0.000000e+00   3.242227e-05   0.000000e+00 
  1.877500e+02   3.374699e-05   0.000000e+00   3.374699e-05   0.000000e+00 
  1.880000e+02   3.585332e-05   0.000000e+00   3.585332e-05   0.000000e+00 
  1.882500e+02   3.155819e-05   0.000000e+00   3.155819e-05   0.000000e+00 
  1.885000e+02   3.447153e-05   0.000000e+00   3.447153e-05   0.000000e+00 
  1.887500e+02   3.586705e-05   0.000000e+00   3.586705e-05   0.000000e+00 
  1.890000e+02   3.595731e-05   0.000000e+00   3.595731e-05   0.000000e+00 
  1.892500e+02   3.478479e-05   0.000000e+00   3.478479e-05   0.000000e+00 
  1.895000e+02   3.764414e-05   0.000000e+00   3.764414e-05   0.000000e+00 
  1.897500e+02   3.730427e-05   0.000000e+00   3.730427e-05   0.000000e+00 
  1.900000e+02   2.793793e-05   0.000000e+00   2.793793e-05   0.000000e+00 
  1.902500e+02   3.173653e-05   0.000000e+00   3.173653e-05   0.000000e+00 
  1.905000e+02   3.583539e-05   0.000000e+00   3.583539e-05   0.000000e+00 
  1.907500e+02   3.507321e-05   0.000000e+00   3.507321e-05   0.000000e+00 
  1.910000e+02   3.409791e-05   0.000000e+00   3.409791e-05   0.000000e+00 
  1.912500e+02   3.512738e-05   0.000000e+00   3.512738e-05   0.000000e+00 
  1.915000e+02   3.383576e-05   0.000000e+00   3.383576e-05   0.000000e+00 
  1.917500e+02   2.909811e-05   0.000000e+00   2.909811e-05   0.000000e+00 
  1.920000e+02   3.411399e-05   0.000000e+00   3.411399e-05   0.000000e+00 
  1.922500e+02   3.766544e-05   0.000000e+00   3.766544e-05   0.000000e+00 
  1.925000e+02   4.072517e-05   0.000000e+00   4.072517e-05   0.000000e+00 
  1.927500e+02   4.216483e-05   0.000000e+00   4.216483e-05   0.000000e+00 
  1.930000e+02   3.315027e-05   0.000000e+00   3.315027e-05   0.000000e+00 
  1.932500e+02   3.283608e-05   0.000000e+00   3.283608e-05   0.000000e+00 
  1.935000e+02   3.315596e-05   0.000000e+00   3.315596e-05   0.000000e+00 
  1.937500e+02   3.504423e-05   0.000000e+00   3.504423e-05   0.000000e+00 
  1.940000e+02   3.580096e-05   0.000000e+00   3.580096e-05   0.000000e+00 
  1.942500e+02   3.642963e-05   0.000000e+00   3.642963e-05   0.000000e+00 
  1.945000e+02   3.534419e-05   0.000000e+00   3.534419e-05   0.000000e+00 
  1.947500e+02   3.171506e-05   0.000000e+00   3.171506e-05   0.000000e+00 
  1.950000e+02   3.491131e-05   0.000000e+00   3.491131e-05   0.000000e+00 
  1.952500e+02   3.468213e-05   0.000000e+00   3.468213e-05   0.000000e+00 
  1.955000e+02   3.239062e-05   0.000000e+00   3.239062e-05   0.000000e+00 
  1.957500e+02   3.369990e-05   0.000000e+00   3.369990e-05   0.000000e+00 
  1.960000e+02   3.594493e-05   0.000000e+00   3.594493e-05   0.000000e+00 
  1.962500e+02   3.478735e-05   0.000000e+00   3.478735e-05   0.000000e+00 
  1.965000e+02   3.400150e-05   0.000000e+00   3.400150e-05   0.000000e+00 
  1.967500e+02   3.539640e-05   0.000000e+00   3.539640e-05   0.000000e+00 
  1.970000e+02   3.469173e-05   0.000000e+00   3.469173e-05   0.000000e+00 
  1.972500e+02   3.390438e-05   0.000000e+00   3.390438e-05   0.000000e+00 
  1.975000e+02   3.248252e-05   0.000000e+00   3.248252e-05   0.000000e+00 
  1.977500e+02   3.274403e-05   0.000000e+00   3.274403e-05   0.000000e+00 
  1.980000e+02   3.404647e-05   0.000000e+00   3.404647e-05   0.000000e+00 
  1.982500e+02   3.373695e-05   0.000000e+00   3.373695e-05   0.000000e+00 
  1.985000e+02   3.479117e-05   0.000000e+00   3.479117e-05   0.000000e+00 
  1.987500e+02   3.732200e-05   0.000000e+00   3.732200e-05   0.000000e+00 
  1.990000e+02   3.799894e-05   0.000000e+00   3.799894e-05   0.000000e+00 
  1.992500e+02   3.406531e-05   0.000000e+00   3.406531e-05   0.000000e+00 
  1.995000e+02   3.128209e-05   0.000000e+00   3.128209e-05   0.000000e+00 
  1.997500e+02   3.752156e-05   0.000000e+00   3.752156e-05   0.000000e+00 
  2.000000e+02   4.240172e-05   0.000000e+00   4.240172e-05   0.000000e+00 
