  0.000000e+00   5.154018e-03   6.567228e-06   5.154022e-03   7.300600e-02 
  5.000000e-01   4.510254e-03   2.610864e-03   5.211430e-03   3.006539e+01 
  1.000000e+00   3.656101e-03   2.913679e-03   4.675104e-03   3.855260e+01 
  1.500000e+00   3.409318e-03   2.797971e-03   4.410453e-03   3.937515e+01 
  2.000000e+00   3.469496e-03   2.971971e-03   4.568371e-03   4.058335e+01 
  2.500000e+00   4.106639e-03   2.449522e-03   4.781699e-03   3.081517e+01 
  3.000000e+00   4.182939e-03   1.892643e-03   4.591195e-03   2.434520e+01 
  3.500000e+00   3.271250e-03   1.966353e-03   3.816755e-03   3.101014e+01 
  4.000000e+00   2.666253e-03   2.066206e-03   3.373146e-03   3.777380e+01 
  4.500000e+00   2.358187e-03   1.912667e-03   3.036337e-03   3.904465e+01 
  5.000000e+00   1.879715e-03   1.657011e-03   2.505796e-03   4.139690e+01 
  5.500000e+00   1.678192e-03   1.674648e-03   2.370817e-03   4.493942e+01 
  6.000000e+00   1.789788e-03   1.766704e-03   2.514873e-03   4.462812e+01 
  6.500000e+00   1.774322e-03   1.737250e-03   2.483194e-03   4.439514e+01 
  7.000000e+00   1.691774e-03   1.605069e-03   2.332026e-03   4.349349e+01 
  7.500000e+00   1.716431e-03   1.284637e-03   2.143928e-03   3.681246e+01 
  8.000000e+00   1.619164e-03   1.038231e-03   1.923439e-03   3.266855e+01 
  8.500000e+00   1.545578e-03   8.366868e-04   1.757514e-03   2.842856e+01 
  9.000000e+00   1.518388e-03   7.067424e-04   1.674810e-03   2.495989e+01 
  9.500000e+00   1.420138e-03   8.284338e-04   1.644109e-03   3.025704e+01 
  1.000000e+01   1.236975e-03   8.509186e-04   1.501389e-03   3.452419e+01 
  1.050000e+01   1.073307e-03   6.948704e-04   1.278606e-03   3.291945e+01 
  1.100000e+01   8.846108e-04   7.739205e-04   1.175368e-03   4.118175e+01 
  1.150000e+01   6.805402e-04   9.398505e-04   1.160368e-03   5.409192e+01 
  1.200000e+01   7.584885e-04   9.492642e-04   1.215075e-03   5.137417e+01 
  1.250000e+01   9.050623e-04   9.427418e-04   1.306866e-03   4.616818e+01 
  1.300000e+01   8.439395e-04   9.004453e-04   1.234113e-03   4.685533e+01 
  1.350000e+01   8.825452e-04   7.269703e-04   1.143404e-03   3.947897e+01 
  1.400000e+01   8.911587e-04   5.366942e-04   1.040291e-03   3.105816e+01 
  1.450000e+01   8.721372e-04   5.091814e-04   1.009895e-03   3.027773e+01 
  1.500000e+01   7.812514e-04   6.408766e-04   1.010483e-03   3.936273e+01 
  1.550000e+01   5.982882e-04   7.725775e-04   9.771513e-04   5.224560e+01 
  1.600000e+01   6.174364e-04   7.464390e-04   9.687099e-04   5.040326e+01 
  1.650000e+01   5.580874e-04   6.711655e-04   8.728830e-04   5.025581e+01 
  1.700000e+01   4.250839e-04   6.045826e-04   7.390645e-04   5.488883e+01 
  1.750000e+01   5.033716e-04   5.385908e-04   7.371994e-04   4.693590e+01 
  1.800000e+01   6.367933e-04   4.554419e-04   7.829004e-04   3.557278e+01 
  1.850000e+01   6.550390e-04   4.349638e-04   7.863012e-04   3.358525e+01 
  1.900000e+01   5.421831e-04   4.710382e-04   7.182196e-04   4.098348e+01 
  1.950000e+01   4.775753e-04   4.811334e-04   6.779141e-04   4.521264e+01 
  2.000000e+01   4.871629e-04   4.679312e-04   6.754905e-04   4.384645e+01 
  2.050000e+01   4.589330e-04   4.465330e-04   6.403212e-04   4.421540e+01 
  2.100000e+01   3.961912e-04   4.004875e-04   5.633450e-04   4.530898e+01 
  2.150000e+01   3.506556e-04   4.604837e-04   5.787957e-04   5.271095e+01 
  2.200000e+01   3.168414e-04   4.302725e-04   5.343435e-04   5.363304e+01 
  2.250000e+01   3.182279e-04   4.057478e-04   5.156553e-04   5.189291e+01 
  2.300000e+01   3.206304e-04   4.351671e-04   5.405315e-04   5.361727e+01 
  2.350000e+01   3.533526e-04   3.616946e-04   5.056491e-04   4.566840e+01 
  2.400000e+01   3.459303e-04   2.850943e-04   4.482706e-04   3.949323e+01 
  2.450000e+01   3.373736e-04   2.983165e-04   4.503484e-04   4.148413e+01 
  2.500000e+01   3.267694e-04   2.765004e-04   4.280546e-04   4.023668e+01 
  2.550000e+01   2.793448e-04   2.601556e-04   3.817257e-04   4.296294e+01 
  2.600000e+01   2.933216e-04   2.899615e-04   4.124503e-04   4.466993e+01 
  2.650000e+01   2.758699e-04   3.379976e-04   4.362873e-04   5.077905e+01 
  2.700000e+01   2.097038e-04   2.943249e-04   3.613901e-04   5.453047e+01 
  2.750000e+01   2.372084e-04   2.081255e-04   3.155694e-04   4.126356e+01 
  2.800000e+01   2.806623e-04   2.107145e-04   3.509586e-04   3.689835e+01 
  2.850000e+01   2.877961e-04   2.592234e-04   3.873285e-04   4.200996e+01 
  2.900000e+01   2.763723e-04   2.579154e-04   3.780238e-04   4.302151e+01 
  2.950000e+01   2.618190e-04   2.223291e-04   3.434813e-04   4.033695e+01 
  3.000000e+01   2.477533e-04   1.902547e-04   3.123756e-04   3.752137e+01 
  3.050000e+01   2.569963e-04   1.909162e-04   3.201501e-04   3.660774e+01 
  3.100000e+01   2.854455e-04   2.034366e-04   3.505219e-04   3.547741e+01 
  3.150000e+01   2.709158e-04   2.029615e-04   3.385096e-04   3.683939e+01 
  3.200000e+01   2.027682e-04   2.146255e-04   2.952610e-04   4.662721e+01 
  3.250000e+01   1.601979e-04   2.117613e-04   2.655300e-04   5.289241e+01 
  3.300000e+01   1.658499e-04   1.895136e-04   2.518364e-04   4.880969e+01 
  3.350000e+01   1.686083e-04   1.731788e-04   2.417016e-04   4.576613e+01 
  3.400000e+01   1.734267e-04   2.092509e-04   2.717771e-04   5.034813e+01 
  3.450000e+01   1.731139e-04   1.802613e-04   2.499251e-04   4.615870e+01 
  3.500000e+01   1.778591e-04   1.399679e-04   2.263292e-04   3.820131e+01 
  3.550000e+01   1.610818e-04   1.356021e-04   2.105594e-04   4.009139e+01 
  3.600000e+01   1.622356e-04   1.128081e-04   1.976007e-04   3.481224e+01 
  3.650000e+01   1.553475e-04   1.562814e-04   2.203559e-04   4.517172e+01 
  3.700000e+01   1.184276e-04   1.927094e-04   2.261902e-04   5.842761e+01 
  3.750000e+01   9.835325e-05   1.798945e-04   2.050253e-04   6.133335e+01 
  3.800000e+01   6.297298e-05   1.830161e-04   1.935472e-04   7.101246e+01 
  3.850000e+01   1.214628e-04   1.727020e-04   2.111379e-04   5.488095e+01 
  3.900000e+01   1.782349e-04   1.456427e-04   2.301727e-04   3.925359e+01 
  3.950000e+01   1.981397e-04   1.138441e-04   2.285165e-04   2.988016e+01 
  4.000000e+01   1.880324e-04   1.062668e-04   2.159834e-04   2.947303e+01 
  4.050000e+01   1.546531e-04   9.055639e-05   1.792150e-04   3.035091e+01 
  4.100000e+01   1.272556e-04   8.355918e-05   1.522371e-04   3.328989e+01 
  4.150000e+01   1.127276e-04   1.132824e-04   1.598136e-04   4.514064e+01 
  4.200000e+01   9.550020e-05   1.121355e-04   1.472910e-04   4.958061e+01 
  4.250000e+01   8.689880e-05   9.120313e-05   1.259738e-04   4.638444e+01 
  4.300000e+01   7.937693e-05   8.621625e-05   1.171919e-04   4.736508e+01 
  4.350000e+01   1.081099e-04   8.649511e-05   1.384527e-04   3.866212e+01 
  4.400000e+01   1.234123e-04   7.938194e-05   1.467381e-04   3.275016e+01 
  4.450000e+01   1.299547e-04   7.798354e-05   1.515574e-04   3.096724e+01 
  4.500000e+01   1.326224e-04   8.210173e-05   1.559788e-04   3.176015e+01 
  4.550000e+01   1.139691e-04   6.978031e-05   1.336347e-04   3.147806e+01 
  4.600000e+01   9.562276e-05   7.037009e-05   1.187252e-04   3.634985e+01 
  4.650000e+01   9.293140e-05   7.636650e-05   1.202834e-04   3.941170e+01 
  4.700000e+01   8.224969e-05   9.829710e-05   1.281692e-04   5.007923e+01 
  4.750000e+01   7.133714e-05   1.113613e-04   1.322510e-04   5.735669e+01 
  4.800000e+01   6.956910e-05   9.880437e-05   1.208394e-04   5.485025e+01 
  4.850000e+01   8.188315e-05   7.912799e-05   1.138687e-04   4.401967e+01 
  4.900000e+01   7.740373e-05   6.394542e-05   1.004010e-04   3.956107e+01 
  4.950000e+01   7.181109e-05   6.993952e-05   1.002416e-04   4.424355e+01 
  5.000000e+01   8.466096e-05   7.447076e-05   1.127536e-04   4.133599e+01 
  5.050000e+01   8.768127e-05   7.207586e-05   1.135030e-04   3.942093e+01 
  5.100000e+01   9.463262e-05   7.672019e-05   1.218250e-04   3.903224e+01 
  5.150000e+01   8.383683e-05   8.687995e-05   1.207342e-04   4.602122e+01 
  5.200000e+01   7.603820e-05   7.519381e-05   1.069388e-04   4.468010e+01 
  5.250000e+01   6.763104e-05   5.789301e-05   8.902561e-05   4.056393e+01 
  5.300000e+01   6.815548e-05   7.370229e-05   1.003852e-04   4.723919e+01 
  5.350000e+01   7.351582e-05   8.234849e-05   1.103895e-04   4.824342e+01 
  5.400000e+01   5.768751e-05   7.811653e-05   9.710839e-05   5.355487e+01 
  5.450000e+01   5.740431e-05   7.828885e-05   9.707934e-05   5.374973e+01 
  5.500000e+01   5.497571e-05   8.794902e-05   1.037177e-04   5.799107e+01 
  5.550000e+01   5.647334e-05   8.448532e-05   1.016219e-04   5.623966e+01 
  5.600000e+01   6.241912e-05   5.790287e-05   8.514040e-05   4.285043e+01 
  5.650000e+01   6.508904e-05   3.847924e-05   7.561240e-05   3.059067e+01 
  5.700000e+01   6.947733e-05   5.001099e-05   8.560489e-05   3.574699e+01 
  5.750000e+01   7.599098e-05   5.988253e-05   9.674991e-05   3.823886e+01 
  5.800000e+01   7.817835e-05   4.639592e-05   9.090894e-05   3.068754e+01 
  5.850000e+01   7.165889e-05   3.624400e-05   8.030333e-05   2.682960e+01 
  5.900000e+01   6.218636e-05   6.505301e-05   8.999465e-05   4.629063e+01 
  5.950000e+01   9.908048e-05   1.533289e-04   1.825560e-04   5.712963e+01 
  6.000000e+01   1.339776e-04   2.147180e-04   2.530885e-04   5.803706e+01 
  6.050000e+01   9.349589e-05   1.529712e-04   1.792809e-04   5.856675e+01 
  6.100000e+01   5.014175e-05   6.605688e-05   8.293195e-05   5.279898e+01 
  6.150000e+01   4.319733e-05   4.166523e-05   6.001667e-05   4.396569e+01 
  6.200000e+01   3.440855e-05   4.399677e-05   5.585395e-05   5.197211e+01 
  6.250000e+01   3.190371e-05   5.047000e-05   5.970818e-05   5.770170e+01 
  6.300000e+01   3.595947e-05   4.398828e-05   5.681596e-05   5.073474e+01 
  6.350000e+01   4.284927e-05   3.874834e-05   5.777105e-05   4.212285e+01 
  6.400000e+01   4.383067e-05   4.922803e-05   6.591302e-05   4.831941e+01 
  6.450000e+01   3.728296e-05   4.482235e-05   5.830148e-05   5.024652e+01 
  6.500000e+01   3.270286e-05   4.958782e-05   5.940058e-05   5.659539e+01 
  6.550000e+01   2.703255e-05   5.403009e-05   6.041530e-05   6.342010e+01 
  6.600000e+01   3.362367e-05   4.746142e-05   5.816475e-05   5.468463e+01 
  6.650000e+01   3.932263e-05   4.035574e-05   5.634585e-05   4.574285e+01 
  6.700000e+01   3.862176e-05   3.971895e-05   5.540068e-05   4.580239e+01 
  6.750000e+01   3.481287e-05   3.789529e-05   5.145861e-05   4.742756e+01 
  6.800000e+01   3.520370e-05   3.167368e-05   4.735528e-05   4.197853e+01 
  6.850000e+01   3.975737e-05   3.614911e-05   5.373460e-05   4.227846e+01 
  6.900000e+01   4.807053e-05   3.941520e-05   6.216377e-05   3.934988e+01 
  6.950000e+01   5.041549e-05   3.677579e-05   6.240336e-05   3.610904e+01 
  7.000000e+01   4.432207e-05   3.961791e-05   5.944766e-05   4.179238e+01 
  7.050000e+01   3.544442e-05   4.278144e-05   5.555680e-05   5.035825e+01 
  7.100000e+01   3.279495e-05   4.989915e-05   5.971126e-05   5.668610e+01 
  7.150000e+01   3.353475e-05   4.548631e-05   5.651181e-05   5.360053e+01 
  7.200000e+01   3.661434e-05   3.121721e-05   4.811574e-05   4.045075e+01 
  7.250000e+01   3.317169e-05   4.423183e-05   5.528848e-05   5.313190e+01 
  7.300000e+01   3.369075e-05   5.235451e-05   6.225802e-05   5.723824e+01 
  7.350000e+01   3.644751e-05   4.038711e-05   5.440165e-05   4.793520e+01 
  7.400000e+01   3.698236e-05   2.685347e-05   4.570343e-05   3.598399e+01 
  7.450000e+01   3.824882e-05   2.432904e-05   4.533072e-05   3.245934e+01 
  7.500000e+01   4.043843e-05   3.229819e-05   5.175365e-05   3.861437e+01 
  7.550000e+01   3.543094e-05   3.394392e-05   4.906670e-05   4.377208e+01 
  7.600000e+01   3.025115e-05   3.505778e-05   4.630529e-05   4.920928e+01 
  7.650000e+01   3.714808e-05   3.216896e-05   4.914084e-05   4.089143e+01 
  7.700000e+01   4.317226e-05   2.481294e-05   4.979484e-05   2.988782e+01 
  7.750000e+01   3.583040e-05   2.467656e-05   4.350574e-05   3.455536e+01 
  7.800000e+01   2.788277e-05   2.602732e-05   3.814277e-05   4.302880e+01 
  7.850000e+01   2.646970e-05   2.762957e-05   3.826275e-05   4.622821e+01 
  7.900000e+01   2.935762e-05   2.942877e-05   4.156828e-05   4.506935e+01 
  7.950000e+01   3.507774e-05   2.978295e-05   4.601599e-05   4.033310e+01 
  8.000000e+01   3.418135e-05   3.303139e-05   4.753354e-05   4.401981e+01 
  8.050000e+01   2.246831e-05   3.583072e-05   4.229262e-05   5.790948e+01 
  8.100000e+01   2.808288e-05   3.768621e-05   4.699892e-05   5.330738e+01 
  8.150000e+01   3.582187e-05   3.483719e-05   4.996835e-05   4.420160e+01 
  8.200000e+01   3.511709e-05   3.540718e-05   4.986861e-05   4.523567e+01 
  8.250000e+01   3.460193e-05   3.475792e-05   4.904494e-05   4.512885e+01 
  8.300000e+01   2.985795e-05   3.620139e-05   4.692588e-05   5.048508e+01 
  8.350000e+01   2.523187e-05   3.341485e-05   4.187123e-05   5.294320e+01 
  8.400000e+01   2.888050e-05   2.376774e-05   3.740306e-05   3.945330e+01 
  8.450000e+01   2.440468e-05   2.339209e-05   3.380500e-05   4.378635e+01 
  8.500000e+01   2.468105e-05   3.027202e-05   3.905828e-05   5.080933e+01 
  8.550000e+01   2.454136e-05   3.130415e-05   3.977723e-05   5.190479e+01 
  8.600000e+01   2.565059e-05   3.128104e-05   4.045313e-05   5.064810e+01 
  8.650000e+01   2.198561e-05   2.385378e-05   3.244025e-05   4.733377e+01 
  8.700000e+01   2.228404e-05   1.964519e-05   2.970711e-05   4.139879e+01 
  8.750000e+01   2.433918e-05   2.337364e-05   3.374496e-05   4.384069e+01 
  8.800000e+01   2.225160e-05   2.387463e-05   3.263635e-05   4.701521e+01 
  8.850000e+01   2.234676e-05   2.057519e-05   3.037625e-05   4.263651e+01 
  8.900000e+01   2.428889e-05   1.556894e-05   2.885034e-05   3.265947e+01 
  8.950000e+01   3.116648e-05   2.195492e-05   3.812307e-05   3.516240e+01 
  9.000000e+01   3.336266e-05   3.229839e-05   4.643547e-05   4.407140e+01 
  9.050000e+01   2.380597e-05   3.082870e-05   3.895039e-05   5.232463e+01 
  9.100000e+01   2.590527e-05   2.210205e-05   3.405265e-05   4.047039e+01 
  9.150000e+01   3.373452e-05   1.877742e-05   3.860841e-05   2.910133e+01 
  9.200000e+01   3.262346e-05   2.450274e-05   4.080042e-05   3.690937e+01 
  9.250000e+01   2.375082e-05   2.163210e-05   3.212552e-05   4.232706e+01 
  9.300000e+01   1.652202e-05   1.963218e-05   2.565930e-05   4.991676e+01 
  9.350000e+01   1.662085e-05   2.237185e-05   2.787028e-05   5.339002e+01 
  9.400000e+01   2.193826e-05   2.551691e-05   3.365115e-05   4.931258e+01 
  9.450000e+01   2.600044e-05   2.069910e-05   3.323366e-05   3.852349e+01 
  9.500000e+01   2.779677e-05   1.745401e-05   3.282230e-05   3.212533e+01 
  9.550000e+01   2.276313e-05   2.326738e-05   3.255044e-05   4.562764e+01 
  9.600000e+01   2.160627e-05   2.705523e-05   3.462392e-05   5.138918e+01 
  9.650000e+01   1.877309e-05   2.187750e-05   2.882801e-05   4.936710e+01 
  9.700000e+01   1.687611e-05   1.675829e-05   2.378326e-05   4.479929e+01 
  9.750000e+01   1.689480e-05   1.896187e-05   2.539658e-05   4.829934e+01 
  9.800000e+01   2.247266e-05   1.991203e-05   3.002514e-05   4.154274e+01 
  9.850000e+01   2.340850e-05   1.959781e-05   3.052920e-05   3.993638e+01 
  9.900000e+01   4.473967e-05   4.693395e-05   6.484160e-05   4.637115e+01 
  9.950000e+01   1.428091e-04   1.526900e-04   2.090662e-04   4.691513e+01 
  1.000000e+02   2.058537e-04   2.207926e-04   3.018694e-04   4.700537e+01 
  1.005000e+02   1.379850e-04   1.493901e-04   2.033648e-04   4.727270e+01 
  1.010000e+02   4.002669e-05   4.600216e-05   6.097815e-05   4.897331e+01 
  1.015000e+02   1.389049e-05   1.362410e-05   1.945666e-05   4.444529e+01 
  1.020000e+02   1.744959e-05   1.505162e-05   2.304429e-05   4.078030e+01 
  1.025000e+02   1.980297e-05   1.564941e-05   2.524008e-05   3.831775e+01 
  1.030000e+02   1.765970e-05   1.073170e-05   2.066481e-05   3.128681e+01 
  1.035000e+02   1.878020e-05   1.558861e-05   2.440698e-05   3.969457e+01 
  1.040000e+02   2.774348e-05   2.614870e-05   3.812420e-05   4.330500e+01 
  1.045000e+02   2.638680e-05   2.547519e-05   3.667763e-05   4.399298e+01 
  1.050000e+02   2.296576e-05   2.210115e-05   3.187298e-05   4.390090e+01 
  1.055000e+02   1.876213e-05   1.745022e-05   2.562280e-05   4.292517e+01 
  1.060000e+02   1.376279e-05   1.683973e-05   2.174836e-05   5.074152e+01 
  1.065000e+02   1.776676e-05   1.704988e-05   2.462430e-05   4.382044e+01 
  1.070000e+02   2.152617e-05   1.479728e-05   2.612155e-05   3.450497e+01 
  1.075000e+02   2.388075e-05   2.100775e-05   3.180591e-05   4.133788e+01 
  1.080000e+02   2.786208e-05   2.903750e-05   4.024266e-05   4.618344e+01 
  1.085000e+02   2.339520e-05   2.271419e-05   3.260782e-05   4.415384e+01 
  1.090000e+02   1.413374e-05   1.519023e-05   2.074863e-05   4.706338e+01 
  1.095000e+02   1.920068e-05   1.805454e-05   2.635588e-05   4.323788e+01 
  1.100000e+02   2.668887e-05   2.147521e-05   3.425610e-05   3.882191e+01 
  1.105000e+02   2.236588e-05   2.087242e-05   3.059233e-05   4.302178e+01 
  1.110000e+02   1.449741e-05   1.752276e-05   2.274252e-05   5.039743e+01 
  1.115000e+02   1.482228e-05   1.564022e-05   2.154800e-05   4.653805e+01 
  1.120000e+02   2.188196e-05   1.979519e-05   2.950711e-05   4.213361e+01 
  1.125000e+02   1.998464e-05   1.988560e-05   2.819260e-05   4.485767e+01 
  1.130000e+02   1.159587e-05   1.408946e-05   1.824766e-05   5.054502e+01 
  1.135000e+02   1.043904e-05   1.134613e-05   1.541779e-05   4.738432e+01 
  1.140000e+02   1.509790e-05   1.136985e-05   1.890027e-05   3.698248e+01 
  1.145000e+02   1.964278e-05   1.587054e-05   2.525298e-05   3.893676e+01 
  1.150000e+02   2.338501e-05   1.932285e-05   3.033532e-05   3.956665e+01 
  1.155000e+02   1.929297e-05   1.695279e-05   2.568298e-05   4.130586e+01 
  1.160000e+02   1.535335e-05   2.046392e-05   2.558315e-05   5.312041e+01 
  1.165000e+02   1.747431e-05   2.254288e-05   2.852250e-05   5.221864e+01 
  1.170000e+02   1.519419e-05   1.624576e-05   2.224383e-05   4.691566e+01 
  1.175000e+02   1.525586e-05   1.070505e-05   1.863705e-05   3.505736e+01 
  1.180000e+02   1.572774e-05   1.086322e-05   1.911469e-05   3.463301e+01 
  1.185000e+02   2.016296e-05   1.271987e-05   2.383988e-05   3.224592e+01 
  1.190000e+02   3.190219e-05   2.981630e-05   4.366648e-05   4.306432e+01 
  1.195000e+02   6.944832e-05   8.556255e-05   1.101999e-04   5.093489e+01 
  1.200000e+02   1.010451e-04   1.260141e-04   1.615229e-04   5.127541e+01 
  1.205000e+02   7.397217e-05   8.988812e-05   1.164120e-04   5.054780e+01 
  1.210000e+02   2.596032e-05   3.171886e-05   4.098810e-05   5.070137e+01 
  1.215000e+02   7.437514e-06   1.406406e-05   1.590957e-05   6.212872e+01 
  1.220000e+02   9.156915e-06   1.452067e-05   1.716680e-05   5.776397e+01 
  1.225000e+02   1.056230e-05   1.368665e-05   1.728834e-05   5.234181e+01 
  1.230000e+02   1.079457e-05   1.048618e-05   1.504935e-05   4.416975e+01 
  1.235000e+02   1.035648e-05   9.316228e-06   1.393014e-05   4.197313e+01 
  1.240000e+02   1.071511e-05   1.193495e-05   1.603922e-05   4.808274e+01 
  1.245000e+02   1.292400e-05   1.468495e-05   1.956215e-05   4.864950e+01 
  1.250000e+02   1.544474e-05   1.523997e-05   2.169785e-05   4.461766e+01 
  1.255000e+02   1.088698e-05   1.251992e-05   1.659141e-05   4.899068e+01 
  1.260000e+02   7.417689e-06   1.016929e-05   1.258716e-05   5.389223e+01 
  1.265000e+02   7.411539e-06   1.025574e-05   1.265351e-05   5.414541e+01 
  1.270000e+02   7.826500e-06   9.412636e-06   1.224140e-05   5.025686e+01 
  1.275000e+02   9.189373e-06   7.630467e-06   1.194440e-05   3.970480e+01 
  1.280000e+02   9.956999e-06   8.346336e-06   1.299243e-05   3.997102e+01 
  1.285000e+02   1.172509e-05   1.015093e-05   1.550868e-05   4.088418e+01 
  1.290000e+02   1.111224e-05   8.109680e-06   1.375677e-05   3.612186e+01 
  1.295000e+02   1.310637e-05   8.460453e-06   1.559988e-05   3.284313e+01 
  1.300000e+02   1.459570e-05   1.161062e-05   1.865049e-05   3.850162e+01 
  1.305000e+02   1.082429e-05   9.138174e-06   1.416585e-05   4.017202e+01 
  1.310000e+02   7.296421e-06   6.578463e-06   9.824151e-06   4.203786e+01 
  1.315000e+02   7.851880e-06   7.606584e-06   1.093216e-05   4.409090e+01 
  1.320000e+02   9.436277e-06   9.292807e-06   1.324385e-05   4.456110e+01 
  1.325000e+02   8.907286e-06   1.028888e-05   1.360885e-05   4.911661e+01 
  1.330000e+02   7.168137e-06   9.088175e-06   1.157485e-05   5.173601e+01 
  1.335000e+02   5.500723e-06   7.636872e-06   9.411682e-06   5.423537e+01 
  1.340000e+02   6.082800e-06   7.927272e-06   9.992102e-06   5.250005e+01 
  1.345000e+02   6.936229e-06   8.570825e-06   1.102589e-05   5.101731e+01 
  1.350000e+02   7.938085e-06   9.570423e-06   1.243407e-05   5.032635e+01 
  1.355000e+02   6.714841e-06   8.486319e-06   1.082158e-05   5.164702e+01 
  1.360000e+02   8.404671e-06   7.680671e-06   1.138557e-05   4.242286e+01 
  1.365000e+02   9.395352e-06   7.327788e-06   1.191508e-05   3.795201e+01 
  1.370000e+02   8.143513e-06   7.606962e-06   1.114373e-05   4.304893e+01 
  1.375000e+02   8.713811e-06   8.166440e-06   1.194241e-05   4.314273e+01 
  1.380000e+02   8.654585e-06   7.906059e-06   1.172210e-05   4.241204e+01 
  1.385000e+02   8.575073e-06   8.086167e-06   1.178635e-05   4.331920e+01 
  1.390000e+02   7.567728e-06   7.584415e-06   1.071419e-05   4.506310e+01 
  1.395000e+02   6.152447e-06   7.384916e-06   9.611950e-06   5.020198e+01 
  1.400000e+02   7.604618e-06   6.992466e-06   1.033077e-05   4.259862e+01 
  1.405000e+02   8.235053e-06   7.201396e-06   1.093966e-05   4.116908e+01 
  1.410000e+02   8.423923e-06   8.472952e-06   1.194795e-05   4.516625e+01 
  1.415000e+02   8.603546e-06   7.878359e-06   1.166574e-05   4.248067e+01 
  1.420000e+02   7.870465e-06   6.410773e-06   1.015097e-05   3.916404e+01 
  1.425000e+02   7.901461e-06   8.463613e-06   1.157868e-05   4.696738e+01 
  1.430000e+02   8.210703e-06   1.030373e-05   1.317507e-05   5.144982e+01 
  1.435000e+02   8.162426e-06   9.424956e-06   1.246816e-05   4.910600e+01 
  1.440000e+02   7.706272e-06   7.418887e-06   1.069703e-05   4.391148e+01 
  1.445000e+02   9.516435e-06   8.290388e-06   1.262114e-05   4.106125e+01 
  1.450000e+02   1.058652e-05   1.039618e-05   1.483762e-05   4.448026e+01 
  1.455000e+02   7.801192e-06   8.818000e-06   1.177352e-05   4.850115e+01 
  1.460000e+02   7.419749e-06   5.910441e-06   9.486094e-06   3.854021e+01 
  1.465000e+02   9.711162e-06   8.301296e-06   1.277569e-05   4.052448e+01 
  1.470000e+02   9.100746e-06   1.046880e-05   1.387153e-05   4.899887e+01 
  1.475000e+02   8.043915e-06   9.829179e-06   1.270108e-05   5.070410e+01 
  1.480000e+02   7.896885e-06   6.607362e-06   1.029651e-05   3.991938e+01 
  1.485000e+02   7.208046e-06   6.373788e-06   9.621907e-06   4.148505e+01 
  1.490000e+02   6.520621e-06   8.084628e-06   1.038651e-05   5.111224e+01 
  1.495000e+02   7.359110e-06   8.464559e-06   1.121630e-05   4.899621e+01 
  1.500000e+02   1.071604e-05   1.026096e-05   1.483647e-05   4.375721e+01 
  1.505000e+02   1.046593e-05   1.062662e-05   1.491512e-05   4.543649e+01 
  1.510000e+02   8.792533e-06   9.888709e-06   1.323235e-05   4.835814e+01 
  1.515000e+02   7.708070e-06   8.836047e-06   1.172562e-05   4.890038e+01 
  1.520000e+02   8.430986e-06   8.389918e-06   1.189421e-05   4.486011e+01 
  1.525000e+02   9.747903e-06   7.994521e-06   1.260690e-05   3.935611e+01 
  1.530000e+02   9.234102e-06   7.549715e-06   1.192757e-05   3.926911e+01 
  1.535000e+02   9.051560e-06   8.086935e-06   1.213793e-05   4.177855e+01 
  1.540000e+02   8.493816e-06   8.045864e-06   1.169961e-05   4.344861e+01 
  1.545000e+02   9.321959e-06   8.620168e-06   1.269670e-05   4.276007e+01 
  1.550000e+02   1.035755e-05   9.215913e-06   1.386405e-05   4.166196e+01 
  1.555000e+02   8.279298e-06   7.561094e-06   1.121236e-05   4.240398e+01 
  1.560000e+02   5.350933e-06   5.974641e-06   8.020525e-06   4.815213e+01 
  1.565000e+02   5.122953e-06   5.760874e-06   7.709235e-06   4.835437e+01 
  1.570000e+02   6.966914e-06   6.727299e-06   9.684753e-06   4.399757e+01 
  1.575000e+02   7.214708e-06   7.123320e-06   1.013872e-05   4.463481e+01 
  1.580000e+02   7.496150e-06   6.953628e-06   1.022473e-05   4.284982e+01 
  1.585000e+02   7.605066e-06   8.014742e-06   1.104867e-05   4.650240e+01 
  1.590000e+02   7.301110e-06   8.721266e-06   1.137395e-05   5.006522e+01 
  1.595000e+02   8.103924e-06   8.272908e-06   1.158079e-05   4.559118e+01 
  1.600000e+02   7.535528e-06   7.367225e-06   1.053851e-05   4.435296e+01 
  1.605000e+02   6.106245e-06   6.184737e-06   8.691213e-06   4.536589e+01 
  1.610000e+02   5.903772e-06   4.946195e-06   7.701908e-06   3.995636e+01 
  1.615000e+02   5.761945e-06   5.994556e-06   8.314729e-06   4.613348e+01 
  1.620000e+02   6.595049e-06   7.413483e-06   9.922420e-06   4.834364e+01 
  1.625000e+02   6.923043e-06   8.678292e-06   1.110141e-05   5.141914e+01 
  1.630000e+02   6.972440e-06   8.362029e-06   1.088754e-05   5.017793e+01 
  1.635000e+02   7.973800e-06   6.974027e-06   1.059332e-05   4.117352e+01 
  1.640000e+02   8.400513e-06   5.989214e-06   1.031694e-05   3.548727e+01 
  1.645000e+02   8.013168e-06   6.554334e-06   1.035230e-05   3.928129e+01 
  1.650000e+02   7.031243e-06   6.529505e-06   9.595458e-06   4.288106e+01 
  1.655000e+02   5.397869e-06   4.889045e-06   7.282839e-06   4.216827e+01 
  1.660000e+02   4.968120e-06   4.986811e-06   7.039212e-06   4.510758e+01 
  1.665000e+02   6.375073e-06   5.787091e-06   8.609993e-06   4.223218e+01 
  1.670000e+02   7.231422e-06   7.404269e-06   1.034972e-05   4.567662e+01 
  1.675000e+02   9.334462e-06   7.245123e-06   1.181626e-05   3.781752e+01 
  1.680000e+02   1.007889e-05   8.453479e-06   1.315467e-05   3.998761e+01 
  1.685000e+02   9.240283e-06   1.207668e-05   1.520622e-05   5.257916e+01 
  1.690000e+02   8.067601e-06   1.110375e-05   1.372514e-05   5.399914e+01 
  1.695000e+02   7.307573e-06   8.307105e-06   1.106384e-05   4.866264e+01 
  1.700000e+02   7.333219e-06   6.829926e-06   1.002118e-05   4.296482e+01 
  1.705000e+02   5.452912e-06   5.580432e-06   7.802273e-06   4.566217e+01 
  1.710000e+02   5.797491e-06   6.448737e-06   8.671627e-06   4.804408e+01 
  1.715000e+02   5.711853e-06   8.566869e-06   1.029643e-05   5.630712e+01 
  1.720000e+02   8.809396e-06   1.194933e-05   1.484561e-05   5.360128e+01 
  1.725000e+02   1.142868e-05   1.546587e-05   1.923039e-05   5.353703e+01 
  1.730000e+02   8.539728e-06   1.241234e-05   1.506629e-05   5.547192e+01 
  1.735000e+02   5.696570e-06   7.143813e-06   9.137012e-06   5.143068e+01 
  1.740000e+02   6.345923e-06   5.171538e-06   8.186303e-06   3.917792e+01 
  1.745000e+02   5.762188e-06   4.404058e-06   7.252485e-06   3.739079e+01 
  1.750000e+02   6.374332e-06   7.333348e-06   9.716486e-06   4.900200e+01 
  1.755000e+02   6.431493e-06   8.398506e-06   1.057823e-05   5.255546e+01 
  1.760000e+02   5.670307e-06   7.696588e-06   9.559803e-06   5.361981e+01 
  1.765000e+02   5.601408e-06   7.013587e-06   8.975867e-06   5.138735e+01 
  1.770000e+02   6.493854e-06   5.802925e-06   8.708851e-06   4.178405e+01 
  1.775000e+02   7.622269e-06   5.387012e-06   9.333749e-06   3.525063e+01 
  1.780000e+02   1.060833e-05   7.516643e-06   1.300141e-05   3.531987e+01 
  1.785000e+02   1.307368e-05   9.850108e-06   1.636904e-05   3.699549e+01 
  1.790000e+02   1.115924e-05   8.613531e-06   1.409686e-05   3.766362e+01 
  1.795000e+02   9.469616e-06   6.831473e-06   1.167659e-05   3.580704e+01 
  1.800000e+02   8.846709e-06   7.490168e-06   1.159167e-05   4.025330e+01 
  1.805000e+02   6.222050e-06   7.035589e-06   9.392199e-06   4.851148e+01 
  1.810000e+02   4.940439e-06   6.338175e-06   8.036193e-06   5.206453e+01 
  1.815000e+02   6.268164e-06   6.018780e-06   8.689971e-06   4.383725e+01 
  1.820000e+02   7.439635e-06   5.492685e-06   9.247581e-06   3.643846e+01 
  1.825000e+02   7.014854e-06   5.471893e-06   8.896617e-06   3.795579e+01 
  1.830000e+02   6.999497e-06   7.005490e-06   9.903022e-06   4.502452e+01 
  1.835000e+02   9.103344e-06   9.517848e-06   1.317043e-05   4.627518e+01 
  1.840000e+02   8.780034e-06   9.203723e-06   1.271996e-05   4.634961e+01 
  1.845000e+02   7.322595e-06   5.909801e-06   9.409896e-06   3.890574e+01 
  1.850000e+02   6.527778e-06   5.673918e-06   8.649002e-06   4.099703e+01 
  1.855000e+02   5.857714e-06   6.845345e-06   9.009526e-06   4.944566e+01 
  1.860000e+02   5.308822e-06   6.635769e-06   8.498060e-06   5.133910e+01 
  1.865000e+02   4.784142e-06   5.438217e-06   7.243081e-06   4.866106e+01 
  1.870000e+02   7.309495e-06   5.873293e-06   9.376795e-06   3.878242e+01 
  1.875000e+02   1.367756e-05   6.870082e-06   1.530600e-05   2.666985e+01 
  1.880000e+02   1.441394e-05   6.659370e-06   1.587794e-05   2.479736e+01 
  1.885000e+02   8.857870e-06   5.363952e-06   1.035538e-05   3.119733e+01 
  1.890000e+02   4.823158e-06   4.810415e-06   6.811971e-06   4.492421e+01 
  1.895000e+02   5.466972e-06   6.127425e-06   8.211767e-06   4.826022e+01 
  1.900000e+02   7.000526e-06   6.771086e-06   9.739351e-06   4.404551e+01 
  1.905000e+02   6.447590e-06   6.501951e-06   9.156789e-06   4.524052e+01 
  1.910000e+02   7.185013e-06   7.393454e-06   1.030959e-05   4.581915e+01 
  1.915000e+02   1.291614e-05   1.145351e-05   1.726295e-05   4.156533e+01 
  1.920000e+02   1.386412e-05   1.135783e-05   1.792245e-05   3.932516e+01 
  1.925000e+02   8.354762e-06   6.645647e-06   1.067552e-05   3.849987e+01 
  1.930000e+02   4.930601e-06   5.800057e-06   7.612588e-06   4.963229e+01 
  1.935000e+02   5.076297e-06   5.845709e-06   7.742164e-06   4.902959e+01 
  1.940000e+02   6.417351e-06   5.696188e-06   8.580731e-06   4.159299e+01 
  1.945000e+02   6.989440e-06   5.139264e-06   8.675500e-06   3.632666e+01 
  1.950000e+02   6.602120e-06   6.584009e-06   9.324010e-06   4.492130e+01 
  1.955000e+02   1.099184e-05   1.350686e-05   1.741424e-05   5.086142e+01 
  1.960000e+02   1.338579e-05   1.584280e-05   2.074063e-05   4.980509e+01 
  1.965000e+02   8.791048e-06   9.334392e-06   1.282238e-05   4.671703e+01 
  1.970000e+02   5.149345e-06   5.230020e-06   7.339541e-06   4.544533e+01 
  1.975000e+02   5.265484e-06   5.294725e-06   7.467224e-06   4.515865e+01 
  1.980000e+02   5.353565e-06   4.512860e-06   7.001898e-06   4.012967e+01 
  1.985000e+02   5.236131e-06   3.475572e-06   6.284637e-06   3.357490e+01 
  1.990000e+02   1.548825e-05   1.239995e-05   1.984048e-05   3.868090e+01 
  1.995000e+02   4.997357e-05   4.615192e-05   6.802468e-05   4.272330e+01 
  2.000000e+02   7.043152e-05   6.602891e-05   9.654230e-05   4.315211e+01 
  2.005000e+02   4.568958e-05   4.250542e-05   6.240392e-05   4.293231e+01 
  2.010000e+02   1.197949e-05   1.133192e-05   1.649001e-05   4.340879e+01 
  2.015000e+02   3.340610e-06   4.553499e-06   5.647480e-06   5.373489e+01 
  2.020000e+02   5.119026e-06   5.629524e-06   7.608940e-06   4.771920e+01 
  2.025000e+02   6.721367e-06   6.308827e-06   9.218355e-06   4.318660e+01 
  2.030000e+02   1.463932e-05   1.611939e-05   2.177485e-05   4.775487e+01 
  2.035000e+02   2.716462e-05   3.220814e-05   4.213408e-05   4.985543e+01 
  2.040000e+02   2.728421e-05   3.367719e-05   4.334260e-05   5.098669e+01 
  2.045000e+02   1.467055e-05   1.915797e-05   2.412992e-05   5.255627e+01 
  2.050000e+02   4.126459e-06   7.077610e-06   8.192693e-06   5.975653e+01 
  2.055000e+02   3.675326e-06   3.817233e-06   5.298989e-06   4.608504e+01 
  2.060000e+02   4.273079e-06   3.227979e-06   5.355283e-06   3.706821e+01 
  2.065000e+02   4.733287e-06   4.618025e-06   6.612879e-06   4.429382e+01 
  2.070000e+02   6.467978e-06   7.508986e-06   9.910581e-06   4.925954e+01 
  2.075000e+02   1.019341e-05   1.134106e-05   1.524877e-05   4.805062e+01 
  2.080000e+02   1.438309e-05   1.475671e-05   2.060665e-05   4.573458e+01 
  2.085000e+02   1.147232e-05   1.267991e-05   1.709954e-05   4.786235e+01 
  2.090000e+02   4.943880e-06   7.481774e-06   8.967658e-06   5.654368e+01 
  2.095000e+02   3.422774e-06   5.346092e-06   6.347920e-06   5.737106e+01 
  2.100000e+02   4.365065e-06   4.777260e-06   6.471168e-06   4.758151e+01 
  2.105000e+02   4.807594e-06   4.926183e-06   6.883331e-06   4.569801e+01 
  2.110000e+02   4.980716e-06   4.521964e-06   6.727234e-06   4.223613e+01 
  2.115000e+02   7.694201e-06   4.004541e-06   8.673931e-06   2.749528e+01 
  2.120000e+02   1.121459e-05   7.720890e-06   1.361541e-05   3.454617e+01 
  2.125000e+02   1.007406e-05   9.250306e-06   1.367680e-05   4.255909e+01 
  2.130000e+02   6.547309e-06   6.956064e-06   9.552700e-06   4.673384e+01 
  2.135000e+02   5.249406e-06   5.725760e-06   7.767921e-06   4.748524e+01 
  2.140000e+02   3.995399e-06   4.720525e-06   6.184381e-06   4.975580e+01 
  2.145000e+02   4.199781e-06   4.713557e-06   6.313144e-06   4.829895e+01 
  2.150000e+02   4.909321e-06   5.880015e-06   7.660026e-06   5.014093e+01 
  2.155000e+02   6.167915e-06   5.785375e-06   8.456579e-06   4.316699e+01 
  2.160000e+02   9.343283e-06   6.525519e-06   1.139646e-05   3.493115e+01 
  2.165000e+02   9.231827e-06   6.777895e-06   1.145279e-05   3.628566e+01 
  2.170000e+02   6.695932e-06   5.106122e-06   8.420689e-06   3.732808e+01 
  2.175000e+02   5.914083e-06   3.894907e-06   7.081432e-06   3.336817e+01 
  2.180000e+02   5.104558e-06   3.990664e-06   6.479345e-06   3.801774e+01 
  2.185000e+02   4.266754e-06   3.774710e-06   5.696808e-06   4.149853e+01 
  2.190000e+02   3.712773e-06   3.326360e-06   4.984913e-06   4.185790e+01 
  2.195000e+02   5.412207e-06   3.593936e-06   6.496797e-06   3.358585e+01 
  2.200000e+02   7.908545e-06   6.829622e-06   1.044935e-05   4.081307e+01 
  2.205000e+02   7.409354e-06   7.850274e-06   1.079469e-05   4.665508e+01 
  2.210000e+02   5.854095e-06   5.918250e-06   8.324429e-06   4.531223e+01 
  2.215000e+02   4.981176e-06   4.385716e-06   6.636763e-06   4.136256e+01 
  2.220000e+02   4.112931e-06   3.895328e-06   5.664784e-06   4.344352e+01 
  2.225000e+02   3.336721e-06   4.298123e-06   5.441284e-06   5.217707e+01 
  2.230000e+02   3.339121e-06   4.791495e-06   5.840219e-06   5.512794e+01 
  2.235000e+02   4.236098e-06   3.797394e-06   5.689001e-06   4.187421e+01 
  2.240000e+02   6.108668e-06   3.902583e-06   7.248860e-06   3.257288e+01 
  2.245000e+02   7.967521e-06   5.457493e-06   9.657412e-06   3.440987e+01 
  2.250000e+02   7.624632e-06   5.080762e-06   9.162377e-06   3.367796e+01 
  2.255000e+02   5.464165e-06   3.395723e-06   6.433353e-06   3.185901e+01 
  2.260000e+02   4.249311e-06   3.112347e-06   5.267195e-06   3.622037e+01 
  2.265000e+02   4.476385e-06   3.766450e-06   5.850143e-06   4.007740e+01 
  2.270000e+02   4.516537e-06   3.939478e-06   5.993212e-06   4.109605e+01 
  2.275000e+02   4.231887e-06   3.557749e-06   5.528693e-06   4.005378e+01 
  2.280000e+02   4.749617e-06   4.358340e-06   6.446239e-06   4.254009e+01 
  2.285000e+02   5.174376e-06   6.326417e-06   8.172987e-06   5.072027e+01 
  2.290000e+02   4.324641e-06   6.519029e-06   7.823060e-06   5.644020e+01 
  2.295000e+02   3.627815e-06   4.815061e-06   6.028753e-06   5.300450e+01 
  2.300000e+02   4.153946e-06   4.709228e-06   6.279498e-06   4.858492e+01 
  2.305000e+02   4.004318e-06   5.185161e-06   6.551370e-06   5.232234e+01 
  2.310000e+02   3.545502e-06   4.515093e-06   5.740788e-06   5.185902e+01 
  2.315000e+02   3.825566e-06   3.946309e-06   5.496209e-06   4.589006e+01 
  2.320000e+02   4.108304e-06   4.042131e-06   5.763418e-06   4.453482e+01 
  2.325000e+02   4.699707e-06   3.331030e-06   5.760469e-06   3.532802e+01 
  2.330000e+02   4.219128e-06   2.956147e-06   5.151684e-06   3.501714e+01 
  2.335000e+02   4.030111e-06   3.564260e-06   5.380125e-06   4.148978e+01 
  2.340000e+02   4.585388e-06   3.683944e-06   5.881941e-06   3.877872e+01 
  2.345000e+02   4.210736e-06   3.788865e-06   5.664433e-06   4.198122e+01 
  2.350000e+02   4.307856e-06   4.141668e-06   5.975871e-06   4.387323e+01 
  2.355000e+02   4.454531e-06   4.611941e-06   6.411929e-06   4.599465e+01 
  2.360000e+02   4.690558e-06   4.618342e-06   6.582585e-06   4.455552e+01 
  2.365000e+02   5.295385e-06   4.267187e-06   6.800734e-06   3.886295e+01 
  2.370000e+02   5.438249e-06   4.384707e-06   6.985715e-06   3.887825e+01 
  2.375000e+02   5.670261e-06   4.834767e-06   7.451633e-06   4.045268e+01 
  2.380000e+02   7.065397e-06   7.186106e-06   1.007770e-05   4.548528e+01 
  2.385000e+02   5.674416e-06   6.545228e-06   8.662506e-06   4.907619e+01 
  2.390000e+02   6.985441e-06   8.096380e-06   1.069335e-05   4.921284e+01 
  2.395000e+02   2.096576e-05   2.285228e-05   3.101274e-05   4.746526e+01 
  2.400000e+02   3.290366e-05   3.547094e-05   4.838221e-05   4.715029e+01 
  2.405000e+02   2.520347e-05   2.635676e-05   3.646771e-05   4.628136e+01 
  2.410000e+02   9.774723e-06   9.323585e-06   1.350831e-05   4.364681e+01 
  2.415000e+02   4.499758e-06   4.153540e-06   6.123701e-06   4.270882e+01 
  2.420000e+02   3.770183e-06   4.408035e-06   5.800436e-06   4.945970e+01 
  2.425000e+02   4.785378e-06   4.508972e-06   6.575004e-06   4.329657e+01 
  2.430000e+02   5.536531e-06   4.187683e-06   6.941892e-06   3.710288e+01 
  2.435000e+02   5.026146e-06   3.846867e-06   6.329339e-06   3.742940e+01 
  2.440000e+02   4.820852e-06   3.329441e-06   5.858822e-06   3.463025e+01 
  2.445000e+02   6.023630e-06   3.983240e-06   7.221518e-06   3.347543e+01 
  2.450000e+02   6.871832e-06   5.752933e-06   8.962049e-06   3.993526e+01 
  2.455000e+02   5.601707e-06   5.430282e-06   7.801737e-06   4.410976e+01 
  2.460000e+02   4.092462e-06   3.910458e-06   5.660383e-06   4.369719e+01 
  2.465000e+02   4.874915e-06   4.001837e-06   6.307099e-06   3.938271e+01 
  2.470000e+02   4.572199e-06   3.422826e-06   5.711457e-06   3.681915e+01 
  2.475000e+02   3.470288e-06   3.220898e-06   4.734668e-06   4.286549e+01 
  2.480000e+02   3.981075e-06   3.883595e-06   5.561589e-06   4.428987e+01 
  2.485000e+02   4.545507e-06   4.352249e-06   6.293148e-06   4.375574e+01 
  2.490000e+02   3.492465e-06   3.940552e-06   5.265479e-06   4.844980e+01 
  2.495000e+02   3.081411e-06   2.530985e-06   3.987603e-06   3.939872e+01 
  2.500000e+02   3.634211e-06   2.840966e-06   4.612871e-06   3.801574e+01 
  2.505000e+02   3.957050e-06   3.710027e-06   5.424255e-06   4.315465e+01 
  2.510000e+02   4.354686e-06   3.907896e-06   5.851063e-06   4.190481e+01 
  2.515000e+02   3.781658e-06   4.608036e-06   5.961119e-06   5.062544e+01 
  2.520000e+02   3.840599e-06   4.469216e-06   5.892715e-06   4.932605e+01 
  2.525000e+02   4.184471e-06   3.651957e-06   5.553970e-06   4.111251e+01 
  2.530000e+02   3.519233e-06   3.539266e-06   4.991133e-06   4.516261e+01 
  2.535000e+02   3.900579e-06   4.655082e-06   6.073245e-06   5.003973e+01 
  2.540000e+02   4.367861e-06   5.463075e-06   6.994526e-06   5.135682e+01 
  2.545000e+02   4.944152e-06   6.093651e-06   7.847116e-06   5.094546e+01 
  2.550000e+02   4.345525e-06   5.233190e-06   6.802196e-06   5.029451e+01 
  2.555000e+02   3.505361e-06   4.030839e-06   5.341836e-06   4.898861e+01 
  2.560000e+02   4.025320e-06   3.361892e-06   5.244570e-06   3.986816e+01 
  2.565000e+02   4.214778e-06   3.283981e-06   5.343115e-06   3.792425e+01 
  2.570000e+02   3.562210e-06   3.133450e-06   4.744244e-06   4.133604e+01 
  2.575000e+02   3.113989e-06   2.770762e-06   4.168219e-06   4.166201e+01 
  2.580000e+02   3.117360e-06   2.749904e-06   4.156911e-06   4.141635e+01 
  2.585000e+02   3.059131e-06   2.999366e-06   4.284212e-06   4.443481e+01 
  2.590000e+02   2.991829e-06   4.037403e-06   5.025103e-06   5.346052e+01 
  2.595000e+02   3.935942e-06   4.904038e-06   6.288182e-06   5.124975e+01 
  2.600000e+02   4.910687e-06   5.049947e-06   7.043920e-06   4.580100e+01 
  2.605000e+02   4.077232e-06   3.679248e-06   5.491875e-06   4.206273e+01 
  2.610000e+02   3.485159e-06   2.770489e-06   4.452183e-06   3.848256e+01 
  2.615000e+02   3.886344e-06   2.948894e-06   4.878488e-06   3.719063e+01 
  2.620000e+02   4.164976e-06   2.965534e-06   5.112868e-06   3.545151e+01 
  2.625000e+02   4.220314e-06   2.713113e-06   5.017173e-06   3.273574e+01 
  2.630000e+02   3.645199e-06   4.030347e-06   5.434259e-06   4.787260e+01 
  2.635000e+02   2.738540e-06   4.685110e-06   5.426772e-06   5.969286e+01 
  2.640000e+02   3.152742e-06   4.241081e-06   5.284557e-06   5.337356e+01 
  2.645000e+02   3.700171e-06   3.980320e-06   5.434539e-06   4.708896e+01 
  2.650000e+02   3.831695e-06   3.835585e-06   5.421586e-06   4.502906e+01 
  2.655000e+02   3.523116e-06   3.059438e-06   4.666102e-06   4.097072e+01 
  2.660000e+02   3.502025e-06   2.556748e-06   4.336028e-06   3.613232e+01 
  2.665000e+02   3.754290e-06   3.225081e-06   4.949327e-06   4.066386e+01 
  2.670000e+02   4.168954e-06   4.406706e-06   6.066237e-06   4.658806e+01 
  2.675000e+02   3.907027e-06   4.666639e-06   6.086245e-06   5.006308e+01 
  2.680000e+02   3.430894e-06   3.955925e-06   5.236447e-06   4.906555e+01 
  2.685000e+02   3.448941e-06   3.553722e-06   4.952185e-06   4.585725e+01 
  2.690000e+02   3.261766e-06   3.498933e-06   4.783476e-06   4.700912e+01 
  2.695000e+02   3.068027e-06   3.345528e-06   4.539311e-06   4.747752e+01 
  2.700000e+02   3.003226e-06   2.989529e-06   4.237529e-06   4.486905e+01 
  2.705000e+02   3.180588e-06   2.427699e-06   4.001233e-06   3.735399e+01 
  2.710000e+02   3.969463e-06   3.035992e-06   4.997388e-06   3.741010e+01 
  2.715000e+02   4.272519e-06   3.684038e-06   5.641502e-06   4.077000e+01 
  2.720000e+02   4.531089e-06   3.153015e-06   5.520169e-06   3.483261e+01 
  2.725000e+02   4.824316e-06   3.502803e-06   5.961850e-06   3.598237e+01 
  2.730000e+02   4.792813e-06   3.616100e-06   6.003935e-06   3.703396e+01 
  2.735000e+02   3.917407e-06   3.135437e-06   5.017673e-06   3.867328e+01 
  2.740000e+02   2.923600e-06   3.065942e-06   4.236442e-06   4.636138e+01 
  2.745000e+02   3.286173e-06   3.872935e-06   5.079228e-06   4.968550e+01 
  2.750000e+02   3.680224e-06   4.900992e-06   6.128929e-06   5.309659e+01 
  2.755000e+02   4.096302e-06   4.943872e-06   6.420402e-06   5.035616e+01 
  2.760000e+02   3.458609e-06   4.253888e-06   5.482476e-06   5.088728e+01 
  2.765000e+02   2.584188e-06   3.698467e-06   4.511838e-06   5.505727e+01 
  2.770000e+02   2.955268e-06   3.300705e-06   4.430379e-06   4.816050e+01 
  2.775000e+02   3.789711e-06   2.975319e-06   4.818136e-06   3.813562e+01 
  2.780000e+02   3.680482e-06   3.319146e-06   4.956075e-06   4.204489e+01 
  2.785000e+02   3.264646e-06   3.262806e-06   4.615606e-06   4.498385e+01 
  2.790000e+02   4.035922e-06   3.505990e-06   5.346086e-06   4.098072e+01 
  2.795000e+02   5.494162e-06   5.135716e-06   7.520731e-06   4.306868e+01 
  2.800000e+02   5.293848e-06   6.401802e-06   8.307099e-06   5.041160e+01 
  2.805000e+02   4.017918e-06   5.409381e-06   6.738328e-06   5.339619e+01 
  2.810000e+02   3.264320e-06   4.207935e-06   5.325646e-06   5.219735e+01 
  2.815000e+02   2.629138e-06   3.053397e-06   4.029343e-06   4.926979e+01 
  2.820000e+02   2.582102e-06   2.373957e-06   3.507552e-06   4.259510e+01 
  2.825000e+02   3.565029e-06   2.796696e-06   4.531109e-06   3.811349e+01 
  2.830000e+02   5.114910e-06   4.302262e-06   6.683694e-06   4.006792e+01 
  2.835000e+02   5.946657e-06   5.980231e-06   8.433616e-06   4.516128e+01 
  2.840000e+02   4.598526e-06   5.968687e-06   7.534697e-06   5.238784e+01 
  2.845000e+02   3.034877e-06   4.753359e-06   5.639583e-06   5.744299e+01 
  2.850000e+02   2.818678e-06   3.561262e-06   4.541754e-06   5.163899e+01 
  2.855000e+02   3.029749e-06   3.443606e-06   4.586698e-06   4.865807e+01 
  2.860000e+02   3.327913e-06   3.845835e-06   5.085809e-06   4.912941e+01 
  2.865000e+02   3.774470e-06   3.535203e-06   5.171487e-06   4.312521e+01 
  2.870000e+02   5.146132e-06   4.029552e-06   6.536050e-06   3.806184e+01 
  2.875000e+02   7.547196e-06   6.098935e-06   9.703462e-06   3.894189e+01 
  2.880000e+02   7.490695e-06   5.667184e-06   9.392948e-06   3.710981e+01 
  2.885000e+02   4.688171e-06   3.199514e-06   5.675900e-06   3.431218e+01 
  2.890000e+02   3.032995e-06   2.809052e-06   4.133984e-06   4.280476e+01 
  2.895000e+02   2.824429e-06   3.227106e-06   4.288544e-06   4.880693e+01 
  2.900000e+02   3.749362e-06   4.194937e-06   5.626297e-06   4.821021e+01 
  2.905000e+02   4.366402e-06   4.412183e-06   6.207481e-06   4.529879e+01 
  2.910000e+02   4.191865e-06   4.836878e-06   6.400556e-06   4.908626e+01 
  2.915000e+02   6.677064e-06   8.024100e-06   1.043884e-05   5.023526e+01 
  2.920000e+02   6.811432e-06   8.717998e-06   1.106341e-05   5.199924e+01 
  2.925000e+02   3.727595e-06   5.621845e-06   6.745376e-06   5.645341e+01 
  2.930000e+02   2.845694e-06   3.395824e-06   4.430530e-06   5.003706e+01 
  2.935000e+02   2.646239e-06   2.826235e-06   3.871716e-06   4.688384e+01 
  2.940000e+02   2.889173e-06   3.372783e-06   4.441057e-06   4.941617e+01 
  2.945000e+02   3.053308e-06   3.295487e-06   4.492541e-06   4.718452e+01 
  2.950000e+02   3.395917e-06   3.863050e-06   5.143482e-06   4.868204e+01 
  2.955000e+02   6.896561e-06   7.614868e-06   1.027369e-05   4.783379e+01 
  2.960000e+02   8.207678e-06   8.914672e-06   1.211765e-05   4.736444e+01 
  2.965000e+02   4.474316e-06   5.518437e-06   7.104411e-06   5.096506e+01 
  2.970000e+02   3.345080e-06   4.126471e-06   5.311998e-06   5.097041e+01 
  2.975000e+02   5.508040e-06   5.031761e-06   7.460370e-06   4.241264e+01 
  2.980000e+02   5.002476e-06   4.515195e-06   6.738825e-06   4.206916e+01 
  2.985000e+02   3.514223e-06   3.780684e-06   5.161718e-06   4.709192e+01 
  2.990000e+02   5.883528e-06   6.628426e-06   8.862952e-06   4.840707e+01 
  2.995000e+02   1.602333e-05   1.611136e-05   2.272275e-05   4.515695e+01 
  3.000000e+02   2.201248e-05   2.140932e-05   3.070681e-05   4.420416e+01 
  3.005000e+02   1.415167e-05   1.380889e-05   1.977258e-05   4.429761e+01 
  3.010000e+02   3.839411e-06   4.534117e-06   5.941321e-06   4.974265e+01 
  3.015000e+02   1.516183e-06   2.774727e-06   3.161949e-06   6.134665e+01 
  3.020000e+02   1.907557e-06   2.532687e-06   3.170690e-06   5.301385e+01 
  3.025000e+02   2.768042e-06   2.332543e-06   3.619781e-06   4.011979e+01 
  3.030000e+02   3.115171e-06   2.650334e-06   4.090057e-06   4.039056e+01 
  3.035000e+02   5.646136e-06   5.362369e-06   7.786774e-06   4.352340e+01 
  3.040000e+02   8.904944e-06   8.277761e-06   1.215810e-05   4.290958e+01 
  3.045000e+02   6.827263e-06   6.751135e-06   9.601528e-06   4.467876e+01 
  3.050000e+02   3.551158e-06   4.258553e-06   5.544907e-06   5.017566e+01 
  3.055000e+02   3.790016e-06   4.017088e-06   5.522790e-06   4.666599e+01 
  3.060000e+02   3.592482e-06   3.415350e-06   4.956868e-06   4.355209e+01 
  3.065000e+02   2.743918e-06   2.697546e-06   3.847836e-06   4.451174e+01 
  3.070000e+02   3.808289e-06   2.741209e-06   4.692259e-06   3.574636e+01 
  3.075000e+02   6.278935e-06   4.685404e-06   7.834414e-06   3.673067e+01 
  3.080000e+02   8.661683e-06   7.931002e-06   1.174417e-05   4.247853e+01 
  3.085000e+02   7.191752e-06   7.322132e-06   1.026328e-05   4.551468e+01 
  3.090000e+02   3.649213e-06   4.337623e-06   5.668485e-06   4.992632e+01 
  3.095000e+02   2.320561e-06   2.746170e-06   3.595338e-06   4.980161e+01 
  3.100000e+02   2.755922e-06   2.544674e-06   3.751062e-06   4.271776e+01 
  3.105000e+02   3.185150e-06   3.021788e-06   4.390487e-06   4.349236e+01 
  3.110000e+02   3.415626e-06   3.206457e-06   4.684855e-06   4.319082e+01 
  3.115000e+02   4.755748e-06   3.473542e-06   5.889197e-06   3.614395e+01 
  3.120000e+02   6.803458e-06   5.150153e-06   8.532943e-06   3.712537e+01 
  3.125000e+02   6.324524e-06   5.126241e-06   8.141127e-06   3.902594e+01 
  3.130000e+02   3.760823e-06   3.121272e-06   4.887343e-06   3.969077e+01 
  3.135000e+02   2.772642e-06   3.204141e-06   4.237223e-06   4.912934e+01 
  3.140000e+02   2.582326e-06   3.179081e-06   4.095725e-06   5.091349e+01 
  3.145000e+02   2.729127e-06   2.738626e-06   3.866291e-06   4.509954e+01 
  3.150000e+02   3.040188e-06   2.808318e-06   4.138767e-06   4.272963e+01 
  3.155000e+02   3.601964e-06   3.521573e-06   5.037422e-06   4.435342e+01 
  3.160000e+02   5.449014e-06   4.446795e-06   7.033189e-06   3.921696e+01 
  3.165000e+02   5.382736e-06   4.282899e-06   6.878740e-06   3.850832e+01 
  3.170000e+02   3.504722e-06   3.275880e-06   4.797339e-06   4.306703e+01 
  3.175000e+02   3.194643e-06   2.932435e-06   4.336464e-06   4.254952e+01 
  3.180000e+02   3.507573e-06   2.889404e-06   4.544417e-06   3.948038e+01 
  3.185000e+02   3.173703e-06   2.549779e-06   4.071089e-06   3.877868e+01 
  3.190000e+02   3.084820e-06   2.983398e-06   4.291478e-06   4.404247e+01 
  3.195000e+02   4.145132e-06   3.702344e-06   5.557830e-06   4.177056e+01 
  3.200000e+02   5.185885e-06   4.138867e-06   6.635030e-06   3.859345e+01 
  3.205000e+02   4.241457e-06   3.401496e-06   5.436923e-06   3.872835e+01 
  3.210000e+02   2.927785e-06   2.758581e-06   4.022648e-06   4.329560e+01 
  3.215000e+02   2.890715e-06   3.008144e-06   4.171950e-06   4.614044e+01 
  3.220000e+02   3.140556e-06   2.661784e-06   4.116818e-06   4.028300e+01 
  3.225000e+02   3.290143e-06   1.989587e-06   3.844932e-06   3.116183e+01 
  3.230000e+02   2.749204e-06   2.362672e-06   3.624961e-06   4.067583e+01 
  3.235000e+02   2.568238e-06   2.918545e-06   3.887640e-06   4.865313e+01 
  3.240000e+02   3.245798e-06   3.113271e-06   4.497517e-06   4.380610e+01 
  3.245000e+02   3.699623e-06   3.366767e-06   5.002232e-06   4.230313e+01 
  3.250000e+02   3.611848e-06   3.352820e-06   4.928169e-06   4.287005e+01 
  3.255000e+02   3.120189e-06   2.792217e-06   4.187130e-06   4.182494e+01 
  3.260000e+02   2.798412e-06   2.057532e-06   3.473406e-06   3.632518e+01 
  3.265000e+02   2.882990e-06   2.332843e-06   3.708609e-06   3.897891e+01 
  3.270000e+02   2.665778e-06   2.508608e-06   3.660531e-06   4.326019e+01 
  3.275000e+02   2.538066e-06   2.434680e-06   3.517022e-06   4.380896e+01 
  3.280000e+02   3.287216e-06   2.701388e-06   4.254796e-06   3.941288e+01 
  3.285000e+02   3.601350e-06   3.168223e-06   4.796598e-06   4.133912e+01 
  3.290000e+02   3.288834e-06   4.209508e-06   5.341946e-06   5.199995e+01 
  3.295000e+02   3.056364e-06   4.645430e-06   5.560700e-06   5.665792e+01 
  3.300000e+02   3.466843e-06   4.463677e-06   5.651851e-06   5.216427e+01 
  3.305000e+02   3.271356e-06   4.085035e-06   5.233477e-06   5.131174e+01 
  3.310000e+02   2.768910e-06   3.719264e-06   4.636786e-06   5.333312e+01 
  3.315000e+02   3.260550e-06   3.298185e-06   4.637802e-06   4.532876e+01 
  3.320000e+02   4.410765e-06   3.164555e-06   5.428559e-06   3.565799e+01 
  3.325000e+02   4.929821e-06   4.589349e-06   6.735374e-06   4.295157e+01 
  3.330000e+02   4.302370e-06   5.265013e-06   6.799319e-06   5.074560e+01 
  3.335000e+02   3.734375e-06   4.273623e-06   5.675333e-06   4.885241e+01 
  3.340000e+02   3.717637e-06   3.734410e-06   5.269406e-06   4.512896e+01 
  3.345000e+02   2.903818e-06   4.705882e-06   5.529690e-06   5.832286e+01 
  3.350000e+02   2.801309e-06   4.993336e-06   5.725447e-06   6.070715e+01 
  3.355000e+02   3.612841e-06   4.080759e-06   5.450249e-06   4.848038e+01 
  3.360000e+02   4.004649e-06   2.913038e-06   4.952070e-06   3.603267e+01 
  3.365000e+02   3.755727e-06   2.793546e-06   4.680747e-06   3.664222e+01 
  3.370000e+02   3.559462e-06   3.126184e-06   4.737383e-06   4.129200e+01 
  3.375000e+02   3.356686e-06   3.191892e-06   4.632010e-06   4.355847e+01 
  3.380000e+02   3.218763e-06   2.838352e-06   4.291466e-06   4.140631e+01 
  3.385000e+02   2.929515e-06   2.457081e-06   3.823520e-06   3.998767e+01 
  3.390000e+02   4.049917e-06   2.500445e-06   4.759628e-06   3.169145e+01 
  3.395000e+02   5.987182e-06   3.744359e-06   7.061627e-06   3.202169e+01 
  3.400000e+02   6.717248e-06   4.497747e-06   8.084005e-06   3.380554e+01 
  3.405000e+02   5.097253e-06   3.719765e-06   6.310202e-06   3.612043e+01 
  3.410000e+02   2.707667e-06   2.550481e-06   3.719733e-06   4.328772e+01 
  3.415000e+02   2.116837e-06   2.007227e-06   2.917183e-06   4.347754e+01 
  3.420000e+02   2.806898e-06   2.196479e-06   3.564154e-06   3.804422e+01 
  3.425000e+02   3.031048e-06   2.492671e-06   3.924368e-06   3.943317e+01 
  3.430000e+02   2.974736e-06   2.708425e-06   4.023012e-06   4.231710e+01 
  3.435000e+02   2.995236e-06   2.535223e-06   3.924130e-06   4.024519e+01 
  3.440000e+02   3.239068e-06   2.958058e-06   4.386533e-06   4.240369e+01 
  3.445000e+02   4.269198e-06   5.234418e-06   6.754642e-06   5.079927e+01 
  3.450000e+02   7.357682e-06   7.996309e-06   1.086630e-05   4.738176e+01 
  3.455000e+02   7.000898e-06   6.678979e-06   9.675812e-06   4.365195e+01 
  3.460000e+02   3.600770e-06   2.837140e-06   4.584202e-06   3.823549e+01 
  3.465000e+02   2.362686e-06   2.150761e-06   3.195006e-06   4.231170e+01 
  3.470000e+02   2.538123e-06   2.705543e-06   3.709721e-06   4.682872e+01 
  3.475000e+02   3.008138e-06   2.525388e-06   3.927656e-06   4.001407e+01 
  3.480000e+02   3.451287e-06   2.464592e-06   4.240943e-06   3.553093e+01 
  3.485000e+02   3.385381e-06   2.960315e-06   4.497140e-06   4.116777e+01 
  3.490000e+02   2.826928e-06   2.792569e-06   3.973659e-06   4.464968e+01 
  3.495000e+02   2.625458e-06   2.199593e-06   3.425090e-06   3.995607e+01 
  3.500000e+02   2.574450e-06   2.171077e-06   3.367695e-06   4.014150e+01 
  3.505000e+02   2.416008e-06   2.090536e-06   3.194908e-06   4.086916e+01 
  3.510000e+02   2.769228e-06   2.651088e-06   3.833652e-06   4.375140e+01 
  3.515000e+02   3.101465e-06   3.024136e-06   4.331799e-06   4.427674e+01 
  3.520000e+02   3.081965e-06   2.950376e-06   4.266524e-06   4.375034e+01 
  3.525000e+02   2.723114e-06   2.530495e-06   3.717359e-06   4.290024e+01 
  3.530000e+02   2.484533e-06   2.752254e-06   3.707803e-06   4.792659e+01 
  3.535000e+02   2.471141e-06   3.675144e-06   4.428682e-06   5.608339e+01 
  3.540000e+02   2.163299e-06   3.810359e-06   4.381632e-06   6.041462e+01 
  3.545000e+02   2.472265e-06   3.734821e-06   4.478948e-06   5.649743e+01 
  3.550000e+02   2.925868e-06   3.687796e-06   4.707499e-06   5.157179e+01 
  3.555000e+02   3.565270e-06   3.260704e-06   4.831495e-06   4.244524e+01 
  3.560000e+02   4.974494e-06   3.981145e-06   6.371429e-06   3.867069e+01 
  3.565000e+02   5.699764e-06   4.684142e-06   7.377567e-06   3.941382e+01 
  3.570000e+02   5.229470e-06   4.054382e-06   6.617051e-06   3.778624e+01 
  3.575000e+02   4.063921e-06   2.945153e-06   5.018902e-06   3.593111e+01 
  3.580000e+02   2.777702e-06   2.098526e-06   3.481299e-06   3.707068e+01 
  3.585000e+02   2.236641e-06   2.308224e-06   3.214104e-06   4.590235e+01 
  3.590000e+02   3.325005e-06   3.441185e-06   4.785124e-06   4.598371e+01 
  3.595000e+02   1.000665e-05   1.079018e-05   1.471601e-05   4.715764e+01 
  3.600000e+02   1.734631e-05   1.813883e-05   2.509804e-05   4.627942e+01 
  3.605000e+02   1.435171e-05   1.454774e-05   2.043547e-05   4.538863e+01 
  3.610000e+02   5.863866e-06   6.039499e-06   8.417866e-06   4.584533e+01 
  3.615000e+02   2.304041e-06   2.936723e-06   3.732686e-06   5.188361e+01 
  3.620000e+02   2.434406e-06   3.038386e-06   3.893343e-06   5.129771e+01 
  3.625000e+02   2.658044e-06   3.305544e-06   4.241676e-06   5.119666e+01 
  3.630000e+02   2.217108e-06   3.644587e-06   4.265980e-06   5.868663e+01 
  3.635000e+02   2.225126e-06   3.536418e-06   4.178210e-06   5.782175e+01 
  3.640000e+02   2.667828e-06   3.572760e-06   4.458915e-06   5.325080e+01 
  3.645000e+02   2.579873e-06   3.373219e-06   4.246687e-06   5.259085e+01 
  3.650000e+02   2.414879e-06   2.647338e-06   3.583299e-06   4.762920e+01 
  3.655000e+02   2.094670e-06   2.004442e-06   2.899212e-06   4.373903e+01 
  3.660000e+02   2.226748e-06   1.807379e-06   2.867931e-06   3.906511e+01 
  3.665000e+02   2.410714e-06   1.763472e-06   2.986867e-06   3.618601e+01 
  3.670000e+02   2.171267e-06   1.760638e-06   2.795397e-06   3.903792e+01 
  3.675000e+02   2.528186e-06   2.192951e-06   3.346753e-06   4.093841e+01 
  3.680000e+02   2.933527e-06   2.293196e-06   3.723483e-06   3.801544e+01 
  3.685000e+02   2.694625e-06   2.235608e-06   3.501278e-06   3.968096e+01 
  3.690000e+02   2.555350e-06   2.129188e-06   3.326147e-06   3.980200e+01 
  3.695000e+02   2.608909e-06   2.374926e-06   3.527985e-06   4.231203e+01 
  3.700000e+02   2.520864e-06   2.729806e-06   3.715723e-06   4.727879e+01 
  3.705000e+02   1.824580e-06   2.884577e-06   3.413192e-06   5.768544e+01 
  3.710000e+02   1.921048e-06   2.774105e-06   3.374327e-06   5.529767e+01 
  3.715000e+02   2.865661e-06   2.627444e-06   3.887862e-06   4.251683e+01 
  3.720000e+02   3.151330e-06   2.220005e-06   3.854776e-06   3.516339e+01 
  3.725000e+02   3.114824e-06   2.137551e-06   3.777731e-06   3.445990e+01 
  3.730000e+02   3.061546e-06   2.294399e-06   3.825876e-06   3.684880e+01 
  3.735000e+02   2.959199e-06   2.479326e-06   3.860559e-06   3.995752e+01 
  3.740000e+02   2.426281e-06   2.422358e-06   3.428507e-06   4.495363e+01 
  3.745000e+02   1.732794e-06   2.431149e-06   2.985475e-06   5.452074e+01 
  3.750000e+02   2.016986e-06   2.488366e-06   3.203154e-06   5.097292e+01 
  3.755000e+02   2.305237e-06   2.398617e-06   3.326782e-06   4.613727e+01 
  3.760000e+02   2.356918e-06   2.133100e-06   3.178864e-06   4.214628e+01 
  3.765000e+02   2.407926e-06   2.103809e-06   3.197518e-06   4.114376e+01 
  3.770000e+02   2.588629e-06   2.022429e-06   3.284999e-06   3.799959e+01 
  3.775000e+02   2.707825e-06   2.095626e-06   3.424027e-06   3.773682e+01 
  3.780000e+02   2.221845e-06   2.497276e-06   3.342602e-06   4.834027e+01 
  3.785000e+02   2.262770e-06   2.805765e-06   3.604503e-06   5.111480e+01 
  3.790000e+02   3.243409e-06   3.052880e-06   4.454187e-06   4.326673e+01 
  3.795000e+02   3.833485e-06   4.487995e-06   5.902347e-06   4.949723e+01 
  3.800000e+02   3.126725e-06   5.183250e-06   6.053304e-06   5.890009e+01 
  3.805000e+02   2.031261e-06   3.971972e-06   4.461231e-06   6.291486e+01 
  3.810000e+02   2.044144e-06   3.026015e-06   3.651752e-06   5.596005e+01 
  3.815000e+02   1.792447e-06   2.588015e-06   3.148125e-06   5.529370e+01 
  3.820000e+02   2.164410e-06   2.557581e-06   3.350506e-06   4.975969e+01 
  3.825000e+02   2.758349e-06   2.466149e-06   3.700051e-06   4.179885e+01 
  3.830000e+02   3.494056e-06   2.343189e-06   4.207013e-06   3.384666e+01 
  3.835000e+02   3.559378e-06   3.449470e-06   4.956613e-06   4.410159e+01 
  3.840000e+02   2.772133e-06   4.047573e-06   4.905871e-06   5.559324e+01 
  3.845000e+02   2.063262e-06   3.687476e-06   4.225462e-06   6.077156e+01 
  3.850000e+02   2.181566e-06   3.337505e-06   3.987251e-06   5.682929e+01 
  3.855000e+02   2.442734e-06   2.655507e-06   3.608139e-06   4.738983e+01 
  3.860000e+02   2.426057e-06   2.321127e-06   3.357586e-06   4.373376e+01 
  3.865000e+02   2.417069e-06   2.843340e-06   3.731864e-06   4.963277e+01 
  3.870000e+02   2.632887e-06   3.394368e-06   4.295792e-06   5.220058e+01 
  3.875000e+02   3.506183e-06   4.618071e-06   5.798267e-06   5.279310e+01 
  3.880000e+02   3.101527e-06   4.276532e-06   5.282821e-06   5.404874e+01 
  3.885000e+02   1.920842e-06   2.359475e-06   3.042491e-06   5.085106e+01 
  3.890000e+02   1.727600e-06   2.055926e-06   2.685411e-06   4.995958e+01 
  3.895000e+02   2.588591e-06   2.150873e-06   3.365569e-06   3.972336e+01 
  3.900000e+02   3.848874e-06   3.051376e-06   4.911692e-06   3.840728e+01 
  3.905000e+02   4.038223e-06   3.445363e-06   5.308274e-06   4.047041e+01 
  3.910000e+02   3.624280e-06   3.098091e-06   4.767974e-06   4.052434e+01 
  3.915000e+02   4.257626e-06   4.854433e-06   6.457004e-06   4.874731e+01 
  3.920000e+02   4.304850e-06   5.107438e-06   6.679645e-06   4.987383e+01 
  3.925000e+02   3.238225e-06   3.649595e-06   4.879103e-06   4.841789e+01 
  3.930000e+02   2.531485e-06   2.695879e-06   3.698132e-06   4.680128e+01 
  3.935000e+02   2.408346e-06   2.220835e-06   3.276010e-06   4.268042e+01 
  3.940000e+02   2.200067e-06   1.986286e-06   2.964056e-06   4.207666e+01 
  3.945000e+02   2.147756e-06   2.204151e-06   3.077522e-06   4.574243e+01 
  3.950000e+02   2.981145e-06   3.026561e-06   4.248211e-06   4.543313e+01 
  3.955000e+02   4.486140e-06   4.751324e-06   6.534564e-06   4.664436e+01 
  3.960000e+02   4.686286e-06   5.745016e-06   7.413938e-06   5.079542e+01 
  3.965000e+02   2.681510e-06   4.286527e-06   5.056166e-06   5.797126e+01 
  3.970000e+02   2.034328e-06   2.734441e-06   3.408175e-06   5.335205e+01 
  3.975000e+02   2.565833e-06   2.420043e-06   3.527054e-06   4.332511e+01 
  3.980000e+02   2.767367e-06   2.662436e-06   3.840168e-06   4.389290e+01 
  3.985000e+02   2.713774e-06   2.848518e-06   3.934288e-06   4.638769e+01 
  3.990000e+02   5.438104e-06   5.482042e-06   7.721772e-06   4.523053e+01 
  3.995000e+02   1.543182e-05   1.526342e-05   2.170514e-05   4.468565e+01 
  4.000000e+02   2.080650e-05   2.053303e-05   2.923210e-05   4.462098e+01 
