  0.000000e+00   9.812882e-05   0.000000e+00   9.812882e-05   0.000000e+00 
  1.280000e+02   9.288539e-05   0.000000e+00   9.288539e-05   0.000000e+00 
  2.560000e+02   9.513915e-05   0.000000e+00   9.513915e-05   0.000000e+00 
  3.840000e+02   9.787084e-05   0.000000e+00   9.787084e-05   0.000000e+00 
  5.120000e+02   1.037217e-04   0.000000e+00   1.037217e-04   0.000000e+00 
  6.400000e+02   1.105399e-04   0.000000e+00   1.105399e-04   0.000000e+00 
  7.680000e+02   1.196679e-04   0.000000e+00   1.196679e-04   0.000000e+00 
  8.960000e+02   1.282434e-04   0.000000e+00   1.282434e-04   0.000000e+00 
  1.024000e+03   1.426567e-04   0.000000e+00   1.426567e-04   0.000000e+00 
  1.152000e+03   1.540584e-04   0.000000e+00   1.540584e-04   0.000000e+00 
  1.280000e+03   1.691239e-04   0.000000e+00   1.691239e-04   0.000000e+00 
  1.408000e+03   1.809144e-04   0.000000e+00   1.809144e-04   0.000000e+00 
  1.536000e+03   1.900073e-04   0.000000e+00   1.900073e-04   0.000000e+00 
  1.664000e+03   2.022171e-04   0.000000e+00   2.022171e-04   0.000000e+00 
  1.792000e+03   2.122076e-04   0.000000e+00   2.122076e-04   0.000000e+00 
  1.920000e+03   2.243731e-04   0.000000e+00   2.243731e-04   0.000000e+00 
  2.048000e+03   2.410253e-04   0.000000e+00   2.410253e-04   0.000000e+00 
  2.176000e+03   2.558178e-04   0.000000e+00   2.558178e-04   0.000000e+00 
  2.304000e+03   2.700753e-04   0.000000e+00   2.700753e-04   0.000000e+00 
  2.432000e+03   2.846991e-04   0.000000e+00   2.846991e-04   0.000000e+00 
  2.560000e+03   2.954001e-04   0.000000e+00   2.954001e-04   0.000000e+00 
  2.688000e+03   3.088948e-04   0.000000e+00   3.088948e-04   0.000000e+00 
  2.816000e+03   3.183383e-04   0.000000e+00   3.183383e-04   0.000000e+00 
  2.944000e+03   3.263493e-04   0.000000e+00   3.263493e-04   0.000000e+00 
  3.072000e+03   3.358812e-04   0.000000e+00   3.358812e-04   0.000000e+00 
  3.200000e+03   3.477057e-04   0.000000e+00   3.477057e-04   0.000000e+00 
  3.328000e+03   3.655697e-04   0.000000e+00   3.655697e-04   0.000000e+00 
  3.456000e+03   3.799634e-04   0.000000e+00   3.799634e-04   0.000000e+00 
  3.584000e+03   3.821191e-04   0.000000e+00   3.821191e-04   0.000000e+00 
  3.712000e+03   4.026154e-04   0.000000e+00   4.026154e-04   0.000000e+00 
  3.840000e+03   4.131268e-04   0.000000e+00   4.131268e-04   0.000000e+00 
  3.968000e+03   4.280165e-04   0.000000e+00   4.280165e-04   0.000000e+00 
  4.096000e+03   4.422050e-04   0.000000e+00   4.422050e-04   0.000000e+00 
  4.224000e+03   4.479606e-04   0.000000e+00   4.479606e-04   0.000000e+00 
  4.352000e+03   4.535001e-04   0.000000e+00   4.535001e-04   0.000000e+00 
  4.480000e+03   4.597399e-04   0.000000e+00   4.597399e-04   0.000000e+00 
  4.608000e+03   4.726791e-04   0.000000e+00   4.726791e-04   0.000000e+00 
  4.736000e+03   4.911655e-04   0.000000e+00   4.911655e-04   0.000000e+00 
  4.864000e+03   5.092925e-04   0.000000e+00   5.092925e-04   0.000000e+00 
  4.992000e+03   5.465614e-04   0.000000e+00   5.465614e-04   0.000000e+00 
  5.120000e+03   5.636814e-04   0.000000e+00   5.636814e-04   0.000000e+00 
  5.248000e+03   5.456384e-04   0.000000e+00   5.456384e-04   0.000000e+00 
  5.376000e+03   5.423091e-04   0.000000e+00   5.423091e-04   0.000000e+00 
  5.504000e+03   5.459260e-04   0.000000e+00   5.459260e-04   0.000000e+00 
  5.632000e+03   5.465786e-04   0.000000e+00   5.465786e-04   0.000000e+00 
  5.760000e+03   5.630811e-04   0.000000e+00   5.630811e-04   0.000000e+00 
  5.888000e+03   5.716323e-04   0.000000e+00   5.716323e-04   0.000000e+00 
  6.016000e+03   5.701024e-04   0.000000e+00   5.701024e-04   0.000000e+00 
  6.144000e+03   5.711041e-04   0.000000e+00   5.711041e-04   0.000000e+00 
  6.272000e+03   5.878765e-04   0.000000e+00   5.878765e-04   0.000000e+00 
  6.400000e+03   5.884247e-04   0.000000e+00   5.884247e-04   0.000000e+00 
  6.528000e+03   6.052073e-04   0.000000e+00   6.052073e-04   0.000000e+00 
  6.656000e+03   6.116572e-04   0.000000e+00   6.116572e-04   0.000000e+00 
  6.784000e+03   6.382896e-04   0.000000e+00   6.382896e-04   0.000000e+00 
  6.912000e+03   6.341499e-04   0.000000e+00   6.341499e-04   0.000000e+00 
  7.040000e+03   6.401257e-04   0.000000e+00   6.401257e-04   0.000000e+00 
  7.168000e+03   6.309160e-04   0.000000e+00   6.309160e-04   0.000000e+00 
  7.296000e+03   6.391372e-04   0.000000e+00   6.391372e-04   0.000000e+00 
  7.424000e+03   6.383871e-04   0.000000e+00   6.383871e-04   0.000000e+00 
  7.552000e+03   6.501479e-04   0.000000e+00   6.501479e-04   0.000000e+00 
  7.680000e+03   6.523413e-04   0.000000e+00   6.523413e-04   0.000000e+00 
  7.808000e+03   6.681302e-04   0.000000e+00   6.681302e-04   0.000000e+00 
  7.936000e+03   6.937917e-04   0.000000e+00   6.937917e-04   0.000000e+00 
  8.064000e+03   7.076261e-04   0.000000e+00   7.076261e-04   0.000000e+00 
  8.192000e+03   6.865346e-04   0.000000e+00   6.865346e-04   0.000000e+00 
  8.320000e+03   6.944272e-04   0.000000e+00   6.944272e-04   0.000000e+00 
  8.448000e+03   6.939688e-04   0.000000e+00   6.939688e-04   0.000000e+00 
  8.576000e+03   6.740306e-04   0.000000e+00   6.740306e-04   0.000000e+00 
  8.704000e+03   6.882967e-04   0.000000e+00   6.882967e-04   0.000000e+00 
  8.832000e+03   7.074354e-04   0.000000e+00   7.074354e-04   0.000000e+00 
  8.960000e+03   7.017945e-04   0.000000e+00   7.017945e-04   0.000000e+00 
  9.088000e+03   7.204433e-04   0.000000e+00   7.204433e-04   0.000000e+00 
  9.216000e+03   7.521483e-04   0.000000e+00   7.521483e-04   0.000000e+00 
  9.344000e+03   7.722385e-04   0.000000e+00   7.722385e-04   0.000000e+00 
  9.472000e+03   7.496872e-04   0.000000e+00   7.496872e-04   0.000000e+00 
  9.600000e+03   7.545316e-04   0.000000e+00   7.545316e-04   0.000000e+00 
  9.728000e+03   7.582693e-04   0.000000e+00   7.582693e-04   0.000000e+00 
  9.856000e+03   7.558531e-04   0.000000e+00   7.558531e-04   0.000000e+00 
  9.984000e+03   7.726391e-04   0.000000e+00   7.726391e-04   0.000000e+00 
  1.011200e+04   7.710795e-04   0.000000e+00   7.710795e-04   0.000000e+00 
  1.024000e+04   8.360979e-04   0.000000e+00   8.360979e-04   0.000000e+00 
  1.036800e+04   9.068699e-04   0.000000e+00   9.068699e-04   0.000000e+00 
  1.049600e+04   8.077469e-04   0.000000e+00   8.077469e-04   0.000000e+00 
  1.062400e+04   7.866390e-04   0.000000e+00   7.866390e-04   0.000000e+00 
  1.075200e+04   7.889932e-04   0.000000e+00   7.889932e-04   0.000000e+00 
  1.088000e+04   7.839224e-04   0.000000e+00   7.839224e-04   0.000000e+00 
  1.100800e+04   8.143089e-04   0.000000e+00   8.143089e-04   0.000000e+00 
  1.113600e+04   8.086473e-04   0.000000e+00   8.086473e-04   0.000000e+00 
  1.126400e+04   7.995009e-04   0.000000e+00   7.995009e-04   0.000000e+00 
  1.139200e+04   8.193281e-04   0.000000e+00   8.193281e-04   0.000000e+00 
  1.152000e+04   8.332052e-04   0.000000e+00   8.332052e-04   0.000000e+00 
  1.164800e+04   8.345750e-04   0.000000e+00   8.345750e-04   0.000000e+00 
  1.177600e+04   8.174748e-04   0.000000e+00   8.174748e-04   0.000000e+00 
  1.190400e+04   8.252736e-04   0.000000e+00   8.252736e-04   0.000000e+00 
  1.203200e+04   8.537722e-04   0.000000e+00   8.537722e-04   0.000000e+00 
  1.216000e+04   8.404091e-04   0.000000e+00   8.404091e-04   0.000000e+00 
  1.228800e+04   8.572648e-04   0.000000e+00   8.572648e-04   0.000000e+00 
  1.241600e+04   8.905269e-04   0.000000e+00   8.905269e-04   0.000000e+00 
  1.254400e+04   8.954554e-04   0.000000e+00   8.954554e-04   0.000000e+00 
  1.267200e+04   8.870180e-04   0.000000e+00   8.870180e-04   0.000000e+00 
  1.280000e+04   9.062974e-04   0.000000e+00   9.062974e-04   0.000000e+00 
  1.292800e+04   9.273629e-04   0.000000e+00   9.273629e-04   0.000000e+00 
  1.305600e+04   9.403544e-04   0.000000e+00   9.403544e-04   0.000000e+00 
  1.318400e+04   9.335735e-04   0.000000e+00   9.335735e-04   0.000000e+00 
  1.331200e+04   9.385428e-04   0.000000e+00   9.385428e-04   0.000000e+00 
  1.344000e+04   9.581030e-04   0.000000e+00   9.581030e-04   0.000000e+00 
  1.356800e+04   9.909001e-04   0.000000e+00   9.909001e-04   0.000000e+00 
  1.369600e+04   9.766511e-04   0.000000e+00   9.766511e-04   0.000000e+00 
  1.382400e+04   9.629691e-04   0.000000e+00   9.629691e-04   0.000000e+00 
  1.395200e+04   9.645034e-04   0.000000e+00   9.645034e-04   0.000000e+00 
  1.408000e+04   9.945690e-04   0.000000e+00   9.945690e-04   0.000000e+00 
  1.420800e+04   1.014384e-03   0.000000e+00   1.014384e-03   0.000000e+00 
  1.433600e+04   1.016767e-03   0.000000e+00   1.016767e-03   0.000000e+00 
  1.446400e+04   1.001368e-03   0.000000e+00   1.001368e-03   0.000000e+00 
  1.459200e+04   1.029932e-03   0.000000e+00   1.029932e-03   0.000000e+00 
  1.472000e+04   1.031910e-03   0.000000e+00   1.031910e-03   0.000000e+00 
  1.484800e+04   1.050096e-03   0.000000e+00   1.050096e-03   0.000000e+00 
  1.497600e+04   1.046942e-03   0.000000e+00   1.046942e-03   0.000000e+00 
  1.510400e+04   1.065274e-03   0.000000e+00   1.065274e-03   0.000000e+00 
  1.523200e+04   1.079240e-03   0.000000e+00   1.079240e-03   0.000000e+00 
  1.536000e+04   1.080333e-03   0.000000e+00   1.080333e-03   0.000000e+00 
  1.548800e+04   1.093088e-03   0.000000e+00   1.093088e-03   0.000000e+00 
  1.561600e+04   1.129317e-03   0.000000e+00   1.129317e-03   0.000000e+00 
  1.574400e+04   1.127572e-03   0.000000e+00   1.127572e-03   0.000000e+00 
  1.587200e+04   1.141814e-03   0.000000e+00   1.141814e-03   0.000000e+00 
  1.600000e+04   1.201369e-03   0.000000e+00   1.201369e-03   0.000000e+00 
  1.612800e+04   1.281882e-03   0.000000e+00   1.281882e-03   0.000000e+00 
  1.625600e+04   1.266863e-03   0.000000e+00   1.266863e-03   0.000000e+00 
  1.638400e+04   1.246731e-03   0.000000e+00   1.246731e-03   0.000000e+00 
  1.651200e+04   1.250881e-03   0.000000e+00   1.250881e-03   0.000000e+00 
  1.664000e+04   1.295375e-03   0.000000e+00   1.295375e-03   0.000000e+00 
  1.676800e+04   1.275944e-03   0.000000e+00   1.275944e-03   0.000000e+00 
  1.689600e+04   1.200833e-03   0.000000e+00   1.200833e-03   0.000000e+00 
  1.702400e+04   1.232426e-03   0.000000e+00   1.232426e-03   0.000000e+00 
  1.715200e+04   1.254819e-03   0.000000e+00   1.254819e-03   0.000000e+00 
  1.728000e+04   1.302266e-03   0.000000e+00   1.302266e-03   0.000000e+00 
  1.740800e+04   1.354123e-03   0.000000e+00   1.354123e-03   0.000000e+00 
  1.753600e+04   1.378905e-03   0.000000e+00   1.378905e-03   0.000000e+00 
  1.766400e+04   1.398452e-03   0.000000e+00   1.398452e-03   0.000000e+00 
  1.779200e+04   1.399559e-03   0.000000e+00   1.399559e-03   0.000000e+00 
  1.792000e+04   1.461289e-03   0.000000e+00   1.461289e-03   0.000000e+00 
  1.804800e+04   1.450972e-03   0.000000e+00   1.450972e-03   0.000000e+00 
  1.817600e+04   1.443275e-03   0.000000e+00   1.443275e-03   0.000000e+00 
  1.830400e+04   1.484531e-03   0.000000e+00   1.484531e-03   0.000000e+00 
  1.843200e+04   1.534744e-03   0.000000e+00   1.534744e-03   0.000000e+00 
  1.856000e+04   1.618129e-03   0.000000e+00   1.618129e-03   0.000000e+00 
  1.868800e+04   1.611349e-03   0.000000e+00   1.611349e-03   0.000000e+00 
  1.881600e+04   1.597401e-03   0.000000e+00   1.597401e-03   0.000000e+00 
  1.894400e+04   1.616720e-03   0.000000e+00   1.616720e-03   0.000000e+00 
  1.907200e+04   1.653840e-03   0.000000e+00   1.653840e-03   0.000000e+00 
  1.920000e+04   1.672081e-03   0.000000e+00   1.672081e-03   0.000000e+00 
  1.932800e+04   1.709536e-03   0.000000e+00   1.709536e-03   0.000000e+00 
  1.945600e+04   1.691863e-03   0.000000e+00   1.691863e-03   0.000000e+00 
  1.958400e+04   1.861826e-03   0.000000e+00   1.861826e-03   0.000000e+00 
  1.971200e+04   1.902697e-03   0.000000e+00   1.902697e-03   0.000000e+00 
  1.984000e+04   1.781091e-03   0.000000e+00   1.781091e-03   0.000000e+00 
  1.996800e+04   1.828145e-03   0.000000e+00   1.828145e-03   0.000000e+00 
  2.009600e+04   1.856035e-03   0.000000e+00   1.856035e-03   0.000000e+00 
  2.022400e+04   1.898670e-03   0.000000e+00   1.898670e-03   0.000000e+00 
  2.035200e+04   1.950613e-03   0.000000e+00   1.950613e-03   0.000000e+00 
  2.048000e+04   1.988051e-03   0.000000e+00   1.988051e-03   0.000000e+00 
  2.060800e+04   1.983271e-03   0.000000e+00   1.983271e-03   0.000000e+00 
  2.073600e+04   1.981459e-03   0.000000e+00   1.981459e-03   0.000000e+00 
  2.086400e+04   2.041156e-03   0.000000e+00   2.041156e-03   0.000000e+00 
  2.099200e+04   2.103971e-03   0.000000e+00   2.103971e-03   0.000000e+00 
  2.112000e+04   2.112797e-03   0.000000e+00   2.112797e-03   0.000000e+00 
  2.124800e+04   2.149943e-03   0.000000e+00   2.149943e-03   0.000000e+00 
  2.137600e+04   2.244722e-03   0.000000e+00   2.244722e-03   0.000000e+00 
  2.150400e+04   2.307093e-03   0.000000e+00   2.307093e-03   0.000000e+00 
  2.163200e+04   2.338405e-03   0.000000e+00   2.338405e-03   0.000000e+00 
  2.176000e+04   2.472299e-03   0.000000e+00   2.472299e-03   0.000000e+00 
  2.188800e+04   2.487827e-03   0.000000e+00   2.487827e-03   0.000000e+00 
  2.201600e+04   2.445458e-03   0.000000e+00   2.445458e-03   0.000000e+00 
  2.214400e+04   2.492492e-03   0.000000e+00   2.492492e-03   0.000000e+00 
  2.227200e+04   2.544421e-03   0.000000e+00   2.544421e-03   0.000000e+00 
  2.240000e+04   2.636992e-03   0.000000e+00   2.636992e-03   0.000000e+00 
  2.252800e+04   2.679114e-03   0.000000e+00   2.679114e-03   0.000000e+00 
  2.265600e+04   2.695389e-03   0.000000e+00   2.695389e-03   0.000000e+00 
  2.278400e+04   2.741394e-03   0.000000e+00   2.741394e-03   0.000000e+00 
  2.291200e+04   2.756623e-03   0.000000e+00   2.756623e-03   0.000000e+00 
  2.304000e+04   2.810238e-03   0.000000e+00   2.810238e-03   0.000000e+00 
  2.316800e+04   2.910393e-03   0.000000e+00   2.910393e-03   0.000000e+00 
  2.329600e+04   2.879575e-03   0.000000e+00   2.879575e-03   0.000000e+00 
  2.342400e+04   3.035949e-03   0.000000e+00   3.035949e-03   0.000000e+00 
  2.355200e+04   3.212624e-03   0.000000e+00   3.212624e-03   0.000000e+00 
  2.368000e+04   3.288482e-03   0.000000e+00   3.288482e-03   0.000000e+00 
  2.380800e+04   3.394206e-03   0.000000e+00   3.394206e-03   0.000000e+00 
  2.393600e+04   3.529551e-03   0.000000e+00   3.529551e-03   0.000000e+00 
  2.406400e+04   3.562220e-03   0.000000e+00   3.562220e-03   0.000000e+00 
  2.419200e+04   3.588315e-03   0.000000e+00   3.588315e-03   0.000000e+00 
  2.432000e+04   3.635781e-03   0.000000e+00   3.635781e-03   0.000000e+00 
  2.444800e+04   3.757047e-03   0.000000e+00   3.757047e-03   0.000000e+00 
  2.457600e+04   3.790266e-03   0.000000e+00   3.790266e-03   0.000000e+00 
  2.470400e+04   4.022579e-03   0.000000e+00   4.022579e-03   0.000000e+00 
  2.483200e+04   4.176253e-03   0.000000e+00   4.176253e-03   0.000000e+00 
  2.496000e+04   4.161197e-03   0.000000e+00   4.161197e-03   0.000000e+00 
  2.508800e+04   4.136412e-03   0.000000e+00   4.136412e-03   0.000000e+00 
  2.521600e+04   4.306916e-03   0.000000e+00   4.306916e-03   0.000000e+00 
  2.534400e+04   4.495914e-03   0.000000e+00   4.495914e-03   0.000000e+00 
  2.547200e+04   4.690739e-03   0.000000e+00   4.690739e-03   0.000000e+00 
  2.560000e+04   4.814176e-03   0.000000e+00   4.814176e-03   0.000000e+00 
  2.572800e+04   4.995010e-03   0.000000e+00   4.995010e-03   0.000000e+00 
  2.585600e+04   5.245534e-03   0.000000e+00   5.245534e-03   0.000000e+00 
  2.598400e+04   5.646421e-03   0.000000e+00   5.646421e-03   0.000000e+00 
  2.611200e+04   5.563783e-03   0.000000e+00   5.563783e-03   0.000000e+00 
  2.624000e+04   5.727601e-03   0.000000e+00   5.727601e-03   0.000000e+00 
  2.636800e+04   6.083767e-03   0.000000e+00   6.083767e-03   0.000000e+00 
  2.649600e+04   6.617535e-03   0.000000e+00   6.617535e-03   0.000000e+00 
  2.662400e+04   7.558145e-03   0.000000e+00   7.558145e-03   0.000000e+00 
  2.675200e+04   7.358239e-03   0.000000e+00   7.358239e-03   0.000000e+00 
  2.688000e+04   6.154419e-03   0.000000e+00   6.154419e-03   0.000000e+00 
  2.700800e+04   5.910230e-03   0.000000e+00   5.910230e-03   0.000000e+00 
  2.713600e+04   6.152372e-03   0.000000e+00   6.152372e-03   0.000000e+00 
  2.726400e+04   6.235136e-03   0.000000e+00   6.235136e-03   0.000000e+00 
  2.739200e+04   6.347196e-03   0.000000e+00   6.347196e-03   0.000000e+00 
  2.752000e+04   5.983238e-03   0.000000e+00   5.983238e-03   0.000000e+00 
  2.764800e+04   5.368720e-03   0.000000e+00   5.368720e-03   0.000000e+00 
  2.777600e+04   5.307260e-03   0.000000e+00   5.307260e-03   0.000000e+00 
  2.790400e+04   5.171495e-03   0.000000e+00   5.171495e-03   0.000000e+00 
  2.803200e+04   4.693572e-03   0.000000e+00   4.693572e-03   0.000000e+00 
  2.816000e+04   4.669936e-03   0.000000e+00   4.669936e-03   0.000000e+00 
  2.828800e+04   5.049895e-03   0.000000e+00   5.049895e-03   0.000000e+00 
  2.841600e+04   4.993387e-03   0.000000e+00   4.993387e-03   0.000000e+00 
  2.854400e+04   5.034460e-03   0.000000e+00   5.034460e-03   0.000000e+00 
  2.867200e+04   5.285663e-03   0.000000e+00   5.285663e-03   0.000000e+00 
  2.880000e+04   4.946362e-03   0.000000e+00   4.946362e-03   0.000000e+00 
  2.892800e+04   4.135625e-03   0.000000e+00   4.135625e-03   0.000000e+00 
  2.905600e+04   3.557367e-03   0.000000e+00   3.557367e-03   0.000000e+00 
  2.918400e+04   3.521577e-03   0.000000e+00   3.521577e-03   0.000000e+00 
  2.931200e+04   3.495643e-03   0.000000e+00   3.495643e-03   0.000000e+00 
  2.944000e+04   3.374255e-03   0.000000e+00   3.374255e-03   0.000000e+00 
  2.956800e+04   3.205177e-03   0.000000e+00   3.205177e-03   0.000000e+00 
  2.969600e+04   3.329358e-03   0.000000e+00   3.329358e-03   0.000000e+00 
  2.982400e+04   3.429182e-03   0.000000e+00   3.429182e-03   0.000000e+00 
  2.995200e+04   3.198982e-03   0.000000e+00   3.198982e-03   0.000000e+00 
  3.008000e+04   2.909665e-03   0.000000e+00   2.909665e-03   0.000000e+00 
  3.020800e+04   2.866999e-03   0.000000e+00   2.866999e-03   0.000000e+00 
  3.033600e+04   2.732516e-03   0.000000e+00   2.732516e-03   0.000000e+00 
  3.046400e+04   2.590180e-03   0.000000e+00   2.590180e-03   0.000000e+00 
  3.059200e+04   2.544670e-03   0.000000e+00   2.544670e-03   0.000000e+00 
  3.072000e+04   2.497608e-03   0.000000e+00   2.497608e-03   0.000000e+00 
  3.084800e+04   2.369143e-03   0.000000e+00   2.369143e-03   0.000000e+00 
  3.097600e+04   2.299312e-03   0.000000e+00   2.299312e-03   0.000000e+00 
  3.110400e+04   2.292341e-03   0.000000e+00   2.292341e-03   0.000000e+00 
  3.123200e+04   2.205151e-03   0.000000e+00   2.205151e-03   0.000000e+00 
  3.136000e+04   2.212678e-03   0.000000e+00   2.212678e-03   0.000000e+00 
  3.148800e+04   2.179758e-03   0.000000e+00   2.179758e-03   0.000000e+00 
  3.161600e+04   2.127603e-03   0.000000e+00   2.127603e-03   0.000000e+00 
  3.174400e+04   2.048591e-03   0.000000e+00   2.048591e-03   0.000000e+00 
  3.187200e+04   2.071377e-03   0.000000e+00   2.071377e-03   0.000000e+00 
  3.200000e+04   2.140668e-03   0.000000e+00   2.140668e-03   0.000000e+00 
  3.212800e+04   2.244720e-03   0.000000e+00   2.244720e-03   0.000000e+00 
  3.225600e+04   1.984884e-03   0.000000e+00   1.984884e-03   0.000000e+00 
  3.238400e+04   1.808788e-03   0.000000e+00   1.808788e-03   0.000000e+00 
  3.251200e+04   1.752389e-03   0.000000e+00   1.752389e-03   0.000000e+00 
  3.264000e+04   1.686708e-03   0.000000e+00   1.686708e-03   0.000000e+00 
  3.276800e+04   1.631542e-03   0.000000e+00   1.631542e-03   0.000000e+00 
  3.289600e+04   1.650161e-03   0.000000e+00   1.650161e-03   0.000000e+00 
  3.302400e+04   1.637515e-03   0.000000e+00   1.637515e-03   0.000000e+00 
  3.315200e+04   1.610429e-03   0.000000e+00   1.610429e-03   0.000000e+00 
  3.328000e+04   1.578263e-03   0.000000e+00   1.578263e-03   0.000000e+00 
  3.340800e+04   1.574694e-03   0.000000e+00   1.574694e-03   0.000000e+00 
  3.353600e+04   1.512408e-03   0.000000e+00   1.512408e-03   0.000000e+00 
  3.366400e+04   1.462107e-03   0.000000e+00   1.462107e-03   0.000000e+00 
  3.379200e+04   1.441266e-03   0.000000e+00   1.441266e-03   0.000000e+00 
  3.392000e+04   1.401686e-03   0.000000e+00   1.401686e-03   0.000000e+00 
  3.404800e+04   1.346036e-03   0.000000e+00   1.346036e-03   0.000000e+00 
  3.417600e+04   1.346696e-03   0.000000e+00   1.346696e-03   0.000000e+00 
  3.430400e+04   1.300994e-03   0.000000e+00   1.300994e-03   0.000000e+00 
  3.443200e+04   1.290667e-03   0.000000e+00   1.290667e-03   0.000000e+00 
  3.456000e+04   1.267515e-03   0.000000e+00   1.267515e-03   0.000000e+00 
  3.468800e+04   1.247828e-03   0.000000e+00   1.247828e-03   0.000000e+00 
  3.481600e+04   1.238553e-03   0.000000e+00   1.238553e-03   0.000000e+00 
  3.494400e+04   1.212108e-03   0.000000e+00   1.212108e-03   0.000000e+00 
  3.507200e+04   1.187232e-03   0.000000e+00   1.187232e-03   0.000000e+00 
  3.520000e+04   1.126234e-03   0.000000e+00   1.126234e-03   0.000000e+00 
  3.532800e+04   1.112387e-03   0.000000e+00   1.112387e-03   0.000000e+00 
  3.545600e+04   1.115461e-03   0.000000e+00   1.115461e-03   0.000000e+00 
  3.558400e+04   1.091956e-03   0.000000e+00   1.091956e-03   0.000000e+00 
  3.571200e+04   1.063899e-03   0.000000e+00   1.063899e-03   0.000000e+00 
  3.584000e+04   1.055454e-03   0.000000e+00   1.055454e-03   0.000000e+00 
  3.596800e+04   1.004239e-03   0.000000e+00   1.004239e-03   0.000000e+00 
  3.609600e+04   1.007345e-03   0.000000e+00   1.007345e-03   0.000000e+00 
  3.622400e+04   9.940179e-04   0.000000e+00   9.940179e-04   0.000000e+00 
  3.635200e+04   9.545293e-04   0.000000e+00   9.545293e-04   0.000000e+00 
  3.648000e+04   9.117427e-04   0.000000e+00   9.117427e-04   0.000000e+00 
  3.660800e+04   8.879808e-04   0.000000e+00   8.879808e-04   0.000000e+00 
  3.673600e+04   8.931538e-04   0.000000e+00   8.931538e-04   0.000000e+00 
  3.686400e+04   8.409869e-04   0.000000e+00   8.409869e-04   0.000000e+00 
  3.699200e+04   8.169284e-04   0.000000e+00   8.169284e-04   0.000000e+00 
  3.712000e+04   8.288649e-04   0.000000e+00   8.288649e-04   0.000000e+00 
  3.724800e+04   8.205454e-04   0.000000e+00   8.205454e-04   0.000000e+00 
  3.737600e+04   7.900103e-04   0.000000e+00   7.900103e-04   0.000000e+00 
  3.750400e+04   7.769497e-04   0.000000e+00   7.769497e-04   0.000000e+00 
  3.763200e+04   7.797494e-04   0.000000e+00   7.797494e-04   0.000000e+00 
  3.776000e+04   7.491949e-04   0.000000e+00   7.491949e-04   0.000000e+00 
  3.788800e+04   7.173236e-04   0.000000e+00   7.173236e-04   0.000000e+00 
  3.801600e+04   7.063918e-04   0.000000e+00   7.063918e-04   0.000000e+00 
  3.814400e+04   7.015301e-04   0.000000e+00   7.015301e-04   0.000000e+00 
  3.827200e+04   6.881859e-04   0.000000e+00   6.881859e-04   0.000000e+00 
  3.840000e+04   6.623171e-04   0.000000e+00   6.623171e-04   0.000000e+00 
  3.852800e+04   6.410039e-04   0.000000e+00   6.410039e-04   0.000000e+00 
  3.865600e+04   6.183209e-04   0.000000e+00   6.183209e-04   0.000000e+00 
  3.878400e+04   6.100027e-04   0.000000e+00   6.100027e-04   0.000000e+00 
  3.891200e+04   5.961974e-04   0.000000e+00   5.961974e-04   0.000000e+00 
  3.904000e+04   5.912890e-04   0.000000e+00   5.912890e-04   0.000000e+00 
  3.916800e+04   5.761693e-04   0.000000e+00   5.761693e-04   0.000000e+00 
  3.929600e+04   5.807467e-04   0.000000e+00   5.807467e-04   0.000000e+00 
  3.942400e+04   5.708343e-04   0.000000e+00   5.708343e-04   0.000000e+00 
  3.955200e+04   5.453017e-04   0.000000e+00   5.453017e-04   0.000000e+00 
  3.968000e+04   5.459840e-04   0.000000e+00   5.459840e-04   0.000000e+00 
  3.980800e+04   5.325721e-04   0.000000e+00   5.325721e-04   0.000000e+00 
  3.993600e+04   5.017593e-04   0.000000e+00   5.017593e-04   0.000000e+00 
  4.006400e+04   4.948082e-04   0.000000e+00   4.948082e-04   0.000000e+00 
  4.019200e+04   4.834585e-04   0.000000e+00   4.834585e-04   0.000000e+00 
  4.032000e+04   4.777347e-04   0.000000e+00   4.777347e-04   0.000000e+00 
  4.044800e+04   4.707715e-04   0.000000e+00   4.707715e-04   0.000000e+00 
  4.057600e+04   4.645278e-04   0.000000e+00   4.645278e-04   0.000000e+00 
  4.070400e+04   4.580747e-04   0.000000e+00   4.580747e-04   0.000000e+00 
  4.083200e+04   4.491939e-04   0.000000e+00   4.491939e-04   0.000000e+00 
  4.096000e+04   4.285382e-04   0.000000e+00   4.285382e-04   0.000000e+00 
  4.108800e+04   4.288350e-04   0.000000e+00   4.288350e-04   0.000000e+00 
  4.121600e+04   4.178230e-04   0.000000e+00   4.178230e-04   0.000000e+00 
  4.134400e+04   4.069181e-04   0.000000e+00   4.069181e-04   0.000000e+00 
  4.147200e+04   3.954603e-04   0.000000e+00   3.954603e-04   0.000000e+00 
  4.160000e+04   3.875728e-04   0.000000e+00   3.875728e-04   0.000000e+00 
  4.172800e+04   3.806550e-04   0.000000e+00   3.806550e-04   0.000000e+00 
  4.185600e+04   3.664060e-04   0.000000e+00   3.664060e-04   0.000000e+00 
  4.198400e+04   3.688118e-04   0.000000e+00   3.688118e-04   0.000000e+00 
  4.211200e+04   3.662974e-04   0.000000e+00   3.662974e-04   0.000000e+00 
  4.224000e+04   3.569697e-04   0.000000e+00   3.569697e-04   0.000000e+00 
  4.236800e+04   3.524167e-04   0.000000e+00   3.524167e-04   0.000000e+00 
  4.249600e+04   3.405529e-04   0.000000e+00   3.405529e-04   0.000000e+00 
  4.262400e+04   3.346772e-04   0.000000e+00   3.346772e-04   0.000000e+00 
  4.275200e+04   3.294772e-04   0.000000e+00   3.294772e-04   0.000000e+00 
  4.288000e+04   3.244861e-04   0.000000e+00   3.244861e-04   0.000000e+00 
  4.300800e+04   3.181534e-04   0.000000e+00   3.181534e-04   0.000000e+00 
  4.313600e+04   3.177330e-04   0.000000e+00   3.177330e-04   0.000000e+00 
  4.326400e+04   3.178251e-04   0.000000e+00   3.178251e-04   0.000000e+00 
  4.339200e+04   3.053107e-04   0.000000e+00   3.053107e-04   0.000000e+00 
  4.352000e+04   2.972119e-04   0.000000e+00   2.972119e-04   0.000000e+00 
  4.364800e+04   2.983061e-04   0.000000e+00   2.983061e-04   0.000000e+00 
  4.377600e+04   2.959205e-04   0.000000e+00   2.959205e-04   0.000000e+00 
  4.390400e+04   2.842270e-04   0.000000e+00   2.842270e-04   0.000000e+00 
  4.403200e+04   2.766524e-04   0.000000e+00   2.766524e-04   0.000000e+00 
  4.416000e+04   2.633427e-04   0.000000e+00   2.633427e-04   0.000000e+00 
  4.428800e+04   2.662948e-04   0.000000e+00   2.662948e-04   0.000000e+00 
  4.441600e+04   2.623214e-04   0.000000e+00   2.623214e-04   0.000000e+00 
  4.454400e+04   2.613110e-04   0.000000e+00   2.613110e-04   0.000000e+00 
  4.467200e+04   2.543400e-04   0.000000e+00   2.543400e-04   0.000000e+00 
  4.480000e+04   2.465323e-04   0.000000e+00   2.465323e-04   0.000000e+00 
  4.492800e+04   2.484243e-04   0.000000e+00   2.484243e-04   0.000000e+00 
  4.505600e+04   2.423251e-04   0.000000e+00   2.423251e-04   0.000000e+00 
  4.518400e+04   2.399158e-04   0.000000e+00   2.399158e-04   0.000000e+00 
  4.531200e+04   2.370197e-04   0.000000e+00   2.370197e-04   0.000000e+00 
  4.544000e+04   2.332268e-04   0.000000e+00   2.332268e-04   0.000000e+00 
  4.556800e+04   2.291949e-04   0.000000e+00   2.291949e-04   0.000000e+00 
  4.569600e+04   2.221436e-04   0.000000e+00   2.221436e-04   0.000000e+00 
  4.582400e+04   2.167810e-04   0.000000e+00   2.167810e-04   0.000000e+00 
  4.595200e+04   2.156320e-04   0.000000e+00   2.156320e-04   0.000000e+00 
  4.608000e+04   2.128604e-04   0.000000e+00   2.128604e-04   0.000000e+00 
  4.620800e+04   2.087439e-04   0.000000e+00   2.087439e-04   0.000000e+00 
  4.633600e+04   2.081932e-04   0.000000e+00   2.081932e-04   0.000000e+00 
  4.646400e+04   2.075247e-04   0.000000e+00   2.075247e-04   0.000000e+00 
  4.659200e+04   1.993825e-04   0.000000e+00   1.993825e-04   0.000000e+00 
  4.672000e+04   1.974206e-04   0.000000e+00   1.974206e-04   0.000000e+00 
  4.684800e+04   2.000005e-04   0.000000e+00   2.000005e-04   0.000000e+00 
  4.697600e+04   1.957102e-04   0.000000e+00   1.957102e-04   0.000000e+00 
  4.710400e+04   1.932484e-04   0.000000e+00   1.932484e-04   0.000000e+00 
  4.723200e+04   1.893467e-04   0.000000e+00   1.893467e-04   0.000000e+00 
  4.736000e+04   1.868232e-04   0.000000e+00   1.868232e-04   0.000000e+00 
  4.748800e+04   1.843886e-04   0.000000e+00   1.843886e-04   0.000000e+00 
  4.761600e+04   1.779768e-04   0.000000e+00   1.779768e-04   0.000000e+00 
  4.774400e+04   1.804804e-04   0.000000e+00   1.804804e-04   0.000000e+00 
  4.787200e+04   1.804051e-04   0.000000e+00   1.804051e-04   0.000000e+00 
  4.800000e+04   1.753443e-04   0.000000e+00   1.753443e-04   0.000000e+00 
  4.812800e+04   1.736788e-04   0.000000e+00   1.736788e-04   0.000000e+00 
  4.825600e+04   1.744993e-04   0.000000e+00   1.744993e-04   0.000000e+00 
  4.838400e+04   1.696185e-04   0.000000e+00   1.696185e-04   0.000000e+00 
  4.851200e+04   1.657388e-04   0.000000e+00   1.657388e-04   0.000000e+00 
  4.864000e+04   1.660884e-04   0.000000e+00   1.660884e-04   0.000000e+00 
  4.876800e+04   1.621379e-04   0.000000e+00   1.621379e-04   0.000000e+00 
  4.889600e+04   1.569078e-04   0.000000e+00   1.569078e-04   0.000000e+00 
  4.902400e+04   1.558471e-04   0.000000e+00   1.558471e-04   0.000000e+00 
  4.915200e+04   1.549461e-04   0.000000e+00   1.549461e-04   0.000000e+00 
  4.928000e+04   1.583658e-04   0.000000e+00   1.583658e-04   0.000000e+00 
  4.940800e+04   1.582171e-04   0.000000e+00   1.582171e-04   0.000000e+00 
  4.953600e+04   1.565396e-04   0.000000e+00   1.565396e-04   0.000000e+00 
  4.966400e+04   1.552143e-04   0.000000e+00   1.552143e-04   0.000000e+00 
  4.979200e+04   1.543334e-04   0.000000e+00   1.543334e-04   0.000000e+00 
  4.992000e+04   1.525237e-04   0.000000e+00   1.525237e-04   0.000000e+00 
  5.004800e+04   1.454289e-04   0.000000e+00   1.454289e-04   0.000000e+00 
  5.017600e+04   1.426026e-04   0.000000e+00   1.426026e-04   0.000000e+00 
  5.030400e+04   1.420382e-04   0.000000e+00   1.420382e-04   0.000000e+00 
  5.043200e+04   1.461876e-04   0.000000e+00   1.461876e-04   0.000000e+00 
  5.056000e+04   1.448402e-04   0.000000e+00   1.448402e-04   0.000000e+00 
  5.068800e+04   1.426689e-04   0.000000e+00   1.426689e-04   0.000000e+00 
  5.081600e+04   1.374555e-04   0.000000e+00   1.374555e-04   0.000000e+00 
  5.094400e+04   1.399367e-04   0.000000e+00   1.399367e-04   0.000000e+00 
  5.107200e+04   1.395035e-04   0.000000e+00   1.395035e-04   0.000000e+00 
  5.120000e+04   1.385147e-04   0.000000e+00   1.385147e-04   0.000000e+00 
  5.132800e+04   1.389113e-04   0.000000e+00   1.389113e-04   0.000000e+00 
  5.145600e+04   1.352690e-04   0.000000e+00   1.352690e-04   0.000000e+00 
  5.158400e+04   1.347189e-04   0.000000e+00   1.347189e-04   0.000000e+00 
  5.171200e+04   1.359620e-04   0.000000e+00   1.359620e-04   0.000000e+00 
  5.184000e+04   1.319908e-04   0.000000e+00   1.319908e-04   0.000000e+00 
  5.196800e+04   1.311473e-04   0.000000e+00   1.311473e-04   0.000000e+00 
  5.209600e+04   1.302805e-04   0.000000e+00   1.302805e-04   0.000000e+00 
  5.222400e+04   1.261018e-04   0.000000e+00   1.261018e-04   0.000000e+00 
  5.235200e+04   1.260958e-04   0.000000e+00   1.260958e-04   0.000000e+00 
  5.248000e+04   1.269828e-04   0.000000e+00   1.269828e-04   0.000000e+00 
  5.260800e+04   1.278795e-04   0.000000e+00   1.278795e-04   0.000000e+00 
  5.273600e+04   1.251073e-04   0.000000e+00   1.251073e-04   0.000000e+00 
  5.286400e+04   1.224140e-04   0.000000e+00   1.224140e-04   0.000000e+00 
  5.299200e+04   1.186349e-04   0.000000e+00   1.186349e-04   0.000000e+00 
  5.312000e+04   1.173343e-04   0.000000e+00   1.173343e-04   0.000000e+00 
  5.324800e+04   1.203289e-04   0.000000e+00   1.203289e-04   0.000000e+00 
  5.337600e+04   1.198070e-04   0.000000e+00   1.198070e-04   0.000000e+00 
  5.350400e+04   1.187302e-04   0.000000e+00   1.187302e-04   0.000000e+00 
  5.363200e+04   1.177136e-04   0.000000e+00   1.177136e-04   0.000000e+00 
  5.376000e+04   1.339965e-04   0.000000e+00   1.339965e-04   0.000000e+00 
  5.388800e+04   1.579854e-04   0.000000e+00   1.579854e-04   0.000000e+00 
  5.401600e+04   1.252177e-04   0.000000e+00   1.252177e-04   0.000000e+00 
  5.414400e+04   1.117199e-04   0.000000e+00   1.117199e-04   0.000000e+00 
  5.427200e+04   1.084053e-04   0.000000e+00   1.084053e-04   0.000000e+00 
  5.440000e+04   1.069245e-04   0.000000e+00   1.069245e-04   0.000000e+00 
  5.452800e+04   1.071586e-04   0.000000e+00   1.071586e-04   0.000000e+00 
  5.465600e+04   1.051381e-04   0.000000e+00   1.051381e-04   0.000000e+00 
  5.478400e+04   1.025985e-04   0.000000e+00   1.025985e-04   0.000000e+00 
  5.491200e+04   1.031112e-04   0.000000e+00   1.031112e-04   0.000000e+00 
  5.504000e+04   1.054203e-04   0.000000e+00   1.054203e-04   0.000000e+00 
  5.516800e+04   1.024493e-04   0.000000e+00   1.024493e-04   0.000000e+00 
  5.529600e+04   1.005429e-04   0.000000e+00   1.005429e-04   0.000000e+00 
  5.542400e+04   1.004431e-04   0.000000e+00   1.004431e-04   0.000000e+00 
  5.555200e+04   9.882037e-05   0.000000e+00   9.882037e-05   0.000000e+00 
  5.568000e+04   9.840229e-05   0.000000e+00   9.840229e-05   0.000000e+00 
  5.580800e+04   9.584652e-05   0.000000e+00   9.584652e-05   0.000000e+00 
  5.593600e+04   9.240522e-05   0.000000e+00   9.240522e-05   0.000000e+00 
  5.606400e+04   9.215465e-05   0.000000e+00   9.215465e-05   0.000000e+00 
  5.619200e+04   9.269642e-05   0.000000e+00   9.269642e-05   0.000000e+00 
  5.632000e+04   9.055356e-05   0.000000e+00   9.055356e-05   0.000000e+00 
  5.644800e+04   8.847173e-05   0.000000e+00   8.847173e-05   0.000000e+00 
  5.657600e+04   8.874774e-05   0.000000e+00   8.874774e-05   0.000000e+00 
  5.670400e+04   8.713685e-05   0.000000e+00   8.713685e-05   0.000000e+00 
  5.683200e+04   8.444919e-05   0.000000e+00   8.444919e-05   0.000000e+00 
  5.696000e+04   8.427425e-05   0.000000e+00   8.427425e-05   0.000000e+00 
  5.708800e+04   8.451737e-05   0.000000e+00   8.451737e-05   0.000000e+00 
  5.721600e+04   8.129481e-05   0.000000e+00   8.129481e-05   0.000000e+00 
  5.734400e+04   7.853103e-05   0.000000e+00   7.853103e-05   0.000000e+00 
  5.747200e+04   8.022995e-05   0.000000e+00   8.022995e-05   0.000000e+00 
  5.760000e+04   7.891747e-05   0.000000e+00   7.891747e-05   0.000000e+00 
  5.772800e+04   7.631918e-05   0.000000e+00   7.631918e-05   0.000000e+00 
  5.785600e+04   7.399682e-05   0.000000e+00   7.399682e-05   0.000000e+00 
  5.798400e+04   7.361497e-05   0.000000e+00   7.361497e-05   0.000000e+00 
  5.811200e+04   7.408622e-05   0.000000e+00   7.408622e-05   0.000000e+00 
  5.824000e+04   7.403484e-05   0.000000e+00   7.403484e-05   0.000000e+00 
  5.836800e+04   7.298669e-05   0.000000e+00   7.298669e-05   0.000000e+00 
  5.849600e+04   7.108701e-05   0.000000e+00   7.108701e-05   0.000000e+00 
  5.862400e+04   7.098243e-05   0.000000e+00   7.098243e-05   0.000000e+00 
  5.875200e+04   6.859991e-05   0.000000e+00   6.859991e-05   0.000000e+00 
  5.888000e+04   6.968562e-05   0.000000e+00   6.968562e-05   0.000000e+00 
  5.900800e+04   6.817676e-05   0.000000e+00   6.817676e-05   0.000000e+00 
  5.913600e+04   6.609466e-05   0.000000e+00   6.609466e-05   0.000000e+00 
  5.926400e+04   6.664107e-05   0.000000e+00   6.664107e-05   0.000000e+00 
  5.939200e+04   6.479843e-05   0.000000e+00   6.479843e-05   0.000000e+00 
  5.952000e+04   6.360958e-05   0.000000e+00   6.360958e-05   0.000000e+00 
  5.964800e+04   6.369661e-05   0.000000e+00   6.369661e-05   0.000000e+00 
  5.977600e+04   6.303058e-05   0.000000e+00   6.303058e-05   0.000000e+00 
  5.990400e+04   6.197910e-05   0.000000e+00   6.197910e-05   0.000000e+00 
  6.003200e+04   6.185774e-05   0.000000e+00   6.185774e-05   0.000000e+00 
  6.016000e+04   6.074399e-05   0.000000e+00   6.074399e-05   0.000000e+00 
  6.028800e+04   5.907189e-05   0.000000e+00   5.907189e-05   0.000000e+00 
  6.041600e+04   5.877952e-05   0.000000e+00   5.877952e-05   0.000000e+00 
  6.054400e+04   5.820398e-05   0.000000e+00   5.820398e-05   0.000000e+00 
  6.067200e+04   5.766858e-05   0.000000e+00   5.766858e-05   0.000000e+00 
  6.080000e+04   5.734991e-05   0.000000e+00   5.734991e-05   0.000000e+00 
  6.092800e+04   5.661778e-05   0.000000e+00   5.661778e-05   0.000000e+00 
  6.105600e+04   5.501868e-05   0.000000e+00   5.501868e-05   0.000000e+00 
  6.118400e+04   5.518180e-05   0.000000e+00   5.518180e-05   0.000000e+00 
  6.131200e+04   5.460746e-05   0.000000e+00   5.460746e-05   0.000000e+00 
  6.144000e+04   5.413933e-05   0.000000e+00   5.413933e-05   0.000000e+00 
  6.156800e+04   5.376201e-05   0.000000e+00   5.376201e-05   0.000000e+00 
  6.169600e+04   5.336560e-05   0.000000e+00   5.336560e-05   0.000000e+00 
  6.182400e+04   5.233285e-05   0.000000e+00   5.233285e-05   0.000000e+00 
  6.195200e+04   5.153443e-05   0.000000e+00   5.153443e-05   0.000000e+00 
  6.208000e+04   5.014768e-05   0.000000e+00   5.014768e-05   0.000000e+00 
  6.220800e+04   5.081986e-05   0.000000e+00   5.081986e-05   0.000000e+00 
  6.233600e+04   5.051729e-05   0.000000e+00   5.051729e-05   0.000000e+00 
  6.246400e+04   4.934610e-05   0.000000e+00   4.934610e-05   0.000000e+00 
  6.259200e+04   4.970263e-05   0.000000e+00   4.970263e-05   0.000000e+00 
  6.272000e+04   4.932443e-05   0.000000e+00   4.932443e-05   0.000000e+00 
  6.284800e+04   4.823678e-05   0.000000e+00   4.823678e-05   0.000000e+00 
  6.297600e+04   4.701138e-05   0.000000e+00   4.701138e-05   0.000000e+00 
  6.310400e+04   4.715225e-05   0.000000e+00   4.715225e-05   0.000000e+00 
  6.323200e+04   4.722467e-05   0.000000e+00   4.722467e-05   0.000000e+00 
  6.336000e+04   4.622927e-05   0.000000e+00   4.622927e-05   0.000000e+00 
  6.348800e+04   4.693110e-05   0.000000e+00   4.693110e-05   0.000000e+00 
  6.361600e+04   4.722642e-05   0.000000e+00   4.722642e-05   0.000000e+00 
  6.374400e+04   4.708345e-05   0.000000e+00   4.708345e-05   0.000000e+00 
  6.387200e+04   4.708767e-05   0.000000e+00   4.708767e-05   0.000000e+00 
  6.400000e+04   4.660845e-05   0.000000e+00   4.660845e-05   0.000000e+00 
  6.412800e+04   4.615093e-05   0.000000e+00   4.615093e-05   0.000000e+00 
  6.425600e+04   4.685492e-05   0.000000e+00   4.685492e-05   0.000000e+00 
  6.438400e+04   4.592034e-05   0.000000e+00   4.592034e-05   0.000000e+00 
  6.451200e+04   4.538132e-05   0.000000e+00   4.538132e-05   0.000000e+00 
  6.464000e+04   4.513291e-05   0.000000e+00   4.513291e-05   0.000000e+00 
  6.476800e+04   4.354407e-05   0.000000e+00   4.354407e-05   0.000000e+00 
  6.489600e+04   4.286698e-05   0.000000e+00   4.286698e-05   0.000000e+00 
  6.502400e+04   4.266994e-05   0.000000e+00   4.266994e-05   0.000000e+00 
  6.515200e+04   4.259585e-05   0.000000e+00   4.259585e-05   0.000000e+00 
  6.528000e+04   4.271120e-05   0.000000e+00   4.271120e-05   0.000000e+00 
  6.540800e+04   4.151256e-05   0.000000e+00   4.151256e-05   0.000000e+00 
  6.553600e+04   4.138956e-05   0.000000e+00   4.138956e-05   0.000000e+00 
  6.566400e+04   4.176782e-05   0.000000e+00   4.176782e-05   0.000000e+00 
  6.579200e+04   4.168229e-05   0.000000e+00   4.168229e-05   0.000000e+00 
  6.592000e+04   4.108757e-05   0.000000e+00   4.108757e-05   0.000000e+00 
  6.604800e+04   4.002371e-05   0.000000e+00   4.002371e-05   0.000000e+00 
  6.617600e+04   4.043922e-05   0.000000e+00   4.043922e-05   0.000000e+00 
  6.630400e+04   4.028340e-05   0.000000e+00   4.028340e-05   0.000000e+00 
  6.643200e+04   4.118744e-05   0.000000e+00   4.118744e-05   0.000000e+00 
  6.656000e+04   4.080306e-05   0.000000e+00   4.080306e-05   0.000000e+00 
  6.668800e+04   3.917090e-05   0.000000e+00   3.917090e-05   0.000000e+00 
  6.681600e+04   3.902218e-05   0.000000e+00   3.902218e-05   0.000000e+00 
  6.694400e+04   3.916172e-05   0.000000e+00   3.916172e-05   0.000000e+00 
  6.707200e+04   3.956677e-05   0.000000e+00   3.956677e-05   0.000000e+00 
  6.720000e+04   3.875524e-05   0.000000e+00   3.875524e-05   0.000000e+00 
  6.732800e+04   3.769406e-05   0.000000e+00   3.769406e-05   0.000000e+00 
  6.745600e+04   3.866008e-05   0.000000e+00   3.866008e-05   0.000000e+00 
  6.758400e+04   3.906509e-05   0.000000e+00   3.906509e-05   0.000000e+00 
  6.771200e+04   3.823253e-05   0.000000e+00   3.823253e-05   0.000000e+00 
  6.784000e+04   3.791138e-05   0.000000e+00   3.791138e-05   0.000000e+00 
  6.796800e+04   3.761697e-05   0.000000e+00   3.761697e-05   0.000000e+00 
  6.809600e+04   3.858106e-05   0.000000e+00   3.858106e-05   0.000000e+00 
  6.822400e+04   3.906785e-05   0.000000e+00   3.906785e-05   0.000000e+00 
  6.835200e+04   3.820301e-05   0.000000e+00   3.820301e-05   0.000000e+00 
  6.848000e+04   3.759303e-05   0.000000e+00   3.759303e-05   0.000000e+00 
  6.860800e+04   3.664471e-05   0.000000e+00   3.664471e-05   0.000000e+00 
  6.873600e+04   3.667338e-05   0.000000e+00   3.667338e-05   0.000000e+00 
  6.886400e+04   3.661032e-05   0.000000e+00   3.661032e-05   0.000000e+00 
  6.899200e+04   3.763734e-05   0.000000e+00   3.763734e-05   0.000000e+00 
  6.912000e+04   3.703422e-05   0.000000e+00   3.703422e-05   0.000000e+00 
  6.924800e+04   3.708784e-05   0.000000e+00   3.708784e-05   0.000000e+00 
  6.937600e+04   3.720946e-05   0.000000e+00   3.720946e-05   0.000000e+00 
  6.950400e+04   3.817807e-05   0.000000e+00   3.817807e-05   0.000000e+00 
  6.963200e+04   3.712966e-05   0.000000e+00   3.712966e-05   0.000000e+00 
  6.976000e+04   3.687054e-05   0.000000e+00   3.687054e-05   0.000000e+00 
  6.988800e+04   3.562041e-05   0.000000e+00   3.562041e-05   0.000000e+00 
  7.001600e+04   3.516977e-05   0.000000e+00   3.516977e-05   0.000000e+00 
  7.014400e+04   3.518266e-05   0.000000e+00   3.518266e-05   0.000000e+00 
  7.027200e+04   3.579057e-05   0.000000e+00   3.579057e-05   0.000000e+00 
  7.040000e+04   3.549497e-05   0.000000e+00   3.549497e-05   0.000000e+00 
  7.052800e+04   3.607102e-05   0.000000e+00   3.607102e-05   0.000000e+00 
  7.065600e+04   3.528551e-05   0.000000e+00   3.528551e-05   0.000000e+00 
  7.078400e+04   3.500640e-05   0.000000e+00   3.500640e-05   0.000000e+00 
  7.091200e+04   3.409610e-05   0.000000e+00   3.409610e-05   0.000000e+00 
  7.104000e+04   3.493303e-05   0.000000e+00   3.493303e-05   0.000000e+00 
  7.116800e+04   3.882959e-05   0.000000e+00   3.882959e-05   0.000000e+00 
  7.129600e+04   3.767854e-05   0.000000e+00   3.767854e-05   0.000000e+00 
  7.142400e+04   3.457352e-05   0.000000e+00   3.457352e-05   0.000000e+00 
  7.155200e+04   3.489592e-05   0.000000e+00   3.489592e-05   0.000000e+00 
  7.168000e+04   3.592214e-05   0.000000e+00   3.592214e-05   0.000000e+00 
  7.180800e+04   3.420867e-05   0.000000e+00   3.420867e-05   0.000000e+00 
  7.193600e+04   3.302684e-05   0.000000e+00   3.302684e-05   0.000000e+00 
  7.206400e+04   3.303807e-05   0.000000e+00   3.303807e-05   0.000000e+00 
  7.219200e+04   3.339194e-05   0.000000e+00   3.339194e-05   0.000000e+00 
  7.232000e+04   3.303707e-05   0.000000e+00   3.303707e-05   0.000000e+00 
  7.244800e+04   3.295043e-05   0.000000e+00   3.295043e-05   0.000000e+00 
  7.257600e+04   3.279746e-05   0.000000e+00   3.279746e-05   0.000000e+00 
  7.270400e+04   3.107516e-05   0.000000e+00   3.107516e-05   0.000000e+00 
  7.283200e+04   3.108451e-05   0.000000e+00   3.108451e-05   0.000000e+00 
  7.296000e+04   3.175139e-05   0.000000e+00   3.175139e-05   0.000000e+00 
  7.308800e+04   3.121301e-05   0.000000e+00   3.121301e-05   0.000000e+00 
  7.321600e+04   3.058800e-05   0.000000e+00   3.058800e-05   0.000000e+00 
  7.334400e+04   3.148391e-05   0.000000e+00   3.148391e-05   0.000000e+00 
  7.347200e+04   4.446501e-05   0.000000e+00   4.446501e-05   0.000000e+00 
  7.360000e+04   4.285968e-05   0.000000e+00   4.285968e-05   0.000000e+00 
  7.372800e+04   2.996883e-05   0.000000e+00   2.996883e-05   0.000000e+00 
  7.385600e+04   2.916376e-05   0.000000e+00   2.916376e-05   0.000000e+00 
  7.398400e+04   2.956965e-05   0.000000e+00   2.956965e-05   0.000000e+00 
  7.411200e+04   2.885282e-05   0.000000e+00   2.885282e-05   0.000000e+00 
  7.424000e+04   2.913182e-05   0.000000e+00   2.913182e-05   0.000000e+00 
  7.436800e+04   2.864626e-05   0.000000e+00   2.864626e-05   0.000000e+00 
  7.449600e+04   3.029566e-05   0.000000e+00   3.029566e-05   0.000000e+00 
  7.462400e+04   3.213473e-05   0.000000e+00   3.213473e-05   0.000000e+00 
  7.475200e+04   2.902232e-05   0.000000e+00   2.902232e-05   0.000000e+00 
  7.488000e+04   2.837674e-05   0.000000e+00   2.837674e-05   0.000000e+00 
  7.500800e+04   2.688983e-05   0.000000e+00   2.688983e-05   0.000000e+00 
  7.513600e+04   2.628603e-05   0.000000e+00   2.628603e-05   0.000000e+00 
  7.526400e+04   2.592586e-05   0.000000e+00   2.592586e-05   0.000000e+00 
  7.539200e+04   2.552426e-05   0.000000e+00   2.552426e-05   0.000000e+00 
  7.552000e+04   2.525907e-05   0.000000e+00   2.525907e-05   0.000000e+00 
  7.564800e+04   2.530040e-05   0.000000e+00   2.530040e-05   0.000000e+00 
  7.577600e+04   2.594171e-05   0.000000e+00   2.594171e-05   0.000000e+00 
  7.590400e+04   2.524005e-05   0.000000e+00   2.524005e-05   0.000000e+00 
  7.603200e+04   2.393525e-05   0.000000e+00   2.393525e-05   0.000000e+00 
  7.616000e+04   2.362797e-05   0.000000e+00   2.362797e-05   0.000000e+00 
  7.628800e+04   2.409952e-05   0.000000e+00   2.409952e-05   0.000000e+00 
  7.641600e+04   2.273531e-05   0.000000e+00   2.273531e-05   0.000000e+00 
  7.654400e+04   2.279380e-05   0.000000e+00   2.279380e-05   0.000000e+00 
  7.667200e+04   2.238699e-05   0.000000e+00   2.238699e-05   0.000000e+00 
  7.680000e+04   2.234834e-05   0.000000e+00   2.234834e-05   0.000000e+00 
  7.692800e+04   2.292163e-05   0.000000e+00   2.292163e-05   0.000000e+00 
  7.705600e+04   2.213243e-05   0.000000e+00   2.213243e-05   0.000000e+00 
  7.718400e+04   2.160265e-05   0.000000e+00   2.160265e-05   0.000000e+00 
  7.731200e+04   2.097900e-05   0.000000e+00   2.097900e-05   0.000000e+00 
  7.744000e+04   2.166894e-05   0.000000e+00   2.166894e-05   0.000000e+00 
  7.756800e+04   2.222226e-05   0.000000e+00   2.222226e-05   0.000000e+00 
  7.769600e+04   2.054644e-05   0.000000e+00   2.054644e-05   0.000000e+00 
  7.782400e+04   2.025816e-05   0.000000e+00   2.025816e-05   0.000000e+00 
  7.795200e+04   2.028118e-05   0.000000e+00   2.028118e-05   0.000000e+00 
  7.808000e+04   1.967314e-05   0.000000e+00   1.967314e-05   0.000000e+00 
  7.820800e+04   1.974830e-05   0.000000e+00   1.974830e-05   0.000000e+00 
  7.833600e+04   1.922435e-05   0.000000e+00   1.922435e-05   0.000000e+00 
  7.846400e+04   1.873348e-05   0.000000e+00   1.873348e-05   0.000000e+00 
  7.859200e+04   1.894907e-05   0.000000e+00   1.894907e-05   0.000000e+00 
  7.872000e+04   1.856253e-05   0.000000e+00   1.856253e-05   0.000000e+00 
  7.884800e+04   1.809927e-05   0.000000e+00   1.809927e-05   0.000000e+00 
  7.897600e+04   1.783677e-05   0.000000e+00   1.783677e-05   0.000000e+00 
  7.910400e+04   1.765630e-05   0.000000e+00   1.765630e-05   0.000000e+00 
  7.923200e+04   1.755388e-05   0.000000e+00   1.755388e-05   0.000000e+00 
  7.936000e+04   1.725720e-05   0.000000e+00   1.725720e-05   0.000000e+00 
  7.948800e+04   1.691533e-05   0.000000e+00   1.691533e-05   0.000000e+00 
  7.961600e+04   1.671974e-05   0.000000e+00   1.671974e-05   0.000000e+00 
  7.974400e+04   1.667441e-05   0.000000e+00   1.667441e-05   0.000000e+00 
  7.987200e+04   1.692088e-05   0.000000e+00   1.692088e-05   0.000000e+00 
  8.000000e+04   1.644321e-05   0.000000e+00   1.644321e-05   0.000000e+00 
  8.012800e+04   1.605182e-05   0.000000e+00   1.605182e-05   0.000000e+00 
  8.025600e+04   1.571085e-05   0.000000e+00   1.571085e-05   0.000000e+00 
  8.038400e+04   1.592523e-05   0.000000e+00   1.592523e-05   0.000000e+00 
  8.051200e+04   1.636442e-05   0.000000e+00   1.636442e-05   0.000000e+00 
  8.064000e+04   1.581977e-05   0.000000e+00   1.581977e-05   0.000000e+00 
  8.076800e+04   1.562701e-05   0.000000e+00   1.562701e-05   0.000000e+00 
  8.089600e+04   1.485870e-05   0.000000e+00   1.485870e-05   0.000000e+00 
  8.102400e+04   1.464121e-05   0.000000e+00   1.464121e-05   0.000000e+00 
  8.115200e+04   1.499168e-05   0.000000e+00   1.499168e-05   0.000000e+00 
  8.128000e+04   1.503532e-05   0.000000e+00   1.503532e-05   0.000000e+00 
  8.140800e+04   1.522814e-05   0.000000e+00   1.522814e-05   0.000000e+00 
  8.153600e+04   1.578117e-05   0.000000e+00   1.578117e-05   0.000000e+00 
  8.166400e+04   1.515827e-05   0.000000e+00   1.515827e-05   0.000000e+00 
  8.179200e+04   1.457775e-05   0.000000e+00   1.457775e-05   0.000000e+00 
  8.192000e+04   1.457547e-05   0.000000e+00   1.457547e-05   0.000000e+00 
  8.204800e+04   1.450268e-05   0.000000e+00   1.450268e-05   0.000000e+00 
  8.217600e+04   1.443918e-05   0.000000e+00   1.443918e-05   0.000000e+00 
  8.230400e+04   1.424409e-05   0.000000e+00   1.424409e-05   0.000000e+00 
  8.243200e+04   1.384377e-05   0.000000e+00   1.384377e-05   0.000000e+00 
  8.256000e+04   1.419859e-05   0.000000e+00   1.419859e-05   0.000000e+00 
  8.268800e+04   1.431630e-05   0.000000e+00   1.431630e-05   0.000000e+00 
  8.281600e+04   1.476604e-05   0.000000e+00   1.476604e-05   0.000000e+00 
  8.294400e+04   1.421648e-05   0.000000e+00   1.421648e-05   0.000000e+00 
  8.307200e+04   1.369205e-05   0.000000e+00   1.369205e-05   0.000000e+00 
  8.320000e+04   1.413918e-05   0.000000e+00   1.413918e-05   0.000000e+00 
  8.332800e+04   1.426070e-05   0.000000e+00   1.426070e-05   0.000000e+00 
  8.345600e+04   1.385615e-05   0.000000e+00   1.385615e-05   0.000000e+00 
  8.358400e+04   1.391916e-05   0.000000e+00   1.391916e-05   0.000000e+00 
  8.371200e+04   1.403854e-05   0.000000e+00   1.403854e-05   0.000000e+00 
  8.384000e+04   1.414941e-05   0.000000e+00   1.414941e-05   0.000000e+00 
  8.396800e+04   1.406174e-05   0.000000e+00   1.406174e-05   0.000000e+00 
  8.409600e+04   1.409359e-05   0.000000e+00   1.409359e-05   0.000000e+00 
  8.422400e+04   1.417402e-05   0.000000e+00   1.417402e-05   0.000000e+00 
  8.435200e+04   1.445788e-05   0.000000e+00   1.445788e-05   0.000000e+00 
  8.448000e+04   1.419180e-05   0.000000e+00   1.419180e-05   0.000000e+00 
  8.460800e+04   1.413589e-05   0.000000e+00   1.413589e-05   0.000000e+00 
  8.473600e+04   1.418358e-05   0.000000e+00   1.418358e-05   0.000000e+00 
  8.486400e+04   1.404747e-05   0.000000e+00   1.404747e-05   0.000000e+00 
  8.499200e+04   1.429958e-05   0.000000e+00   1.429958e-05   0.000000e+00 
  8.512000e+04   1.431053e-05   0.000000e+00   1.431053e-05   0.000000e+00 
  8.524800e+04   1.437469e-05   0.000000e+00   1.437469e-05   0.000000e+00 
  8.537600e+04   1.439185e-05   0.000000e+00   1.439185e-05   0.000000e+00 
  8.550400e+04   1.430915e-05   0.000000e+00   1.430915e-05   0.000000e+00 
  8.563200e+04   1.428999e-05   0.000000e+00   1.428999e-05   0.000000e+00 
  8.576000e+04   1.429979e-05   0.000000e+00   1.429979e-05   0.000000e+00 
  8.588800e+04   1.446742e-05   0.000000e+00   1.446742e-05   0.000000e+00 
  8.601600e+04   1.476850e-05   0.000000e+00   1.476850e-05   0.000000e+00 
  8.614400e+04   1.486451e-05   0.000000e+00   1.486451e-05   0.000000e+00 
  8.627200e+04   1.490270e-05   0.000000e+00   1.490270e-05   0.000000e+00 
  8.640000e+04   1.499972e-05   0.000000e+00   1.499972e-05   0.000000e+00 
  8.652800e+04   1.499060e-05   0.000000e+00   1.499060e-05   0.000000e+00 
  8.665600e+04   1.490963e-05   0.000000e+00   1.490963e-05   0.000000e+00 
  8.678400e+04   1.498561e-05   0.000000e+00   1.498561e-05   0.000000e+00 
  8.691200e+04   1.538469e-05   0.000000e+00   1.538469e-05   0.000000e+00 
  8.704000e+04   1.526527e-05   0.000000e+00   1.526527e-05   0.000000e+00 
  8.716800e+04   1.493408e-05   0.000000e+00   1.493408e-05   0.000000e+00 
  8.729600e+04   1.490076e-05   0.000000e+00   1.490076e-05   0.000000e+00 
  8.742400e+04   1.514000e-05   0.000000e+00   1.514000e-05   0.000000e+00 
  8.755200e+04   1.527224e-05   0.000000e+00   1.527224e-05   0.000000e+00 
  8.768000e+04   1.511959e-05   0.000000e+00   1.511959e-05   0.000000e+00 
  8.780800e+04   1.541161e-05   0.000000e+00   1.541161e-05   0.000000e+00 
  8.793600e+04   1.504550e-05   0.000000e+00   1.504550e-05   0.000000e+00 
  8.806400e+04   1.502301e-05   0.000000e+00   1.502301e-05   0.000000e+00 
  8.819200e+04   1.524063e-05   0.000000e+00   1.524063e-05   0.000000e+00 
  8.832000e+04   1.528505e-05   0.000000e+00   1.528505e-05   0.000000e+00 
  8.844800e+04   1.514226e-05   0.000000e+00   1.514226e-05   0.000000e+00 
  8.857600e+04   1.537565e-05   0.000000e+00   1.537565e-05   0.000000e+00 
  8.870400e+04   1.549270e-05   0.000000e+00   1.549270e-05   0.000000e+00 
  8.883200e+04   1.555205e-05   0.000000e+00   1.555205e-05   0.000000e+00 
  8.896000e+04   1.534044e-05   0.000000e+00   1.534044e-05   0.000000e+00 
  8.908800e+04   1.507721e-05   0.000000e+00   1.507721e-05   0.000000e+00 
  8.921600e+04   1.535561e-05   0.000000e+00   1.535561e-05   0.000000e+00 
  8.934400e+04   1.550690e-05   0.000000e+00   1.550690e-05   0.000000e+00 
  8.947200e+04   1.543318e-05   0.000000e+00   1.543318e-05   0.000000e+00 
  8.960000e+04   1.557407e-05   0.000000e+00   1.557407e-05   0.000000e+00 
  8.972800e+04   1.564864e-05   0.000000e+00   1.564864e-05   0.000000e+00 
  8.985600e+04   1.572006e-05   0.000000e+00   1.572006e-05   0.000000e+00 
  8.998400e+04   1.540235e-05   0.000000e+00   1.540235e-05   0.000000e+00 
  9.011200e+04   1.585278e-05   0.000000e+00   1.585278e-05   0.000000e+00 
  9.024000e+04   1.638408e-05   0.000000e+00   1.638408e-05   0.000000e+00 
  9.036800e+04   1.601445e-05   0.000000e+00   1.601445e-05   0.000000e+00 
  9.049600e+04   1.590438e-05   0.000000e+00   1.590438e-05   0.000000e+00 
  9.062400e+04   1.604145e-05   0.000000e+00   1.604145e-05   0.000000e+00 
  9.075200e+04   1.633086e-05   0.000000e+00   1.633086e-05   0.000000e+00 
  9.088000e+04   1.594034e-05   0.000000e+00   1.594034e-05   0.000000e+00 
  9.100800e+04   1.629350e-05   0.000000e+00   1.629350e-05   0.000000e+00 
  9.113600e+04   1.592488e-05   0.000000e+00   1.592488e-05   0.000000e+00 
  9.126400e+04   1.597925e-05   0.000000e+00   1.597925e-05   0.000000e+00 
  9.139200e+04   1.619881e-05   0.000000e+00   1.619881e-05   0.000000e+00 
  9.152000e+04   1.609512e-05   0.000000e+00   1.609512e-05   0.000000e+00 
  9.164800e+04   1.592272e-05   0.000000e+00   1.592272e-05   0.000000e+00 
  9.177600e+04   1.611270e-05   0.000000e+00   1.611270e-05   0.000000e+00 
  9.190400e+04   1.615763e-05   0.000000e+00   1.615763e-05   0.000000e+00 
  9.203200e+04   1.634447e-05   0.000000e+00   1.634447e-05   0.000000e+00 
  9.216000e+04   1.595248e-05   0.000000e+00   1.595248e-05   0.000000e+00 
  9.228800e+04   1.588676e-05   0.000000e+00   1.588676e-05   0.000000e+00 
  9.241600e+04   1.607021e-05   0.000000e+00   1.607021e-05   0.000000e+00 
  9.254400e+04   1.647484e-05   0.000000e+00   1.647484e-05   0.000000e+00 
  9.267200e+04   1.620321e-05   0.000000e+00   1.620321e-05   0.000000e+00 
  9.280000e+04   1.620183e-05   0.000000e+00   1.620183e-05   0.000000e+00 
  9.292800e+04   1.585237e-05   0.000000e+00   1.585237e-05   0.000000e+00 
  9.305600e+04   1.588545e-05   0.000000e+00   1.588545e-05   0.000000e+00 
  9.318400e+04   1.591600e-05   0.000000e+00   1.591600e-05   0.000000e+00 
  9.331200e+04   1.564159e-05   0.000000e+00   1.564159e-05   0.000000e+00 
  9.344000e+04   1.609079e-05   0.000000e+00   1.609079e-05   0.000000e+00 
  9.356800e+04   1.593057e-05   0.000000e+00   1.593057e-05   0.000000e+00 
  9.369600e+04   1.605056e-05   0.000000e+00   1.605056e-05   0.000000e+00 
  9.382400e+04   1.623328e-05   0.000000e+00   1.623328e-05   0.000000e+00 
  9.395200e+04   1.621587e-05   0.000000e+00   1.621587e-05   0.000000e+00 
  9.408000e+04   1.596674e-05   0.000000e+00   1.596674e-05   0.000000e+00 
  9.420800e+04   1.591529e-05   0.000000e+00   1.591529e-05   0.000000e+00 
  9.433600e+04   1.599699e-05   0.000000e+00   1.599699e-05   0.000000e+00 
  9.446400e+04   1.589953e-05   0.000000e+00   1.589953e-05   0.000000e+00 
  9.459200e+04   1.608152e-05   0.000000e+00   1.608152e-05   0.000000e+00 
  9.472000e+04   1.611957e-05   0.000000e+00   1.611957e-05   0.000000e+00 
  9.484800e+04   1.588645e-05   0.000000e+00   1.588645e-05   0.000000e+00 
  9.497600e+04   1.573114e-05   0.000000e+00   1.573114e-05   0.000000e+00 
  9.510400e+04   1.567659e-05   0.000000e+00   1.567659e-05   0.000000e+00 
  9.523200e+04   1.552112e-05   0.000000e+00   1.552112e-05   0.000000e+00 
  9.536000e+04   1.542434e-05   0.000000e+00   1.542434e-05   0.000000e+00 
  9.548800e+04   1.550827e-05   0.000000e+00   1.550827e-05   0.000000e+00 
  9.561600e+04   1.598021e-05   0.000000e+00   1.598021e-05   0.000000e+00 
  9.574400e+04   1.583287e-05   0.000000e+00   1.583287e-05   0.000000e+00 
  9.587200e+04   1.553647e-05   0.000000e+00   1.553647e-05   0.000000e+00 
  9.600000e+04   1.581680e-05   0.000000e+00   1.581680e-05   0.000000e+00 
  9.612800e+04   1.585880e-05   0.000000e+00   1.585880e-05   0.000000e+00 
  9.625600e+04   1.567967e-05   0.000000e+00   1.567967e-05   0.000000e+00 
  9.638400e+04   1.587197e-05   0.000000e+00   1.587197e-05   0.000000e+00 
  9.651200e+04   1.607019e-05   0.000000e+00   1.607019e-05   0.000000e+00 
  9.664000e+04   1.570678e-05   0.000000e+00   1.570678e-05   0.000000e+00 
  9.676800e+04   1.587541e-05   0.000000e+00   1.587541e-05   0.000000e+00 
  9.689600e+04   1.599156e-05   0.000000e+00   1.599156e-05   0.000000e+00 
  9.702400e+04   1.572802e-05   0.000000e+00   1.572802e-05   0.000000e+00 
  9.715200e+04   1.552648e-05   0.000000e+00   1.552648e-05   0.000000e+00 
  9.728000e+04   1.579364e-05   0.000000e+00   1.579364e-05   0.000000e+00 
  9.740800e+04   1.602655e-05   0.000000e+00   1.602655e-05   0.000000e+00 
  9.753600e+04   1.621899e-05   0.000000e+00   1.621899e-05   0.000000e+00 
  9.766400e+04   1.584541e-05   0.000000e+00   1.584541e-05   0.000000e+00 
  9.779200e+04   1.556240e-05   0.000000e+00   1.556240e-05   0.000000e+00 
  9.792000e+04   1.592024e-05   0.000000e+00   1.592024e-05   0.000000e+00 
  9.804800e+04   1.601288e-05   0.000000e+00   1.601288e-05   0.000000e+00 
  9.817600e+04   1.602161e-05   0.000000e+00   1.602161e-05   0.000000e+00 
  9.830400e+04   1.588066e-05   0.000000e+00   1.588066e-05   0.000000e+00 
  9.843200e+04   1.540444e-05   0.000000e+00   1.540444e-05   0.000000e+00 
  9.856000e+04   1.522153e-05   0.000000e+00   1.522153e-05   0.000000e+00 
  9.868800e+04   1.577188e-05   0.000000e+00   1.577188e-05   0.000000e+00 
  9.881600e+04   1.565856e-05   0.000000e+00   1.565856e-05   0.000000e+00 
  9.894400e+04   1.566257e-05   0.000000e+00   1.566257e-05   0.000000e+00 
  9.907200e+04   1.532433e-05   0.000000e+00   1.532433e-05   0.000000e+00 
  9.920000e+04   1.531397e-05   0.000000e+00   1.531397e-05   0.000000e+00 
  9.932800e+04   1.567508e-05   0.000000e+00   1.567508e-05   0.000000e+00 
  9.945600e+04   1.593799e-05   0.000000e+00   1.593799e-05   0.000000e+00 
  9.958400e+04   1.565836e-05   0.000000e+00   1.565836e-05   0.000000e+00 
  9.971200e+04   1.607050e-05   0.000000e+00   1.607050e-05   0.000000e+00 
  9.984000e+04   1.657433e-05   0.000000e+00   1.657433e-05   0.000000e+00 
  9.996800e+04   1.629478e-05   0.000000e+00   1.629478e-05   0.000000e+00 
  1.000960e+05   1.567024e-05   0.000000e+00   1.567024e-05   0.000000e+00 
  1.002240e+05   1.575682e-05   0.000000e+00   1.575682e-05   0.000000e+00 
  1.003520e+05   1.582478e-05   0.000000e+00   1.582478e-05   0.000000e+00 
  1.004800e+05   1.568186e-05   0.000000e+00   1.568186e-05   0.000000e+00 
  1.006080e+05   1.593090e-05   0.000000e+00   1.593090e-05   0.000000e+00 
  1.007360e+05   1.558214e-05   0.000000e+00   1.558214e-05   0.000000e+00 
  1.008640e+05   1.622882e-05   0.000000e+00   1.622882e-05   0.000000e+00 
  1.009920e+05   1.646542e-05   0.000000e+00   1.646542e-05   0.000000e+00 
  1.011200e+05   1.627312e-05   0.000000e+00   1.627312e-05   0.000000e+00 
  1.012480e+05   1.603165e-05   0.000000e+00   1.603165e-05   0.000000e+00 
  1.013760e+05   1.556004e-05   0.000000e+00   1.556004e-05   0.000000e+00 
  1.015040e+05   1.545749e-05   0.000000e+00   1.545749e-05   0.000000e+00 
  1.016320e+05   1.599810e-05   0.000000e+00   1.599810e-05   0.000000e+00 
  1.017600e+05   1.548736e-05   0.000000e+00   1.548736e-05   0.000000e+00 
  1.018880e+05   1.558063e-05   0.000000e+00   1.558063e-05   0.000000e+00 
  1.020160e+05   1.536825e-05   0.000000e+00   1.536825e-05   0.000000e+00 
  1.021440e+05   1.564036e-05   0.000000e+00   1.564036e-05   0.000000e+00 
  1.022720e+05   1.559037e-05   0.000000e+00   1.559037e-05   0.000000e+00 
  1.024000e+05   1.563171e-05   0.000000e+00   1.563171e-05   0.000000e+00 
