  0.000000e+00   5.985324e-06   0.000000e+00   5.985324e-06   0.000000e+00 
  1.600000e+01   2.990032e-06   0.000000e+00   2.990032e-06   0.000000e+00 
  3.200000e+01   1.401495e-07   0.000000e+00   1.401495e-07   0.000000e+00 
  4.800000e+01   2.421120e-07   0.000000e+00   2.421120e-07   0.000000e+00 
  6.400000e+01   3.406074e-07   0.000000e+00   3.406074e-07   0.000000e+00 
  8.000000e+01   2.700282e-07   0.000000e+00   2.700282e-07   0.000000e+00 
  9.600000e+01   3.889582e-07   0.000000e+00   3.889582e-07   0.000000e+00 
  1.120000e+02   6.581960e-07   0.000000e+00   6.581960e-07   0.000000e+00 
  1.280000e+02   8.692068e-07   0.000000e+00   8.692068e-07   0.000000e+00 
  1.440000e+02   1.440914e-06   0.000000e+00   1.440914e-06   0.000000e+00 
  1.600000e+02   2.870976e-06   0.000000e+00   2.870976e-06   0.000000e+00 
  1.760000e+02   4.333758e-06   0.000000e+00   4.333758e-06   0.000000e+00 
  1.920000e+02   3.839548e-06   0.000000e+00   3.839548e-06   0.000000e+00 
  2.080000e+02   3.163781e-06   0.000000e+00   3.163781e-06   0.000000e+00 
  2.240000e+02   2.995510e-06   0.000000e+00   2.995510e-06   0.000000e+00 
  2.400000e+02   3.866976e-06   0.000000e+00   3.866976e-06   0.000000e+00 
  2.560000e+02   3.777983e-06   0.000000e+00   3.777983e-06   0.000000e+00 
  2.720000e+02   4.372793e-06   0.000000e+00   4.372793e-06   0.000000e+00 
  2.880000e+02   6.071455e-06   0.000000e+00   6.071455e-06   0.000000e+00 
  3.040000e+02   6.921481e-06   0.000000e+00   6.921481e-06   0.000000e+00 
  3.200000e+02   5.900759e-06   0.000000e+00   5.900759e-06   0.000000e+00 
  3.360000e+02   6.283115e-06   0.000000e+00   6.283115e-06   0.000000e+00 
  3.520000e+02   5.941742e-06   0.000000e+00   5.941742e-06   0.000000e+00 
  3.680000e+02   6.006404e-06   0.000000e+00   6.006404e-06   0.000000e+00 
  3.840000e+02   7.229060e-06   0.000000e+00   7.229060e-06   0.000000e+00 
  4.000000e+02   7.803785e-06   0.000000e+00   7.803785e-06   0.000000e+00 
  4.160000e+02   1.402609e-05   0.000000e+00   1.402609e-05   0.000000e+00 
  4.320000e+02   1.104363e-05   0.000000e+00   1.104363e-05   0.000000e+00 
  4.480000e+02   7.343221e-06   0.000000e+00   7.343221e-06   0.000000e+00 
  4.640000e+02   8.104121e-06   0.000000e+00   8.104121e-06   0.000000e+00 
  4.800000e+02   9.463167e-06   0.000000e+00   9.463167e-06   0.000000e+00 
  4.960000e+02   1.089789e-05   0.000000e+00   1.089789e-05   0.000000e+00 
  5.120000e+02   9.007664e-06   0.000000e+00   9.007664e-06   0.000000e+00 
  5.280000e+02   2.206889e-05   0.000000e+00   2.206889e-05   0.000000e+00 
  5.440000e+02   3.639584e-05   0.000000e+00   3.639584e-05   0.000000e+00 
  5.600000e+02   2.403047e-05   0.000000e+00   2.403047e-05   0.000000e+00 
  5.760000e+02   9.214113e-06   0.000000e+00   9.214113e-06   0.000000e+00 
  5.920000e+02   9.357630e-06   0.000000e+00   9.357630e-06   0.000000e+00 
  6.080000e+02   1.055930e-05   0.000000e+00   1.055930e-05   0.000000e+00 
  6.240000e+02   1.022134e-05   0.000000e+00   1.022134e-05   0.000000e+00 
  6.400000e+02   9.441062e-06   0.000000e+00   9.441062e-06   0.000000e+00 
  6.560000e+02   1.107730e-05   0.000000e+00   1.107730e-05   0.000000e+00 
  6.720000e+02   1.106090e-05   0.000000e+00   1.106090e-05   0.000000e+00 
  6.880000e+02   1.115780e-05   0.000000e+00   1.115780e-05   0.000000e+00 
  7.040000e+02   1.052398e-05   0.000000e+00   1.052398e-05   0.000000e+00 
  7.200000e+02   8.482089e-06   0.000000e+00   8.482089e-06   0.000000e+00 
  7.360000e+02   8.206628e-06   0.000000e+00   8.206628e-06   0.000000e+00 
  7.520000e+02   8.780206e-06   0.000000e+00   8.780206e-06   0.000000e+00 
  7.680000e+02   1.371621e-05   0.000000e+00   1.371621e-05   0.000000e+00 
  7.840000e+02   1.802607e-05   0.000000e+00   1.802607e-05   0.000000e+00 
  8.000000e+02   1.570457e-05   0.000000e+00   1.570457e-05   0.000000e+00 
  8.160000e+02   2.472172e-05   0.000000e+00   2.472172e-05   0.000000e+00 
  8.320000e+02   2.896515e-05   0.000000e+00   2.896515e-05   0.000000e+00 
  8.480000e+02   1.684215e-05   0.000000e+00   1.684215e-05   0.000000e+00 
  8.640000e+02   1.237915e-05   0.000000e+00   1.237915e-05   0.000000e+00 
  8.800000e+02   1.665431e-05   0.000000e+00   1.665431e-05   0.000000e+00 
  8.960000e+02   3.713517e-05   0.000000e+00   3.713517e-05   0.000000e+00 
  9.120000e+02   2.786506e-05   0.000000e+00   2.786506e-05   0.000000e+00 
  9.280000e+02   1.323944e-05   0.000000e+00   1.323944e-05   0.000000e+00 
  9.440000e+02   1.304270e-05   0.000000e+00   1.304270e-05   0.000000e+00 
  9.600000e+02   1.353674e-05   0.000000e+00   1.353674e-05   0.000000e+00 
  9.760000e+02   1.349251e-05   0.000000e+00   1.349251e-05   0.000000e+00 
  9.920000e+02   2.232703e-05   0.000000e+00   2.232703e-05   0.000000e+00 
  1.008000e+03   2.370506e-05   0.000000e+00   2.370506e-05   0.000000e+00 
  1.024000e+03   2.899846e-05   0.000000e+00   2.899846e-05   0.000000e+00 
  1.040000e+03   3.302030e-05   0.000000e+00   3.302030e-05   0.000000e+00 
  1.056000e+03   1.761530e-05   0.000000e+00   1.761530e-05   0.000000e+00 
  1.072000e+03   1.276978e-05   0.000000e+00   1.276978e-05   0.000000e+00 
  1.088000e+03   1.751891e-05   0.000000e+00   1.751891e-05   0.000000e+00 
  1.104000e+03   2.013243e-05   0.000000e+00   2.013243e-05   0.000000e+00 
  1.120000e+03   2.049285e-05   0.000000e+00   2.049285e-05   0.000000e+00 
  1.136000e+03   3.792091e-05   0.000000e+00   3.792091e-05   0.000000e+00 
  1.152000e+03   2.936697e-05   0.000000e+00   2.936697e-05   0.000000e+00 
  1.168000e+03   1.537903e-05   0.000000e+00   1.537903e-05   0.000000e+00 
  1.184000e+03   1.403161e-05   0.000000e+00   1.403161e-05   0.000000e+00 
  1.200000e+03   1.505720e-05   0.000000e+00   1.505720e-05   0.000000e+00 
  1.216000e+03   1.572077e-05   0.000000e+00   1.572077e-05   0.000000e+00 
  1.232000e+03   1.626378e-05   0.000000e+00   1.626378e-05   0.000000e+00 
  1.248000e+03   4.895986e-05   0.000000e+00   4.895986e-05   0.000000e+00 
  1.264000e+03   6.570220e-05   0.000000e+00   6.570220e-05   0.000000e+00 
  1.280000e+03   2.539015e-05   0.000000e+00   2.539015e-05   0.000000e+00 
  1.296000e+03   1.531396e-05   0.000000e+00   1.531396e-05   0.000000e+00 
  1.312000e+03   1.542580e-05   0.000000e+00   1.542580e-05   0.000000e+00 
  1.328000e+03   1.697846e-05   0.000000e+00   1.697846e-05   0.000000e+00 
  1.344000e+03   1.651828e-05   0.000000e+00   1.651828e-05   0.000000e+00 
  1.360000e+03   1.848494e-05   0.000000e+00   1.848494e-05   0.000000e+00 
  1.376000e+03   2.261259e-05   0.000000e+00   2.261259e-05   0.000000e+00 
  1.392000e+03   2.122903e-05   0.000000e+00   2.122903e-05   0.000000e+00 
  1.408000e+03   2.024275e-05   0.000000e+00   2.024275e-05   0.000000e+00 
  1.424000e+03   2.411423e-05   0.000000e+00   2.411423e-05   0.000000e+00 
  1.440000e+03   2.808552e-05   0.000000e+00   2.808552e-05   0.000000e+00 
  1.456000e+03   2.828504e-05   0.000000e+00   2.828504e-05   0.000000e+00 
  1.472000e+03   2.492244e-05   0.000000e+00   2.492244e-05   0.000000e+00 
  1.488000e+03   3.709505e-05   0.000000e+00   3.709505e-05   0.000000e+00 
  1.504000e+03   4.471092e-05   0.000000e+00   4.471092e-05   0.000000e+00 
  1.520000e+03   2.613503e-05   0.000000e+00   2.613503e-05   0.000000e+00 
  1.536000e+03   2.235072e-05   0.000000e+00   2.235072e-05   0.000000e+00 
  1.552000e+03   2.115487e-05   0.000000e+00   2.115487e-05   0.000000e+00 
  1.568000e+03   2.165936e-05   0.000000e+00   2.165936e-05   0.000000e+00 
  1.584000e+03   2.169297e-05   0.000000e+00   2.169297e-05   0.000000e+00 
  1.600000e+03   2.553787e-05   0.000000e+00   2.553787e-05   0.000000e+00 
  1.616000e+03   5.490451e-05   0.000000e+00   5.490451e-05   0.000000e+00 
  1.632000e+03   4.117215e-05   0.000000e+00   4.117215e-05   0.000000e+00 
  1.648000e+03   2.363637e-05   0.000000e+00   2.363637e-05   0.000000e+00 
  1.664000e+03   2.739208e-05   0.000000e+00   2.739208e-05   0.000000e+00 
  1.680000e+03   2.328689e-05   0.000000e+00   2.328689e-05   0.000000e+00 
  1.696000e+03   2.056250e-05   0.000000e+00   2.056250e-05   0.000000e+00 
  1.712000e+03   2.097959e-05   0.000000e+00   2.097959e-05   0.000000e+00 
  1.728000e+03   2.163079e-05   0.000000e+00   2.163079e-05   0.000000e+00 
  1.744000e+03   2.229232e-05   0.000000e+00   2.229232e-05   0.000000e+00 
  1.760000e+03   2.213912e-05   0.000000e+00   2.213912e-05   0.000000e+00 
  1.776000e+03   2.229719e-05   0.000000e+00   2.229719e-05   0.000000e+00 
  1.792000e+03   2.350417e-05   0.000000e+00   2.350417e-05   0.000000e+00 
  1.808000e+03   2.391974e-05   0.000000e+00   2.391974e-05   0.000000e+00 
  1.824000e+03   2.767161e-05   0.000000e+00   2.767161e-05   0.000000e+00 
  1.840000e+03   3.618339e-05   0.000000e+00   3.618339e-05   0.000000e+00 
  1.856000e+03   6.210065e-05   0.000000e+00   6.210065e-05   0.000000e+00 
  1.872000e+03   4.570656e-05   0.000000e+00   4.570656e-05   0.000000e+00 
  1.888000e+03   2.800784e-05   0.000000e+00   2.800784e-05   0.000000e+00 
  1.904000e+03   2.826396e-05   0.000000e+00   2.826396e-05   0.000000e+00 
  1.920000e+03   2.649671e-05   0.000000e+00   2.649671e-05   0.000000e+00 
  1.936000e+03   2.710467e-05   0.000000e+00   2.710467e-05   0.000000e+00 
  1.952000e+03   2.825022e-05   0.000000e+00   2.825022e-05   0.000000e+00 
  1.968000e+03   6.303557e-05   0.000000e+00   6.303557e-05   0.000000e+00 
  1.984000e+03   8.598846e-05   0.000000e+00   8.598846e-05   0.000000e+00 
  2.000000e+03   4.894291e-05   0.000000e+00   4.894291e-05   0.000000e+00 
  2.016000e+03   3.014153e-05   0.000000e+00   3.014153e-05   0.000000e+00 
  2.032000e+03   2.587290e-05   0.000000e+00   2.587290e-05   0.000000e+00 
  2.048000e+03   2.667319e-05   0.000000e+00   2.667319e-05   0.000000e+00 
  2.064000e+03   2.740392e-05   0.000000e+00   2.740392e-05   0.000000e+00 
  2.080000e+03   2.848007e-05   0.000000e+00   2.848007e-05   0.000000e+00 
  2.096000e+03   2.818712e-05   0.000000e+00   2.818712e-05   0.000000e+00 
  2.112000e+03   2.844257e-05   0.000000e+00   2.844257e-05   0.000000e+00 
  2.128000e+03   2.816052e-05   0.000000e+00   2.816052e-05   0.000000e+00 
  2.144000e+03   2.872234e-05   0.000000e+00   2.872234e-05   0.000000e+00 
  2.160000e+03   3.049277e-05   0.000000e+00   3.049277e-05   0.000000e+00 
  2.176000e+03   3.218244e-05   0.000000e+00   3.218244e-05   0.000000e+00 
  2.192000e+03   3.302928e-05   0.000000e+00   3.302928e-05   0.000000e+00 
  2.208000e+03   6.926994e-05   0.000000e+00   6.926994e-05   0.000000e+00 
  2.224000e+03   8.793279e-05   0.000000e+00   8.793279e-05   0.000000e+00 
  2.240000e+03   4.340267e-05   0.000000e+00   4.340267e-05   0.000000e+00 
  2.256000e+03   3.217965e-05   0.000000e+00   3.217965e-05   0.000000e+00 
  2.272000e+03   3.057561e-05   0.000000e+00   3.057561e-05   0.000000e+00 
  2.288000e+03   3.089924e-05   0.000000e+00   3.089924e-05   0.000000e+00 
  2.304000e+03   3.344410e-05   0.000000e+00   3.344410e-05   0.000000e+00 
  2.320000e+03   4.999870e-05   0.000000e+00   4.999870e-05   0.000000e+00 
  2.336000e+03   1.039213e-04   0.000000e+00   1.039213e-04   0.000000e+00 
  2.352000e+03   7.345241e-05   0.000000e+00   7.345241e-05   0.000000e+00 
  2.368000e+03   3.251492e-05   0.000000e+00   3.251492e-05   0.000000e+00 
  2.384000e+03   3.505587e-05   0.000000e+00   3.505587e-05   0.000000e+00 
  2.400000e+03   3.459860e-05   0.000000e+00   3.459860e-05   0.000000e+00 
  2.416000e+03   3.311645e-05   0.000000e+00   3.311645e-05   0.000000e+00 
  2.432000e+03   3.709496e-05   0.000000e+00   3.709496e-05   0.000000e+00 
  2.448000e+03   4.266917e-05   0.000000e+00   4.266917e-05   0.000000e+00 
  2.464000e+03   4.708987e-05   0.000000e+00   4.708987e-05   0.000000e+00 
  2.480000e+03   4.563697e-05   0.000000e+00   4.563697e-05   0.000000e+00 
  2.496000e+03   4.737343e-05   0.000000e+00   4.737343e-05   0.000000e+00 
  2.512000e+03   4.685933e-05   0.000000e+00   4.685933e-05   0.000000e+00 
  2.528000e+03   4.573487e-05   0.000000e+00   4.573487e-05   0.000000e+00 
  2.544000e+03   4.938831e-05   0.000000e+00   4.938831e-05   0.000000e+00 
  2.560000e+03   5.920511e-05   0.000000e+00   5.920511e-05   0.000000e+00 
  2.576000e+03   9.872410e-05   0.000000e+00   9.872410e-05   0.000000e+00 
  2.592000e+03   9.098800e-05   0.000000e+00   9.098800e-05   0.000000e+00 
  2.608000e+03   7.590454e-05   0.000000e+00   7.590454e-05   0.000000e+00 
  2.624000e+03   7.743472e-05   0.000000e+00   7.743472e-05   0.000000e+00 
  2.640000e+03   9.029803e-05   0.000000e+00   9.029803e-05   0.000000e+00 
  2.656000e+03   1.037272e-04   0.000000e+00   1.037272e-04   0.000000e+00 
  2.672000e+03   1.099886e-04   0.000000e+00   1.099886e-04   0.000000e+00 
  2.688000e+03   1.204599e-04   0.000000e+00   1.204599e-04   0.000000e+00 
  2.704000e+03   1.334011e-04   0.000000e+00   1.334011e-04   0.000000e+00 
  2.720000e+03   9.795119e-05   0.000000e+00   9.795119e-05   0.000000e+00 
  2.736000e+03   9.464939e-05   0.000000e+00   9.464939e-05   0.000000e+00 
  2.752000e+03   9.396331e-05   0.000000e+00   9.396331e-05   0.000000e+00 
  2.768000e+03   9.648644e-05   0.000000e+00   9.648644e-05   0.000000e+00 
  2.784000e+03   1.003410e-04   0.000000e+00   1.003410e-04   0.000000e+00 
  2.800000e+03   1.065873e-04   0.000000e+00   1.065873e-04   0.000000e+00 
  2.816000e+03   1.043257e-04   0.000000e+00   1.043257e-04   0.000000e+00 
  2.832000e+03   1.038549e-04   0.000000e+00   1.038549e-04   0.000000e+00 
  2.848000e+03   9.607026e-05   0.000000e+00   9.607026e-05   0.000000e+00 
  2.864000e+03   8.396842e-05   0.000000e+00   8.396842e-05   0.000000e+00 
  2.880000e+03   7.485587e-05   0.000000e+00   7.485587e-05   0.000000e+00 
  2.896000e+03   6.990172e-05   0.000000e+00   6.990172e-05   0.000000e+00 
  2.912000e+03   6.584689e-05   0.000000e+00   6.584689e-05   0.000000e+00 
  2.928000e+03   9.602766e-05   0.000000e+00   9.602766e-05   0.000000e+00 
  2.944000e+03   1.159535e-04   0.000000e+00   1.159535e-04   0.000000e+00 
  2.960000e+03   6.172252e-05   0.000000e+00   6.172252e-05   0.000000e+00 
  2.976000e+03   5.543092e-05   0.000000e+00   5.543092e-05   0.000000e+00 
  2.992000e+03   6.754537e-05   0.000000e+00   6.754537e-05   0.000000e+00 
  3.008000e+03   6.954662e-05   0.000000e+00   6.954662e-05   0.000000e+00 
  3.024000e+03   6.002184e-05   0.000000e+00   6.002184e-05   0.000000e+00 
  3.040000e+03   6.082153e-05   0.000000e+00   6.082153e-05   0.000000e+00 
  3.056000e+03   7.146971e-05   0.000000e+00   7.146971e-05   0.000000e+00 
  3.072000e+03   7.823441e-05   0.000000e+00   7.823441e-05   0.000000e+00 
  3.088000e+03   9.477183e-05   0.000000e+00   9.477183e-05   0.000000e+00 
  3.104000e+03   1.060154e-04   0.000000e+00   1.060154e-04   0.000000e+00 
  3.120000e+03   8.917308e-05   0.000000e+00   8.917308e-05   0.000000e+00 
  3.136000e+03   6.684159e-05   0.000000e+00   6.684159e-05   0.000000e+00 
  3.152000e+03   6.555515e-05   0.000000e+00   6.555515e-05   0.000000e+00 
  3.168000e+03   6.909897e-05   0.000000e+00   6.909897e-05   0.000000e+00 
  3.184000e+03   7.016851e-05   0.000000e+00   7.016851e-05   0.000000e+00 
  3.200000e+03   5.473469e-05   0.000000e+00   5.473469e-05   0.000000e+00 
  3.216000e+03   5.394926e-05   0.000000e+00   5.394926e-05   0.000000e+00 
  3.232000e+03   5.696693e-05   0.000000e+00   5.696693e-05   0.000000e+00 
  3.248000e+03   5.862005e-05   0.000000e+00   5.862005e-05   0.000000e+00 
  3.264000e+03   5.288704e-05   0.000000e+00   5.288704e-05   0.000000e+00 
  3.280000e+03   6.529339e-05   0.000000e+00   6.529339e-05   0.000000e+00 
  3.296000e+03   1.132992e-04   0.000000e+00   1.132992e-04   0.000000e+00 
  3.312000e+03   8.668910e-05   0.000000e+00   8.668910e-05   0.000000e+00 
  3.328000e+03   5.665993e-05   0.000000e+00   5.665993e-05   0.000000e+00 
  3.344000e+03   5.739817e-05   0.000000e+00   5.739817e-05   0.000000e+00 
  3.360000e+03   5.773837e-05   0.000000e+00   5.773837e-05   0.000000e+00 
  3.376000e+03   5.673221e-05   0.000000e+00   5.673221e-05   0.000000e+00 
  3.392000e+03   5.764924e-05   0.000000e+00   5.764924e-05   0.000000e+00 
  3.408000e+03   7.564312e-05   0.000000e+00   7.564312e-05   0.000000e+00 
  3.424000e+03   8.984914e-05   0.000000e+00   8.984914e-05   0.000000e+00 
  3.440000e+03   6.426287e-05   0.000000e+00   6.426287e-05   0.000000e+00 
  3.456000e+03   6.097572e-05   0.000000e+00   6.097572e-05   0.000000e+00 
  3.472000e+03   6.493579e-05   0.000000e+00   6.493579e-05   0.000000e+00 
  3.488000e+03   6.410688e-05   0.000000e+00   6.410688e-05   0.000000e+00 
  3.504000e+03   6.468964e-05   0.000000e+00   6.468964e-05   0.000000e+00 
  3.520000e+03   6.407787e-05   0.000000e+00   6.407787e-05   0.000000e+00 
  3.536000e+03   7.301525e-05   0.000000e+00   7.301525e-05   0.000000e+00 
  3.552000e+03   7.291714e-05   0.000000e+00   7.291714e-05   0.000000e+00 
  3.568000e+03   6.978086e-05   0.000000e+00   6.978086e-05   0.000000e+00 
  3.584000e+03   6.500875e-05   0.000000e+00   6.500875e-05   0.000000e+00 
  3.600000e+03   6.692057e-05   0.000000e+00   6.692057e-05   0.000000e+00 
  3.616000e+03   7.049428e-05   0.000000e+00   7.049428e-05   0.000000e+00 
  3.632000e+03   7.072489e-05   0.000000e+00   7.072489e-05   0.000000e+00 
  3.648000e+03   7.784916e-05   0.000000e+00   7.784916e-05   0.000000e+00 
  3.664000e+03   7.742127e-05   0.000000e+00   7.742127e-05   0.000000e+00 
  3.680000e+03   7.390056e-05   0.000000e+00   7.390056e-05   0.000000e+00 
  3.696000e+03   7.854338e-05   0.000000e+00   7.854338e-05   0.000000e+00 
  3.712000e+03   7.831350e-05   0.000000e+00   7.831350e-05   0.000000e+00 
  3.728000e+03   7.810529e-05   0.000000e+00   7.810529e-05   0.000000e+00 
  3.744000e+03   7.796938e-05   0.000000e+00   7.796938e-05   0.000000e+00 
  3.760000e+03   8.517280e-05   0.000000e+00   8.517280e-05   0.000000e+00 
  3.776000e+03   9.228344e-05   0.000000e+00   9.228344e-05   0.000000e+00 
  3.792000e+03   8.336071e-05   0.000000e+00   8.336071e-05   0.000000e+00 
  3.808000e+03   8.400292e-05   0.000000e+00   8.400292e-05   0.000000e+00 
  3.824000e+03   9.260482e-05   0.000000e+00   9.260482e-05   0.000000e+00 
  3.840000e+03   9.564416e-05   0.000000e+00   9.564416e-05   0.000000e+00 
  3.856000e+03   9.328592e-05   0.000000e+00   9.328592e-05   0.000000e+00 
  3.872000e+03   9.141315e-05   0.000000e+00   9.141315e-05   0.000000e+00 
  3.888000e+03   9.323459e-05   0.000000e+00   9.323459e-05   0.000000e+00 
  3.904000e+03   1.005081e-04   0.000000e+00   1.005081e-04   0.000000e+00 
  3.920000e+03   9.677612e-05   0.000000e+00   9.677612e-05   0.000000e+00 
  3.936000e+03   9.589815e-05   0.000000e+00   9.589815e-05   0.000000e+00 
  3.952000e+03   9.675003e-05   0.000000e+00   9.675003e-05   0.000000e+00 
  3.968000e+03   9.880962e-05   0.000000e+00   9.880962e-05   0.000000e+00 
  3.984000e+03   1.062168e-04   0.000000e+00   1.062168e-04   0.000000e+00 
  4.000000e+03   1.263647e-04   0.000000e+00   1.263647e-04   0.000000e+00 
  4.016000e+03   1.590833e-04   0.000000e+00   1.590833e-04   0.000000e+00 
  4.032000e+03   1.333180e-04   0.000000e+00   1.333180e-04   0.000000e+00 
  4.048000e+03   1.153473e-04   0.000000e+00   1.153473e-04   0.000000e+00 
  4.064000e+03   1.197322e-04   0.000000e+00   1.197322e-04   0.000000e+00 
  4.080000e+03   1.390778e-04   0.000000e+00   1.390778e-04   0.000000e+00 
  4.096000e+03   1.520902e-04   0.000000e+00   1.520902e-04   0.000000e+00 
  4.112000e+03   1.716452e-04   0.000000e+00   1.716452e-04   0.000000e+00 
  4.128000e+03   1.904872e-04   0.000000e+00   1.904872e-04   0.000000e+00 
  4.144000e+03   1.829090e-04   0.000000e+00   1.829090e-04   0.000000e+00 
  4.160000e+03   1.577169e-04   0.000000e+00   1.577169e-04   0.000000e+00 
  4.176000e+03   1.408754e-04   0.000000e+00   1.408754e-04   0.000000e+00 
  4.192000e+03   1.345787e-04   0.000000e+00   1.345787e-04   0.000000e+00 
  4.208000e+03   1.292247e-04   0.000000e+00   1.292247e-04   0.000000e+00 
  4.224000e+03   1.223098e-04   0.000000e+00   1.223098e-04   0.000000e+00 
  4.240000e+03   1.165967e-04   0.000000e+00   1.165967e-04   0.000000e+00 
  4.256000e+03   1.162469e-04   0.000000e+00   1.162469e-04   0.000000e+00 
  4.272000e+03   1.167707e-04   0.000000e+00   1.167707e-04   0.000000e+00 
  4.288000e+03   1.110113e-04   0.000000e+00   1.110113e-04   0.000000e+00 
  4.304000e+03   1.093471e-04   0.000000e+00   1.093471e-04   0.000000e+00 
  4.320000e+03   1.140040e-04   0.000000e+00   1.140040e-04   0.000000e+00 
  4.336000e+03   1.131665e-04   0.000000e+00   1.131665e-04   0.000000e+00 
  4.352000e+03   1.066030e-04   0.000000e+00   1.066030e-04   0.000000e+00 
  4.368000e+03   1.372562e-04   0.000000e+00   1.372562e-04   0.000000e+00 
  4.384000e+03   1.581978e-04   0.000000e+00   1.581978e-04   0.000000e+00 
  4.400000e+03   1.113723e-04   0.000000e+00   1.113723e-04   0.000000e+00 
  4.416000e+03   1.027611e-04   0.000000e+00   1.027611e-04   0.000000e+00 
  4.432000e+03   1.056284e-04   0.000000e+00   1.056284e-04   0.000000e+00 
  4.448000e+03   1.070925e-04   0.000000e+00   1.070925e-04   0.000000e+00 
  4.464000e+03   1.056988e-04   0.000000e+00   1.056988e-04   0.000000e+00 
  4.480000e+03   1.048079e-04   0.000000e+00   1.048079e-04   0.000000e+00 
  4.496000e+03   1.060349e-04   0.000000e+00   1.060349e-04   0.000000e+00 
  4.512000e+03   1.050403e-04   0.000000e+00   1.050403e-04   0.000000e+00 
  4.528000e+03   1.081120e-04   0.000000e+00   1.081120e-04   0.000000e+00 
  4.544000e+03   1.105224e-04   0.000000e+00   1.105224e-04   0.000000e+00 
  4.560000e+03   1.200469e-04   0.000000e+00   1.200469e-04   0.000000e+00 
  4.576000e+03   1.237945e-04   0.000000e+00   1.237945e-04   0.000000e+00 
  4.592000e+03   1.062749e-04   0.000000e+00   1.062749e-04   0.000000e+00 
  4.608000e+03   1.124403e-04   0.000000e+00   1.124403e-04   0.000000e+00 
  4.624000e+03   1.178749e-04   0.000000e+00   1.178749e-04   0.000000e+00 
  4.640000e+03   1.102539e-04   0.000000e+00   1.102539e-04   0.000000e+00 
  4.656000e+03   1.047330e-04   0.000000e+00   1.047330e-04   0.000000e+00 
  4.672000e+03   1.047524e-04   0.000000e+00   1.047524e-04   0.000000e+00 
  4.688000e+03   1.040802e-04   0.000000e+00   1.040802e-04   0.000000e+00 
  4.704000e+03   1.064158e-04   0.000000e+00   1.064158e-04   0.000000e+00 
  4.720000e+03   1.001005e-04   0.000000e+00   1.001005e-04   0.000000e+00 
  4.736000e+03   1.032008e-04   0.000000e+00   1.032008e-04   0.000000e+00 
  4.752000e+03   9.914253e-05   0.000000e+00   9.914253e-05   0.000000e+00 
  4.768000e+03   9.811592e-05   0.000000e+00   9.811592e-05   0.000000e+00 
  4.784000e+03   9.909622e-05   0.000000e+00   9.909622e-05   0.000000e+00 
  4.800000e+03   1.031282e-04   0.000000e+00   1.031282e-04   0.000000e+00 
  4.816000e+03   1.022795e-04   0.000000e+00   1.022795e-04   0.000000e+00 
  4.832000e+03   1.044763e-04   0.000000e+00   1.044763e-04   0.000000e+00 
  4.848000e+03   1.157347e-04   0.000000e+00   1.157347e-04   0.000000e+00 
  4.864000e+03   1.110553e-04   0.000000e+00   1.110553e-04   0.000000e+00 
  4.880000e+03   9.804736e-05   0.000000e+00   9.804736e-05   0.000000e+00 
  4.896000e+03   1.046638e-04   0.000000e+00   1.046638e-04   0.000000e+00 
  4.912000e+03   1.086895e-04   0.000000e+00   1.086895e-04   0.000000e+00 
  4.928000e+03   1.032352e-04   0.000000e+00   1.032352e-04   0.000000e+00 
  4.944000e+03   9.884064e-05   0.000000e+00   9.884064e-05   0.000000e+00 
  4.960000e+03   1.004840e-04   0.000000e+00   1.004840e-04   0.000000e+00 
  4.976000e+03   1.229303e-04   0.000000e+00   1.229303e-04   0.000000e+00 
  4.992000e+03   1.364275e-04   0.000000e+00   1.364275e-04   0.000000e+00 
  5.008000e+03   1.363195e-04   0.000000e+00   1.363195e-04   0.000000e+00 
  5.024000e+03   1.144176e-04   0.000000e+00   1.144176e-04   0.000000e+00 
  5.040000e+03   1.142963e-04   0.000000e+00   1.142963e-04   0.000000e+00 
  5.056000e+03   1.260064e-04   0.000000e+00   1.260064e-04   0.000000e+00 
  5.072000e+03   1.456044e-04   0.000000e+00   1.456044e-04   0.000000e+00 
  5.088000e+03   1.767270e-04   0.000000e+00   1.767270e-04   0.000000e+00 
  5.104000e+03   1.724001e-04   0.000000e+00   1.724001e-04   0.000000e+00 
  5.120000e+03   1.486373e-04   0.000000e+00   1.486373e-04   0.000000e+00 
  5.136000e+03   1.546601e-04   0.000000e+00   1.546601e-04   0.000000e+00 
  5.152000e+03   1.589074e-04   0.000000e+00   1.589074e-04   0.000000e+00 
  5.168000e+03   1.565408e-04   0.000000e+00   1.565408e-04   0.000000e+00 
  5.184000e+03   1.537546e-04   0.000000e+00   1.537546e-04   0.000000e+00 
  5.200000e+03   1.426940e-04   0.000000e+00   1.426940e-04   0.000000e+00 
  5.216000e+03   1.454234e-04   0.000000e+00   1.454234e-04   0.000000e+00 
  5.232000e+03   1.313321e-04   0.000000e+00   1.313321e-04   0.000000e+00 
  5.248000e+03   1.209425e-04   0.000000e+00   1.209425e-04   0.000000e+00 
  5.264000e+03   1.239678e-04   0.000000e+00   1.239678e-04   0.000000e+00 
  5.280000e+03   1.257947e-04   0.000000e+00   1.257947e-04   0.000000e+00 
  5.296000e+03   1.126193e-04   0.000000e+00   1.126193e-04   0.000000e+00 
  5.312000e+03   1.069912e-04   0.000000e+00   1.069912e-04   0.000000e+00 
  5.328000e+03   1.236965e-04   0.000000e+00   1.236965e-04   0.000000e+00 
  5.344000e+03   1.216435e-04   0.000000e+00   1.216435e-04   0.000000e+00 
  5.360000e+03   1.128491e-04   0.000000e+00   1.128491e-04   0.000000e+00 
  5.376000e+03   1.022022e-04   0.000000e+00   1.022022e-04   0.000000e+00 
  5.392000e+03   1.040191e-04   0.000000e+00   1.040191e-04   0.000000e+00 
  5.408000e+03   1.074027e-04   0.000000e+00   1.074027e-04   0.000000e+00 
  5.424000e+03   9.605770e-05   0.000000e+00   9.605770e-05   0.000000e+00 
  5.440000e+03   1.023044e-04   0.000000e+00   1.023044e-04   0.000000e+00 
  5.456000e+03   1.309426e-04   0.000000e+00   1.309426e-04   0.000000e+00 
  5.472000e+03   1.185897e-04   0.000000e+00   1.185897e-04   0.000000e+00 
  5.488000e+03   9.925023e-05   0.000000e+00   9.925023e-05   0.000000e+00 
  5.504000e+03   9.610328e-05   0.000000e+00   9.610328e-05   0.000000e+00 
  5.520000e+03   1.013299e-04   0.000000e+00   1.013299e-04   0.000000e+00 
  5.536000e+03   1.031950e-04   0.000000e+00   1.031950e-04   0.000000e+00 
  5.552000e+03   9.927911e-05   0.000000e+00   9.927911e-05   0.000000e+00 
  5.568000e+03   1.095820e-04   0.000000e+00   1.095820e-04   0.000000e+00 
  5.584000e+03   1.140741e-04   0.000000e+00   1.140741e-04   0.000000e+00 
  5.600000e+03   9.859160e-05   0.000000e+00   9.859160e-05   0.000000e+00 
  5.616000e+03   9.860924e-05   0.000000e+00   9.860924e-05   0.000000e+00 
  5.632000e+03   9.847305e-05   0.000000e+00   9.847305e-05   0.000000e+00 
  5.648000e+03   9.630392e-05   0.000000e+00   9.630392e-05   0.000000e+00 
  5.664000e+03   9.536189e-05   0.000000e+00   9.536189e-05   0.000000e+00 
  5.680000e+03   9.662465e-05   0.000000e+00   9.662465e-05   0.000000e+00 
  5.696000e+03   1.002023e-04   0.000000e+00   1.002023e-04   0.000000e+00 
  5.712000e+03   8.824467e-05   0.000000e+00   8.824467e-05   0.000000e+00 
  5.728000e+03   8.554612e-05   0.000000e+00   8.554612e-05   0.000000e+00 
  5.744000e+03   8.827388e-05   0.000000e+00   8.827388e-05   0.000000e+00 
  5.760000e+03   8.834051e-05   0.000000e+00   8.834051e-05   0.000000e+00 
  5.776000e+03   7.955298e-05   0.000000e+00   7.955298e-05   0.000000e+00 
  5.792000e+03   8.174010e-05   0.000000e+00   8.174010e-05   0.000000e+00 
  5.808000e+03   9.247612e-05   0.000000e+00   9.247612e-05   0.000000e+00 
  5.824000e+03   9.003674e-05   0.000000e+00   9.003674e-05   0.000000e+00 
  5.840000e+03   8.302247e-05   0.000000e+00   8.302247e-05   0.000000e+00 
  5.856000e+03   8.438329e-05   0.000000e+00   8.438329e-05   0.000000e+00 
  5.872000e+03   8.661054e-05   0.000000e+00   8.661054e-05   0.000000e+00 
  5.888000e+03   8.243936e-05   0.000000e+00   8.243936e-05   0.000000e+00 
  5.904000e+03   7.909213e-05   0.000000e+00   7.909213e-05   0.000000e+00 
  5.920000e+03   8.727331e-05   0.000000e+00   8.727331e-05   0.000000e+00 
  5.936000e+03   9.992633e-05   0.000000e+00   9.992633e-05   0.000000e+00 
  5.952000e+03   8.505667e-05   0.000000e+00   8.505667e-05   0.000000e+00 
  5.968000e+03   7.637421e-05   0.000000e+00   7.637421e-05   0.000000e+00 
  5.984000e+03   9.706536e-05   0.000000e+00   9.706536e-05   0.000000e+00 
  6.000000e+03   1.294714e-04   0.000000e+00   1.294714e-04   0.000000e+00 
  6.016000e+03   9.604398e-05   0.000000e+00   9.604398e-05   0.000000e+00 
  6.032000e+03   7.756025e-05   0.000000e+00   7.756025e-05   0.000000e+00 
  6.048000e+03   9.098788e-05   0.000000e+00   9.098788e-05   0.000000e+00 
  6.064000e+03   9.304733e-05   0.000000e+00   9.304733e-05   0.000000e+00 
  6.080000e+03   7.697723e-05   0.000000e+00   7.697723e-05   0.000000e+00 
  6.096000e+03   8.408791e-05   0.000000e+00   8.408791e-05   0.000000e+00 
  6.112000e+03   8.295177e-05   0.000000e+00   8.295177e-05   0.000000e+00 
  6.128000e+03   8.198160e-05   0.000000e+00   8.198160e-05   0.000000e+00 
  6.144000e+03   8.000567e-05   0.000000e+00   8.000567e-05   0.000000e+00 
  6.160000e+03   8.785638e-05   0.000000e+00   8.785638e-05   0.000000e+00 
  6.176000e+03   1.033583e-04   0.000000e+00   1.033583e-04   0.000000e+00 
  6.192000e+03   9.006601e-05   0.000000e+00   9.006601e-05   0.000000e+00 
  6.208000e+03   8.493380e-05   0.000000e+00   8.493380e-05   0.000000e+00 
  6.224000e+03   8.266701e-05   0.000000e+00   8.266701e-05   0.000000e+00 
  6.240000e+03   7.969620e-05   0.000000e+00   7.969620e-05   0.000000e+00 
  6.256000e+03   7.581661e-05   0.000000e+00   7.581661e-05   0.000000e+00 
  6.272000e+03   7.976210e-05   0.000000e+00   7.976210e-05   0.000000e+00 
  6.288000e+03   9.045811e-05   0.000000e+00   9.045811e-05   0.000000e+00 
  6.304000e+03   8.431897e-05   0.000000e+00   8.431897e-05   0.000000e+00 
  6.320000e+03   7.617913e-05   0.000000e+00   7.617913e-05   0.000000e+00 
  6.336000e+03   7.571078e-05   0.000000e+00   7.571078e-05   0.000000e+00 
  6.352000e+03   7.440155e-05   0.000000e+00   7.440155e-05   0.000000e+00 
  6.368000e+03   7.634091e-05   0.000000e+00   7.634091e-05   0.000000e+00 
  6.384000e+03   7.256548e-05   0.000000e+00   7.256548e-05   0.000000e+00 
  6.400000e+03   7.266399e-05   0.000000e+00   7.266399e-05   0.000000e+00 
  6.416000e+03   8.750150e-05   0.000000e+00   8.750150e-05   0.000000e+00 
  6.432000e+03   7.867608e-05   0.000000e+00   7.867608e-05   0.000000e+00 
  6.448000e+03   7.243943e-05   0.000000e+00   7.243943e-05   0.000000e+00 
  6.464000e+03   7.328540e-05   0.000000e+00   7.328540e-05   0.000000e+00 
  6.480000e+03   7.181483e-05   0.000000e+00   7.181483e-05   0.000000e+00 
  6.496000e+03   7.172020e-05   0.000000e+00   7.172020e-05   0.000000e+00 
  6.512000e+03   7.231949e-05   0.000000e+00   7.231949e-05   0.000000e+00 
  6.528000e+03   8.656066e-05   0.000000e+00   8.656066e-05   0.000000e+00 
  6.544000e+03   8.335508e-05   0.000000e+00   8.335508e-05   0.000000e+00 
  6.560000e+03   6.878881e-05   0.000000e+00   6.878881e-05   0.000000e+00 
  6.576000e+03   7.108799e-05   0.000000e+00   7.108799e-05   0.000000e+00 
  6.592000e+03   7.085979e-05   0.000000e+00   7.085979e-05   0.000000e+00 
  6.608000e+03   7.366276e-05   0.000000e+00   7.366276e-05   0.000000e+00 
  6.624000e+03   7.110931e-05   0.000000e+00   7.110931e-05   0.000000e+00 
  6.640000e+03   7.071171e-05   0.000000e+00   7.071171e-05   0.000000e+00 
  6.656000e+03   7.298548e-05   0.000000e+00   7.298548e-05   0.000000e+00 
  6.672000e+03   6.783679e-05   0.000000e+00   6.783679e-05   0.000000e+00 
  6.688000e+03   6.833108e-05   0.000000e+00   6.833108e-05   0.000000e+00 
  6.704000e+03   6.834836e-05   0.000000e+00   6.834836e-05   0.000000e+00 
  6.720000e+03   6.784802e-05   0.000000e+00   6.784802e-05   0.000000e+00 
  6.736000e+03   7.440231e-05   0.000000e+00   7.440231e-05   0.000000e+00 
  6.752000e+03   7.214999e-05   0.000000e+00   7.214999e-05   0.000000e+00 
  6.768000e+03   7.387232e-05   0.000000e+00   7.387232e-05   0.000000e+00 
  6.784000e+03   7.586877e-05   0.000000e+00   7.586877e-05   0.000000e+00 
  6.800000e+03   6.681693e-05   0.000000e+00   6.681693e-05   0.000000e+00 
  6.816000e+03   6.300732e-05   0.000000e+00   6.300732e-05   0.000000e+00 
  6.832000e+03   6.842316e-05   0.000000e+00   6.842316e-05   0.000000e+00 
  6.848000e+03   6.972074e-05   0.000000e+00   6.972074e-05   0.000000e+00 
  6.864000e+03   7.154904e-05   0.000000e+00   7.154904e-05   0.000000e+00 
  6.880000e+03   7.621243e-05   0.000000e+00   7.621243e-05   0.000000e+00 
  6.896000e+03   7.799968e-05   0.000000e+00   7.799968e-05   0.000000e+00 
  6.912000e+03   7.573591e-05   0.000000e+00   7.573591e-05   0.000000e+00 
  6.928000e+03   6.822485e-05   0.000000e+00   6.822485e-05   0.000000e+00 
  6.944000e+03   7.054958e-05   0.000000e+00   7.054958e-05   0.000000e+00 
  6.960000e+03   6.881412e-05   0.000000e+00   6.881412e-05   0.000000e+00 
  6.976000e+03   7.181559e-05   0.000000e+00   7.181559e-05   0.000000e+00 
  6.992000e+03   1.041228e-04   0.000000e+00   1.041228e-04   0.000000e+00 
  7.008000e+03   1.110854e-04   0.000000e+00   1.110854e-04   0.000000e+00 
  7.024000e+03   8.979877e-05   0.000000e+00   8.979877e-05   0.000000e+00 
  7.040000e+03   7.267122e-05   0.000000e+00   7.267122e-05   0.000000e+00 
  7.056000e+03   7.059697e-05   0.000000e+00   7.059697e-05   0.000000e+00 
  7.072000e+03   6.849562e-05   0.000000e+00   6.849562e-05   0.000000e+00 
  7.088000e+03   6.942873e-05   0.000000e+00   6.942873e-05   0.000000e+00 
  7.104000e+03   7.546764e-05   0.000000e+00   7.546764e-05   0.000000e+00 
  7.120000e+03   8.015947e-05   0.000000e+00   8.015947e-05   0.000000e+00 
  7.136000e+03   8.741354e-05   0.000000e+00   8.741354e-05   0.000000e+00 
  7.152000e+03   8.726773e-05   0.000000e+00   8.726773e-05   0.000000e+00 
  7.168000e+03   8.644194e-05   0.000000e+00   8.644194e-05   0.000000e+00 
  7.184000e+03   9.332872e-05   0.000000e+00   9.332872e-05   0.000000e+00 
  7.200000e+03   9.100609e-05   0.000000e+00   9.100609e-05   0.000000e+00 
  7.216000e+03   8.454560e-05   0.000000e+00   8.454560e-05   0.000000e+00 
  7.232000e+03   8.633689e-05   0.000000e+00   8.633689e-05   0.000000e+00 
  7.248000e+03   8.469902e-05   0.000000e+00   8.469902e-05   0.000000e+00 
  7.264000e+03   7.863651e-05   0.000000e+00   7.863651e-05   0.000000e+00 
  7.280000e+03   8.150112e-05   0.000000e+00   8.150112e-05   0.000000e+00 
  7.296000e+03   8.300767e-05   0.000000e+00   8.300767e-05   0.000000e+00 
  7.312000e+03   8.156229e-05   0.000000e+00   8.156229e-05   0.000000e+00 
  7.328000e+03   7.939871e-05   0.000000e+00   7.939871e-05   0.000000e+00 
  7.344000e+03   7.829570e-05   0.000000e+00   7.829570e-05   0.000000e+00 
  7.360000e+03   8.206940e-05   0.000000e+00   8.206940e-05   0.000000e+00 
  7.376000e+03   9.002187e-05   0.000000e+00   9.002187e-05   0.000000e+00 
  7.392000e+03   8.363068e-05   0.000000e+00   8.363068e-05   0.000000e+00 
  7.408000e+03   7.545911e-05   0.000000e+00   7.545911e-05   0.000000e+00 
  7.424000e+03   7.368156e-05   0.000000e+00   7.368156e-05   0.000000e+00 
  7.440000e+03   7.830304e-05   0.000000e+00   7.830304e-05   0.000000e+00 
  7.456000e+03   7.740622e-05   0.000000e+00   7.740622e-05   0.000000e+00 
  7.472000e+03   7.339127e-05   0.000000e+00   7.339127e-05   0.000000e+00 
  7.488000e+03   8.916784e-05   0.000000e+00   8.916784e-05   0.000000e+00 
  7.504000e+03   9.290727e-05   0.000000e+00   9.290727e-05   0.000000e+00 
  7.520000e+03   8.989898e-05   0.000000e+00   8.989898e-05   0.000000e+00 
  7.536000e+03   8.900519e-05   0.000000e+00   8.900519e-05   0.000000e+00 
  7.552000e+03   9.730987e-05   0.000000e+00   9.730987e-05   0.000000e+00 
  7.568000e+03   1.036751e-04   0.000000e+00   1.036751e-04   0.000000e+00 
  7.584000e+03   1.176772e-04   0.000000e+00   1.176772e-04   0.000000e+00 
  7.600000e+03   1.365642e-04   0.000000e+00   1.365642e-04   0.000000e+00 
  7.616000e+03   1.480452e-04   0.000000e+00   1.480452e-04   0.000000e+00 
  7.632000e+03   1.488109e-04   0.000000e+00   1.488109e-04   0.000000e+00 
  7.648000e+03   1.506397e-04   0.000000e+00   1.506397e-04   0.000000e+00 
  7.664000e+03   1.428311e-04   0.000000e+00   1.428311e-04   0.000000e+00 
  7.680000e+03   1.397915e-04   0.000000e+00   1.397915e-04   0.000000e+00 
  7.696000e+03   1.174348e-04   0.000000e+00   1.174348e-04   0.000000e+00 
  7.712000e+03   9.811387e-05   0.000000e+00   9.811387e-05   0.000000e+00 
  7.728000e+03   1.030925e-04   0.000000e+00   1.030925e-04   0.000000e+00 
  7.744000e+03   9.933789e-05   0.000000e+00   9.933789e-05   0.000000e+00 
  7.760000e+03   8.903637e-05   0.000000e+00   8.903637e-05   0.000000e+00 
  7.776000e+03   8.768115e-05   0.000000e+00   8.768115e-05   0.000000e+00 
  7.792000e+03   9.078376e-05   0.000000e+00   9.078376e-05   0.000000e+00 
  7.808000e+03   8.872183e-05   0.000000e+00   8.872183e-05   0.000000e+00 
  7.824000e+03   8.582604e-05   0.000000e+00   8.582604e-05   0.000000e+00 
  7.840000e+03   8.714895e-05   0.000000e+00   8.714895e-05   0.000000e+00 
  7.856000e+03   2.867338e-04   0.000000e+00   2.867338e-04   0.000000e+00 
  7.872000e+03   3.705618e-04   0.000000e+00   3.705618e-04   0.000000e+00 
  7.888000e+03   1.397669e-04   0.000000e+00   1.397669e-04   0.000000e+00 
  7.904000e+03   8.486339e-05   0.000000e+00   8.486339e-05   0.000000e+00 
  7.920000e+03   8.535529e-05   0.000000e+00   8.535529e-05   0.000000e+00 
  7.936000e+03   8.476798e-05   0.000000e+00   8.476798e-05   0.000000e+00 
  7.952000e+03   8.889801e-05   0.000000e+00   8.889801e-05   0.000000e+00 
  7.968000e+03   9.254943e-05   0.000000e+00   9.254943e-05   0.000000e+00 
  7.984000e+03   9.802137e-05   0.000000e+00   9.802137e-05   0.000000e+00 
  8.000000e+03   1.013527e-04   0.000000e+00   1.013527e-04   0.000000e+00 
  8.016000e+03   8.819036e-05   0.000000e+00   8.819036e-05   0.000000e+00 
  8.032000e+03   8.030229e-05   0.000000e+00   8.030229e-05   0.000000e+00 
  8.048000e+03   7.949238e-05   0.000000e+00   7.949238e-05   0.000000e+00 
  8.064000e+03   8.138655e-05   0.000000e+00   8.138655e-05   0.000000e+00 
  8.080000e+03   8.316492e-05   0.000000e+00   8.316492e-05   0.000000e+00 
  8.096000e+03   8.412706e-05   0.000000e+00   8.412706e-05   0.000000e+00 
  8.112000e+03   8.986072e-05   0.000000e+00   8.986072e-05   0.000000e+00 
  8.128000e+03   9.139265e-05   0.000000e+00   9.139265e-05   0.000000e+00 
  8.144000e+03   9.455631e-05   0.000000e+00   9.455631e-05   0.000000e+00 
  8.160000e+03   1.140828e-04   0.000000e+00   1.140828e-04   0.000000e+00 
  8.176000e+03   1.283410e-04   0.000000e+00   1.283410e-04   0.000000e+00 
  8.192000e+03   1.282900e-04   0.000000e+00   1.282900e-04   0.000000e+00 
  8.208000e+03   1.265483e-04   0.000000e+00   1.265483e-04   0.000000e+00 
  8.224000e+03   1.299705e-04   0.000000e+00   1.299705e-04   0.000000e+00 
  8.240000e+03   1.236264e-04   0.000000e+00   1.236264e-04   0.000000e+00 
  8.256000e+03   1.189895e-04   0.000000e+00   1.189895e-04   0.000000e+00 
  8.272000e+03   1.119028e-04   0.000000e+00   1.119028e-04   0.000000e+00 
  8.288000e+03   1.037227e-04   0.000000e+00   1.037227e-04   0.000000e+00 
  8.304000e+03   9.893425e-05   0.000000e+00   9.893425e-05   0.000000e+00 
  8.320000e+03   9.729395e-05   0.000000e+00   9.729395e-05   0.000000e+00 
  8.336000e+03   1.060042e-04   0.000000e+00   1.060042e-04   0.000000e+00 
  8.352000e+03   9.847148e-05   0.000000e+00   9.847148e-05   0.000000e+00 
  8.368000e+03   8.756858e-05   0.000000e+00   8.756858e-05   0.000000e+00 
  8.384000e+03   8.947380e-05   0.000000e+00   8.947380e-05   0.000000e+00 
  8.400000e+03   9.015866e-05   0.000000e+00   9.015866e-05   0.000000e+00 
  8.416000e+03   8.302448e-05   0.000000e+00   8.302448e-05   0.000000e+00 
  8.432000e+03   8.248378e-05   0.000000e+00   8.248378e-05   0.000000e+00 
  8.448000e+03   9.227936e-05   0.000000e+00   9.227936e-05   0.000000e+00 
  8.464000e+03   9.999600e-05   0.000000e+00   9.999600e-05   0.000000e+00 
  8.480000e+03   8.307780e-05   0.000000e+00   8.307780e-05   0.000000e+00 
  8.496000e+03   7.455820e-05   0.000000e+00   7.455820e-05   0.000000e+00 
  8.512000e+03   7.822488e-05   0.000000e+00   7.822488e-05   0.000000e+00 
  8.528000e+03   8.014221e-05   0.000000e+00   8.014221e-05   0.000000e+00 
  8.544000e+03   7.383295e-05   0.000000e+00   7.383295e-05   0.000000e+00 
  8.560000e+03   7.697821e-05   0.000000e+00   7.697821e-05   0.000000e+00 
  8.576000e+03   7.664615e-05   0.000000e+00   7.664615e-05   0.000000e+00 
  8.592000e+03   7.368920e-05   0.000000e+00   7.368920e-05   0.000000e+00 
  8.608000e+03   7.692702e-05   0.000000e+00   7.692702e-05   0.000000e+00 
  8.624000e+03   7.861001e-05   0.000000e+00   7.861001e-05   0.000000e+00 
  8.640000e+03   7.745613e-05   0.000000e+00   7.745613e-05   0.000000e+00 
  8.656000e+03   7.455191e-05   0.000000e+00   7.455191e-05   0.000000e+00 
  8.672000e+03   7.574820e-05   0.000000e+00   7.574820e-05   0.000000e+00 
  8.688000e+03   7.067366e-05   0.000000e+00   7.067366e-05   0.000000e+00 
  8.704000e+03   7.411571e-05   0.000000e+00   7.411571e-05   0.000000e+00 
  8.720000e+03   7.307970e-05   0.000000e+00   7.307970e-05   0.000000e+00 
  8.736000e+03   7.628081e-05   0.000000e+00   7.628081e-05   0.000000e+00 
  8.752000e+03   7.905797e-05   0.000000e+00   7.905797e-05   0.000000e+00 
  8.768000e+03   8.127110e-05   0.000000e+00   8.127110e-05   0.000000e+00 
  8.784000e+03   7.437046e-05   0.000000e+00   7.437046e-05   0.000000e+00 
  8.800000e+03   7.363544e-05   0.000000e+00   7.363544e-05   0.000000e+00 
  8.816000e+03   8.555662e-05   0.000000e+00   8.555662e-05   0.000000e+00 
  8.832000e+03   7.704584e-05   0.000000e+00   7.704584e-05   0.000000e+00 
  8.848000e+03   6.969947e-05   0.000000e+00   6.969947e-05   0.000000e+00 
  8.864000e+03   7.672878e-05   0.000000e+00   7.672878e-05   0.000000e+00 
  8.880000e+03   7.828313e-05   0.000000e+00   7.828313e-05   0.000000e+00 
  8.896000e+03   7.171756e-05   0.000000e+00   7.171756e-05   0.000000e+00 
  8.912000e+03   7.208926e-05   0.000000e+00   7.208926e-05   0.000000e+00 
  8.928000e+03   7.111247e-05   0.000000e+00   7.111247e-05   0.000000e+00 
  8.944000e+03   7.442840e-05   0.000000e+00   7.442840e-05   0.000000e+00 
  8.960000e+03   7.419979e-05   0.000000e+00   7.419979e-05   0.000000e+00 
  8.976000e+03   7.664095e-05   0.000000e+00   7.664095e-05   0.000000e+00 
  8.992000e+03   9.683976e-05   0.000000e+00   9.683976e-05   0.000000e+00 
  9.008000e+03   9.475741e-05   0.000000e+00   9.475741e-05   0.000000e+00 
  9.024000e+03   7.716253e-05   0.000000e+00   7.716253e-05   0.000000e+00 
  9.040000e+03   7.871539e-05   0.000000e+00   7.871539e-05   0.000000e+00 
  9.056000e+03   8.451872e-05   0.000000e+00   8.451872e-05   0.000000e+00 
  9.072000e+03   8.601249e-05   0.000000e+00   8.601249e-05   0.000000e+00 
  9.088000e+03   8.213004e-05   0.000000e+00   8.213004e-05   0.000000e+00 
  9.104000e+03   8.305284e-05   0.000000e+00   8.305284e-05   0.000000e+00 
  9.120000e+03   8.416596e-05   0.000000e+00   8.416596e-05   0.000000e+00 
  9.136000e+03   8.639017e-05   0.000000e+00   8.639017e-05   0.000000e+00 
  9.152000e+03   8.905453e-05   0.000000e+00   8.905453e-05   0.000000e+00 
  9.168000e+03   1.068528e-04   0.000000e+00   1.068528e-04   0.000000e+00 
  9.184000e+03   1.176957e-04   0.000000e+00   1.176957e-04   0.000000e+00 
  9.200000e+03   1.185683e-04   0.000000e+00   1.185683e-04   0.000000e+00 
  9.216000e+03   1.206009e-04   0.000000e+00   1.206009e-04   0.000000e+00 
  9.232000e+03   1.211122e-04   0.000000e+00   1.211122e-04   0.000000e+00 
  9.248000e+03   1.187595e-04   0.000000e+00   1.187595e-04   0.000000e+00 
  9.264000e+03   1.149896e-04   0.000000e+00   1.149896e-04   0.000000e+00 
  9.280000e+03   1.105554e-04   0.000000e+00   1.105554e-04   0.000000e+00 
  9.296000e+03   1.115296e-04   0.000000e+00   1.115296e-04   0.000000e+00 
  9.312000e+03   1.089175e-04   0.000000e+00   1.089175e-04   0.000000e+00 
  9.328000e+03   1.135760e-04   0.000000e+00   1.135760e-04   0.000000e+00 
  9.344000e+03   1.123048e-04   0.000000e+00   1.123048e-04   0.000000e+00 
  9.360000e+03   1.118918e-04   0.000000e+00   1.118918e-04   0.000000e+00 
  9.376000e+03   1.167376e-04   0.000000e+00   1.167376e-04   0.000000e+00 
  9.392000e+03   1.169044e-04   0.000000e+00   1.169044e-04   0.000000e+00 
  9.408000e+03   1.260816e-04   0.000000e+00   1.260816e-04   0.000000e+00 
  9.424000e+03   1.356250e-04   0.000000e+00   1.356250e-04   0.000000e+00 
  9.440000e+03   1.265433e-04   0.000000e+00   1.265433e-04   0.000000e+00 
  9.456000e+03   1.235832e-04   0.000000e+00   1.235832e-04   0.000000e+00 
  9.472000e+03   1.338086e-04   0.000000e+00   1.338086e-04   0.000000e+00 
  9.488000e+03   1.497705e-04   0.000000e+00   1.497705e-04   0.000000e+00 
  9.504000e+03   1.609197e-04   0.000000e+00   1.609197e-04   0.000000e+00 
  9.520000e+03   1.556686e-04   0.000000e+00   1.556686e-04   0.000000e+00 
  9.536000e+03   1.546077e-04   0.000000e+00   1.546077e-04   0.000000e+00 
  9.552000e+03   1.535440e-04   0.000000e+00   1.535440e-04   0.000000e+00 
  9.568000e+03   1.526549e-04   0.000000e+00   1.526549e-04   0.000000e+00 
  9.584000e+03   1.555433e-04   0.000000e+00   1.555433e-04   0.000000e+00 
  9.600000e+03   1.453622e-04   0.000000e+00   1.453622e-04   0.000000e+00 
  9.616000e+03   1.388856e-04   0.000000e+00   1.388856e-04   0.000000e+00 
  9.632000e+03   1.267561e-04   0.000000e+00   1.267561e-04   0.000000e+00 
  9.648000e+03   1.173049e-04   0.000000e+00   1.173049e-04   0.000000e+00 
  9.664000e+03   1.081859e-04   0.000000e+00   1.081859e-04   0.000000e+00 
  9.680000e+03   1.069222e-04   0.000000e+00   1.069222e-04   0.000000e+00 
  9.696000e+03   1.025954e-04   0.000000e+00   1.025954e-04   0.000000e+00 
  9.712000e+03   1.021417e-04   0.000000e+00   1.021417e-04   0.000000e+00 
  9.728000e+03   1.003416e-04   0.000000e+00   1.003416e-04   0.000000e+00 
  9.744000e+03   9.091399e-05   0.000000e+00   9.091399e-05   0.000000e+00 
  9.760000e+03   8.751520e-05   0.000000e+00   8.751520e-05   0.000000e+00 
  9.776000e+03   9.742739e-05   0.000000e+00   9.742739e-05   0.000000e+00 
  9.792000e+03   9.420743e-05   0.000000e+00   9.420743e-05   0.000000e+00 
  9.808000e+03   8.253832e-05   0.000000e+00   8.253832e-05   0.000000e+00 
  9.824000e+03   7.957806e-05   0.000000e+00   7.957806e-05   0.000000e+00 
  9.840000e+03   7.784113e-05   0.000000e+00   7.784113e-05   0.000000e+00 
  9.856000e+03   7.290800e-05   0.000000e+00   7.290800e-05   0.000000e+00 
  9.872000e+03   7.319090e-05   0.000000e+00   7.319090e-05   0.000000e+00 
  9.888000e+03   8.085390e-05   0.000000e+00   8.085390e-05   0.000000e+00 
  9.904000e+03   8.184681e-05   0.000000e+00   8.184681e-05   0.000000e+00 
  9.920000e+03   7.053337e-05   0.000000e+00   7.053337e-05   0.000000e+00 
  9.936000e+03   6.926710e-05   0.000000e+00   6.926710e-05   0.000000e+00 
  9.952000e+03   6.708698e-05   0.000000e+00   6.708698e-05   0.000000e+00 
  9.968000e+03   6.867594e-05   0.000000e+00   6.867594e-05   0.000000e+00 
  9.984000e+03   7.984952e-05   0.000000e+00   7.984952e-05   0.000000e+00 
  1.000000e+04   8.875730e-05   0.000000e+00   8.875730e-05   0.000000e+00 
  1.001600e+04   7.617781e-05   0.000000e+00   7.617781e-05   0.000000e+00 
  1.003200e+04   6.996545e-05   0.000000e+00   6.996545e-05   0.000000e+00 
  1.004800e+04   6.872565e-05   0.000000e+00   6.872565e-05   0.000000e+00 
  1.006400e+04   6.946507e-05   0.000000e+00   6.946507e-05   0.000000e+00 
  1.008000e+04   6.733101e-05   0.000000e+00   6.733101e-05   0.000000e+00 
  1.009600e+04   6.354927e-05   0.000000e+00   6.354927e-05   0.000000e+00 
  1.011200e+04   6.910127e-05   0.000000e+00   6.910127e-05   0.000000e+00 
  1.012800e+04   7.364997e-05   0.000000e+00   7.364997e-05   0.000000e+00 
  1.014400e+04   6.424801e-05   0.000000e+00   6.424801e-05   0.000000e+00 
  1.016000e+04   6.530664e-05   0.000000e+00   6.530664e-05   0.000000e+00 
  1.017600e+04   6.644644e-05   0.000000e+00   6.644644e-05   0.000000e+00 
  1.019200e+04   7.349480e-05   0.000000e+00   7.349480e-05   0.000000e+00 
  1.020800e+04   7.225884e-05   0.000000e+00   7.225884e-05   0.000000e+00 
  1.022400e+04   6.776019e-05   0.000000e+00   6.776019e-05   0.000000e+00 
  1.024000e+04   7.489368e-05   0.000000e+00   7.489368e-05   0.000000e+00 
  1.025600e+04   8.825770e-05   0.000000e+00   8.825770e-05   0.000000e+00 
  1.027200e+04   7.529782e-05   0.000000e+00   7.529782e-05   0.000000e+00 
  1.028800e+04   6.973105e-05   0.000000e+00   6.973105e-05   0.000000e+00 
  1.030400e+04   6.581616e-05   0.000000e+00   6.581616e-05   0.000000e+00 
  1.032000e+04   6.287010e-05   0.000000e+00   6.287010e-05   0.000000e+00 
  1.033600e+04   6.312858e-05   0.000000e+00   6.312858e-05   0.000000e+00 
  1.035200e+04   6.365639e-05   0.000000e+00   6.365639e-05   0.000000e+00 
  1.036800e+04   6.631212e-05   0.000000e+00   6.631212e-05   0.000000e+00 
  1.038400e+04   6.443699e-05   0.000000e+00   6.443699e-05   0.000000e+00 
  1.040000e+04   6.366813e-05   0.000000e+00   6.366813e-05   0.000000e+00 
  1.041600e+04   5.960347e-05   0.000000e+00   5.960347e-05   0.000000e+00 
  1.043200e+04   6.307015e-05   0.000000e+00   6.307015e-05   0.000000e+00 
  1.044800e+04   6.318918e-05   0.000000e+00   6.318918e-05   0.000000e+00 
  1.046400e+04   6.275505e-05   0.000000e+00   6.275505e-05   0.000000e+00 
  1.048000e+04   6.454290e-05   0.000000e+00   6.454290e-05   0.000000e+00 
  1.049600e+04   8.048767e-05   0.000000e+00   8.048767e-05   0.000000e+00 
  1.051200e+04   6.878395e-05   0.000000e+00   6.878395e-05   0.000000e+00 
  1.052800e+04   6.481971e-05   0.000000e+00   6.481971e-05   0.000000e+00 
  1.054400e+04   6.368857e-05   0.000000e+00   6.368857e-05   0.000000e+00 
  1.056000e+04   6.055236e-05   0.000000e+00   6.055236e-05   0.000000e+00 
  1.057600e+04   6.012496e-05   0.000000e+00   6.012496e-05   0.000000e+00 
  1.059200e+04   5.655907e-05   0.000000e+00   5.655907e-05   0.000000e+00 
  1.060800e+04   6.586838e-05   0.000000e+00   6.586838e-05   0.000000e+00 
  1.062400e+04   7.222007e-05   0.000000e+00   7.222007e-05   0.000000e+00 
  1.064000e+04   6.227922e-05   0.000000e+00   6.227922e-05   0.000000e+00 
  1.065600e+04   5.985631e-05   0.000000e+00   5.985631e-05   0.000000e+00 
  1.067200e+04   6.083768e-05   0.000000e+00   6.083768e-05   0.000000e+00 
  1.068800e+04   6.182538e-05   0.000000e+00   6.182538e-05   0.000000e+00 
  1.070400e+04   6.854662e-05   0.000000e+00   6.854662e-05   0.000000e+00 
  1.072000e+04   6.927331e-05   0.000000e+00   6.927331e-05   0.000000e+00 
  1.073600e+04   7.003725e-05   0.000000e+00   7.003725e-05   0.000000e+00 
  1.075200e+04   6.703789e-05   0.000000e+00   6.703789e-05   0.000000e+00 
  1.076800e+04   6.894361e-05   0.000000e+00   6.894361e-05   0.000000e+00 
  1.078400e+04   7.018947e-05   0.000000e+00   7.018947e-05   0.000000e+00 
  1.080000e+04   6.539624e-05   0.000000e+00   6.539624e-05   0.000000e+00 
  1.081600e+04   6.617347e-05   0.000000e+00   6.617347e-05   0.000000e+00 
  1.083200e+04   6.524552e-05   0.000000e+00   6.524552e-05   0.000000e+00 
  1.084800e+04   7.266640e-05   0.000000e+00   7.266640e-05   0.000000e+00 
  1.086400e+04   7.303133e-05   0.000000e+00   7.303133e-05   0.000000e+00 
  1.088000e+04   6.077341e-05   0.000000e+00   6.077341e-05   0.000000e+00 
  1.089600e+04   5.962140e-05   0.000000e+00   5.962140e-05   0.000000e+00 
  1.091200e+04   6.038811e-05   0.000000e+00   6.038811e-05   0.000000e+00 
  1.092800e+04   6.119719e-05   0.000000e+00   6.119719e-05   0.000000e+00 
  1.094400e+04   6.363960e-05   0.000000e+00   6.363960e-05   0.000000e+00 
  1.096000e+04   6.224767e-05   0.000000e+00   6.224767e-05   0.000000e+00 
  1.097600e+04   6.419343e-05   0.000000e+00   6.419343e-05   0.000000e+00 
  1.099200e+04   7.076743e-05   0.000000e+00   7.076743e-05   0.000000e+00 
  1.100800e+04   7.568384e-05   0.000000e+00   7.568384e-05   0.000000e+00 
  1.102400e+04   6.663048e-05   0.000000e+00   6.663048e-05   0.000000e+00 
  1.104000e+04   6.299810e-05   0.000000e+00   6.299810e-05   0.000000e+00 
  1.105600e+04   6.238318e-05   0.000000e+00   6.238318e-05   0.000000e+00 
  1.107200e+04   6.554274e-05   0.000000e+00   6.554274e-05   0.000000e+00 
  1.108800e+04   6.662167e-05   0.000000e+00   6.662167e-05   0.000000e+00 
  1.110400e+04   6.676984e-05   0.000000e+00   6.676984e-05   0.000000e+00 
  1.112000e+04   6.281946e-05   0.000000e+00   6.281946e-05   0.000000e+00 
  1.113600e+04   6.556768e-05   0.000000e+00   6.556768e-05   0.000000e+00 
  1.115200e+04   6.542812e-05   0.000000e+00   6.542812e-05   0.000000e+00 
  1.116800e+04   7.090935e-05   0.000000e+00   7.090935e-05   0.000000e+00 
  1.118400e+04   6.611624e-05   0.000000e+00   6.611624e-05   0.000000e+00 
  1.120000e+04   6.203837e-05   0.000000e+00   6.203837e-05   0.000000e+00 
  1.121600e+04   6.472485e-05   0.000000e+00   6.472485e-05   0.000000e+00 
  1.123200e+04   7.010083e-05   0.000000e+00   7.010083e-05   0.000000e+00 
  1.124800e+04   7.191661e-05   0.000000e+00   7.191661e-05   0.000000e+00 
  1.126400e+04   6.992195e-05   0.000000e+00   6.992195e-05   0.000000e+00 
  1.128000e+04   7.185716e-05   0.000000e+00   7.185716e-05   0.000000e+00 
  1.129600e+04   6.829263e-05   0.000000e+00   6.829263e-05   0.000000e+00 
  1.131200e+04   6.507467e-05   0.000000e+00   6.507467e-05   0.000000e+00 
  1.132800e+04   7.161651e-05   0.000000e+00   7.161651e-05   0.000000e+00 
  1.134400e+04   7.363424e-05   0.000000e+00   7.363424e-05   0.000000e+00 
  1.136000e+04   6.646558e-05   0.000000e+00   6.646558e-05   0.000000e+00 
  1.137600e+04   6.545961e-05   0.000000e+00   6.545961e-05   0.000000e+00 
  1.139200e+04   6.191013e-05   0.000000e+00   6.191013e-05   0.000000e+00 
  1.140800e+04   6.367399e-05   0.000000e+00   6.367399e-05   0.000000e+00 
  1.142400e+04   6.576438e-05   0.000000e+00   6.576438e-05   0.000000e+00 
  1.144000e+04   6.236745e-05   0.000000e+00   6.236745e-05   0.000000e+00 
  1.145600e+04   7.094592e-05   0.000000e+00   7.094592e-05   0.000000e+00 
  1.147200e+04   6.920587e-05   0.000000e+00   6.920587e-05   0.000000e+00 
  1.148800e+04   7.026017e-05   0.000000e+00   7.026017e-05   0.000000e+00 
  1.150400e+04   7.248945e-05   0.000000e+00   7.248945e-05   0.000000e+00 
  1.152000e+04   6.930593e-05   0.000000e+00   6.930593e-05   0.000000e+00 
  1.153600e+04   6.585977e-05   0.000000e+00   6.585977e-05   0.000000e+00 
  1.155200e+04   6.720063e-05   0.000000e+00   6.720063e-05   0.000000e+00 
  1.156800e+04   6.975636e-05   0.000000e+00   6.975636e-05   0.000000e+00 
  1.158400e+04   6.878815e-05   0.000000e+00   6.878815e-05   0.000000e+00 
  1.160000e+04   6.455038e-05   0.000000e+00   6.455038e-05   0.000000e+00 
  1.161600e+04   6.815927e-05   0.000000e+00   6.815927e-05   0.000000e+00 
  1.163200e+04   6.535912e-05   0.000000e+00   6.535912e-05   0.000000e+00 
  1.164800e+04   6.544786e-05   0.000000e+00   6.544786e-05   0.000000e+00 
  1.166400e+04   6.842201e-05   0.000000e+00   6.842201e-05   0.000000e+00 
  1.168000e+04   6.932933e-05   0.000000e+00   6.932933e-05   0.000000e+00 
  1.169600e+04   7.820367e-05   0.000000e+00   7.820367e-05   0.000000e+00 
  1.171200e+04   6.898495e-05   0.000000e+00   6.898495e-05   0.000000e+00 
  1.172800e+04   6.680496e-05   0.000000e+00   6.680496e-05   0.000000e+00 
  1.174400e+04   6.422489e-05   0.000000e+00   6.422489e-05   0.000000e+00 
  1.176000e+04   6.704606e-05   0.000000e+00   6.704606e-05   0.000000e+00 
  1.177600e+04   6.512481e-05   0.000000e+00   6.512481e-05   0.000000e+00 
  1.179200e+04   6.697515e-05   0.000000e+00   6.697515e-05   0.000000e+00 
  1.180800e+04   6.635199e-05   0.000000e+00   6.635199e-05   0.000000e+00 
  1.182400e+04   6.106061e-05   0.000000e+00   6.106061e-05   0.000000e+00 
  1.184000e+04   6.208332e-05   0.000000e+00   6.208332e-05   0.000000e+00 
  1.185600e+04   6.256446e-05   0.000000e+00   6.256446e-05   0.000000e+00 
  1.187200e+04   6.134465e-05   0.000000e+00   6.134465e-05   0.000000e+00 
  1.188800e+04   6.195225e-05   0.000000e+00   6.195225e-05   0.000000e+00 
  1.190400e+04   6.103394e-05   0.000000e+00   6.103394e-05   0.000000e+00 
  1.192000e+04   6.253149e-05   0.000000e+00   6.253149e-05   0.000000e+00 
  1.193600e+04   6.496020e-05   0.000000e+00   6.496020e-05   0.000000e+00 
  1.195200e+04   6.292440e-05   0.000000e+00   6.292440e-05   0.000000e+00 
  1.196800e+04   6.706096e-05   0.000000e+00   6.706096e-05   0.000000e+00 
  1.198400e+04   6.855432e-05   0.000000e+00   6.855432e-05   0.000000e+00 
  1.200000e+04   7.188441e-05   0.000000e+00   7.188441e-05   0.000000e+00 
  1.201600e+04   6.987990e-05   0.000000e+00   6.987990e-05   0.000000e+00 
  1.203200e+04   6.588088e-05   0.000000e+00   6.588088e-05   0.000000e+00 
  1.204800e+04   6.275967e-05   0.000000e+00   6.275967e-05   0.000000e+00 
  1.206400e+04   6.476438e-05   0.000000e+00   6.476438e-05   0.000000e+00 
  1.208000e+04   6.542376e-05   0.000000e+00   6.542376e-05   0.000000e+00 
  1.209600e+04   6.448964e-05   0.000000e+00   6.448964e-05   0.000000e+00 
  1.211200e+04   6.604910e-05   0.000000e+00   6.604910e-05   0.000000e+00 
  1.212800e+04   6.777034e-05   0.000000e+00   6.777034e-05   0.000000e+00 
  1.214400e+04   6.600517e-05   0.000000e+00   6.600517e-05   0.000000e+00 
  1.216000e+04   6.853430e-05   0.000000e+00   6.853430e-05   0.000000e+00 
  1.217600e+04   7.339567e-05   0.000000e+00   7.339567e-05   0.000000e+00 
  1.219200e+04   7.334130e-05   0.000000e+00   7.334130e-05   0.000000e+00 
  1.220800e+04   7.608649e-05   0.000000e+00   7.608649e-05   0.000000e+00 
  1.222400e+04   7.786603e-05   0.000000e+00   7.786603e-05   0.000000e+00 
  1.224000e+04   7.882700e-05   0.000000e+00   7.882700e-05   0.000000e+00 
  1.225600e+04   8.668895e-05   0.000000e+00   8.668895e-05   0.000000e+00 
  1.227200e+04   9.267454e-05   0.000000e+00   9.267454e-05   0.000000e+00 
  1.228800e+04   9.524656e-05   0.000000e+00   9.524656e-05   0.000000e+00 
  1.230400e+04   9.380134e-05   0.000000e+00   9.380134e-05   0.000000e+00 
  1.232000e+04   8.631031e-05   0.000000e+00   8.631031e-05   0.000000e+00 
  1.233600e+04   8.394093e-05   0.000000e+00   8.394093e-05   0.000000e+00 
  1.235200e+04   7.942315e-05   0.000000e+00   7.942315e-05   0.000000e+00 
  1.236800e+04   7.982842e-05   0.000000e+00   7.982842e-05   0.000000e+00 
  1.238400e+04   7.921381e-05   0.000000e+00   7.921381e-05   0.000000e+00 
  1.240000e+04   7.640899e-05   0.000000e+00   7.640899e-05   0.000000e+00 
  1.241600e+04   7.539718e-05   0.000000e+00   7.539718e-05   0.000000e+00 
  1.243200e+04   7.879947e-05   0.000000e+00   7.879947e-05   0.000000e+00 
  1.244800e+04   7.490612e-05   0.000000e+00   7.490612e-05   0.000000e+00 
  1.246400e+04   7.025585e-05   0.000000e+00   7.025585e-05   0.000000e+00 
  1.248000e+04   7.471696e-05   0.000000e+00   7.471696e-05   0.000000e+00 
  1.249600e+04   7.359395e-05   0.000000e+00   7.359395e-05   0.000000e+00 
  1.251200e+04   7.356432e-05   0.000000e+00   7.356432e-05   0.000000e+00 
  1.252800e+04   7.686653e-05   0.000000e+00   7.686653e-05   0.000000e+00 
  1.254400e+04   7.925805e-05   0.000000e+00   7.925805e-05   0.000000e+00 
  1.256000e+04   7.569721e-05   0.000000e+00   7.569721e-05   0.000000e+00 
  1.257600e+04   7.497313e-05   0.000000e+00   7.497313e-05   0.000000e+00 
  1.259200e+04   7.824886e-05   0.000000e+00   7.824886e-05   0.000000e+00 
  1.260800e+04   7.716569e-05   0.000000e+00   7.716569e-05   0.000000e+00 
  1.262400e+04   7.522973e-05   0.000000e+00   7.522973e-05   0.000000e+00 
  1.264000e+04   7.805521e-05   0.000000e+00   7.805521e-05   0.000000e+00 
  1.265600e+04   7.811990e-05   0.000000e+00   7.811990e-05   0.000000e+00 
  1.267200e+04   7.210395e-05   0.000000e+00   7.210395e-05   0.000000e+00 
  1.268800e+04   7.739820e-05   0.000000e+00   7.739820e-05   0.000000e+00 
  1.270400e+04   7.739313e-05   0.000000e+00   7.739313e-05   0.000000e+00 
  1.272000e+04   7.452408e-05   0.000000e+00   7.452408e-05   0.000000e+00 
  1.273600e+04   7.594178e-05   0.000000e+00   7.594178e-05   0.000000e+00 
  1.275200e+04   7.916096e-05   0.000000e+00   7.916096e-05   0.000000e+00 
  1.276800e+04   7.655338e-05   0.000000e+00   7.655338e-05   0.000000e+00 
  1.278400e+04   7.512420e-05   0.000000e+00   7.512420e-05   0.000000e+00 
  1.280000e+04   7.324533e-05   0.000000e+00   7.324533e-05   0.000000e+00 
