  0.000000e+00   9.831240e-07   0.000000e+00   9.831240e-07   0.000000e+00 
  1.280000e+02   9.433618e-07   0.000000e+00   9.433618e-07   0.000000e+00 
  2.560000e+02   1.717581e-06   0.000000e+00   1.717581e-06   0.000000e+00 
  3.840000e+02   3.220922e-06   0.000000e+00   3.220922e-06   0.000000e+00 
  5.120000e+02   5.969526e-06   0.000000e+00   5.969526e-06   0.000000e+00 
  6.400000e+02   5.983093e-06   0.000000e+00   5.983093e-06   0.000000e+00 
  7.680000e+02   8.724963e-06   0.000000e+00   8.724963e-06   0.000000e+00 
  8.960000e+02   1.077974e-05   0.000000e+00   1.077974e-05   0.000000e+00 
  1.024000e+03   1.182804e-05   0.000000e+00   1.182804e-05   0.000000e+00 
  1.152000e+03   1.062708e-05   0.000000e+00   1.062708e-05   0.000000e+00 
  1.280000e+03   1.064232e-05   0.000000e+00   1.064232e-05   0.000000e+00 
  1.408000e+03   1.117102e-05   0.000000e+00   1.117102e-05   0.000000e+00 
  1.536000e+03   1.178016e-05   0.000000e+00   1.178016e-05   0.000000e+00 
  1.664000e+03   1.008786e-05   0.000000e+00   1.008786e-05   0.000000e+00 
  1.792000e+03   1.177236e-05   0.000000e+00   1.177236e-05   0.000000e+00 
  1.920000e+03   1.547036e-05   0.000000e+00   1.547036e-05   0.000000e+00 
  2.048000e+03   1.392398e-05   0.000000e+00   1.392398e-05   0.000000e+00 
  2.176000e+03   1.525722e-05   0.000000e+00   1.525722e-05   0.000000e+00 
  2.304000e+03   1.813126e-05   0.000000e+00   1.813126e-05   0.000000e+00 
  2.432000e+03   1.738132e-05   0.000000e+00   1.738132e-05   0.000000e+00 
  2.560000e+03   2.508125e-05   0.000000e+00   2.508125e-05   0.000000e+00 
  2.688000e+03   3.387922e-05   0.000000e+00   3.387922e-05   0.000000e+00 
  2.816000e+03   3.360429e-05   0.000000e+00   3.360429e-05   0.000000e+00 
  2.944000e+03   2.732349e-05   0.000000e+00   2.732349e-05   0.000000e+00 
  3.072000e+03   2.406975e-05   0.000000e+00   2.406975e-05   0.000000e+00 
  3.200000e+03   2.251953e-05   0.000000e+00   2.251953e-05   0.000000e+00 
  3.328000e+03   2.266157e-05   0.000000e+00   2.266157e-05   0.000000e+00 
  3.456000e+03   2.179721e-05   0.000000e+00   2.179721e-05   0.000000e+00 
  3.584000e+03   2.255218e-05   0.000000e+00   2.255218e-05   0.000000e+00 
  3.712000e+03   2.562857e-05   0.000000e+00   2.562857e-05   0.000000e+00 
  3.840000e+03   2.952606e-05   0.000000e+00   2.952606e-05   0.000000e+00 
  3.968000e+03   3.635020e-05   0.000000e+00   3.635020e-05   0.000000e+00 
  4.096000e+03   4.539266e-05   0.000000e+00   4.539266e-05   0.000000e+00 
  4.224000e+03   4.138671e-05   0.000000e+00   4.138671e-05   0.000000e+00 
  4.352000e+03   3.643445e-05   0.000000e+00   3.643445e-05   0.000000e+00 
  4.480000e+03   3.401475e-05   0.000000e+00   3.401475e-05   0.000000e+00 
  4.608000e+03   3.206981e-05   0.000000e+00   3.206981e-05   0.000000e+00 
  4.736000e+03   3.009784e-05   0.000000e+00   3.009784e-05   0.000000e+00 
  4.864000e+03   3.108120e-05   0.000000e+00   3.108120e-05   0.000000e+00 
  4.992000e+03   3.863007e-05   0.000000e+00   3.863007e-05   0.000000e+00 
  5.120000e+03   4.613609e-05   0.000000e+00   4.613609e-05   0.000000e+00 
  5.248000e+03   3.981042e-05   0.000000e+00   3.981042e-05   0.000000e+00 
  5.376000e+03   3.336630e-05   0.000000e+00   3.336630e-05   0.000000e+00 
  5.504000e+03   3.169385e-05   0.000000e+00   3.169385e-05   0.000000e+00 
  5.632000e+03   2.873917e-05   0.000000e+00   2.873917e-05   0.000000e+00 
  5.760000e+03   2.545364e-05   0.000000e+00   2.545364e-05   0.000000e+00 
  5.888000e+03   2.571145e-05   0.000000e+00   2.571145e-05   0.000000e+00 
  6.016000e+03   2.963972e-05   0.000000e+00   2.963972e-05   0.000000e+00 
  6.144000e+03   2.879619e-05   0.000000e+00   2.879619e-05   0.000000e+00 
  6.272000e+03   2.682418e-05   0.000000e+00   2.682418e-05   0.000000e+00 
  6.400000e+03   2.453896e-05   0.000000e+00   2.453896e-05   0.000000e+00 
  6.528000e+03   2.189528e-05   0.000000e+00   2.189528e-05   0.000000e+00 
  6.656000e+03   2.081247e-05   0.000000e+00   2.081247e-05   0.000000e+00 
  6.784000e+03   2.021848e-05   0.000000e+00   2.021848e-05   0.000000e+00 
  6.912000e+03   2.085828e-05   0.000000e+00   2.085828e-05   0.000000e+00 
  7.040000e+03   2.207264e-05   0.000000e+00   2.207264e-05   0.000000e+00 
  7.168000e+03   2.309333e-05   0.000000e+00   2.309333e-05   0.000000e+00 
  7.296000e+03   2.215589e-05   0.000000e+00   2.215589e-05   0.000000e+00 
  7.424000e+03   2.219768e-05   0.000000e+00   2.219768e-05   0.000000e+00 
  7.552000e+03   2.957613e-05   0.000000e+00   2.957613e-05   0.000000e+00 
  7.680000e+03   3.396200e-05   0.000000e+00   3.396200e-05   0.000000e+00 
  7.808000e+03   3.223338e-05   0.000000e+00   3.223338e-05   0.000000e+00 
  7.936000e+03   3.111173e-05   0.000000e+00   3.111173e-05   0.000000e+00 
  8.064000e+03   2.620822e-05   0.000000e+00   2.620822e-05   0.000000e+00 
  8.192000e+03   2.898783e-05   0.000000e+00   2.898783e-05   0.000000e+00 
  8.320000e+03   2.667339e-05   0.000000e+00   2.667339e-05   0.000000e+00 
  8.448000e+03   2.233854e-05   0.000000e+00   2.233854e-05   0.000000e+00 
  8.576000e+03   2.069386e-05   0.000000e+00   2.069386e-05   0.000000e+00 
  8.704000e+03   2.067567e-05   0.000000e+00   2.067567e-05   0.000000e+00 
  8.832000e+03   2.094663e-05   0.000000e+00   2.094663e-05   0.000000e+00 
  8.960000e+03   2.101259e-05   0.000000e+00   2.101259e-05   0.000000e+00 
  9.088000e+03   2.366914e-05   0.000000e+00   2.366914e-05   0.000000e+00 
  9.216000e+03   3.100558e-05   0.000000e+00   3.100558e-05   0.000000e+00 
  9.344000e+03   3.293067e-05   0.000000e+00   3.293067e-05   0.000000e+00 
  9.472000e+03   3.602256e-05   0.000000e+00   3.602256e-05   0.000000e+00 
  9.600000e+03   3.512161e-05   0.000000e+00   3.512161e-05   0.000000e+00 
  9.728000e+03   2.690540e-05   0.000000e+00   2.690540e-05   0.000000e+00 
  9.856000e+03   2.131129e-05   0.000000e+00   2.131129e-05   0.000000e+00 
  9.984000e+03   1.935160e-05   0.000000e+00   1.935160e-05   0.000000e+00 
  1.011200e+04   1.841190e-05   0.000000e+00   1.841190e-05   0.000000e+00 
  1.024000e+04   1.878886e-05   0.000000e+00   1.878886e-05   0.000000e+00 
  1.036800e+04   1.770616e-05   0.000000e+00   1.770616e-05   0.000000e+00 
  1.049600e+04   1.713707e-05   0.000000e+00   1.713707e-05   0.000000e+00 
  1.062400e+04   1.737938e-05   0.000000e+00   1.737938e-05   0.000000e+00 
  1.075200e+04   1.765507e-05   0.000000e+00   1.765507e-05   0.000000e+00 
  1.088000e+04   1.757315e-05   0.000000e+00   1.757315e-05   0.000000e+00 
  1.100800e+04   1.775778e-05   0.000000e+00   1.775778e-05   0.000000e+00 
  1.113600e+04   1.814548e-05   0.000000e+00   1.814548e-05   0.000000e+00 
  1.126400e+04   1.838359e-05   0.000000e+00   1.838359e-05   0.000000e+00 
  1.139200e+04   1.848659e-05   0.000000e+00   1.848659e-05   0.000000e+00 
  1.152000e+04   1.893542e-05   0.000000e+00   1.893542e-05   0.000000e+00 
  1.164800e+04   1.949449e-05   0.000000e+00   1.949449e-05   0.000000e+00 
  1.177600e+04   1.953267e-05   0.000000e+00   1.953267e-05   0.000000e+00 
  1.190400e+04   1.873496e-05   0.000000e+00   1.873496e-05   0.000000e+00 
  1.203200e+04   2.054625e-05   0.000000e+00   2.054625e-05   0.000000e+00 
  1.216000e+04   2.287659e-05   0.000000e+00   2.287659e-05   0.000000e+00 
  1.228800e+04   2.422531e-05   0.000000e+00   2.422531e-05   0.000000e+00 
  1.241600e+04   2.390907e-05   0.000000e+00   2.390907e-05   0.000000e+00 
  1.254400e+04   2.297725e-05   0.000000e+00   2.297725e-05   0.000000e+00 
  1.267200e+04   2.123840e-05   0.000000e+00   2.123840e-05   0.000000e+00 
  1.280000e+04   2.107403e-05   0.000000e+00   2.107403e-05   0.000000e+00 
  1.292800e+04   2.180264e-05   0.000000e+00   2.180264e-05   0.000000e+00 
  1.305600e+04   2.269781e-05   0.000000e+00   2.269781e-05   0.000000e+00 
  1.318400e+04   2.513739e-05   0.000000e+00   2.513739e-05   0.000000e+00 
  1.331200e+04   3.148754e-05   0.000000e+00   3.148754e-05   0.000000e+00 
  1.344000e+04   9.153434e-05   0.000000e+00   9.153434e-05   0.000000e+00 
  1.356800e+04   1.310870e-04   0.000000e+00   1.310870e-04   0.000000e+00 
  1.369600e+04   6.915348e-05   0.000000e+00   6.915348e-05   0.000000e+00 
  1.382400e+04   6.000608e-05   0.000000e+00   6.000608e-05   0.000000e+00 
  1.395200e+04   6.660292e-05   0.000000e+00   6.660292e-05   0.000000e+00 
  1.408000e+04   6.976326e-05   0.000000e+00   6.976326e-05   0.000000e+00 
  1.420800e+04   1.114899e-04   0.000000e+00   1.114899e-04   0.000000e+00 
  1.433600e+04   1.219346e-04   0.000000e+00   1.219346e-04   0.000000e+00 
  1.446400e+04   5.450875e-05   0.000000e+00   5.450875e-05   0.000000e+00 
  1.459200e+04   3.813483e-05   0.000000e+00   3.813483e-05   0.000000e+00 
  1.472000e+04   3.693265e-05   0.000000e+00   3.693265e-05   0.000000e+00 
  1.484800e+04   3.770889e-05   0.000000e+00   3.770889e-05   0.000000e+00 
  1.497600e+04   3.925589e-05   0.000000e+00   3.925589e-05   0.000000e+00 
  1.510400e+04   4.166214e-05   0.000000e+00   4.166214e-05   0.000000e+00 
  1.523200e+04   3.412045e-05   0.000000e+00   3.412045e-05   0.000000e+00 
  1.536000e+04   3.090224e-05   0.000000e+00   3.090224e-05   0.000000e+00 
  1.548800e+04   3.483903e-05   0.000000e+00   3.483903e-05   0.000000e+00 
  1.561600e+04   5.885357e-05   0.000000e+00   5.885357e-05   0.000000e+00 
  1.574400e+04   6.779444e-05   0.000000e+00   6.779444e-05   0.000000e+00 
  1.587200e+04   3.564634e-05   0.000000e+00   3.564634e-05   0.000000e+00 
  1.600000e+04   2.313949e-05   0.000000e+00   2.313949e-05   0.000000e+00 
  1.612800e+04   2.219683e-05   0.000000e+00   2.219683e-05   0.000000e+00 
  1.625600e+04   2.117227e-05   0.000000e+00   2.117227e-05   0.000000e+00 
  1.638400e+04   2.054483e-05   0.000000e+00   2.054483e-05   0.000000e+00 
  1.651200e+04   1.878398e-05   0.000000e+00   1.878398e-05   0.000000e+00 
  1.664000e+04   1.805060e-05   0.000000e+00   1.805060e-05   0.000000e+00 
  1.676800e+04   1.742151e-05   0.000000e+00   1.742151e-05   0.000000e+00 
  1.689600e+04   1.535205e-05   0.000000e+00   1.535205e-05   0.000000e+00 
  1.702400e+04   1.428438e-05   0.000000e+00   1.428438e-05   0.000000e+00 
  1.715200e+04   1.618365e-05   0.000000e+00   1.618365e-05   0.000000e+00 
  1.728000e+04   1.543196e-05   0.000000e+00   1.543196e-05   0.000000e+00 
  1.740800e+04   1.665820e-05   0.000000e+00   1.665820e-05   0.000000e+00 
  1.753600e+04   1.481737e-05   0.000000e+00   1.481737e-05   0.000000e+00 
  1.766400e+04   1.308348e-05   0.000000e+00   1.308348e-05   0.000000e+00 
  1.779200e+04   1.295647e-05   0.000000e+00   1.295647e-05   0.000000e+00 
  1.792000e+04   1.343401e-05   0.000000e+00   1.343401e-05   0.000000e+00 
  1.804800e+04   1.494539e-05   0.000000e+00   1.494539e-05   0.000000e+00 
  1.817600e+04   1.480401e-05   0.000000e+00   1.480401e-05   0.000000e+00 
  1.830400e+04   1.561305e-05   0.000000e+00   1.561305e-05   0.000000e+00 
  1.843200e+04   1.682671e-05   0.000000e+00   1.682671e-05   0.000000e+00 
  1.856000e+04   1.954871e-05   0.000000e+00   1.954871e-05   0.000000e+00 
  1.868800e+04   1.722643e-05   0.000000e+00   1.722643e-05   0.000000e+00 
  1.881600e+04   1.566235e-05   0.000000e+00   1.566235e-05   0.000000e+00 
  1.894400e+04   1.487812e-05   0.000000e+00   1.487812e-05   0.000000e+00 
  1.907200e+04   1.615657e-05   0.000000e+00   1.615657e-05   0.000000e+00 
  1.920000e+04   1.607748e-05   0.000000e+00   1.607748e-05   0.000000e+00 
  1.932800e+04   1.664739e-05   0.000000e+00   1.664739e-05   0.000000e+00 
  1.945600e+04   1.598063e-05   0.000000e+00   1.598063e-05   0.000000e+00 
  1.958400e+04   1.874596e-05   0.000000e+00   1.874596e-05   0.000000e+00 
  1.971200e+04   3.180686e-05   0.000000e+00   3.180686e-05   0.000000e+00 
  1.984000e+04   4.137762e-05   0.000000e+00   4.137762e-05   0.000000e+00 
  1.996800e+04   4.264604e-05   0.000000e+00   4.264604e-05   0.000000e+00 
  2.009600e+04   5.481715e-05   0.000000e+00   5.481715e-05   0.000000e+00 
  2.022400e+04   4.750910e-05   0.000000e+00   4.750910e-05   0.000000e+00 
  2.035200e+04   3.738354e-05   0.000000e+00   3.738354e-05   0.000000e+00 
  2.048000e+04   2.750153e-05   0.000000e+00   2.750153e-05   0.000000e+00 
  2.060800e+04   2.408528e-05   0.000000e+00   2.408528e-05   0.000000e+00 
  2.073600e+04   2.127626e-05   0.000000e+00   2.127626e-05   0.000000e+00 
  2.086400e+04   2.159476e-05   0.000000e+00   2.159476e-05   0.000000e+00 
  2.099200e+04   2.293468e-05   0.000000e+00   2.293468e-05   0.000000e+00 
  2.112000e+04   2.282297e-05   0.000000e+00   2.282297e-05   0.000000e+00 
  2.124800e+04   2.207179e-05   0.000000e+00   2.207179e-05   0.000000e+00 
  2.137600e+04   2.086317e-05   0.000000e+00   2.086317e-05   0.000000e+00 
  2.150400e+04   1.922443e-05   0.000000e+00   1.922443e-05   0.000000e+00 
  2.163200e+04   1.735217e-05   0.000000e+00   1.735217e-05   0.000000e+00 
  2.176000e+04   1.598288e-05   0.000000e+00   1.598288e-05   0.000000e+00 
  2.188800e+04   1.477996e-05   0.000000e+00   1.477996e-05   0.000000e+00 
  2.201600e+04   1.367719e-05   0.000000e+00   1.367719e-05   0.000000e+00 
  2.214400e+04   1.337615e-05   0.000000e+00   1.337615e-05   0.000000e+00 
  2.227200e+04   1.286008e-05   0.000000e+00   1.286008e-05   0.000000e+00 
  2.240000e+04   1.285433e-05   0.000000e+00   1.285433e-05   0.000000e+00 
  2.252800e+04   1.286864e-05   0.000000e+00   1.286864e-05   0.000000e+00 
  2.265600e+04   1.284948e-05   0.000000e+00   1.284948e-05   0.000000e+00 
  2.278400e+04   1.278386e-05   0.000000e+00   1.278386e-05   0.000000e+00 
  2.291200e+04   1.207154e-05   0.000000e+00   1.207154e-05   0.000000e+00 
  2.304000e+04   1.214909e-05   0.000000e+00   1.214909e-05   0.000000e+00 
  2.316800e+04   1.240544e-05   0.000000e+00   1.240544e-05   0.000000e+00 
  2.329600e+04   1.261715e-05   0.000000e+00   1.261715e-05   0.000000e+00 
  2.342400e+04   1.286714e-05   0.000000e+00   1.286714e-05   0.000000e+00 
  2.355200e+04   1.369756e-05   0.000000e+00   1.369756e-05   0.000000e+00 
  2.368000e+04   1.396537e-05   0.000000e+00   1.396537e-05   0.000000e+00 
  2.380800e+04   1.320225e-05   0.000000e+00   1.320225e-05   0.000000e+00 
  2.393600e+04   1.250719e-05   0.000000e+00   1.250719e-05   0.000000e+00 
  2.406400e+04   1.125130e-05   0.000000e+00   1.125130e-05   0.000000e+00 
  2.419200e+04   1.063848e-05   0.000000e+00   1.063848e-05   0.000000e+00 
  2.432000e+04   1.051153e-05   0.000000e+00   1.051153e-05   0.000000e+00 
  2.444800e+04   1.255369e-05   0.000000e+00   1.255369e-05   0.000000e+00 
  2.457600e+04   1.554075e-05   0.000000e+00   1.554075e-05   0.000000e+00 
  2.470400e+04   1.451581e-05   0.000000e+00   1.451581e-05   0.000000e+00 
  2.483200e+04   1.008127e-05   0.000000e+00   1.008127e-05   0.000000e+00 
  2.496000e+04   8.632652e-06   0.000000e+00   8.632652e-06   0.000000e+00 
  2.508800e+04   8.608182e-06   0.000000e+00   8.608182e-06   0.000000e+00 
  2.521600e+04   8.761460e-06   0.000000e+00   8.761460e-06   0.000000e+00 
  2.534400e+04   9.194378e-06   0.000000e+00   9.194378e-06   0.000000e+00 
  2.547200e+04   8.957062e-06   0.000000e+00   8.957062e-06   0.000000e+00 
  2.560000e+04   9.408134e-06   0.000000e+00   9.408134e-06   0.000000e+00 
  2.572800e+04   1.331264e-05   0.000000e+00   1.331264e-05   0.000000e+00 
  2.585600e+04   2.864313e-05   0.000000e+00   2.864313e-05   0.000000e+00 
  2.598400e+04   3.987209e-05   0.000000e+00   3.987209e-05   0.000000e+00 
  2.611200e+04   3.009851e-05   0.000000e+00   3.009851e-05   0.000000e+00 
  2.624000e+04   1.200141e-05   0.000000e+00   1.200141e-05   0.000000e+00 
  2.636800e+04   8.917747e-06   0.000000e+00   8.917747e-06   0.000000e+00 
  2.649600e+04   8.877867e-06   0.000000e+00   8.877867e-06   0.000000e+00 
  2.662400e+04   1.022068e-05   0.000000e+00   1.022068e-05   0.000000e+00 
  2.675200e+04   1.100545e-05   0.000000e+00   1.100545e-05   0.000000e+00 
  2.688000e+04   1.225355e-05   0.000000e+00   1.225355e-05   0.000000e+00 
  2.700800e+04   3.770400e-05   0.000000e+00   3.770400e-05   0.000000e+00 
  2.713600e+04   4.382369e-05   0.000000e+00   4.382369e-05   0.000000e+00 
  2.726400e+04   2.374447e-05   0.000000e+00   2.374447e-05   0.000000e+00 
  2.739200e+04   2.245576e-05   0.000000e+00   2.245576e-05   0.000000e+00 
  2.752000e+04   1.604684e-05   0.000000e+00   1.604684e-05   0.000000e+00 
  2.764800e+04   1.030144e-05   0.000000e+00   1.030144e-05   0.000000e+00 
  2.777600e+04   1.007824e-05   0.000000e+00   1.007824e-05   0.000000e+00 
  2.790400e+04   1.137232e-05   0.000000e+00   1.137232e-05   0.000000e+00 
  2.803200e+04   1.293582e-05   0.000000e+00   1.293582e-05   0.000000e+00 
  2.816000e+04   1.283372e-05   0.000000e+00   1.283372e-05   0.000000e+00 
  2.828800e+04   1.142866e-05   0.000000e+00   1.142866e-05   0.000000e+00 
  2.841600e+04   2.012418e-05   0.000000e+00   2.012418e-05   0.000000e+00 
  2.854400e+04   5.150296e-05   0.000000e+00   5.150296e-05   0.000000e+00 
  2.867200e+04   3.980556e-05   0.000000e+00   3.980556e-05   0.000000e+00 
  2.880000e+04   1.078819e-05   0.000000e+00   1.078819e-05   0.000000e+00 
  2.892800e+04   8.617347e-06   0.000000e+00   8.617347e-06   0.000000e+00 
  2.905600e+04   7.792661e-06   0.000000e+00   7.792661e-06   0.000000e+00 
  2.918400e+04   7.029856e-06   0.000000e+00   7.029856e-06   0.000000e+00 
  2.931200e+04   7.179853e-06   0.000000e+00   7.179853e-06   0.000000e+00 
  2.944000e+04   7.239049e-06   0.000000e+00   7.239049e-06   0.000000e+00 
  2.956800e+04   7.256065e-06   0.000000e+00   7.256065e-06   0.000000e+00 
  2.969600e+04   8.479718e-06   0.000000e+00   8.479718e-06   0.000000e+00 
  2.982400e+04   9.033033e-06   0.000000e+00   9.033033e-06   0.000000e+00 
  2.995200e+04   8.154439e-06   0.000000e+00   8.154439e-06   0.000000e+00 
  3.008000e+04   7.910610e-06   0.000000e+00   7.910610e-06   0.000000e+00 
  3.020800e+04   7.674943e-06   0.000000e+00   7.674943e-06   0.000000e+00 
  3.033600e+04   8.236693e-06   0.000000e+00   8.236693e-06   0.000000e+00 
  3.046400e+04   9.197051e-06   0.000000e+00   9.197051e-06   0.000000e+00 
  3.059200e+04   1.480408e-05   0.000000e+00   1.480408e-05   0.000000e+00 
  3.072000e+04   2.723888e-05   0.000000e+00   2.723888e-05   0.000000e+00 
  3.084800e+04   2.029526e-05   0.000000e+00   2.029526e-05   0.000000e+00 
  3.097600e+04   9.369269e-06   0.000000e+00   9.369269e-06   0.000000e+00 
  3.110400e+04   8.587059e-06   0.000000e+00   8.587059e-06   0.000000e+00 
  3.123200e+04   1.190853e-05   0.000000e+00   1.190853e-05   0.000000e+00 
  3.136000e+04   1.015852e-05   0.000000e+00   1.015852e-05   0.000000e+00 
  3.148800e+04   1.018666e-05   0.000000e+00   1.018666e-05   0.000000e+00 
  3.161600e+04   8.837080e-06   0.000000e+00   8.837080e-06   0.000000e+00 
  3.174400e+04   1.025948e-05   0.000000e+00   1.025948e-05   0.000000e+00 
  3.187200e+04   9.817191e-06   0.000000e+00   9.817191e-06   0.000000e+00 
  3.200000e+04   2.797680e-05   0.000000e+00   2.797680e-05   0.000000e+00 
  3.212800e+04   4.553455e-05   0.000000e+00   4.553455e-05   0.000000e+00 
  3.225600e+04   2.303458e-05   0.000000e+00   2.303458e-05   0.000000e+00 
  3.238400e+04   9.391541e-06   0.000000e+00   9.391541e-06   0.000000e+00 
  3.251200e+04   7.973416e-06   0.000000e+00   7.973416e-06   0.000000e+00 
  3.264000e+04   7.643592e-06   0.000000e+00   7.643592e-06   0.000000e+00 
  3.276800e+04   7.635821e-06   0.000000e+00   7.635821e-06   0.000000e+00 
  3.289600e+04   7.493265e-06   0.000000e+00   7.493265e-06   0.000000e+00 
  3.302400e+04   7.788570e-06   0.000000e+00   7.788570e-06   0.000000e+00 
  3.315200e+04   8.143933e-06   0.000000e+00   8.143933e-06   0.000000e+00 
  3.328000e+04   7.784529e-06   0.000000e+00   7.784529e-06   0.000000e+00 
  3.340800e+04   1.291562e-05   0.000000e+00   1.291562e-05   0.000000e+00 
  3.353600e+04   1.500630e-05   0.000000e+00   1.500630e-05   0.000000e+00 
  3.366400e+04   9.641609e-06   0.000000e+00   9.641609e-06   0.000000e+00 
  3.379200e+04   7.938428e-06   0.000000e+00   7.938428e-06   0.000000e+00 
  3.392000e+04   7.552037e-06   0.000000e+00   7.552037e-06   0.000000e+00 
  3.404800e+04   7.787276e-06   0.000000e+00   7.787276e-06   0.000000e+00 
  3.417600e+04   7.590572e-06   0.000000e+00   7.590572e-06   0.000000e+00 
  3.430400e+04   7.568744e-06   0.000000e+00   7.568744e-06   0.000000e+00 
  3.443200e+04   7.556093e-06   0.000000e+00   7.556093e-06   0.000000e+00 
  3.456000e+04   7.124667e-06   0.000000e+00   7.124667e-06   0.000000e+00 
  3.468800e+04   7.172623e-06   0.000000e+00   7.172623e-06   0.000000e+00 
  3.481600e+04   7.911029e-06   0.000000e+00   7.911029e-06   0.000000e+00 
  3.494400e+04   7.567011e-06   0.000000e+00   7.567011e-06   0.000000e+00 
  3.507200e+04   7.071568e-06   0.000000e+00   7.071568e-06   0.000000e+00 
  3.520000e+04   7.111652e-06   0.000000e+00   7.111652e-06   0.000000e+00 
  3.532800e+04   7.148024e-06   0.000000e+00   7.148024e-06   0.000000e+00 
  3.545600e+04   7.221593e-06   0.000000e+00   7.221593e-06   0.000000e+00 
  3.558400e+04   7.142803e-06   0.000000e+00   7.142803e-06   0.000000e+00 
  3.571200e+04   7.106672e-06   0.000000e+00   7.106672e-06   0.000000e+00 
  3.584000e+04   7.753010e-06   0.000000e+00   7.753010e-06   0.000000e+00 
  3.596800e+04   7.256715e-06   0.000000e+00   7.256715e-06   0.000000e+00 
  3.609600e+04   8.027754e-06   0.000000e+00   8.027754e-06   0.000000e+00 
  3.622400e+04   8.643702e-06   0.000000e+00   8.643702e-06   0.000000e+00 
  3.635200e+04   8.458404e-06   0.000000e+00   8.458404e-06   0.000000e+00 
  3.648000e+04   7.138810e-06   0.000000e+00   7.138810e-06   0.000000e+00 
  3.660800e+04   6.732732e-06   0.000000e+00   6.732732e-06   0.000000e+00 
  3.673600e+04   6.788919e-06   0.000000e+00   6.788919e-06   0.000000e+00 
  3.686400e+04   6.836385e-06   0.000000e+00   6.836385e-06   0.000000e+00 
  3.699200e+04   7.064636e-06   0.000000e+00   7.064636e-06   0.000000e+00 
  3.712000e+04   8.081371e-06   0.000000e+00   8.081371e-06   0.000000e+00 
  3.724800e+04   1.124787e-05   0.000000e+00   1.124787e-05   0.000000e+00 
  3.737600e+04   1.869322e-05   0.000000e+00   1.869322e-05   0.000000e+00 
  3.750400e+04   1.362598e-05   0.000000e+00   1.362598e-05   0.000000e+00 
  3.763200e+04   9.037910e-06   0.000000e+00   9.037910e-06   0.000000e+00 
  3.776000e+04   8.423518e-06   0.000000e+00   8.423518e-06   0.000000e+00 
  3.788800e+04   7.809703e-06   0.000000e+00   7.809703e-06   0.000000e+00 
  3.801600e+04   8.343302e-06   0.000000e+00   8.343302e-06   0.000000e+00 
  3.814400e+04   9.079661e-06   0.000000e+00   9.079661e-06   0.000000e+00 
  3.827200e+04   8.058527e-06   0.000000e+00   8.058527e-06   0.000000e+00 
  3.840000e+04   7.013084e-06   0.000000e+00   7.013084e-06   0.000000e+00 
  3.852800e+04   7.211488e-06   0.000000e+00   7.211488e-06   0.000000e+00 
  3.865600e+04   1.013548e-05   0.000000e+00   1.013548e-05   0.000000e+00 
  3.878400e+04   1.261975e-05   0.000000e+00   1.261975e-05   0.000000e+00 
  3.891200e+04   8.807756e-06   0.000000e+00   8.807756e-06   0.000000e+00 
  3.904000e+04   6.627468e-06   0.000000e+00   6.627468e-06   0.000000e+00 
  3.916800e+04   5.989800e-06   0.000000e+00   5.989800e-06   0.000000e+00 
  3.929600e+04   6.845896e-06   0.000000e+00   6.845896e-06   0.000000e+00 
  3.942400e+04   1.016910e-05   0.000000e+00   1.016910e-05   0.000000e+00 
  3.955200e+04   1.168708e-05   0.000000e+00   1.168708e-05   0.000000e+00 
  3.968000e+04   9.117704e-06   0.000000e+00   9.117704e-06   0.000000e+00 
  3.980800e+04   7.459143e-06   0.000000e+00   7.459143e-06   0.000000e+00 
  3.993600e+04   8.518562e-06   0.000000e+00   8.518562e-06   0.000000e+00 
  4.006400e+04   1.008324e-05   0.000000e+00   1.008324e-05   0.000000e+00 
  4.019200e+04   6.728863e-06   0.000000e+00   6.728863e-06   0.000000e+00 
  4.032000e+04   5.822547e-06   0.000000e+00   5.822547e-06   0.000000e+00 
  4.044800e+04   1.183003e-05   0.000000e+00   1.183003e-05   0.000000e+00 
  4.057600e+04   3.155781e-05   0.000000e+00   3.155781e-05   0.000000e+00 
  4.070400e+04   3.025993e-05   0.000000e+00   3.025993e-05   0.000000e+00 
  4.083200e+04   1.063743e-05   0.000000e+00   1.063743e-05   0.000000e+00 
  4.096000e+04   6.066653e-06   0.000000e+00   6.066653e-06   0.000000e+00 
  4.108800e+04   5.782407e-06   0.000000e+00   5.782407e-06   0.000000e+00 
  4.121600e+04   6.259454e-06   0.000000e+00   6.259454e-06   0.000000e+00 
  4.134400e+04   1.426695e-05   0.000000e+00   1.426695e-05   0.000000e+00 
  4.147200e+04   1.442119e-05   0.000000e+00   1.442119e-05   0.000000e+00 
  4.160000e+04   8.125121e-06   0.000000e+00   8.125121e-06   0.000000e+00 
  4.172800e+04   7.831400e-06   0.000000e+00   7.831400e-06   0.000000e+00 
  4.185600e+04   1.170402e-05   0.000000e+00   1.170402e-05   0.000000e+00 
  4.198400e+04   1.977916e-05   0.000000e+00   1.977916e-05   0.000000e+00 
  4.211200e+04   2.236789e-05   0.000000e+00   2.236789e-05   0.000000e+00 
  4.224000e+04   2.383222e-05   0.000000e+00   2.383222e-05   0.000000e+00 
  4.236800e+04   2.050453e-05   0.000000e+00   2.050453e-05   0.000000e+00 
  4.249600e+04   1.245837e-05   0.000000e+00   1.245837e-05   0.000000e+00 
  4.262400e+04   1.034591e-05   0.000000e+00   1.034591e-05   0.000000e+00 
  4.275200e+04   2.273601e-05   0.000000e+00   2.273601e-05   0.000000e+00 
  4.288000e+04   3.535105e-05   0.000000e+00   3.535105e-05   0.000000e+00 
  4.300800e+04   1.805815e-05   0.000000e+00   1.805815e-05   0.000000e+00 
  4.313600e+04   6.794256e-06   0.000000e+00   6.794256e-06   0.000000e+00 
  4.326400e+04   6.560465e-06   0.000000e+00   6.560465e-06   0.000000e+00 
  4.339200e+04   1.010762e-05   0.000000e+00   1.010762e-05   0.000000e+00 
  4.352000e+04   1.281861e-05   0.000000e+00   1.281861e-05   0.000000e+00 
  4.364800e+04   1.001854e-05   0.000000e+00   1.001854e-05   0.000000e+00 
  4.377600e+04   7.126912e-06   0.000000e+00   7.126912e-06   0.000000e+00 
  4.390400e+04   6.001387e-06   0.000000e+00   6.001387e-06   0.000000e+00 
  4.403200e+04   5.582605e-06   0.000000e+00   5.582605e-06   0.000000e+00 
  4.416000e+04   6.511273e-06   0.000000e+00   6.511273e-06   0.000000e+00 
  4.428800e+04   5.689680e-06   0.000000e+00   5.689680e-06   0.000000e+00 
  4.441600e+04   5.264933e-06   0.000000e+00   5.264933e-06   0.000000e+00 
  4.454400e+04   5.455652e-06   0.000000e+00   5.455652e-06   0.000000e+00 
  4.467200e+04   5.667785e-06   0.000000e+00   5.667785e-06   0.000000e+00 
  4.480000e+04   5.725772e-06   0.000000e+00   5.725772e-06   0.000000e+00 
  4.492800e+04   5.334975e-06   0.000000e+00   5.334975e-06   0.000000e+00 
  4.505600e+04   5.090241e-06   0.000000e+00   5.090241e-06   0.000000e+00 
  4.518400e+04   5.285991e-06   0.000000e+00   5.285991e-06   0.000000e+00 
  4.531200e+04   5.879753e-06   0.000000e+00   5.879753e-06   0.000000e+00 
  4.544000e+04   6.478745e-06   0.000000e+00   6.478745e-06   0.000000e+00 
  4.556800e+04   1.018546e-05   0.000000e+00   1.018546e-05   0.000000e+00 
  4.569600e+04   1.061865e-05   0.000000e+00   1.061865e-05   0.000000e+00 
  4.582400e+04   8.182786e-06   0.000000e+00   8.182786e-06   0.000000e+00 
  4.595200e+04   7.448679e-06   0.000000e+00   7.448679e-06   0.000000e+00 
  4.608000e+04   6.081804e-06   0.000000e+00   6.081804e-06   0.000000e+00 
  4.620800e+04   5.485361e-06   0.000000e+00   5.485361e-06   0.000000e+00 
  4.633600e+04   5.215788e-06   0.000000e+00   5.215788e-06   0.000000e+00 
  4.646400e+04   5.190244e-06   0.000000e+00   5.190244e-06   0.000000e+00 
  4.659200e+04   5.318806e-06   0.000000e+00   5.318806e-06   0.000000e+00 
  4.672000e+04   6.000625e-06   0.000000e+00   6.000625e-06   0.000000e+00 
  4.684800e+04   7.235692e-06   0.000000e+00   7.235692e-06   0.000000e+00 
  4.697600e+04   6.737319e-06   0.000000e+00   6.737319e-06   0.000000e+00 
  4.710400e+04   6.118026e-06   0.000000e+00   6.118026e-06   0.000000e+00 
  4.723200e+04   5.857633e-06   0.000000e+00   5.857633e-06   0.000000e+00 
  4.736000e+04   5.858789e-06   0.000000e+00   5.858789e-06   0.000000e+00 
  4.748800e+04   6.579696e-06   0.000000e+00   6.579696e-06   0.000000e+00 
  4.761600e+04   6.718549e-06   0.000000e+00   6.718549e-06   0.000000e+00 
  4.774400e+04   6.354951e-06   0.000000e+00   6.354951e-06   0.000000e+00 
  4.787200e+04   6.164405e-06   0.000000e+00   6.164405e-06   0.000000e+00 
  4.800000e+04   5.982214e-06   0.000000e+00   5.982214e-06   0.000000e+00 
  4.812800e+04   5.758526e-06   0.000000e+00   5.758526e-06   0.000000e+00 
  4.825600e+04   5.621054e-06   0.000000e+00   5.621054e-06   0.000000e+00 
  4.838400e+04   5.624286e-06   0.000000e+00   5.624286e-06   0.000000e+00 
  4.851200e+04   5.363869e-06   0.000000e+00   5.363869e-06   0.000000e+00 
  4.864000e+04   5.355442e-06   0.000000e+00   5.355442e-06   0.000000e+00 
  4.876800e+04   6.328403e-06   0.000000e+00   6.328403e-06   0.000000e+00 
  4.889600e+04   8.138943e-06   0.000000e+00   8.138943e-06   0.000000e+00 
  4.902400e+04   6.353326e-06   0.000000e+00   6.353326e-06   0.000000e+00 
  4.915200e+04   5.461730e-06   0.000000e+00   5.461730e-06   0.000000e+00 
  4.928000e+04   5.567572e-06   0.000000e+00   5.567572e-06   0.000000e+00 
  4.940800e+04   5.299723e-06   0.000000e+00   5.299723e-06   0.000000e+00 
  4.953600e+04   4.997970e-06   0.000000e+00   4.997970e-06   0.000000e+00 
  4.966400e+04   4.970001e-06   0.000000e+00   4.970001e-06   0.000000e+00 
  4.979200e+04   5.098406e-06   0.000000e+00   5.098406e-06   0.000000e+00 
  4.992000e+04   4.816261e-06   0.000000e+00   4.816261e-06   0.000000e+00 
  5.004800e+04   4.864334e-06   0.000000e+00   4.864334e-06   0.000000e+00 
  5.017600e+04   5.159399e-06   0.000000e+00   5.159399e-06   0.000000e+00 
  5.030400e+04   5.436617e-06   0.000000e+00   5.436617e-06   0.000000e+00 
  5.043200e+04   5.466706e-06   0.000000e+00   5.466706e-06   0.000000e+00 
  5.056000e+04   5.880834e-06   0.000000e+00   5.880834e-06   0.000000e+00 
  5.068800e+04   6.879247e-06   0.000000e+00   6.879247e-06   0.000000e+00 
  5.081600e+04   6.240161e-06   0.000000e+00   6.240161e-06   0.000000e+00 
  5.094400e+04   5.895427e-06   0.000000e+00   5.895427e-06   0.000000e+00 
  5.107200e+04   5.806993e-06   0.000000e+00   5.806993e-06   0.000000e+00 
  5.120000e+04   5.768230e-06   0.000000e+00   5.768230e-06   0.000000e+00 
  5.132800e+04   5.416950e-06   0.000000e+00   5.416950e-06   0.000000e+00 
  5.145600e+04   5.255653e-06   0.000000e+00   5.255653e-06   0.000000e+00 
  5.158400e+04   5.778707e-06   0.000000e+00   5.778707e-06   0.000000e+00 
  5.171200e+04   6.755656e-06   0.000000e+00   6.755656e-06   0.000000e+00 
  5.184000e+04   7.362235e-06   0.000000e+00   7.362235e-06   0.000000e+00 
  5.196800e+04   8.470782e-06   0.000000e+00   8.470782e-06   0.000000e+00 
  5.209600e+04   9.145883e-06   0.000000e+00   9.145883e-06   0.000000e+00 
  5.222400e+04   7.024673e-06   0.000000e+00   7.024673e-06   0.000000e+00 
  5.235200e+04   5.763079e-06   0.000000e+00   5.763079e-06   0.000000e+00 
  5.248000e+04   5.565895e-06   0.000000e+00   5.565895e-06   0.000000e+00 
  5.260800e+04   6.779785e-06   0.000000e+00   6.779785e-06   0.000000e+00 
  5.273600e+04   5.905931e-06   0.000000e+00   5.905931e-06   0.000000e+00 
  5.286400e+04   6.225261e-06   0.000000e+00   6.225261e-06   0.000000e+00 
  5.299200e+04   7.126572e-06   0.000000e+00   7.126572e-06   0.000000e+00 
  5.312000e+04   6.668055e-06   0.000000e+00   6.668055e-06   0.000000e+00 
  5.324800e+04   4.996488e-06   0.000000e+00   4.996488e-06   0.000000e+00 
  5.337600e+04   4.591376e-06   0.000000e+00   4.591376e-06   0.000000e+00 
  5.350400e+04   4.423306e-06   0.000000e+00   4.423306e-06   0.000000e+00 
  5.363200e+04   4.247093e-06   0.000000e+00   4.247093e-06   0.000000e+00 
  5.376000e+04   4.692389e-06   0.000000e+00   4.692389e-06   0.000000e+00 
  5.388800e+04   5.553262e-06   0.000000e+00   5.553262e-06   0.000000e+00 
  5.401600e+04   8.167875e-06   0.000000e+00   8.167875e-06   0.000000e+00 
  5.414400e+04   1.350850e-05   0.000000e+00   1.350850e-05   0.000000e+00 
  5.427200e+04   1.192074e-05   0.000000e+00   1.192074e-05   0.000000e+00 
  5.440000e+04   8.243660e-06   0.000000e+00   8.243660e-06   0.000000e+00 
  5.452800e+04   6.581432e-06   0.000000e+00   6.581432e-06   0.000000e+00 
  5.465600e+04   4.941380e-06   0.000000e+00   4.941380e-06   0.000000e+00 
  5.478400e+04   4.704678e-06   0.000000e+00   4.704678e-06   0.000000e+00 
  5.491200e+04   6.037063e-06   0.000000e+00   6.037063e-06   0.000000e+00 
  5.504000e+04   4.998239e-06   0.000000e+00   4.998239e-06   0.000000e+00 
  5.516800e+04   4.783497e-06   0.000000e+00   4.783497e-06   0.000000e+00 
  5.529600e+04   4.785067e-06   0.000000e+00   4.785067e-06   0.000000e+00 
  5.542400e+04   4.573946e-06   0.000000e+00   4.573946e-06   0.000000e+00 
  5.555200e+04   4.516186e-06   0.000000e+00   4.516186e-06   0.000000e+00 
  5.568000e+04   5.360423e-06   0.000000e+00   5.360423e-06   0.000000e+00 
  5.580800e+04   5.548674e-06   0.000000e+00   5.548674e-06   0.000000e+00 
  5.593600e+04   6.781080e-06   0.000000e+00   6.781080e-06   0.000000e+00 
  5.606400e+04   6.858115e-06   0.000000e+00   6.858115e-06   0.000000e+00 
  5.619200e+04   6.951518e-06   0.000000e+00   6.951518e-06   0.000000e+00 
  5.632000e+04   6.198192e-06   0.000000e+00   6.198192e-06   0.000000e+00 
  5.644800e+04   4.559662e-06   0.000000e+00   4.559662e-06   0.000000e+00 
  5.657600e+04   4.066762e-06   0.000000e+00   4.066762e-06   0.000000e+00 
  5.670400e+04   4.243238e-06   0.000000e+00   4.243238e-06   0.000000e+00 
  5.683200e+04   4.587376e-06   0.000000e+00   4.587376e-06   0.000000e+00 
  5.696000e+04   5.798850e-06   0.000000e+00   5.798850e-06   0.000000e+00 
  5.708800e+04   1.155124e-05   0.000000e+00   1.155124e-05   0.000000e+00 
  5.721600e+04   1.258004e-05   0.000000e+00   1.258004e-05   0.000000e+00 
  5.734400e+04   6.704292e-06   0.000000e+00   6.704292e-06   0.000000e+00 
  5.747200e+04   5.872248e-06   0.000000e+00   5.872248e-06   0.000000e+00 
  5.760000e+04   6.103055e-06   0.000000e+00   6.103055e-06   0.000000e+00 
  5.772800e+04   5.750264e-06   0.000000e+00   5.750264e-06   0.000000e+00 
  5.785600e+04   5.553761e-06   0.000000e+00   5.553761e-06   0.000000e+00 
  5.798400e+04   9.602246e-06   0.000000e+00   9.602246e-06   0.000000e+00 
  5.811200e+04   1.268839e-05   0.000000e+00   1.268839e-05   0.000000e+00 
  5.824000e+04   1.012366e-05   0.000000e+00   1.012366e-05   0.000000e+00 
  5.836800e+04   5.413071e-06   0.000000e+00   5.413071e-06   0.000000e+00 
  5.849600e+04   3.872211e-06   0.000000e+00   3.872211e-06   0.000000e+00 
  5.862400e+04   3.961255e-06   0.000000e+00   3.961255e-06   0.000000e+00 
  5.875200e+04   4.108389e-06   0.000000e+00   4.108389e-06   0.000000e+00 
  5.888000e+04   4.020484e-06   0.000000e+00   4.020484e-06   0.000000e+00 
  5.900800e+04   4.160473e-06   0.000000e+00   4.160473e-06   0.000000e+00 
  5.913600e+04   4.507563e-06   0.000000e+00   4.507563e-06   0.000000e+00 
  5.926400e+04   5.171551e-06   0.000000e+00   5.171551e-06   0.000000e+00 
  5.939200e+04   5.166261e-06   0.000000e+00   5.166261e-06   0.000000e+00 
  5.952000e+04   5.431249e-06   0.000000e+00   5.431249e-06   0.000000e+00 
  5.964800e+04   6.276031e-06   0.000000e+00   6.276031e-06   0.000000e+00 
  5.977600e+04   4.364760e-06   0.000000e+00   4.364760e-06   0.000000e+00 
  5.990400e+04   3.681976e-06   0.000000e+00   3.681976e-06   0.000000e+00 
  6.003200e+04   4.323932e-06   0.000000e+00   4.323932e-06   0.000000e+00 
  6.016000e+04   6.951434e-06   0.000000e+00   6.951434e-06   0.000000e+00 
  6.028800e+04   6.865366e-06   0.000000e+00   6.865366e-06   0.000000e+00 
  6.041600e+04   4.679590e-06   0.000000e+00   4.679590e-06   0.000000e+00 
  6.054400e+04   3.946870e-06   0.000000e+00   3.946870e-06   0.000000e+00 
  6.067200e+04   4.127271e-06   0.000000e+00   4.127271e-06   0.000000e+00 
  6.080000e+04   4.606281e-06   0.000000e+00   4.606281e-06   0.000000e+00 
  6.092800e+04   4.435276e-06   0.000000e+00   4.435276e-06   0.000000e+00 
  6.105600e+04   4.041962e-06   0.000000e+00   4.041962e-06   0.000000e+00 
  6.118400e+04   3.887119e-06   0.000000e+00   3.887119e-06   0.000000e+00 
  6.131200e+04   4.178677e-06   0.000000e+00   4.178677e-06   0.000000e+00 
  6.144000e+04   5.012282e-06   0.000000e+00   5.012282e-06   0.000000e+00 
  6.156800e+04   4.420333e-06   0.000000e+00   4.420333e-06   0.000000e+00 
  6.169600e+04   3.658060e-06   0.000000e+00   3.658060e-06   0.000000e+00 
  6.182400e+04   3.652345e-06   0.000000e+00   3.652345e-06   0.000000e+00 
  6.195200e+04   3.771651e-06   0.000000e+00   3.771651e-06   0.000000e+00 
  6.208000e+04   4.684135e-06   0.000000e+00   4.684135e-06   0.000000e+00 
  6.220800e+04   5.310425e-06   0.000000e+00   5.310425e-06   0.000000e+00 
  6.233600e+04   4.625638e-06   0.000000e+00   4.625638e-06   0.000000e+00 
  6.246400e+04   5.271234e-06   0.000000e+00   5.271234e-06   0.000000e+00 
  6.259200e+04   5.378606e-06   0.000000e+00   5.378606e-06   0.000000e+00 
  6.272000e+04   5.360273e-06   0.000000e+00   5.360273e-06   0.000000e+00 
  6.284800e+04   4.186255e-06   0.000000e+00   4.186255e-06   0.000000e+00 
  6.297600e+04   3.755255e-06   0.000000e+00   3.755255e-06   0.000000e+00 
  6.310400e+04   4.328836e-06   0.000000e+00   4.328836e-06   0.000000e+00 
  6.323200e+04   6.280994e-06   0.000000e+00   6.280994e-06   0.000000e+00 
  6.336000e+04   7.988986e-06   0.000000e+00   7.988986e-06   0.000000e+00 
  6.348800e+04   7.276416e-06   0.000000e+00   7.276416e-06   0.000000e+00 
  6.361600e+04   4.917745e-06   0.000000e+00   4.917745e-06   0.000000e+00 
  6.374400e+04   4.301153e-06   0.000000e+00   4.301153e-06   0.000000e+00 
  6.387200e+04   4.246329e-06   0.000000e+00   4.246329e-06   0.000000e+00 
  6.400000e+04   4.527026e-06   0.000000e+00   4.527026e-06   0.000000e+00 
  6.412800e+04   7.980391e-06   0.000000e+00   7.980391e-06   0.000000e+00 
  6.425600e+04   1.087803e-05   0.000000e+00   1.087803e-05   0.000000e+00 
  6.438400e+04   9.036404e-06   0.000000e+00   9.036404e-06   0.000000e+00 
  6.451200e+04   5.865676e-06   0.000000e+00   5.865676e-06   0.000000e+00 
  6.464000e+04   4.304280e-06   0.000000e+00   4.304280e-06   0.000000e+00 
  6.476800e+04   4.143907e-06   0.000000e+00   4.143907e-06   0.000000e+00 
  6.489600e+04   3.722929e-06   0.000000e+00   3.722929e-06   0.000000e+00 
  6.502400e+04   3.768690e-06   0.000000e+00   3.768690e-06   0.000000e+00 
  6.515200e+04   3.809603e-06   0.000000e+00   3.809603e-06   0.000000e+00 
  6.528000e+04   3.885778e-06   0.000000e+00   3.885778e-06   0.000000e+00 
  6.540800e+04   4.587644e-06   0.000000e+00   4.587644e-06   0.000000e+00 
  6.553600e+04   8.418264e-06   0.000000e+00   8.418264e-06   0.000000e+00 
  6.566400e+04   8.585860e-06   0.000000e+00   8.585860e-06   0.000000e+00 
  6.579200e+04   5.399869e-06   0.000000e+00   5.399869e-06   0.000000e+00 
  6.592000e+04   4.577868e-06   0.000000e+00   4.577868e-06   0.000000e+00 
  6.604800e+04   5.802452e-06   0.000000e+00   5.802452e-06   0.000000e+00 
  6.617600e+04   5.741439e-06   0.000000e+00   5.741439e-06   0.000000e+00 
  6.630400e+04   4.576190e-06   0.000000e+00   4.576190e-06   0.000000e+00 
  6.643200e+04   7.882672e-06   0.000000e+00   7.882672e-06   0.000000e+00 
  6.656000e+04   9.487802e-06   0.000000e+00   9.487802e-06   0.000000e+00 
  6.668800e+04   6.400538e-06   0.000000e+00   6.400538e-06   0.000000e+00 
  6.681600e+04   5.967580e-06   0.000000e+00   5.967580e-06   0.000000e+00 
  6.694400e+04   5.975824e-06   0.000000e+00   5.975824e-06   0.000000e+00 
  6.707200e+04   5.036539e-06   0.000000e+00   5.036539e-06   0.000000e+00 
  6.720000e+04   4.626665e-06   0.000000e+00   4.626665e-06   0.000000e+00 
  6.732800e+04   6.161612e-06   0.000000e+00   6.161612e-06   0.000000e+00 
  6.745600e+04   7.042969e-06   0.000000e+00   7.042969e-06   0.000000e+00 
  6.758400e+04   5.869234e-06   0.000000e+00   5.869234e-06   0.000000e+00 
  6.771200e+04   1.327491e-05   0.000000e+00   1.327491e-05   0.000000e+00 
  6.784000e+04   1.510488e-05   0.000000e+00   1.510488e-05   0.000000e+00 
  6.796800e+04   7.857902e-06   0.000000e+00   7.857902e-06   0.000000e+00 
  6.809600e+04   1.099507e-05   0.000000e+00   1.099507e-05   0.000000e+00 
  6.822400e+04   8.686057e-06   0.000000e+00   8.686057e-06   0.000000e+00 
  6.835200e+04   4.199738e-06   0.000000e+00   4.199738e-06   0.000000e+00 
  6.848000e+04   4.158924e-06   0.000000e+00   4.158924e-06   0.000000e+00 
  6.860800e+04   3.623236e-06   0.000000e+00   3.623236e-06   0.000000e+00 
  6.873600e+04   3.869777e-06   0.000000e+00   3.869777e-06   0.000000e+00 
  6.886400e+04   4.466755e-06   0.000000e+00   4.466755e-06   0.000000e+00 
  6.899200e+04   5.390329e-06   0.000000e+00   5.390329e-06   0.000000e+00 
  6.912000e+04   5.345031e-06   0.000000e+00   5.345031e-06   0.000000e+00 
  6.924800e+04   7.922406e-06   0.000000e+00   7.922406e-06   0.000000e+00 
  6.937600e+04   1.388953e-05   0.000000e+00   1.388953e-05   0.000000e+00 
  6.950400e+04   2.255181e-05   0.000000e+00   2.255181e-05   0.000000e+00 
  6.963200e+04   1.258250e-05   0.000000e+00   1.258250e-05   0.000000e+00 
  6.976000e+04   5.411920e-06   0.000000e+00   5.411920e-06   0.000000e+00 
  6.988800e+04   4.955826e-06   0.000000e+00   4.955826e-06   0.000000e+00 
  7.001600e+04   3.821654e-06   0.000000e+00   3.821654e-06   0.000000e+00 
  7.014400e+04   3.414692e-06   0.000000e+00   3.414692e-06   0.000000e+00 
  7.027200e+04   3.346039e-06   0.000000e+00   3.346039e-06   0.000000e+00 
  7.040000e+04   3.370517e-06   0.000000e+00   3.370517e-06   0.000000e+00 
  7.052800e+04   3.554973e-06   0.000000e+00   3.554973e-06   0.000000e+00 
  7.065600e+04   4.079393e-06   0.000000e+00   4.079393e-06   0.000000e+00 
  7.078400e+04   8.493117e-06   0.000000e+00   8.493117e-06   0.000000e+00 
  7.091200e+04   1.061077e-05   0.000000e+00   1.061077e-05   0.000000e+00 
  7.104000e+04   8.603170e-06   0.000000e+00   8.603170e-06   0.000000e+00 
  7.116800e+04   1.989440e-05   0.000000e+00   1.989440e-05   0.000000e+00 
  7.129600e+04   1.430834e-05   0.000000e+00   1.430834e-05   0.000000e+00 
  7.142400e+04   5.199184e-06   0.000000e+00   5.199184e-06   0.000000e+00 
  7.155200e+04   5.975267e-06   0.000000e+00   5.975267e-06   0.000000e+00 
  7.168000e+04   6.349713e-06   0.000000e+00   6.349713e-06   0.000000e+00 
  7.180800e+04   4.768109e-06   0.000000e+00   4.768109e-06   0.000000e+00 
  7.193600e+04   3.607870e-06   0.000000e+00   3.607870e-06   0.000000e+00 
  7.206400e+04   3.882979e-06   0.000000e+00   3.882979e-06   0.000000e+00 
  7.219200e+04   4.647993e-06   0.000000e+00   4.647993e-06   0.000000e+00 
  7.232000e+04   4.503961e-06   0.000000e+00   4.503961e-06   0.000000e+00 
  7.244800e+04   3.876817e-06   0.000000e+00   3.876817e-06   0.000000e+00 
  7.257600e+04   3.806110e-06   0.000000e+00   3.806110e-06   0.000000e+00 
  7.270400e+04   3.841610e-06   0.000000e+00   3.841610e-06   0.000000e+00 
  7.283200e+04   4.503868e-06   0.000000e+00   4.503868e-06   0.000000e+00 
  7.296000e+04   4.561323e-06   0.000000e+00   4.561323e-06   0.000000e+00 
  7.308800e+04   4.128241e-06   0.000000e+00   4.128241e-06   0.000000e+00 
  7.321600e+04   4.063391e-06   0.000000e+00   4.063391e-06   0.000000e+00 
  7.334400e+04   1.019210e-05   0.000000e+00   1.019210e-05   0.000000e+00 
  7.347200e+04   3.799050e-05   0.000000e+00   3.799050e-05   0.000000e+00 
  7.360000e+04   3.297652e-05   0.000000e+00   3.297652e-05   0.000000e+00 
  7.372800e+04   6.331079e-06   0.000000e+00   6.331079e-06   0.000000e+00 
  7.385600e+04   4.140833e-06   0.000000e+00   4.140833e-06   0.000000e+00 
  7.398400e+04   3.689146e-06   0.000000e+00   3.689146e-06   0.000000e+00 
  7.411200e+04   3.451860e-06   0.000000e+00   3.451860e-06   0.000000e+00 
  7.424000e+04   3.386406e-06   0.000000e+00   3.386406e-06   0.000000e+00 
  7.436800e+04   3.639095e-06   0.000000e+00   3.639095e-06   0.000000e+00 
  7.449600e+04   1.001743e-05   0.000000e+00   1.001743e-05   0.000000e+00 
  7.462400e+04   1.216738e-05   0.000000e+00   1.216738e-05   0.000000e+00 
  7.475200e+04   7.594278e-06   0.000000e+00   7.594278e-06   0.000000e+00 
  7.488000e+04   6.773363e-06   0.000000e+00   6.773363e-06   0.000000e+00 
  7.500800e+04   4.617196e-06   0.000000e+00   4.617196e-06   0.000000e+00 
  7.513600e+04   3.534148e-06   0.000000e+00   3.534148e-06   0.000000e+00 
  7.526400e+04   3.572751e-06   0.000000e+00   3.572751e-06   0.000000e+00 
  7.539200e+04   4.484773e-06   0.000000e+00   4.484773e-06   0.000000e+00 
  7.552000e+04   8.355899e-06   0.000000e+00   8.355899e-06   0.000000e+00 
  7.564800e+04   1.014278e-05   0.000000e+00   1.014278e-05   0.000000e+00 
  7.577600e+04   7.919015e-06   0.000000e+00   7.919015e-06   0.000000e+00 
  7.590400e+04   7.024983e-06   0.000000e+00   7.024983e-06   0.000000e+00 
  7.603200e+04   5.570067e-06   0.000000e+00   5.570067e-06   0.000000e+00 
  7.616000e+04   5.579775e-06   0.000000e+00   5.579775e-06   0.000000e+00 
  7.628800e+04   7.045576e-06   0.000000e+00   7.045576e-06   0.000000e+00 
  7.641600e+04   4.455013e-06   0.000000e+00   4.455013e-06   0.000000e+00 
  7.654400e+04   3.976417e-06   0.000000e+00   3.976417e-06   0.000000e+00 
  7.667200e+04   4.615162e-06   0.000000e+00   4.615162e-06   0.000000e+00 
  7.680000e+04   4.416254e-06   0.000000e+00   4.416254e-06   0.000000e+00 
  7.692800e+04   3.620284e-06   0.000000e+00   3.620284e-06   0.000000e+00 
  7.705600e+04   3.641438e-06   0.000000e+00   3.641438e-06   0.000000e+00 
  7.718400e+04   4.607747e-06   0.000000e+00   4.607747e-06   0.000000e+00 
  7.731200e+04   6.408056e-06   0.000000e+00   6.408056e-06   0.000000e+00 
  7.744000e+04   5.978026e-06   0.000000e+00   5.978026e-06   0.000000e+00 
  7.756800e+04   6.503376e-06   0.000000e+00   6.503376e-06   0.000000e+00 
  7.769600e+04   4.184774e-06   0.000000e+00   4.184774e-06   0.000000e+00 
  7.782400e+04   3.737852e-06   0.000000e+00   3.737852e-06   0.000000e+00 
  7.795200e+04   4.803191e-06   0.000000e+00   4.803191e-06   0.000000e+00 
  7.808000e+04   4.885805e-06   0.000000e+00   4.885805e-06   0.000000e+00 
  7.820800e+04   4.178049e-06   0.000000e+00   4.178049e-06   0.000000e+00 
  7.833600e+04   3.694047e-06   0.000000e+00   3.694047e-06   0.000000e+00 
  7.846400e+04   3.277343e-06   0.000000e+00   3.277343e-06   0.000000e+00 
  7.859200e+04   3.436511e-06   0.000000e+00   3.436511e-06   0.000000e+00 
  7.872000e+04   4.679148e-06   0.000000e+00   4.679148e-06   0.000000e+00 
  7.884800e+04   5.051462e-06   0.000000e+00   5.051462e-06   0.000000e+00 
  7.897600e+04   3.941225e-06   0.000000e+00   3.941225e-06   0.000000e+00 
  7.910400e+04   3.820342e-06   0.000000e+00   3.820342e-06   0.000000e+00 
  7.923200e+04   3.933497e-06   0.000000e+00   3.933497e-06   0.000000e+00 
  7.936000e+04   4.253327e-06   0.000000e+00   4.253327e-06   0.000000e+00 
  7.948800e+04   3.841759e-06   0.000000e+00   3.841759e-06   0.000000e+00 
  7.961600e+04   3.653249e-06   0.000000e+00   3.653249e-06   0.000000e+00 
  7.974400e+04   3.637721e-06   0.000000e+00   3.637721e-06   0.000000e+00 
  7.987200e+04   3.985441e-06   0.000000e+00   3.985441e-06   0.000000e+00 
  8.000000e+04   3.784766e-06   0.000000e+00   3.784766e-06   0.000000e+00 
  8.012800e+04   3.543134e-06   0.000000e+00   3.543134e-06   0.000000e+00 
  8.025600e+04   3.497820e-06   0.000000e+00   3.497820e-06   0.000000e+00 
  8.038400e+04   3.732369e-06   0.000000e+00   3.732369e-06   0.000000e+00 
  8.051200e+04   3.910572e-06   0.000000e+00   3.910572e-06   0.000000e+00 
  8.064000e+04   3.448269e-06   0.000000e+00   3.448269e-06   0.000000e+00 
  8.076800e+04   3.405680e-06   0.000000e+00   3.405680e-06   0.000000e+00 
  8.089600e+04   3.698414e-06   0.000000e+00   3.698414e-06   0.000000e+00 
  8.102400e+04   3.576922e-06   0.000000e+00   3.576922e-06   0.000000e+00 
  8.115200e+04   3.583297e-06   0.000000e+00   3.583297e-06   0.000000e+00 
  8.128000e+04   3.924212e-06   0.000000e+00   3.924212e-06   0.000000e+00 
  8.140800e+04   5.080392e-06   0.000000e+00   5.080392e-06   0.000000e+00 
  8.153600e+04   8.337418e-06   0.000000e+00   8.337418e-06   0.000000e+00 
  8.166400e+04   6.943044e-06   0.000000e+00   6.943044e-06   0.000000e+00 
  8.179200e+04   4.411249e-06   0.000000e+00   4.411249e-06   0.000000e+00 
  8.192000e+04   4.456802e-06   0.000000e+00   4.456802e-06   0.000000e+00 
  8.204800e+04   4.022598e-06   0.000000e+00   4.022598e-06   0.000000e+00 
  8.217600e+04   3.471048e-06   0.000000e+00   3.471048e-06   0.000000e+00 
  8.230400e+04   3.265211e-06   0.000000e+00   3.265211e-06   0.000000e+00 
  8.243200e+04   3.205046e-06   0.000000e+00   3.205046e-06   0.000000e+00 
  8.256000e+04   3.348893e-06   0.000000e+00   3.348893e-06   0.000000e+00 
  8.268800e+04   4.229354e-06   0.000000e+00   4.229354e-06   0.000000e+00 
  8.281600e+04   5.414592e-06   0.000000e+00   5.414592e-06   0.000000e+00 
  8.294400e+04   5.742355e-06   0.000000e+00   5.742355e-06   0.000000e+00 
  8.307200e+04   5.975292e-06   0.000000e+00   5.975292e-06   0.000000e+00 
  8.320000e+04   4.406134e-06   0.000000e+00   4.406134e-06   0.000000e+00 
  8.332800e+04   4.253282e-06   0.000000e+00   4.253282e-06   0.000000e+00 
  8.345600e+04   3.515188e-06   0.000000e+00   3.515188e-06   0.000000e+00 
  8.358400e+04   3.398678e-06   0.000000e+00   3.398678e-06   0.000000e+00 
  8.371200e+04   3.661191e-06   0.000000e+00   3.661191e-06   0.000000e+00 
  8.384000e+04   3.921104e-06   0.000000e+00   3.921104e-06   0.000000e+00 
  8.396800e+04   3.558136e-06   0.000000e+00   3.558136e-06   0.000000e+00 
  8.409600e+04   3.555571e-06   0.000000e+00   3.555571e-06   0.000000e+00 
  8.422400e+04   3.795452e-06   0.000000e+00   3.795452e-06   0.000000e+00 
  8.435200e+04   4.078986e-06   0.000000e+00   4.078986e-06   0.000000e+00 
  8.448000e+04   4.059255e-06   0.000000e+00   4.059255e-06   0.000000e+00 
  8.460800e+04   4.698662e-06   0.000000e+00   4.698662e-06   0.000000e+00 
  8.473600e+04   5.511270e-06   0.000000e+00   5.511270e-06   0.000000e+00 
  8.486400e+04   4.149834e-06   0.000000e+00   4.149834e-06   0.000000e+00 
  8.499200e+04   3.932849e-06   0.000000e+00   3.932849e-06   0.000000e+00 
  8.512000e+04   3.429740e-06   0.000000e+00   3.429740e-06   0.000000e+00 
  8.524800e+04   3.218964e-06   0.000000e+00   3.218964e-06   0.000000e+00 
  8.537600e+04   3.322402e-06   0.000000e+00   3.322402e-06   0.000000e+00 
  8.550400e+04   3.709056e-06   0.000000e+00   3.709056e-06   0.000000e+00 
  8.563200e+04   3.883942e-06   0.000000e+00   3.883942e-06   0.000000e+00 
  8.576000e+04   3.705681e-06   0.000000e+00   3.705681e-06   0.000000e+00 
  8.588800e+04   3.450189e-06   0.000000e+00   3.450189e-06   0.000000e+00 
  8.601600e+04   4.593423e-06   0.000000e+00   4.593423e-06   0.000000e+00 
  8.614400e+04   5.086951e-06   0.000000e+00   5.086951e-06   0.000000e+00 
  8.627200e+04   3.910948e-06   0.000000e+00   3.910948e-06   0.000000e+00 
  8.640000e+04   3.568085e-06   0.000000e+00   3.568085e-06   0.000000e+00 
  8.652800e+04   3.265539e-06   0.000000e+00   3.265539e-06   0.000000e+00 
  8.665600e+04   3.632700e-06   0.000000e+00   3.632700e-06   0.000000e+00 
  8.678400e+04   4.509133e-06   0.000000e+00   4.509133e-06   0.000000e+00 
  8.691200e+04   5.719068e-06   0.000000e+00   5.719068e-06   0.000000e+00 
  8.704000e+04   5.581206e-06   0.000000e+00   5.581206e-06   0.000000e+00 
  8.716800e+04   4.951613e-06   0.000000e+00   4.951613e-06   0.000000e+00 
  8.729600e+04   4.370303e-06   0.000000e+00   4.370303e-06   0.000000e+00 
  8.742400e+04   3.781269e-06   0.000000e+00   3.781269e-06   0.000000e+00 
  8.755200e+04   3.431070e-06   0.000000e+00   3.431070e-06   0.000000e+00 
  8.768000e+04   3.408478e-06   0.000000e+00   3.408478e-06   0.000000e+00 
  8.780800e+04   4.657742e-06   0.000000e+00   4.657742e-06   0.000000e+00 
  8.793600e+04   5.133293e-06   0.000000e+00   5.133293e-06   0.000000e+00 
  8.806400e+04   4.452066e-06   0.000000e+00   4.452066e-06   0.000000e+00 
  8.819200e+04   3.785132e-06   0.000000e+00   3.785132e-06   0.000000e+00 
  8.832000e+04   3.727149e-06   0.000000e+00   3.727149e-06   0.000000e+00 
  8.844800e+04   3.658426e-06   0.000000e+00   3.658426e-06   0.000000e+00 
  8.857600e+04   3.416259e-06   0.000000e+00   3.416259e-06   0.000000e+00 
  8.870400e+04   3.493396e-06   0.000000e+00   3.493396e-06   0.000000e+00 
  8.883200e+04   4.101538e-06   0.000000e+00   4.101538e-06   0.000000e+00 
  8.896000e+04   4.542026e-06   0.000000e+00   4.542026e-06   0.000000e+00 
  8.908800e+04   4.500078e-06   0.000000e+00   4.500078e-06   0.000000e+00 
  8.921600e+04   4.885383e-06   0.000000e+00   4.885383e-06   0.000000e+00 
  8.934400e+04   5.518707e-06   0.000000e+00   5.518707e-06   0.000000e+00 
  8.947200e+04   5.363464e-06   0.000000e+00   5.363464e-06   0.000000e+00 
  8.960000e+04   4.944322e-06   0.000000e+00   4.944322e-06   0.000000e+00 
  8.972800e+04   5.067054e-06   0.000000e+00   5.067054e-06   0.000000e+00 
  8.985600e+04   4.799537e-06   0.000000e+00   4.799537e-06   0.000000e+00 
  8.998400e+04   5.069292e-06   0.000000e+00   5.069292e-06   0.000000e+00 
  9.011200e+04   7.103340e-06   0.000000e+00   7.103340e-06   0.000000e+00 
  9.024000e+04   8.518972e-06   0.000000e+00   8.518972e-06   0.000000e+00 
  9.036800e+04   6.820071e-06   0.000000e+00   6.820071e-06   0.000000e+00 
  9.049600e+04   4.863610e-06   0.000000e+00   4.863610e-06   0.000000e+00 
  9.062400e+04   4.252024e-06   0.000000e+00   4.252024e-06   0.000000e+00 
  9.075200e+04   4.167990e-06   0.000000e+00   4.167990e-06   0.000000e+00 
  9.088000e+04   4.113867e-06   0.000000e+00   4.113867e-06   0.000000e+00 
  9.100800e+04   3.870469e-06   0.000000e+00   3.870469e-06   0.000000e+00 
  9.113600e+04   4.074917e-06   0.000000e+00   4.074917e-06   0.000000e+00 
  9.126400e+04   4.109801e-06   0.000000e+00   4.109801e-06   0.000000e+00 
  9.139200e+04   5.040011e-06   0.000000e+00   5.040011e-06   0.000000e+00 
  9.152000e+04   7.245806e-06   0.000000e+00   7.245806e-06   0.000000e+00 
  9.164800e+04   7.759669e-06   0.000000e+00   7.759669e-06   0.000000e+00 
  9.177600e+04   5.846866e-06   0.000000e+00   5.846866e-06   0.000000e+00 
  9.190400e+04   4.387462e-06   0.000000e+00   4.387462e-06   0.000000e+00 
  9.203200e+04   5.213873e-06   0.000000e+00   5.213873e-06   0.000000e+00 
  9.216000e+04   5.741892e-06   0.000000e+00   5.741892e-06   0.000000e+00 
  9.228800e+04   4.087739e-06   0.000000e+00   4.087739e-06   0.000000e+00 
  9.241600e+04   3.766702e-06   0.000000e+00   3.766702e-06   0.000000e+00 
  9.254400e+04   4.014948e-06   0.000000e+00   4.014948e-06   0.000000e+00 
  9.267200e+04   4.034987e-06   0.000000e+00   4.034987e-06   0.000000e+00 
  9.280000e+04   3.956556e-06   0.000000e+00   3.956556e-06   0.000000e+00 
  9.292800e+04   4.254551e-06   0.000000e+00   4.254551e-06   0.000000e+00 
  9.305600e+04   4.535894e-06   0.000000e+00   4.535894e-06   0.000000e+00 
  9.318400e+04   4.348290e-06   0.000000e+00   4.348290e-06   0.000000e+00 
  9.331200e+04   5.746833e-06   0.000000e+00   5.746833e-06   0.000000e+00 
  9.344000e+04   5.795246e-06   0.000000e+00   5.795246e-06   0.000000e+00 
  9.356800e+04   3.936998e-06   0.000000e+00   3.936998e-06   0.000000e+00 
  9.369600e+04   3.491049e-06   0.000000e+00   3.491049e-06   0.000000e+00 
  9.382400e+04   3.882995e-06   0.000000e+00   3.882995e-06   0.000000e+00 
  9.395200e+04   4.597911e-06   0.000000e+00   4.597911e-06   0.000000e+00 
  9.408000e+04   4.013613e-06   0.000000e+00   4.013613e-06   0.000000e+00 
  9.420800e+04   4.856121e-06   0.000000e+00   4.856121e-06   0.000000e+00 
  9.433600e+04   5.370498e-06   0.000000e+00   5.370498e-06   0.000000e+00 
  9.446400e+04   4.231735e-06   0.000000e+00   4.231735e-06   0.000000e+00 
  9.459200e+04   3.885590e-06   0.000000e+00   3.885590e-06   0.000000e+00 
  9.472000e+04   3.969853e-06   0.000000e+00   3.969853e-06   0.000000e+00 
  9.484800e+04   4.572595e-06   0.000000e+00   4.572595e-06   0.000000e+00 
  9.497600e+04   3.856154e-06   0.000000e+00   3.856154e-06   0.000000e+00 
  9.510400e+04   3.383973e-06   0.000000e+00   3.383973e-06   0.000000e+00 
  9.523200e+04   4.312129e-06   0.000000e+00   4.312129e-06   0.000000e+00 
  9.536000e+04   7.173609e-06   0.000000e+00   7.173609e-06   0.000000e+00 
  9.548800e+04   9.516273e-06   0.000000e+00   9.516273e-06   0.000000e+00 
  9.561600e+04   8.821798e-06   0.000000e+00   8.821798e-06   0.000000e+00 
  9.574400e+04   6.185375e-06   0.000000e+00   6.185375e-06   0.000000e+00 
  9.587200e+04   5.325779e-06   0.000000e+00   5.325779e-06   0.000000e+00 
  9.600000e+04   4.488943e-06   0.000000e+00   4.488943e-06   0.000000e+00 
  9.612800e+04   4.995317e-06   0.000000e+00   4.995317e-06   0.000000e+00 
  9.625600e+04   6.345675e-06   0.000000e+00   6.345675e-06   0.000000e+00 
  9.638400e+04   4.375655e-06   0.000000e+00   4.375655e-06   0.000000e+00 
  9.651200e+04   4.284396e-06   0.000000e+00   4.284396e-06   0.000000e+00 
  9.664000e+04   4.998187e-06   0.000000e+00   4.998187e-06   0.000000e+00 
  9.676800e+04   7.394900e-06   0.000000e+00   7.394900e-06   0.000000e+00 
  9.689600e+04   7.161445e-06   0.000000e+00   7.161445e-06   0.000000e+00 
  9.702400e+04   4.997594e-06   0.000000e+00   4.997594e-06   0.000000e+00 
  9.715200e+04   3.711294e-06   0.000000e+00   3.711294e-06   0.000000e+00 
  9.728000e+04   3.662793e-06   0.000000e+00   3.662793e-06   0.000000e+00 
  9.740800e+04   3.923565e-06   0.000000e+00   3.923565e-06   0.000000e+00 
  9.753600e+04   5.736778e-06   0.000000e+00   5.736778e-06   0.000000e+00 
  9.766400e+04   6.071634e-06   0.000000e+00   6.071634e-06   0.000000e+00 
  9.779200e+04   3.901036e-06   0.000000e+00   3.901036e-06   0.000000e+00 
  9.792000e+04   3.770988e-06   0.000000e+00   3.770988e-06   0.000000e+00 
  9.804800e+04   3.773109e-06   0.000000e+00   3.773109e-06   0.000000e+00 
  9.817600e+04   4.646587e-06   0.000000e+00   4.646587e-06   0.000000e+00 
  9.830400e+04   4.634463e-06   0.000000e+00   4.634463e-06   0.000000e+00 
  9.843200e+04   3.727016e-06   0.000000e+00   3.727016e-06   0.000000e+00 
  9.856000e+04   3.540998e-06   0.000000e+00   3.540998e-06   0.000000e+00 
  9.868800e+04   3.686656e-06   0.000000e+00   3.686656e-06   0.000000e+00 
  9.881600e+04   3.939517e-06   0.000000e+00   3.939517e-06   0.000000e+00 
  9.894400e+04   3.967952e-06   0.000000e+00   3.967952e-06   0.000000e+00 
  9.907200e+04   3.825576e-06   0.000000e+00   3.825576e-06   0.000000e+00 
  9.920000e+04   4.617326e-06   0.000000e+00   4.617326e-06   0.000000e+00 
  9.932800e+04   4.689739e-06   0.000000e+00   4.689739e-06   0.000000e+00 
  9.945600e+04   4.619291e-06   0.000000e+00   4.619291e-06   0.000000e+00 
  9.958400e+04   9.470153e-06   0.000000e+00   9.470153e-06   0.000000e+00 
  9.971200e+04   1.181677e-05   0.000000e+00   1.181677e-05   0.000000e+00 
  9.984000e+04   1.104208e-05   0.000000e+00   1.104208e-05   0.000000e+00 
  9.996800e+04   8.336358e-06   0.000000e+00   8.336358e-06   0.000000e+00 
  1.000960e+05   7.825908e-06   0.000000e+00   7.825908e-06   0.000000e+00 
  1.002240e+05   1.203980e-05   0.000000e+00   1.203980e-05   0.000000e+00 
  1.003520e+05   8.949507e-06   0.000000e+00   8.949507e-06   0.000000e+00 
  1.004800e+05   4.369662e-06   0.000000e+00   4.369662e-06   0.000000e+00 
  1.006080e+05   3.836755e-06   0.000000e+00   3.836755e-06   0.000000e+00 
  1.007360e+05   4.334959e-06   0.000000e+00   4.334959e-06   0.000000e+00 
  1.008640e+05   4.409463e-06   0.000000e+00   4.409463e-06   0.000000e+00 
  1.009920e+05   3.739221e-06   0.000000e+00   3.739221e-06   0.000000e+00 
  1.011200e+05   3.670454e-06   0.000000e+00   3.670454e-06   0.000000e+00 
  1.012480e+05   4.429853e-06   0.000000e+00   4.429853e-06   0.000000e+00 
  1.013760e+05   4.870590e-06   0.000000e+00   4.870590e-06   0.000000e+00 
  1.015040e+05   7.886809e-06   0.000000e+00   7.886809e-06   0.000000e+00 
  1.016320e+05   1.216302e-05   0.000000e+00   1.216302e-05   0.000000e+00 
  1.017600e+05   7.324645e-06   0.000000e+00   7.324645e-06   0.000000e+00 
  1.018880e+05   5.907150e-06   0.000000e+00   5.907150e-06   0.000000e+00 
  1.020160e+05   5.645169e-06   0.000000e+00   5.645169e-06   0.000000e+00 
  1.021440e+05   5.229675e-06   0.000000e+00   5.229675e-06   0.000000e+00 
  1.022720e+05   4.436936e-06   0.000000e+00   4.436936e-06   0.000000e+00 
  1.024000e+05   3.613933e-06   0.000000e+00   3.613933e-06   0.000000e+00 
