  0.000000e+00   6.582239e-05   0.000000e+00   6.582239e-05   0.000000e+00 
  1.280000e+02   6.989654e-05   0.000000e+00   6.989654e-05   0.000000e+00 
  2.560000e+02   7.636994e-05   0.000000e+00   7.636994e-05   0.000000e+00 
  3.840000e+02   7.643575e-05   0.000000e+00   7.643575e-05   0.000000e+00 
  5.120000e+02   8.077326e-05   0.000000e+00   8.077326e-05   0.000000e+00 
  6.400000e+02   8.369522e-05   0.000000e+00   8.369522e-05   0.000000e+00 
  7.680000e+02   8.951201e-05   0.000000e+00   8.951201e-05   0.000000e+00 
  8.960000e+02   9.619138e-05   0.000000e+00   9.619138e-05   0.000000e+00 
  1.024000e+03   1.015007e-04   0.000000e+00   1.015007e-04   0.000000e+00 
  1.152000e+03   1.089631e-04   0.000000e+00   1.089631e-04   0.000000e+00 
  1.280000e+03   1.194617e-04   0.000000e+00   1.194617e-04   0.000000e+00 
  1.408000e+03   1.297943e-04   0.000000e+00   1.297943e-04   0.000000e+00 
  1.536000e+03   1.333500e-04   0.000000e+00   1.333500e-04   0.000000e+00 
  1.664000e+03   1.410886e-04   0.000000e+00   1.410886e-04   0.000000e+00 
  1.792000e+03   1.504304e-04   0.000000e+00   1.504304e-04   0.000000e+00 
  1.920000e+03   1.638034e-04   0.000000e+00   1.638034e-04   0.000000e+00 
  2.048000e+03   1.684476e-04   0.000000e+00   1.684476e-04   0.000000e+00 
  2.176000e+03   1.803604e-04   0.000000e+00   1.803604e-04   0.000000e+00 
  2.304000e+03   1.979176e-04   0.000000e+00   1.979176e-04   0.000000e+00 
  2.432000e+03   2.027128e-04   0.000000e+00   2.027128e-04   0.000000e+00 
  2.560000e+03   2.028490e-04   0.000000e+00   2.028490e-04   0.000000e+00 
  2.688000e+03   2.095390e-04   0.000000e+00   2.095390e-04   0.000000e+00 
  2.816000e+03   2.149830e-04   0.000000e+00   2.149830e-04   0.000000e+00 
  2.944000e+03   2.241924e-04   0.000000e+00   2.241924e-04   0.000000e+00 
  3.072000e+03   2.291765e-04   0.000000e+00   2.291765e-04   0.000000e+00 
  3.200000e+03   2.369174e-04   0.000000e+00   2.369174e-04   0.000000e+00 
  3.328000e+03   2.490511e-04   0.000000e+00   2.490511e-04   0.000000e+00 
  3.456000e+03   2.549028e-04   0.000000e+00   2.549028e-04   0.000000e+00 
  3.584000e+03   2.612958e-04   0.000000e+00   2.612958e-04   0.000000e+00 
  3.712000e+03   2.829503e-04   0.000000e+00   2.829503e-04   0.000000e+00 
  3.840000e+03   2.810328e-04   0.000000e+00   2.810328e-04   0.000000e+00 
  3.968000e+03   2.784643e-04   0.000000e+00   2.784643e-04   0.000000e+00 
  4.096000e+03   2.781372e-04   0.000000e+00   2.781372e-04   0.000000e+00 
  4.224000e+03   2.911431e-04   0.000000e+00   2.911431e-04   0.000000e+00 
  4.352000e+03   2.966395e-04   0.000000e+00   2.966395e-04   0.000000e+00 
  4.480000e+03   3.092960e-04   0.000000e+00   3.092960e-04   0.000000e+00 
  4.608000e+03   3.196082e-04   0.000000e+00   3.196082e-04   0.000000e+00 
  4.736000e+03   3.275932e-04   0.000000e+00   3.275932e-04   0.000000e+00 
  4.864000e+03   3.285465e-04   0.000000e+00   3.285465e-04   0.000000e+00 
  4.992000e+03   3.707941e-04   0.000000e+00   3.707941e-04   0.000000e+00 
  5.120000e+03   4.392334e-04   0.000000e+00   4.392334e-04   0.000000e+00 
  5.248000e+03   5.117281e-04   0.000000e+00   5.117281e-04   0.000000e+00 
  5.376000e+03   4.820291e-04   0.000000e+00   4.820291e-04   0.000000e+00 
  5.504000e+03   3.745472e-04   0.000000e+00   3.745472e-04   0.000000e+00 
  5.632000e+03   3.611920e-04   0.000000e+00   3.611920e-04   0.000000e+00 
  5.760000e+03   3.599255e-04   0.000000e+00   3.599255e-04   0.000000e+00 
  5.888000e+03   3.688754e-04   0.000000e+00   3.688754e-04   0.000000e+00 
  6.016000e+03   3.754800e-04   0.000000e+00   3.754800e-04   0.000000e+00 
  6.144000e+03   3.638023e-04   0.000000e+00   3.638023e-04   0.000000e+00 
  6.272000e+03   3.693730e-04   0.000000e+00   3.693730e-04   0.000000e+00 
  6.400000e+03   3.920947e-04   0.000000e+00   3.920947e-04   0.000000e+00 
  6.528000e+03   3.971573e-04   0.000000e+00   3.971573e-04   0.000000e+00 
  6.656000e+03   3.959158e-04   0.000000e+00   3.959158e-04   0.000000e+00 
  6.784000e+03   3.933690e-04   0.000000e+00   3.933690e-04   0.000000e+00 
  6.912000e+03   4.059727e-04   0.000000e+00   4.059727e-04   0.000000e+00 
  7.040000e+03   4.143986e-04   0.000000e+00   4.143986e-04   0.000000e+00 
  7.168000e+03   4.102319e-04   0.000000e+00   4.102319e-04   0.000000e+00 
  7.296000e+03   4.179817e-04   0.000000e+00   4.179817e-04   0.000000e+00 
  7.424000e+03   4.315039e-04   0.000000e+00   4.315039e-04   0.000000e+00 
  7.552000e+03   4.330035e-04   0.000000e+00   4.330035e-04   0.000000e+00 
  7.680000e+03   4.339803e-04   0.000000e+00   4.339803e-04   0.000000e+00 
  7.808000e+03   4.425410e-04   0.000000e+00   4.425410e-04   0.000000e+00 
  7.936000e+03   4.573731e-04   0.000000e+00   4.573731e-04   0.000000e+00 
  8.064000e+03   4.450860e-04   0.000000e+00   4.450860e-04   0.000000e+00 
  8.192000e+03   4.407760e-04   0.000000e+00   4.407760e-04   0.000000e+00 
  8.320000e+03   4.387308e-04   0.000000e+00   4.387308e-04   0.000000e+00 
  8.448000e+03   4.388909e-04   0.000000e+00   4.388909e-04   0.000000e+00 
  8.576000e+03   4.475795e-04   0.000000e+00   4.475795e-04   0.000000e+00 
  8.704000e+03   4.428827e-04   0.000000e+00   4.428827e-04   0.000000e+00 
  8.832000e+03   4.454862e-04   0.000000e+00   4.454862e-04   0.000000e+00 
  8.960000e+03   4.532939e-04   0.000000e+00   4.532939e-04   0.000000e+00 
  9.088000e+03   4.576582e-04   0.000000e+00   4.576582e-04   0.000000e+00 
  9.216000e+03   5.641296e-04   0.000000e+00   5.641296e-04   0.000000e+00 
  9.344000e+03   6.391528e-04   0.000000e+00   6.391528e-04   0.000000e+00 
  9.472000e+03   5.158203e-04   0.000000e+00   5.158203e-04   0.000000e+00 
  9.600000e+03   6.250844e-04   0.000000e+00   6.250844e-04   0.000000e+00 
  9.728000e+03   7.481293e-04   0.000000e+00   7.481293e-04   0.000000e+00 
  9.856000e+03   5.532691e-04   0.000000e+00   5.532691e-04   0.000000e+00 
  9.984000e+03   4.890326e-04   0.000000e+00   4.890326e-04   0.000000e+00 
  1.011200e+04   4.983933e-04   0.000000e+00   4.983933e-04   0.000000e+00 
  1.024000e+04   5.132629e-04   0.000000e+00   5.132629e-04   0.000000e+00 
  1.036800e+04   4.907964e-04   0.000000e+00   4.907964e-04   0.000000e+00 
  1.049600e+04   4.943379e-04   0.000000e+00   4.943379e-04   0.000000e+00 
  1.062400e+04   4.866006e-04   0.000000e+00   4.866006e-04   0.000000e+00 
  1.075200e+04   4.815971e-04   0.000000e+00   4.815971e-04   0.000000e+00 
  1.088000e+04   4.970835e-04   0.000000e+00   4.970835e-04   0.000000e+00 
  1.100800e+04   5.046021e-04   0.000000e+00   5.046021e-04   0.000000e+00 
  1.113600e+04   4.912979e-04   0.000000e+00   4.912979e-04   0.000000e+00 
  1.126400e+04   4.916349e-04   0.000000e+00   4.916349e-04   0.000000e+00 
  1.139200e+04   4.986415e-04   0.000000e+00   4.986415e-04   0.000000e+00 
  1.152000e+04   5.259663e-04   0.000000e+00   5.259663e-04   0.000000e+00 
  1.164800e+04   5.375354e-04   0.000000e+00   5.375354e-04   0.000000e+00 
  1.177600e+04   5.097748e-04   0.000000e+00   5.097748e-04   0.000000e+00 
  1.190400e+04   5.002128e-04   0.000000e+00   5.002128e-04   0.000000e+00 
  1.203200e+04   5.282145e-04   0.000000e+00   5.282145e-04   0.000000e+00 
  1.216000e+04   5.455727e-04   0.000000e+00   5.455727e-04   0.000000e+00 
  1.228800e+04   5.264929e-04   0.000000e+00   5.264929e-04   0.000000e+00 
  1.241600e+04   5.251617e-04   0.000000e+00   5.251617e-04   0.000000e+00 
  1.254400e+04   5.312731e-04   0.000000e+00   5.312731e-04   0.000000e+00 
  1.267200e+04   5.280880e-04   0.000000e+00   5.280880e-04   0.000000e+00 
  1.280000e+04   5.341154e-04   0.000000e+00   5.341154e-04   0.000000e+00 
  1.292800e+04   5.450661e-04   0.000000e+00   5.450661e-04   0.000000e+00 
  1.305600e+04   5.371645e-04   0.000000e+00   5.371645e-04   0.000000e+00 
  1.318400e+04   5.547915e-04   0.000000e+00   5.547915e-04   0.000000e+00 
  1.331200e+04   5.714354e-04   0.000000e+00   5.714354e-04   0.000000e+00 
  1.344000e+04   5.739445e-04   0.000000e+00   5.739445e-04   0.000000e+00 
  1.356800e+04   5.653069e-04   0.000000e+00   5.653069e-04   0.000000e+00 
  1.369600e+04   5.391914e-04   0.000000e+00   5.391914e-04   0.000000e+00 
  1.382400e+04   5.532879e-04   0.000000e+00   5.532879e-04   0.000000e+00 
  1.395200e+04   5.801418e-04   0.000000e+00   5.801418e-04   0.000000e+00 
  1.408000e+04   5.495716e-04   0.000000e+00   5.495716e-04   0.000000e+00 
  1.420800e+04   5.435675e-04   0.000000e+00   5.435675e-04   0.000000e+00 
  1.433600e+04   5.583987e-04   0.000000e+00   5.583987e-04   0.000000e+00 
  1.446400e+04   5.629448e-04   0.000000e+00   5.629448e-04   0.000000e+00 
  1.459200e+04   5.530109e-04   0.000000e+00   5.530109e-04   0.000000e+00 
  1.472000e+04   5.586704e-04   0.000000e+00   5.586704e-04   0.000000e+00 
  1.484800e+04   5.781227e-04   0.000000e+00   5.781227e-04   0.000000e+00 
  1.497600e+04   5.804224e-04   0.000000e+00   5.804224e-04   0.000000e+00 
  1.510400e+04   5.794287e-04   0.000000e+00   5.794287e-04   0.000000e+00 
  1.523200e+04   5.711928e-04   0.000000e+00   5.711928e-04   0.000000e+00 
  1.536000e+04   5.624620e-04   0.000000e+00   5.624620e-04   0.000000e+00 
  1.548800e+04   5.764868e-04   0.000000e+00   5.764868e-04   0.000000e+00 
  1.561600e+04   5.757212e-04   0.000000e+00   5.757212e-04   0.000000e+00 
  1.574400e+04   5.777369e-04   0.000000e+00   5.777369e-04   0.000000e+00 
  1.587200e+04   5.819363e-04   0.000000e+00   5.819363e-04   0.000000e+00 
  1.600000e+04   5.940772e-04   0.000000e+00   5.940772e-04   0.000000e+00 
  1.612800e+04   6.153616e-04   0.000000e+00   6.153616e-04   0.000000e+00 
  1.625600e+04   5.956952e-04   0.000000e+00   5.956952e-04   0.000000e+00 
  1.638400e+04   6.016798e-04   0.000000e+00   6.016798e-04   0.000000e+00 
  1.651200e+04   6.382830e-04   0.000000e+00   6.382830e-04   0.000000e+00 
  1.664000e+04   6.578776e-04   0.000000e+00   6.578776e-04   0.000000e+00 
  1.676800e+04   6.331027e-04   0.000000e+00   6.331027e-04   0.000000e+00 
  1.689600e+04   6.143686e-04   0.000000e+00   6.143686e-04   0.000000e+00 
  1.702400e+04   6.120641e-04   0.000000e+00   6.120641e-04   0.000000e+00 
  1.715200e+04   6.615437e-04   0.000000e+00   6.615437e-04   0.000000e+00 
  1.728000e+04   7.440288e-04   0.000000e+00   7.440288e-04   0.000000e+00 
  1.740800e+04   6.455207e-04   0.000000e+00   6.455207e-04   0.000000e+00 
  1.753600e+04   5.941910e-04   0.000000e+00   5.941910e-04   0.000000e+00 
  1.766400e+04   6.085585e-04   0.000000e+00   6.085585e-04   0.000000e+00 
  1.779200e+04   6.335917e-04   0.000000e+00   6.335917e-04   0.000000e+00 
  1.792000e+04   6.397663e-04   0.000000e+00   6.397663e-04   0.000000e+00 
  1.804800e+04   6.186448e-04   0.000000e+00   6.186448e-04   0.000000e+00 
  1.817600e+04   6.366696e-04   0.000000e+00   6.366696e-04   0.000000e+00 
  1.830400e+04   6.359277e-04   0.000000e+00   6.359277e-04   0.000000e+00 
  1.843200e+04   6.576018e-04   0.000000e+00   6.576018e-04   0.000000e+00 
  1.856000e+04   8.846542e-04   0.000000e+00   8.846542e-04   0.000000e+00 
  1.868800e+04   8.569397e-04   0.000000e+00   8.569397e-04   0.000000e+00 
  1.881600e+04   6.660360e-04   0.000000e+00   6.660360e-04   0.000000e+00 
  1.894400e+04   6.866767e-04   0.000000e+00   6.866767e-04   0.000000e+00 
  1.907200e+04   7.176751e-04   0.000000e+00   7.176751e-04   0.000000e+00 
  1.920000e+04   6.650046e-04   0.000000e+00   6.650046e-04   0.000000e+00 
  1.932800e+04   6.444100e-04   0.000000e+00   6.444100e-04   0.000000e+00 
  1.945600e+04   6.542083e-04   0.000000e+00   6.542083e-04   0.000000e+00 
  1.958400e+04   6.605732e-04   0.000000e+00   6.605732e-04   0.000000e+00 
  1.971200e+04   6.592222e-04   0.000000e+00   6.592222e-04   0.000000e+00 
  1.984000e+04   6.590630e-04   0.000000e+00   6.590630e-04   0.000000e+00 
  1.996800e+04   6.711302e-04   0.000000e+00   6.711302e-04   0.000000e+00 
  2.009600e+04   6.658694e-04   0.000000e+00   6.658694e-04   0.000000e+00 
  2.022400e+04   6.798293e-04   0.000000e+00   6.798293e-04   0.000000e+00 
  2.035200e+04   6.788064e-04   0.000000e+00   6.788064e-04   0.000000e+00 
  2.048000e+04   6.799531e-04   0.000000e+00   6.799531e-04   0.000000e+00 
  2.060800e+04   6.929177e-04   0.000000e+00   6.929177e-04   0.000000e+00 
  2.073600e+04   6.901545e-04   0.000000e+00   6.901545e-04   0.000000e+00 
  2.086400e+04   6.837281e-04   0.000000e+00   6.837281e-04   0.000000e+00 
  2.099200e+04   7.018577e-04   0.000000e+00   7.018577e-04   0.000000e+00 
  2.112000e+04   7.006926e-04   0.000000e+00   7.006926e-04   0.000000e+00 
  2.124800e+04   6.759870e-04   0.000000e+00   6.759870e-04   0.000000e+00 
  2.137600e+04   6.964114e-04   0.000000e+00   6.964114e-04   0.000000e+00 
  2.150400e+04   7.344479e-04   0.000000e+00   7.344479e-04   0.000000e+00 
  2.163200e+04   7.328845e-04   0.000000e+00   7.328845e-04   0.000000e+00 
  2.176000e+04   9.426724e-04   0.000000e+00   9.426724e-04   0.000000e+00 
  2.188800e+04   1.136558e-03   0.000000e+00   1.136558e-03   0.000000e+00 
  2.201600e+04   7.959293e-04   0.000000e+00   7.959293e-04   0.000000e+00 
  2.214400e+04   7.189023e-04   0.000000e+00   7.189023e-04   0.000000e+00 
  2.227200e+04   7.414609e-04   0.000000e+00   7.414609e-04   0.000000e+00 
  2.240000e+04   8.145034e-04   0.000000e+00   8.145034e-04   0.000000e+00 
  2.252800e+04   7.518295e-04   0.000000e+00   7.518295e-04   0.000000e+00 
  2.265600e+04   7.276078e-04   0.000000e+00   7.276078e-04   0.000000e+00 
  2.278400e+04   7.286079e-04   0.000000e+00   7.286079e-04   0.000000e+00 
  2.291200e+04   7.428176e-04   0.000000e+00   7.428176e-04   0.000000e+00 
  2.304000e+04   7.578370e-04   0.000000e+00   7.578370e-04   0.000000e+00 
  2.316800e+04   7.363951e-04   0.000000e+00   7.363951e-04   0.000000e+00 
  2.329600e+04   7.347437e-04   0.000000e+00   7.347437e-04   0.000000e+00 
  2.342400e+04   7.290227e-04   0.000000e+00   7.290227e-04   0.000000e+00 
  2.355200e+04   7.393620e-04   0.000000e+00   7.393620e-04   0.000000e+00 
  2.368000e+04   7.632520e-04   0.000000e+00   7.632520e-04   0.000000e+00 
  2.380800e+04   8.100690e-04   0.000000e+00   8.100690e-04   0.000000e+00 
  2.393600e+04   8.592391e-04   0.000000e+00   8.592391e-04   0.000000e+00 
  2.406400e+04   9.070507e-04   0.000000e+00   9.070507e-04   0.000000e+00 
  2.419200e+04   8.488163e-04   0.000000e+00   8.488163e-04   0.000000e+00 
  2.432000e+04   7.860372e-04   0.000000e+00   7.860372e-04   0.000000e+00 
  2.444800e+04   7.462648e-04   0.000000e+00   7.462648e-04   0.000000e+00 
  2.457600e+04   7.649584e-04   0.000000e+00   7.649584e-04   0.000000e+00 
  2.470400e+04   7.691077e-04   0.000000e+00   7.691077e-04   0.000000e+00 
  2.483200e+04   7.835079e-04   0.000000e+00   7.835079e-04   0.000000e+00 
  2.496000e+04   7.747082e-04   0.000000e+00   7.747082e-04   0.000000e+00 
  2.508800e+04   7.670769e-04   0.000000e+00   7.670769e-04   0.000000e+00 
  2.521600e+04   8.271161e-04   0.000000e+00   8.271161e-04   0.000000e+00 
  2.534400e+04   8.996092e-04   0.000000e+00   8.996092e-04   0.000000e+00 
  2.547200e+04   8.581261e-04   0.000000e+00   8.581261e-04   0.000000e+00 
  2.560000e+04   8.569859e-04   0.000000e+00   8.569859e-04   0.000000e+00 
  2.572800e+04   8.522884e-04   0.000000e+00   8.522884e-04   0.000000e+00 
  2.585600e+04   8.333198e-04   0.000000e+00   8.333198e-04   0.000000e+00 
  2.598400e+04   8.669652e-04   0.000000e+00   8.669652e-04   0.000000e+00 
  2.611200e+04   8.525755e-04   0.000000e+00   8.525755e-04   0.000000e+00 
  2.624000e+04   8.252813e-04   0.000000e+00   8.252813e-04   0.000000e+00 
  2.636800e+04   8.109863e-04   0.000000e+00   8.109863e-04   0.000000e+00 
  2.649600e+04   8.130513e-04   0.000000e+00   8.130513e-04   0.000000e+00 
  2.662400e+04   8.297552e-04   0.000000e+00   8.297552e-04   0.000000e+00 
  2.675200e+04   8.712706e-04   0.000000e+00   8.712706e-04   0.000000e+00 
  2.688000e+04   9.095679e-04   0.000000e+00   9.095679e-04   0.000000e+00 
  2.700800e+04   9.163257e-04   0.000000e+00   9.163257e-04   0.000000e+00 
  2.713600e+04   8.695216e-04   0.000000e+00   8.695216e-04   0.000000e+00 
  2.726400e+04   9.029595e-04   0.000000e+00   9.029595e-04   0.000000e+00 
  2.739200e+04   8.790740e-04   0.000000e+00   8.790740e-04   0.000000e+00 
  2.752000e+04   8.693766e-04   0.000000e+00   8.693766e-04   0.000000e+00 
  2.764800e+04   9.039206e-04   0.000000e+00   9.039206e-04   0.000000e+00 
  2.777600e+04   8.784430e-04   0.000000e+00   8.784430e-04   0.000000e+00 
  2.790400e+04   8.977198e-04   0.000000e+00   8.977198e-04   0.000000e+00 
  2.803200e+04   8.942687e-04   0.000000e+00   8.942687e-04   0.000000e+00 
  2.816000e+04   8.657275e-04   0.000000e+00   8.657275e-04   0.000000e+00 
  2.828800e+04   8.755058e-04   0.000000e+00   8.755058e-04   0.000000e+00 
  2.841600e+04   8.612216e-04   0.000000e+00   8.612216e-04   0.000000e+00 
  2.854400e+04   8.732897e-04   0.000000e+00   8.732897e-04   0.000000e+00 
  2.867200e+04   9.066349e-04   0.000000e+00   9.066349e-04   0.000000e+00 
  2.880000e+04   9.309156e-04   0.000000e+00   9.309156e-04   0.000000e+00 
  2.892800e+04   9.708419e-04   0.000000e+00   9.708419e-04   0.000000e+00 
  2.905600e+04   9.326587e-04   0.000000e+00   9.326587e-04   0.000000e+00 
  2.918400e+04   9.176445e-04   0.000000e+00   9.176445e-04   0.000000e+00 
  2.931200e+04   9.222305e-04   0.000000e+00   9.222305e-04   0.000000e+00 
  2.944000e+04   9.462819e-04   0.000000e+00   9.462819e-04   0.000000e+00 
  2.956800e+04   9.385752e-04   0.000000e+00   9.385752e-04   0.000000e+00 
  2.969600e+04   9.353493e-04   0.000000e+00   9.353493e-04   0.000000e+00 
  2.982400e+04   9.560135e-04   0.000000e+00   9.560135e-04   0.000000e+00 
  2.995200e+04   9.499863e-04   0.000000e+00   9.499863e-04   0.000000e+00 
  3.008000e+04   9.482728e-04   0.000000e+00   9.482728e-04   0.000000e+00 
  3.020800e+04   9.510961e-04   0.000000e+00   9.510961e-04   0.000000e+00 
  3.033600e+04   9.842048e-04   0.000000e+00   9.842048e-04   0.000000e+00 
  3.046400e+04   1.041708e-03   0.000000e+00   1.041708e-03   0.000000e+00 
  3.059200e+04   1.104098e-03   0.000000e+00   1.104098e-03   0.000000e+00 
  3.072000e+04   1.215815e-03   0.000000e+00   1.215815e-03   0.000000e+00 
  3.084800e+04   1.051359e-03   0.000000e+00   1.051359e-03   0.000000e+00 
  3.097600e+04   9.799850e-04   0.000000e+00   9.799850e-04   0.000000e+00 
  3.110400e+04   9.871145e-04   0.000000e+00   9.871145e-04   0.000000e+00 
  3.123200e+04   9.895245e-04   0.000000e+00   9.895245e-04   0.000000e+00 
  3.136000e+04   9.909995e-04   0.000000e+00   9.909995e-04   0.000000e+00 
  3.148800e+04   1.027209e-03   0.000000e+00   1.027209e-03   0.000000e+00 
  3.161600e+04   1.019598e-03   0.000000e+00   1.019598e-03   0.000000e+00 
  3.174400e+04   9.814930e-04   0.000000e+00   9.814930e-04   0.000000e+00 
  3.187200e+04   1.022562e-03   0.000000e+00   1.022562e-03   0.000000e+00 
  3.200000e+04   1.345673e-03   0.000000e+00   1.345673e-03   0.000000e+00 
  3.212800e+04   1.653738e-03   0.000000e+00   1.653738e-03   0.000000e+00 
  3.225600e+04   1.279633e-03   0.000000e+00   1.279633e-03   0.000000e+00 
  3.238400e+04   1.241542e-03   0.000000e+00   1.241542e-03   0.000000e+00 
  3.251200e+04   1.092439e-03   0.000000e+00   1.092439e-03   0.000000e+00 
  3.264000e+04   1.064015e-03   0.000000e+00   1.064015e-03   0.000000e+00 
  3.276800e+04   1.038570e-03   0.000000e+00   1.038570e-03   0.000000e+00 
  3.289600e+04   9.980152e-04   0.000000e+00   9.980152e-04   0.000000e+00 
  3.302400e+04   1.024697e-03   0.000000e+00   1.024697e-03   0.000000e+00 
  3.315200e+04   1.018873e-03   0.000000e+00   1.018873e-03   0.000000e+00 
  3.328000e+04   1.030282e-03   0.000000e+00   1.030282e-03   0.000000e+00 
  3.340800e+04   1.104352e-03   0.000000e+00   1.104352e-03   0.000000e+00 
  3.353600e+04   1.132341e-03   0.000000e+00   1.132341e-03   0.000000e+00 
  3.366400e+04   1.059949e-03   0.000000e+00   1.059949e-03   0.000000e+00 
  3.379200e+04   1.078834e-03   0.000000e+00   1.078834e-03   0.000000e+00 
  3.392000e+04   1.203971e-03   0.000000e+00   1.203971e-03   0.000000e+00 
  3.404800e+04   1.153595e-03   0.000000e+00   1.153595e-03   0.000000e+00 
  3.417600e+04   1.015321e-03   0.000000e+00   1.015321e-03   0.000000e+00 
  3.430400e+04   9.979561e-04   0.000000e+00   9.979561e-04   0.000000e+00 
  3.443200e+04   9.929175e-04   0.000000e+00   9.929175e-04   0.000000e+00 
  3.456000e+04   1.015743e-03   0.000000e+00   1.015743e-03   0.000000e+00 
  3.468800e+04   9.854013e-04   0.000000e+00   9.854013e-04   0.000000e+00 
  3.481600e+04   9.789374e-04   0.000000e+00   9.789374e-04   0.000000e+00 
  3.494400e+04   9.650415e-04   0.000000e+00   9.650415e-04   0.000000e+00 
  3.507200e+04   9.341067e-04   0.000000e+00   9.341067e-04   0.000000e+00 
  3.520000e+04   9.645201e-04   0.000000e+00   9.645201e-04   0.000000e+00 
  3.532800e+04   9.670340e-04   0.000000e+00   9.670340e-04   0.000000e+00 
  3.545600e+04   9.455361e-04   0.000000e+00   9.455361e-04   0.000000e+00 
  3.558400e+04   9.870959e-04   0.000000e+00   9.870959e-04   0.000000e+00 
  3.571200e+04   1.004801e-03   0.000000e+00   1.004801e-03   0.000000e+00 
  3.584000e+04   1.183977e-03   0.000000e+00   1.183977e-03   0.000000e+00 
  3.596800e+04   1.051379e-03   0.000000e+00   1.051379e-03   0.000000e+00 
  3.609600e+04   9.624235e-04   0.000000e+00   9.624235e-04   0.000000e+00 
  3.622400e+04   1.007813e-03   0.000000e+00   1.007813e-03   0.000000e+00 
  3.635200e+04   1.036061e-03   0.000000e+00   1.036061e-03   0.000000e+00 
  3.648000e+04   9.468922e-04   0.000000e+00   9.468922e-04   0.000000e+00 
  3.660800e+04   9.002558e-04   0.000000e+00   9.002558e-04   0.000000e+00 
  3.673600e+04   9.119381e-04   0.000000e+00   9.119381e-04   0.000000e+00 
  3.686400e+04   9.211591e-04   0.000000e+00   9.211591e-04   0.000000e+00 
  3.699200e+04   9.314831e-04   0.000000e+00   9.314831e-04   0.000000e+00 
  3.712000e+04   1.247712e-03   0.000000e+00   1.247712e-03   0.000000e+00 
  3.724800e+04   1.519259e-03   0.000000e+00   1.519259e-03   0.000000e+00 
  3.737600e+04   1.506998e-03   0.000000e+00   1.506998e-03   0.000000e+00 
  3.750400e+04   1.199214e-03   0.000000e+00   1.199214e-03   0.000000e+00 
  3.763200e+04   9.663850e-04   0.000000e+00   9.663850e-04   0.000000e+00 
  3.776000e+04   9.191574e-04   0.000000e+00   9.191574e-04   0.000000e+00 
  3.788800e+04   8.793726e-04   0.000000e+00   8.793726e-04   0.000000e+00 
  3.801600e+04   8.429648e-04   0.000000e+00   8.429648e-04   0.000000e+00 
  3.814400e+04   8.142487e-04   0.000000e+00   8.142487e-04   0.000000e+00 
  3.827200e+04   7.972917e-04   0.000000e+00   7.972917e-04   0.000000e+00 
  3.840000e+04   8.071961e-04   0.000000e+00   8.071961e-04   0.000000e+00 
  3.852800e+04   7.913347e-04   0.000000e+00   7.913347e-04   0.000000e+00 
  3.865600e+04   7.890891e-04   0.000000e+00   7.890891e-04   0.000000e+00 
  3.878400e+04   8.757591e-04   0.000000e+00   8.757591e-04   0.000000e+00 
  3.891200e+04   8.897021e-04   0.000000e+00   8.897021e-04   0.000000e+00 
  3.904000e+04   7.925593e-04   0.000000e+00   7.925593e-04   0.000000e+00 
  3.916800e+04   7.608961e-04   0.000000e+00   7.608961e-04   0.000000e+00 
  3.929600e+04   7.523199e-04   0.000000e+00   7.523199e-04   0.000000e+00 
  3.942400e+04   7.291339e-04   0.000000e+00   7.291339e-04   0.000000e+00 
  3.955200e+04   7.257903e-04   0.000000e+00   7.257903e-04   0.000000e+00 
  3.968000e+04   7.165823e-04   0.000000e+00   7.165823e-04   0.000000e+00 
  3.980800e+04   6.954896e-04   0.000000e+00   6.954896e-04   0.000000e+00 
  3.993600e+04   6.870065e-04   0.000000e+00   6.870065e-04   0.000000e+00 
  4.006400e+04   7.089686e-04   0.000000e+00   7.089686e-04   0.000000e+00 
  4.019200e+04   6.976515e-04   0.000000e+00   6.976515e-04   0.000000e+00 
  4.032000e+04   6.731767e-04   0.000000e+00   6.731767e-04   0.000000e+00 
  4.044800e+04   6.719441e-04   0.000000e+00   6.719441e-04   0.000000e+00 
  4.057600e+04   6.659264e-04   0.000000e+00   6.659264e-04   0.000000e+00 
  4.070400e+04   6.623313e-04   0.000000e+00   6.623313e-04   0.000000e+00 
  4.083200e+04   6.587012e-04   0.000000e+00   6.587012e-04   0.000000e+00 
  4.096000e+04   6.457118e-04   0.000000e+00   6.457118e-04   0.000000e+00 
  4.108800e+04   6.250541e-04   0.000000e+00   6.250541e-04   0.000000e+00 
  4.121600e+04   6.261503e-04   0.000000e+00   6.261503e-04   0.000000e+00 
  4.134400e+04   6.535767e-04   0.000000e+00   6.535767e-04   0.000000e+00 
  4.147200e+04   6.604025e-04   0.000000e+00   6.604025e-04   0.000000e+00 
  4.160000e+04   6.029392e-04   0.000000e+00   6.029392e-04   0.000000e+00 
  4.172800e+04   5.970995e-04   0.000000e+00   5.970995e-04   0.000000e+00 
  4.185600e+04   6.016675e-04   0.000000e+00   6.016675e-04   0.000000e+00 
  4.198400e+04   6.145490e-04   0.000000e+00   6.145490e-04   0.000000e+00 
  4.211200e+04   6.140609e-04   0.000000e+00   6.140609e-04   0.000000e+00 
  4.224000e+04   6.402841e-04   0.000000e+00   6.402841e-04   0.000000e+00 
  4.236800e+04   6.109651e-04   0.000000e+00   6.109651e-04   0.000000e+00 
  4.249600e+04   6.166778e-04   0.000000e+00   6.166778e-04   0.000000e+00 
  4.262400e+04   5.953066e-04   0.000000e+00   5.953066e-04   0.000000e+00 
  4.275200e+04   5.540097e-04   0.000000e+00   5.540097e-04   0.000000e+00 
  4.288000e+04   5.457789e-04   0.000000e+00   5.457789e-04   0.000000e+00 
  4.300800e+04   5.266417e-04   0.000000e+00   5.266417e-04   0.000000e+00 
  4.313600e+04   5.418589e-04   0.000000e+00   5.418589e-04   0.000000e+00 
  4.326400e+04   5.451047e-04   0.000000e+00   5.451047e-04   0.000000e+00 
  4.339200e+04   5.384991e-04   0.000000e+00   5.384991e-04   0.000000e+00 
  4.352000e+04   5.731404e-04   0.000000e+00   5.731404e-04   0.000000e+00 
  4.364800e+04   8.073316e-04   0.000000e+00   8.073316e-04   0.000000e+00 
  4.377600e+04   8.657944e-04   0.000000e+00   8.657944e-04   0.000000e+00 
  4.390400e+04   5.978697e-04   0.000000e+00   5.978697e-04   0.000000e+00 
  4.403200e+04   5.341034e-04   0.000000e+00   5.341034e-04   0.000000e+00 
  4.416000e+04   5.060255e-04   0.000000e+00   5.060255e-04   0.000000e+00 
  4.428800e+04   5.009238e-04   0.000000e+00   5.009238e-04   0.000000e+00 
  4.441600e+04   4.941282e-04   0.000000e+00   4.941282e-04   0.000000e+00 
  4.454400e+04   4.815540e-04   0.000000e+00   4.815540e-04   0.000000e+00 
  4.467200e+04   4.862819e-04   0.000000e+00   4.862819e-04   0.000000e+00 
  4.480000e+04   4.813429e-04   0.000000e+00   4.813429e-04   0.000000e+00 
  4.492800e+04   4.731310e-04   0.000000e+00   4.731310e-04   0.000000e+00 
  4.505600e+04   4.717920e-04   0.000000e+00   4.717920e-04   0.000000e+00 
  4.518400e+04   4.695291e-04   0.000000e+00   4.695291e-04   0.000000e+00 
  4.531200e+04   4.591941e-04   0.000000e+00   4.591941e-04   0.000000e+00 
  4.544000e+04   4.826837e-04   0.000000e+00   4.826837e-04   0.000000e+00 
  4.556800e+04   5.273994e-04   0.000000e+00   5.273994e-04   0.000000e+00 
  4.569600e+04   4.713098e-04   0.000000e+00   4.713098e-04   0.000000e+00 
  4.582400e+04   4.623425e-04   0.000000e+00   4.623425e-04   0.000000e+00 
  4.595200e+04   4.875262e-04   0.000000e+00   4.875262e-04   0.000000e+00 
  4.608000e+04   4.407138e-04   0.000000e+00   4.407138e-04   0.000000e+00 
  4.620800e+04   4.183995e-04   0.000000e+00   4.183995e-04   0.000000e+00 
  4.633600e+04   4.180862e-04   0.000000e+00   4.180862e-04   0.000000e+00 
  4.646400e+04   4.266325e-04   0.000000e+00   4.266325e-04   0.000000e+00 
  4.659200e+04   4.291804e-04   0.000000e+00   4.291804e-04   0.000000e+00 
  4.672000e+04   4.205841e-04   0.000000e+00   4.205841e-04   0.000000e+00 
  4.684800e+04   4.215736e-04   0.000000e+00   4.215736e-04   0.000000e+00 
  4.697600e+04   4.293363e-04   0.000000e+00   4.293363e-04   0.000000e+00 
  4.710400e+04   4.359980e-04   0.000000e+00   4.359980e-04   0.000000e+00 
  4.723200e+04   4.197394e-04   0.000000e+00   4.197394e-04   0.000000e+00 
  4.736000e+04   3.965686e-04   0.000000e+00   3.965686e-04   0.000000e+00 
  4.748800e+04   3.934857e-04   0.000000e+00   3.934857e-04   0.000000e+00 
  4.761600e+04   3.919319e-04   0.000000e+00   3.919319e-04   0.000000e+00 
  4.774400e+04   3.913722e-04   0.000000e+00   3.913722e-04   0.000000e+00 
  4.787200e+04   3.946695e-04   0.000000e+00   3.946695e-04   0.000000e+00 
  4.800000e+04   3.714238e-04   0.000000e+00   3.714238e-04   0.000000e+00 
  4.812800e+04   3.795796e-04   0.000000e+00   3.795796e-04   0.000000e+00 
  4.825600e+04   3.815380e-04   0.000000e+00   3.815380e-04   0.000000e+00 
  4.838400e+04   3.825380e-04   0.000000e+00   3.825380e-04   0.000000e+00 
  4.851200e+04   3.727024e-04   0.000000e+00   3.727024e-04   0.000000e+00 
  4.864000e+04   3.616335e-04   0.000000e+00   3.616335e-04   0.000000e+00 
  4.876800e+04   3.612369e-04   0.000000e+00   3.612369e-04   0.000000e+00 
  4.889600e+04   3.632590e-04   0.000000e+00   3.632590e-04   0.000000e+00 
  4.902400e+04   3.554748e-04   0.000000e+00   3.554748e-04   0.000000e+00 
  4.915200e+04   3.498222e-04   0.000000e+00   3.498222e-04   0.000000e+00 
  4.928000e+04   3.588040e-04   0.000000e+00   3.588040e-04   0.000000e+00 
  4.940800e+04   3.500430e-04   0.000000e+00   3.500430e-04   0.000000e+00 
  4.953600e+04   3.355969e-04   0.000000e+00   3.355969e-04   0.000000e+00 
  4.966400e+04   3.413134e-04   0.000000e+00   3.413134e-04   0.000000e+00 
  4.979200e+04   3.683857e-04   0.000000e+00   3.683857e-04   0.000000e+00 
  4.992000e+04   3.602440e-04   0.000000e+00   3.602440e-04   0.000000e+00 
  5.004800e+04   3.347254e-04   0.000000e+00   3.347254e-04   0.000000e+00 
  5.017600e+04   3.303033e-04   0.000000e+00   3.303033e-04   0.000000e+00 
  5.030400e+04   3.306255e-04   0.000000e+00   3.306255e-04   0.000000e+00 
  5.043200e+04   3.208918e-04   0.000000e+00   3.208918e-04   0.000000e+00 
  5.056000e+04   3.199545e-04   0.000000e+00   3.199545e-04   0.000000e+00 
  5.068800e+04   3.173008e-04   0.000000e+00   3.173008e-04   0.000000e+00 
  5.081600e+04   3.148941e-04   0.000000e+00   3.148941e-04   0.000000e+00 
  5.094400e+04   3.162425e-04   0.000000e+00   3.162425e-04   0.000000e+00 
  5.107200e+04   3.061680e-04   0.000000e+00   3.061680e-04   0.000000e+00 
  5.120000e+04   3.038996e-04   0.000000e+00   3.038996e-04   0.000000e+00 
  5.132800e+04   3.017842e-04   0.000000e+00   3.017842e-04   0.000000e+00 
  5.145600e+04   3.062009e-04   0.000000e+00   3.062009e-04   0.000000e+00 
  5.158400e+04   3.343642e-04   0.000000e+00   3.343642e-04   0.000000e+00 
  5.171200e+04   3.473313e-04   0.000000e+00   3.473313e-04   0.000000e+00 
  5.184000e+04   3.040762e-04   0.000000e+00   3.040762e-04   0.000000e+00 
  5.196800e+04   2.902953e-04   0.000000e+00   2.902953e-04   0.000000e+00 
  5.209600e+04   2.899166e-04   0.000000e+00   2.899166e-04   0.000000e+00 
  5.222400e+04   2.911326e-04   0.000000e+00   2.911326e-04   0.000000e+00 
  5.235200e+04   2.908806e-04   0.000000e+00   2.908806e-04   0.000000e+00 
  5.248000e+04   3.468760e-04   0.000000e+00   3.468760e-04   0.000000e+00 
  5.260800e+04   4.171068e-04   0.000000e+00   4.171068e-04   0.000000e+00 
  5.273600e+04   3.161480e-04   0.000000e+00   3.161480e-04   0.000000e+00 
  5.286400e+04   2.950697e-04   0.000000e+00   2.950697e-04   0.000000e+00 
  5.299200e+04   2.996363e-04   0.000000e+00   2.996363e-04   0.000000e+00 
  5.312000e+04   2.803039e-04   0.000000e+00   2.803039e-04   0.000000e+00 
  5.324800e+04   2.751308e-04   0.000000e+00   2.751308e-04   0.000000e+00 
  5.337600e+04   2.687938e-04   0.000000e+00   2.687938e-04   0.000000e+00 
  5.350400e+04   2.675063e-04   0.000000e+00   2.675063e-04   0.000000e+00 
  5.363200e+04   2.638971e-04   0.000000e+00   2.638971e-04   0.000000e+00 
  5.376000e+04   2.550968e-04   0.000000e+00   2.550968e-04   0.000000e+00 
  5.388800e+04   2.627018e-04   0.000000e+00   2.627018e-04   0.000000e+00 
  5.401600e+04   2.624099e-04   0.000000e+00   2.624099e-04   0.000000e+00 
  5.414400e+04   2.520314e-04   0.000000e+00   2.520314e-04   0.000000e+00 
  5.427200e+04   2.572946e-04   0.000000e+00   2.572946e-04   0.000000e+00 
  5.440000e+04   3.248876e-04   0.000000e+00   3.248876e-04   0.000000e+00 
  5.452800e+04   3.995149e-04   0.000000e+00   3.995149e-04   0.000000e+00 
  5.465600e+04   2.853155e-04   0.000000e+00   2.853155e-04   0.000000e+00 
  5.478400e+04   2.519934e-04   0.000000e+00   2.519934e-04   0.000000e+00 
  5.491200e+04   2.592381e-04   0.000000e+00   2.592381e-04   0.000000e+00 
  5.504000e+04   2.419929e-04   0.000000e+00   2.419929e-04   0.000000e+00 
  5.516800e+04   2.407589e-04   0.000000e+00   2.407589e-04   0.000000e+00 
  5.529600e+04   2.382952e-04   0.000000e+00   2.382952e-04   0.000000e+00 
  5.542400e+04   2.325325e-04   0.000000e+00   2.325325e-04   0.000000e+00 
  5.555200e+04   2.260193e-04   0.000000e+00   2.260193e-04   0.000000e+00 
  5.568000e+04   2.329360e-04   0.000000e+00   2.329360e-04   0.000000e+00 
  5.580800e+04   2.345542e-04   0.000000e+00   2.345542e-04   0.000000e+00 
  5.593600e+04   2.326963e-04   0.000000e+00   2.326963e-04   0.000000e+00 
  5.606400e+04   2.296610e-04   0.000000e+00   2.296610e-04   0.000000e+00 
  5.619200e+04   2.472210e-04   0.000000e+00   2.472210e-04   0.000000e+00 
  5.632000e+04   2.374605e-04   0.000000e+00   2.374605e-04   0.000000e+00 
  5.644800e+04   2.195434e-04   0.000000e+00   2.195434e-04   0.000000e+00 
  5.657600e+04   2.229645e-04   0.000000e+00   2.229645e-04   0.000000e+00 
  5.670400e+04   2.250786e-04   0.000000e+00   2.250786e-04   0.000000e+00 
  5.683200e+04   2.280428e-04   0.000000e+00   2.280428e-04   0.000000e+00 
  5.696000e+04   2.184390e-04   0.000000e+00   2.184390e-04   0.000000e+00 
  5.708800e+04   2.073426e-04   0.000000e+00   2.073426e-04   0.000000e+00 
  5.721600e+04   2.160551e-04   0.000000e+00   2.160551e-04   0.000000e+00 
  5.734400e+04   2.173206e-04   0.000000e+00   2.173206e-04   0.000000e+00 
  5.747200e+04   2.112776e-04   0.000000e+00   2.112776e-04   0.000000e+00 
  5.760000e+04   2.150247e-04   0.000000e+00   2.150247e-04   0.000000e+00 
  5.772800e+04   2.081920e-04   0.000000e+00   2.081920e-04   0.000000e+00 
  5.785600e+04   1.980715e-04   0.000000e+00   1.980715e-04   0.000000e+00 
  5.798400e+04   1.999793e-04   0.000000e+00   1.999793e-04   0.000000e+00 
  5.811200e+04   1.988510e-04   0.000000e+00   1.988510e-04   0.000000e+00 
  5.824000e+04   1.976716e-04   0.000000e+00   1.976716e-04   0.000000e+00 
  5.836800e+04   1.948403e-04   0.000000e+00   1.948403e-04   0.000000e+00 
  5.849600e+04   1.941220e-04   0.000000e+00   1.941220e-04   0.000000e+00 
  5.862400e+04   1.949253e-04   0.000000e+00   1.949253e-04   0.000000e+00 
  5.875200e+04   1.894960e-04   0.000000e+00   1.894960e-04   0.000000e+00 
  5.888000e+04   1.823097e-04   0.000000e+00   1.823097e-04   0.000000e+00 
  5.900800e+04   1.990719e-04   0.000000e+00   1.990719e-04   0.000000e+00 
  5.913600e+04   2.074291e-04   0.000000e+00   2.074291e-04   0.000000e+00 
  5.926400e+04   1.945840e-04   0.000000e+00   1.945840e-04   0.000000e+00 
  5.939200e+04   1.921786e-04   0.000000e+00   1.921786e-04   0.000000e+00 
  5.952000e+04   1.951981e-04   0.000000e+00   1.951981e-04   0.000000e+00 
  5.964800e+04   1.877022e-04   0.000000e+00   1.877022e-04   0.000000e+00 
  5.977600e+04   1.893643e-04   0.000000e+00   1.893643e-04   0.000000e+00 
  5.990400e+04   1.862628e-04   0.000000e+00   1.862628e-04   0.000000e+00 
  6.003200e+04   1.790893e-04   0.000000e+00   1.790893e-04   0.000000e+00 
  6.016000e+04   1.850588e-04   0.000000e+00   1.850588e-04   0.000000e+00 
  6.028800e+04   1.792614e-04   0.000000e+00   1.792614e-04   0.000000e+00 
  6.041600e+04   1.729425e-04   0.000000e+00   1.729425e-04   0.000000e+00 
  6.054400e+04   1.697258e-04   0.000000e+00   1.697258e-04   0.000000e+00 
  6.067200e+04   1.680802e-04   0.000000e+00   1.680802e-04   0.000000e+00 
  6.080000e+04   1.638208e-04   0.000000e+00   1.638208e-04   0.000000e+00 
  6.092800e+04   1.662372e-04   0.000000e+00   1.662372e-04   0.000000e+00 
  6.105600e+04   1.670027e-04   0.000000e+00   1.670027e-04   0.000000e+00 
  6.118400e+04   1.677463e-04   0.000000e+00   1.677463e-04   0.000000e+00 
  6.131200e+04   1.661955e-04   0.000000e+00   1.661955e-04   0.000000e+00 
  6.144000e+04   1.632457e-04   0.000000e+00   1.632457e-04   0.000000e+00 
  6.156800e+04   1.568789e-04   0.000000e+00   1.568789e-04   0.000000e+00 
  6.169600e+04   1.574757e-04   0.000000e+00   1.574757e-04   0.000000e+00 
  6.182400e+04   1.585846e-04   0.000000e+00   1.585846e-04   0.000000e+00 
  6.195200e+04   1.578850e-04   0.000000e+00   1.578850e-04   0.000000e+00 
  6.208000e+04   1.533075e-04   0.000000e+00   1.533075e-04   0.000000e+00 
  6.220800e+04   1.503880e-04   0.000000e+00   1.503880e-04   0.000000e+00 
  6.233600e+04   1.565766e-04   0.000000e+00   1.565766e-04   0.000000e+00 
  6.246400e+04   1.543947e-04   0.000000e+00   1.543947e-04   0.000000e+00 
  6.259200e+04   1.531318e-04   0.000000e+00   1.531318e-04   0.000000e+00 
  6.272000e+04   1.491544e-04   0.000000e+00   1.491544e-04   0.000000e+00 
  6.284800e+04   1.466178e-04   0.000000e+00   1.466178e-04   0.000000e+00 
  6.297600e+04   1.461976e-04   0.000000e+00   1.461976e-04   0.000000e+00 
  6.310400e+04   1.416421e-04   0.000000e+00   1.416421e-04   0.000000e+00 
  6.323200e+04   1.445343e-04   0.000000e+00   1.445343e-04   0.000000e+00 
  6.336000e+04   1.421015e-04   0.000000e+00   1.421015e-04   0.000000e+00 
  6.348800e+04   1.376872e-04   0.000000e+00   1.376872e-04   0.000000e+00 
  6.361600e+04   1.426454e-04   0.000000e+00   1.426454e-04   0.000000e+00 
  6.374400e+04   1.491823e-04   0.000000e+00   1.491823e-04   0.000000e+00 
  6.387200e+04   1.613522e-04   0.000000e+00   1.613522e-04   0.000000e+00 
  6.400000e+04   2.014554e-04   0.000000e+00   2.014554e-04   0.000000e+00 
  6.412800e+04   3.889800e-04   0.000000e+00   3.889800e-04   0.000000e+00 
  6.425600e+04   4.382834e-04   0.000000e+00   4.382834e-04   0.000000e+00 
  6.438400e+04   2.415037e-04   0.000000e+00   2.415037e-04   0.000000e+00 
  6.451200e+04   1.602814e-04   0.000000e+00   1.602814e-04   0.000000e+00 
  6.464000e+04   1.368677e-04   0.000000e+00   1.368677e-04   0.000000e+00 
  6.476800e+04   1.313551e-04   0.000000e+00   1.313551e-04   0.000000e+00 
  6.489600e+04   1.296767e-04   0.000000e+00   1.296767e-04   0.000000e+00 
  6.502400e+04   1.267339e-04   0.000000e+00   1.267339e-04   0.000000e+00 
  6.515200e+04   1.257377e-04   0.000000e+00   1.257377e-04   0.000000e+00 
  6.528000e+04   1.220099e-04   0.000000e+00   1.220099e-04   0.000000e+00 
  6.540800e+04   1.225171e-04   0.000000e+00   1.225171e-04   0.000000e+00 
  6.553600e+04   1.241499e-04   0.000000e+00   1.241499e-04   0.000000e+00 
  6.566400e+04   1.252085e-04   0.000000e+00   1.252085e-04   0.000000e+00 
  6.579200e+04   1.218934e-04   0.000000e+00   1.218934e-04   0.000000e+00 
  6.592000e+04   1.199722e-04   0.000000e+00   1.199722e-04   0.000000e+00 
  6.604800e+04   1.241679e-04   0.000000e+00   1.241679e-04   0.000000e+00 
  6.617600e+04   1.204056e-04   0.000000e+00   1.204056e-04   0.000000e+00 
  6.630400e+04   1.155510e-04   0.000000e+00   1.155510e-04   0.000000e+00 
  6.643200e+04   1.222560e-04   0.000000e+00   1.222560e-04   0.000000e+00 
  6.656000e+04   1.360688e-04   0.000000e+00   1.360688e-04   0.000000e+00 
  6.668800e+04   1.198956e-04   0.000000e+00   1.198956e-04   0.000000e+00 
  6.681600e+04   1.198527e-04   0.000000e+00   1.198527e-04   0.000000e+00 
  6.694400e+04   1.335501e-04   0.000000e+00   1.335501e-04   0.000000e+00 
  6.707200e+04   1.242622e-04   0.000000e+00   1.242622e-04   0.000000e+00 
  6.720000e+04   1.152915e-04   0.000000e+00   1.152915e-04   0.000000e+00 
  6.732800e+04   1.110522e-04   0.000000e+00   1.110522e-04   0.000000e+00 
  6.745600e+04   1.101718e-04   0.000000e+00   1.101718e-04   0.000000e+00 
  6.758400e+04   1.113211e-04   0.000000e+00   1.113211e-04   0.000000e+00 
  6.771200e+04   1.069958e-04   0.000000e+00   1.069958e-04   0.000000e+00 
  6.784000e+04   1.045173e-04   0.000000e+00   1.045173e-04   0.000000e+00 
  6.796800e+04   1.053818e-04   0.000000e+00   1.053818e-04   0.000000e+00 
  6.809600e+04   1.046120e-04   0.000000e+00   1.046120e-04   0.000000e+00 
  6.822400e+04   1.037722e-04   0.000000e+00   1.037722e-04   0.000000e+00 
  6.835200e+04   1.037209e-04   0.000000e+00   1.037209e-04   0.000000e+00 
  6.848000e+04   1.015965e-04   0.000000e+00   1.015965e-04   0.000000e+00 
  6.860800e+04   1.002833e-04   0.000000e+00   1.002833e-04   0.000000e+00 
  6.873600e+04   1.004719e-04   0.000000e+00   1.004719e-04   0.000000e+00 
  6.886400e+04   1.006132e-04   0.000000e+00   1.006132e-04   0.000000e+00 
  6.899200e+04   1.053902e-04   0.000000e+00   1.053902e-04   0.000000e+00 
  6.912000e+04   1.042906e-04   0.000000e+00   1.042906e-04   0.000000e+00 
  6.924800e+04   1.013434e-04   0.000000e+00   1.013434e-04   0.000000e+00 
  6.937600e+04   1.055327e-04   0.000000e+00   1.055327e-04   0.000000e+00 
  6.950400e+04   1.209362e-04   0.000000e+00   1.209362e-04   0.000000e+00 
  6.963200e+04   1.104203e-04   0.000000e+00   1.104203e-04   0.000000e+00 
  6.976000e+04   1.021628e-04   0.000000e+00   1.021628e-04   0.000000e+00 
  6.988800e+04   9.949839e-05   0.000000e+00   9.949839e-05   0.000000e+00 
  7.001600e+04   9.876959e-05   0.000000e+00   9.876959e-05   0.000000e+00 
  7.014400e+04   9.746152e-05   0.000000e+00   9.746152e-05   0.000000e+00 
  7.027200e+04   9.699100e-05   0.000000e+00   9.699100e-05   0.000000e+00 
  7.040000e+04   9.772040e-05   0.000000e+00   9.772040e-05   0.000000e+00 
  7.052800e+04   9.717412e-05   0.000000e+00   9.717412e-05   0.000000e+00 
  7.065600e+04   9.707064e-05   0.000000e+00   9.707064e-05   0.000000e+00 
  7.078400e+04   9.596644e-05   0.000000e+00   9.596644e-05   0.000000e+00 
  7.091200e+04   9.646163e-05   0.000000e+00   9.646163e-05   0.000000e+00 
  7.104000e+04   9.837846e-05   0.000000e+00   9.837846e-05   0.000000e+00 
  7.116800e+04   1.054273e-04   0.000000e+00   1.054273e-04   0.000000e+00 
  7.129600e+04   1.001721e-04   0.000000e+00   1.001721e-04   0.000000e+00 
  7.142400e+04   9.816742e-05   0.000000e+00   9.816742e-05   0.000000e+00 
  7.155200e+04   1.108995e-04   0.000000e+00   1.108995e-04   0.000000e+00 
  7.168000e+04   1.521844e-04   0.000000e+00   1.521844e-04   0.000000e+00 
  7.180800e+04   1.351286e-04   0.000000e+00   1.351286e-04   0.000000e+00 
  7.193600e+04   9.922343e-05   0.000000e+00   9.922343e-05   0.000000e+00 
  7.206400e+04   9.212757e-05   0.000000e+00   9.212757e-05   0.000000e+00 
  7.219200e+04   9.276763e-05   0.000000e+00   9.276763e-05   0.000000e+00 
  7.232000e+04   9.344464e-05   0.000000e+00   9.344464e-05   0.000000e+00 
  7.244800e+04   9.239123e-05   0.000000e+00   9.239123e-05   0.000000e+00 
  7.257600e+04   9.232206e-05   0.000000e+00   9.232206e-05   0.000000e+00 
  7.270400e+04   9.032791e-05   0.000000e+00   9.032791e-05   0.000000e+00 
  7.283200e+04   8.945142e-05   0.000000e+00   8.945142e-05   0.000000e+00 
  7.296000e+04   9.155452e-05   0.000000e+00   9.155452e-05   0.000000e+00 
  7.308800e+04   9.600849e-05   0.000000e+00   9.600849e-05   0.000000e+00 
  7.321600e+04   9.105003e-05   0.000000e+00   9.105003e-05   0.000000e+00 
  7.334400e+04   9.401493e-05   0.000000e+00   9.401493e-05   0.000000e+00 
  7.347200e+04   1.075926e-04   0.000000e+00   1.075926e-04   0.000000e+00 
  7.360000e+04   1.027320e-04   0.000000e+00   1.027320e-04   0.000000e+00 
  7.372800e+04   8.676046e-05   0.000000e+00   8.676046e-05   0.000000e+00 
  7.385600e+04   8.666104e-05   0.000000e+00   8.666104e-05   0.000000e+00 
  7.398400e+04   8.806152e-05   0.000000e+00   8.806152e-05   0.000000e+00 
  7.411200e+04   8.767004e-05   0.000000e+00   8.767004e-05   0.000000e+00 
  7.424000e+04   8.724358e-05   0.000000e+00   8.724358e-05   0.000000e+00 
  7.436800e+04   9.021467e-05   0.000000e+00   9.021467e-05   0.000000e+00 
  7.449600e+04   9.984273e-05   0.000000e+00   9.984273e-05   0.000000e+00 
  7.462400e+04   1.117422e-04   0.000000e+00   1.117422e-04   0.000000e+00 
  7.475200e+04   1.429594e-04   0.000000e+00   1.429594e-04   0.000000e+00 
  7.488000e+04   1.413340e-04   0.000000e+00   1.413340e-04   0.000000e+00 
  7.500800e+04   9.761765e-05   0.000000e+00   9.761765e-05   0.000000e+00 
  7.513600e+04   8.699212e-05   0.000000e+00   8.699212e-05   0.000000e+00 
  7.526400e+04   8.557679e-05   0.000000e+00   8.557679e-05   0.000000e+00 
  7.539200e+04   8.391483e-05   0.000000e+00   8.391483e-05   0.000000e+00 
  7.552000e+04   8.145916e-05   0.000000e+00   8.145916e-05   0.000000e+00 
  7.564800e+04   8.393749e-05   0.000000e+00   8.393749e-05   0.000000e+00 
  7.577600e+04   8.796877e-05   0.000000e+00   8.796877e-05   0.000000e+00 
  7.590400e+04   8.989310e-05   0.000000e+00   8.989310e-05   0.000000e+00 
  7.603200e+04   8.258794e-05   0.000000e+00   8.258794e-05   0.000000e+00 
  7.616000e+04   8.372228e-05   0.000000e+00   8.372228e-05   0.000000e+00 
  7.628800e+04   8.489917e-05   0.000000e+00   8.489917e-05   0.000000e+00 
  7.641600e+04   8.009201e-05   0.000000e+00   8.009201e-05   0.000000e+00 
  7.654400e+04   7.904386e-05   0.000000e+00   7.904386e-05   0.000000e+00 
  7.667200e+04   7.938990e-05   0.000000e+00   7.938990e-05   0.000000e+00 
  7.680000e+04   7.817337e-05   0.000000e+00   7.817337e-05   0.000000e+00 
  7.692800e+04   7.720578e-05   0.000000e+00   7.720578e-05   0.000000e+00 
  7.705600e+04   7.643463e-05   0.000000e+00   7.643463e-05   0.000000e+00 
  7.718400e+04   7.887292e-05   0.000000e+00   7.887292e-05   0.000000e+00 
  7.731200e+04   7.747910e-05   0.000000e+00   7.747910e-05   0.000000e+00 
  7.744000e+04   7.728943e-05   0.000000e+00   7.728943e-05   0.000000e+00 
  7.756800e+04   7.696918e-05   0.000000e+00   7.696918e-05   0.000000e+00 
  7.769600e+04   7.506252e-05   0.000000e+00   7.506252e-05   0.000000e+00 
  7.782400e+04   7.523748e-05   0.000000e+00   7.523748e-05   0.000000e+00 
  7.795200e+04   7.625332e-05   0.000000e+00   7.625332e-05   0.000000e+00 
  7.808000e+04   7.659222e-05   0.000000e+00   7.659222e-05   0.000000e+00 
  7.820800e+04   7.683891e-05   0.000000e+00   7.683891e-05   0.000000e+00 
  7.833600e+04   7.469959e-05   0.000000e+00   7.469959e-05   0.000000e+00 
  7.846400e+04   7.256261e-05   0.000000e+00   7.256261e-05   0.000000e+00 
  7.859200e+04   7.302798e-05   0.000000e+00   7.302798e-05   0.000000e+00 
  7.872000e+04   7.385113e-05   0.000000e+00   7.385113e-05   0.000000e+00 
  7.884800e+04   7.625225e-05   0.000000e+00   7.625225e-05   0.000000e+00 
  7.897600e+04   7.228805e-05   0.000000e+00   7.228805e-05   0.000000e+00 
  7.910400e+04   7.202270e-05   0.000000e+00   7.202270e-05   0.000000e+00 
  7.923200e+04   7.477165e-05   0.000000e+00   7.477165e-05   0.000000e+00 
  7.936000e+04   7.289492e-05   0.000000e+00   7.289492e-05   0.000000e+00 
  7.948800e+04   7.203285e-05   0.000000e+00   7.203285e-05   0.000000e+00 
  7.961600e+04   6.986107e-05   0.000000e+00   6.986107e-05   0.000000e+00 
  7.974400e+04   6.980403e-05   0.000000e+00   6.980403e-05   0.000000e+00 
  7.987200e+04   7.256935e-05   0.000000e+00   7.256935e-05   0.000000e+00 
  8.000000e+04   7.171276e-05   0.000000e+00   7.171276e-05   0.000000e+00 
  8.012800e+04   6.895928e-05   0.000000e+00   6.895928e-05   0.000000e+00 
  8.025600e+04   6.940933e-05   0.000000e+00   6.940933e-05   0.000000e+00 
  8.038400e+04   7.382830e-05   0.000000e+00   7.382830e-05   0.000000e+00 
  8.051200e+04   8.454007e-05   0.000000e+00   8.454007e-05   0.000000e+00 
  8.064000e+04   7.044233e-05   0.000000e+00   7.044233e-05   0.000000e+00 
  8.076800e+04   6.708550e-05   0.000000e+00   6.708550e-05   0.000000e+00 
  8.089600e+04   7.009992e-05   0.000000e+00   7.009992e-05   0.000000e+00 
  8.102400e+04   6.769978e-05   0.000000e+00   6.769978e-05   0.000000e+00 
  8.115200e+04   6.517949e-05   0.000000e+00   6.517949e-05   0.000000e+00 
  8.128000e+04   6.620523e-05   0.000000e+00   6.620523e-05   0.000000e+00 
  8.140800e+04   6.878663e-05   0.000000e+00   6.878663e-05   0.000000e+00 
  8.153600e+04   7.104718e-05   0.000000e+00   7.104718e-05   0.000000e+00 
  8.166400e+04   6.580885e-05   0.000000e+00   6.580885e-05   0.000000e+00 
  8.179200e+04   6.436284e-05   0.000000e+00   6.436284e-05   0.000000e+00 
  8.192000e+04   6.615928e-05   0.000000e+00   6.615928e-05   0.000000e+00 
  8.204800e+04   6.513720e-05   0.000000e+00   6.513720e-05   0.000000e+00 
  8.217600e+04   6.325634e-05   0.000000e+00   6.325634e-05   0.000000e+00 
  8.230400e+04   6.328222e-05   0.000000e+00   6.328222e-05   0.000000e+00 
  8.243200e+04   6.450350e-05   0.000000e+00   6.450350e-05   0.000000e+00 
  8.256000e+04   6.442920e-05   0.000000e+00   6.442920e-05   0.000000e+00 
  8.268800e+04   6.987676e-05   0.000000e+00   6.987676e-05   0.000000e+00 
  8.281600e+04   9.426613e-05   0.000000e+00   9.426613e-05   0.000000e+00 
  8.294400e+04   8.181344e-05   0.000000e+00   8.181344e-05   0.000000e+00 
  8.307200e+04   6.459904e-05   0.000000e+00   6.459904e-05   0.000000e+00 
  8.320000e+04   6.455112e-05   0.000000e+00   6.455112e-05   0.000000e+00 
  8.332800e+04   6.297797e-05   0.000000e+00   6.297797e-05   0.000000e+00 
  8.345600e+04   6.029791e-05   0.000000e+00   6.029791e-05   0.000000e+00 
  8.358400e+04   5.988711e-05   0.000000e+00   5.988711e-05   0.000000e+00 
  8.371200e+04   5.983692e-05   0.000000e+00   5.983692e-05   0.000000e+00 
  8.384000e+04   5.927804e-05   0.000000e+00   5.927804e-05   0.000000e+00 
  8.396800e+04   5.986151e-05   0.000000e+00   5.986151e-05   0.000000e+00 
  8.409600e+04   6.098281e-05   0.000000e+00   6.098281e-05   0.000000e+00 
  8.422400e+04   5.994770e-05   0.000000e+00   5.994770e-05   0.000000e+00 
  8.435200e+04   5.956970e-05   0.000000e+00   5.956970e-05   0.000000e+00 
  8.448000e+04   5.951731e-05   0.000000e+00   5.951731e-05   0.000000e+00 
  8.460800e+04   5.957547e-05   0.000000e+00   5.957547e-05   0.000000e+00 
  8.473600e+04   5.797844e-05   0.000000e+00   5.797844e-05   0.000000e+00 
  8.486400e+04   5.735845e-05   0.000000e+00   5.735845e-05   0.000000e+00 
  8.499200e+04   5.854472e-05   0.000000e+00   5.854472e-05   0.000000e+00 
  8.512000e+04   5.960228e-05   0.000000e+00   5.960228e-05   0.000000e+00 
  8.524800e+04   5.797076e-05   0.000000e+00   5.797076e-05   0.000000e+00 
  8.537600e+04   5.680481e-05   0.000000e+00   5.680481e-05   0.000000e+00 
  8.550400e+04   5.595338e-05   0.000000e+00   5.595338e-05   0.000000e+00 
  8.563200e+04   5.783075e-05   0.000000e+00   5.783075e-05   0.000000e+00 
  8.576000e+04   5.960934e-05   0.000000e+00   5.960934e-05   0.000000e+00 
  8.588800e+04   6.086419e-05   0.000000e+00   6.086419e-05   0.000000e+00 
  8.601600e+04   8.131163e-05   0.000000e+00   8.131163e-05   0.000000e+00 
  8.614400e+04   7.867748e-05   0.000000e+00   7.867748e-05   0.000000e+00 
  8.627200e+04   5.831070e-05   0.000000e+00   5.831070e-05   0.000000e+00 
  8.640000e+04   5.469733e-05   0.000000e+00   5.469733e-05   0.000000e+00 
  8.652800e+04   5.478845e-05   0.000000e+00   5.478845e-05   0.000000e+00 
  8.665600e+04   5.544355e-05   0.000000e+00   5.544355e-05   0.000000e+00 
  8.678400e+04   5.612483e-05   0.000000e+00   5.612483e-05   0.000000e+00 
  8.691200e+04   5.556929e-05   0.000000e+00   5.556929e-05   0.000000e+00 
  8.704000e+04   5.379415e-05   0.000000e+00   5.379415e-05   0.000000e+00 
  8.716800e+04   5.297064e-05   0.000000e+00   5.297064e-05   0.000000e+00 
  8.729600e+04   5.397985e-05   0.000000e+00   5.397985e-05   0.000000e+00 
  8.742400e+04   5.409814e-05   0.000000e+00   5.409814e-05   0.000000e+00 
  8.755200e+04   5.463799e-05   0.000000e+00   5.463799e-05   0.000000e+00 
  8.768000e+04   5.323620e-05   0.000000e+00   5.323620e-05   0.000000e+00 
  8.780800e+04   5.311833e-05   0.000000e+00   5.311833e-05   0.000000e+00 
  8.793600e+04   5.274566e-05   0.000000e+00   5.274566e-05   0.000000e+00 
  8.806400e+04   5.199424e-05   0.000000e+00   5.199424e-05   0.000000e+00 
  8.819200e+04   5.357214e-05   0.000000e+00   5.357214e-05   0.000000e+00 
  8.832000e+04   5.251704e-05   0.000000e+00   5.251704e-05   0.000000e+00 
  8.844800e+04   5.264904e-05   0.000000e+00   5.264904e-05   0.000000e+00 
  8.857600e+04   5.179875e-05   0.000000e+00   5.179875e-05   0.000000e+00 
  8.870400e+04   5.021336e-05   0.000000e+00   5.021336e-05   0.000000e+00 
  8.883200e+04   5.084518e-05   0.000000e+00   5.084518e-05   0.000000e+00 
  8.896000e+04   4.900760e-05   0.000000e+00   4.900760e-05   0.000000e+00 
  8.908800e+04   4.830486e-05   0.000000e+00   4.830486e-05   0.000000e+00 
  8.921600e+04   4.966270e-05   0.000000e+00   4.966270e-05   0.000000e+00 
  8.934400e+04   5.033522e-05   0.000000e+00   5.033522e-05   0.000000e+00 
  8.947200e+04   5.121509e-05   0.000000e+00   5.121509e-05   0.000000e+00 
  8.960000e+04   5.687790e-05   0.000000e+00   5.687790e-05   0.000000e+00 
  8.972800e+04   6.937377e-05   0.000000e+00   6.937377e-05   0.000000e+00 
  8.985600e+04   7.330089e-05   0.000000e+00   7.330089e-05   0.000000e+00 
  8.998400e+04   5.189553e-05   0.000000e+00   5.189553e-05   0.000000e+00 
  9.011200e+04   5.083794e-05   0.000000e+00   5.083794e-05   0.000000e+00 
  9.024000e+04   5.135101e-05   0.000000e+00   5.135101e-05   0.000000e+00 
  9.036800e+04   5.008779e-05   0.000000e+00   5.008779e-05   0.000000e+00 
  9.049600e+04   4.853334e-05   0.000000e+00   4.853334e-05   0.000000e+00 
  9.062400e+04   4.747508e-05   0.000000e+00   4.747508e-05   0.000000e+00 
  9.075200e+04   4.891518e-05   0.000000e+00   4.891518e-05   0.000000e+00 
  9.088000e+04   5.033866e-05   0.000000e+00   5.033866e-05   0.000000e+00 
  9.100800e+04   4.824975e-05   0.000000e+00   4.824975e-05   0.000000e+00 
  9.113600e+04   4.844557e-05   0.000000e+00   4.844557e-05   0.000000e+00 
  9.126400e+04   4.824223e-05   0.000000e+00   4.824223e-05   0.000000e+00 
  9.139200e+04   4.713468e-05   0.000000e+00   4.713468e-05   0.000000e+00 
  9.152000e+04   4.691079e-05   0.000000e+00   4.691079e-05   0.000000e+00 
  9.164800e+04   4.669059e-05   0.000000e+00   4.669059e-05   0.000000e+00 
  9.177600e+04   5.077538e-05   0.000000e+00   5.077538e-05   0.000000e+00 
  9.190400e+04   5.255783e-05   0.000000e+00   5.255783e-05   0.000000e+00 
  9.203200e+04   4.884910e-05   0.000000e+00   4.884910e-05   0.000000e+00 
  9.216000e+04   4.835572e-05   0.000000e+00   4.835572e-05   0.000000e+00 
  9.228800e+04   4.486248e-05   0.000000e+00   4.486248e-05   0.000000e+00 
  9.241600e+04   4.587809e-05   0.000000e+00   4.587809e-05   0.000000e+00 
  9.254400e+04   4.729718e-05   0.000000e+00   4.729718e-05   0.000000e+00 
  9.267200e+04   4.524055e-05   0.000000e+00   4.524055e-05   0.000000e+00 
  9.280000e+04   4.398701e-05   0.000000e+00   4.398701e-05   0.000000e+00 
  9.292800e+04   4.407769e-05   0.000000e+00   4.407769e-05   0.000000e+00 
  9.305600e+04   4.488853e-05   0.000000e+00   4.488853e-05   0.000000e+00 
  9.318400e+04   4.450314e-05   0.000000e+00   4.450314e-05   0.000000e+00 
  9.331200e+04   4.391214e-05   0.000000e+00   4.391214e-05   0.000000e+00 
  9.344000e+04   4.346231e-05   0.000000e+00   4.346231e-05   0.000000e+00 
  9.356800e+04   4.222123e-05   0.000000e+00   4.222123e-05   0.000000e+00 
  9.369600e+04   4.152085e-05   0.000000e+00   4.152085e-05   0.000000e+00 
  9.382400e+04   4.176879e-05   0.000000e+00   4.176879e-05   0.000000e+00 
  9.395200e+04   4.264526e-05   0.000000e+00   4.264526e-05   0.000000e+00 
  9.408000e+04   4.343893e-05   0.000000e+00   4.343893e-05   0.000000e+00 
  9.420800e+04   4.192988e-05   0.000000e+00   4.192988e-05   0.000000e+00 
  9.433600e+04   4.072495e-05   0.000000e+00   4.072495e-05   0.000000e+00 
  9.446400e+04   4.082772e-05   0.000000e+00   4.082772e-05   0.000000e+00 
  9.459200e+04   4.156179e-05   0.000000e+00   4.156179e-05   0.000000e+00 
  9.472000e+04   4.151963e-05   0.000000e+00   4.151963e-05   0.000000e+00 
  9.484800e+04   4.353189e-05   0.000000e+00   4.353189e-05   0.000000e+00 
  9.497600e+04   4.282228e-05   0.000000e+00   4.282228e-05   0.000000e+00 
  9.510400e+04   4.211918e-05   0.000000e+00   4.211918e-05   0.000000e+00 
  9.523200e+04   4.153839e-05   0.000000e+00   4.153839e-05   0.000000e+00 
  9.536000e+04   4.556822e-05   0.000000e+00   4.556822e-05   0.000000e+00 
  9.548800e+04   4.250872e-05   0.000000e+00   4.250872e-05   0.000000e+00 
  9.561600e+04   3.923011e-05   0.000000e+00   3.923011e-05   0.000000e+00 
  9.574400e+04   4.076980e-05   0.000000e+00   4.076980e-05   0.000000e+00 
  9.587200e+04   4.024108e-05   0.000000e+00   4.024108e-05   0.000000e+00 
  9.600000e+04   3.843621e-05   0.000000e+00   3.843621e-05   0.000000e+00 
  9.612800e+04   3.914998e-05   0.000000e+00   3.914998e-05   0.000000e+00 
  9.625600e+04   3.948843e-05   0.000000e+00   3.948843e-05   0.000000e+00 
  9.638400e+04   4.064603e-05   0.000000e+00   4.064603e-05   0.000000e+00 
  9.651200e+04   4.267883e-05   0.000000e+00   4.267883e-05   0.000000e+00 
  9.664000e+04   4.215389e-05   0.000000e+00   4.215389e-05   0.000000e+00 
  9.676800e+04   5.118706e-05   0.000000e+00   5.118706e-05   0.000000e+00 
  9.689600e+04   4.704736e-05   0.000000e+00   4.704736e-05   0.000000e+00 
  9.702400e+04   3.854622e-05   0.000000e+00   3.854622e-05   0.000000e+00 
  9.715200e+04   3.978210e-05   0.000000e+00   3.978210e-05   0.000000e+00 
  9.728000e+04   4.178482e-05   0.000000e+00   4.178482e-05   0.000000e+00 
  9.740800e+04   3.783207e-05   0.000000e+00   3.783207e-05   0.000000e+00 
  9.753600e+04   3.673194e-05   0.000000e+00   3.673194e-05   0.000000e+00 
  9.766400e+04   3.716838e-05   0.000000e+00   3.716838e-05   0.000000e+00 
  9.779200e+04   3.700584e-05   0.000000e+00   3.700584e-05   0.000000e+00 
  9.792000e+04   3.743131e-05   0.000000e+00   3.743131e-05   0.000000e+00 
  9.804800e+04   3.767739e-05   0.000000e+00   3.767739e-05   0.000000e+00 
  9.817600e+04   4.149499e-05   0.000000e+00   4.149499e-05   0.000000e+00 
  9.830400e+04   3.979158e-05   0.000000e+00   3.979158e-05   0.000000e+00 
  9.843200e+04   3.457789e-05   0.000000e+00   3.457789e-05   0.000000e+00 
  9.856000e+04   3.483468e-05   0.000000e+00   3.483468e-05   0.000000e+00 
  9.868800e+04   3.573277e-05   0.000000e+00   3.573277e-05   0.000000e+00 
  9.881600e+04   3.616897e-05   0.000000e+00   3.616897e-05   0.000000e+00 
  9.894400e+04   3.629561e-05   0.000000e+00   3.629561e-05   0.000000e+00 
  9.907200e+04   3.579699e-05   0.000000e+00   3.579699e-05   0.000000e+00 
  9.920000e+04   3.594108e-05   0.000000e+00   3.594108e-05   0.000000e+00 
  9.932800e+04   3.501483e-05   0.000000e+00   3.501483e-05   0.000000e+00 
  9.945600e+04   3.431092e-05   0.000000e+00   3.431092e-05   0.000000e+00 
  9.958400e+04   3.500835e-05   0.000000e+00   3.500835e-05   0.000000e+00 
  9.971200e+04   3.465104e-05   0.000000e+00   3.465104e-05   0.000000e+00 
  9.984000e+04   3.532764e-05   0.000000e+00   3.532764e-05   0.000000e+00 
  9.996800e+04   4.234739e-05   0.000000e+00   4.234739e-05   0.000000e+00 
  1.000960e+05   4.938039e-05   0.000000e+00   4.938039e-05   0.000000e+00 
  1.002240e+05   4.140592e-05   0.000000e+00   4.140592e-05   0.000000e+00 
  1.003520e+05   3.527479e-05   0.000000e+00   3.527479e-05   0.000000e+00 
  1.004800e+05   3.379916e-05   0.000000e+00   3.379916e-05   0.000000e+00 
  1.006080e+05   3.283775e-05   0.000000e+00   3.283775e-05   0.000000e+00 
  1.007360e+05   3.302292e-05   0.000000e+00   3.302292e-05   0.000000e+00 
  1.008640e+05   3.444919e-05   0.000000e+00   3.444919e-05   0.000000e+00 
  1.009920e+05   3.409142e-05   0.000000e+00   3.409142e-05   0.000000e+00 
  1.011200e+05   3.314657e-05   0.000000e+00   3.314657e-05   0.000000e+00 
  1.012480e+05   3.350415e-05   0.000000e+00   3.350415e-05   0.000000e+00 
  1.013760e+05   3.405134e-05   0.000000e+00   3.405134e-05   0.000000e+00 
  1.015040e+05   4.120985e-05   0.000000e+00   4.120985e-05   0.000000e+00 
  1.016320e+05   5.074470e-05   0.000000e+00   5.074470e-05   0.000000e+00 
  1.017600e+05   3.756684e-05   0.000000e+00   3.756684e-05   0.000000e+00 
  1.018880e+05   3.390312e-05   0.000000e+00   3.390312e-05   0.000000e+00 
  1.020160e+05   3.252389e-05   0.000000e+00   3.252389e-05   0.000000e+00 
  1.021440e+05   3.282889e-05   0.000000e+00   3.282889e-05   0.000000e+00 
  1.022720e+05   3.312732e-05   0.000000e+00   3.312732e-05   0.000000e+00 
  1.024000e+05   3.199949e-05   0.000000e+00   3.199949e-05   0.000000e+00 
