1.000000000000E+01	1.867451E+01	0.000000E+00	0.000000E+00	0.000000E+00
1.091200000000E+01	1.885892E+01	0.000000E+00	0.000000E+00	0.000000E+00
1.182300000000E+01	1.920086E+01	0.000000E+00	0.000000E+00	0.000000E+00
1.273500000000E+01	1.945544E+01	0.000000E+00	0.000000E+00	0.000000E+00
1.380400000000E+01	1.980109E+01	0.000000E+00	0.000000E+00	0.000000E+00
1.506200000000E+01	2.046162E+01	0.000000E+00	0.000000E+00	0.000000E+00
1.632100000000E+01	2.043722E+01	0.000000E+00	0.000000E+00	0.000000E+00
1.757900000000E+01	2.103289E+01	0.000000E+00	0.000000E+00	0.000000E+00
1.905500000000E+01	2.072617E+01	0.000000E+00	0.000000E+00	0.000000E+00
2.072100000000E+01	2.108215E+01	0.000000E+00	0.000000E+00	0.000000E+00
2.238700000000E+01	2.122569E+01	0.000000E+00	0.000000E+00	0.000000E+00
2.426600000000E+01	2.124250E+01	0.000000E+00	0.000000E+00	0.000000E+00
2.647800000000E+01	2.145924E+01	0.000000E+00	0.000000E+00	0.000000E+00
2.869100000000E+01	2.156470E+01	0.000000E+00	0.000000E+00	0.000000E+00
3.090300000000E+01	2.163876E+01	0.000000E+00	0.000000E+00	0.000000E+00
3.349700000000E+01	2.187524E+01	0.000000E+00	0.000000E+00	0.000000E+00
3.642600000000E+01	2.233288E+01	0.000000E+00	0.000000E+00	0.000000E+00
3.935500000000E+01	2.169567E+01	0.000000E+00	0.000000E+00	0.000000E+00
4.265800000000E+01	2.147314E+01	0.000000E+00	0.000000E+00	0.000000E+00
4.654700000000E+01	2.106011E+01	0.000000E+00	0.000000E+00	0.000000E+00
5.043600000000E+01	2.112856E+01	0.000000E+00	0.000000E+00	0.000000E+00
5.432500000000E+01	2.244417E+01	0.000000E+00	0.000000E+00	0.000000E+00
5.888400000000E+01	2.175289E+01	0.000000E+00	0.000000E+00	0.000000E+00
6.403400000000E+01	2.183899E+01	0.000000E+00	0.000000E+00	0.000000E+00
6.918300000000E+01	2.171125E+01	0.000000E+00	0.000000E+00	0.000000E+00
7.498900000000E+01	2.169328E+01	0.000000E+00	0.000000E+00	0.000000E+00
8.182600000000E+01	2.135325E+01	0.000000E+00	0.000000E+00	0.000000E+00
8.866200000000E+01	2.143884E+01	0.000000E+00	0.000000E+00	0.000000E+00
9.549900000000E+01	2.221619E+01	0.000000E+00	0.000000E+00	0.000000E+00
1.035140000000E+02	2.215234E+01	0.000000E+00	0.000000E+00	0.000000E+00
1.129510000000E+02	2.106751E+01	0.000000E+00	0.000000E+00	0.000000E+00
1.223890000000E+02	2.105283E+01	0.000000E+00	0.000000E+00	0.000000E+00
1.318260000000E+02	2.103281E+01	0.000000E+00	0.000000E+00	0.000000E+00
1.428890000000E+02	2.079517E+01	0.000000E+00	0.000000E+00	0.000000E+00
1.553850000000E+02	2.084728E+01	0.000000E+00	0.000000E+00	0.000000E+00
1.678800000000E+02	2.068185E+01	0.000000E+00	0.000000E+00	0.000000E+00
1.819700000000E+02	2.067723E+01	0.000000E+00	0.000000E+00	0.000000E+00
1.985600000000E+02	2.009808E+01	0.000000E+00	0.000000E+00	0.000000E+00
2.151490000000E+02	2.019708E+01	0.000000E+00	0.000000E+00	0.000000E+00
2.317390000000E+02	2.033249E+01	0.000000E+00	0.000000E+00	0.000000E+00
2.511890000000E+02	1.997204E+01	0.000000E+00	0.000000E+00	0.000000E+00
2.731550000000E+02	1.972647E+01	0.000000E+00	0.000000E+00	0.000000E+00
2.951210000000E+02	1.985291E+01	0.000000E+00	0.000000E+00	0.000000E+00
3.198900000000E+02	1.936286E+01	0.000000E+00	0.000000E+00	0.000000E+00
3.490530000000E+02	1.910445E+01	0.000000E+00	0.000000E+00	0.000000E+00
3.782170000000E+02	1.890659E+01	0.000000E+00	0.000000E+00	0.000000E+00
4.073800000000E+02	1.850150E+01	0.000000E+00	0.000000E+00	0.000000E+00
4.415700000000E+02	1.804974E+01	0.000000E+00	0.000000E+00	0.000000E+00
4.801850000000E+02	1.752290E+01	0.000000E+00	0.000000E+00	0.000000E+00
5.188000000000E+02	1.696956E+01	0.000000E+00	0.000000E+00	0.000000E+00
5.623410000000E+02	1.680659E+01	0.000000E+00	0.000000E+00	0.000000E+00
6.136080000000E+02	1.609430E+01	0.000000E+00	0.000000E+00	0.000000E+00
6.648760000000E+02	1.549704E+01	0.000000E+00	0.000000E+00	0.000000E+00
7.161430000000E+02	1.493785E+01	0.000000E+00	0.000000E+00	0.000000E+00
7.762470000000E+02	1.425661E+01	0.000000E+00	0.000000E+00	0.000000E+00
8.470160000000E+02	1.357372E+01	0.000000E+00	0.000000E+00	0.000000E+00
9.177840000000E+02	1.308324E+01	0.000000E+00	0.000000E+00	0.000000E+00
9.885530000000E+02	1.220386E+01	0.000000E+00	0.000000E+00	0.000000E+00
1.071519000000E+03	1.145046E+01	0.000000E+00	0.000000E+00	0.000000E+00
1.165222000000E+03	1.077704E+01	0.000000E+00	0.000000E+00	0.000000E+00
1.258925000000E+03	9.549148E+00	0.000000E+00	0.000000E+00	0.000000E+00
1.364583000000E+03	8.204562E+00	0.000000E+00	0.000000E+00	0.000000E+00
1.488989000000E+03	6.933837E+00	0.000000E+00	0.000000E+00	0.000000E+00
1.613395000000E+03	5.013833E+00	0.000000E+00	0.000000E+00	0.000000E+00
1.737801000000E+03	3.902364E+00	0.000000E+00	0.000000E+00	0.000000E+00
1.883649000000E+03	1.919167E+00	0.000000E+00	0.000000E+00	0.000000E+00
2.048372000000E+03	1.392369E+00	0.000000E+00	0.000000E+00	0.000000E+00
2.213095000000E+03	-2.807796E-01	0.000000E+00	0.000000E+00	0.000000E+00
2.398833000000E+03	-3.126106E+00	0.000000E+00	0.000000E+00	0.000000E+00
2.617529000000E+03	-2.473294E+00	0.000000E+00	0.000000E+00	0.000000E+00
2.836225000000E+03	3.974653E-01	0.000000E+00	0.000000E+00	0.000000E+00
3.054921000000E+03	-9.144799E-02	0.000000E+00	0.000000E+00	0.000000E+00
3.311311000000E+03	2.000707E-01	0.000000E+00	0.000000E+00	0.000000E+00
3.600881000000E+03	3.574121E+00	0.000000E+00	0.000000E+00	0.000000E+00
3.890451000000E+03	4.982552E+00	0.000000E+00	0.000000E+00	0.000000E+00
4.216965000000E+03	5.893363E+00	0.000000E+00	0.000000E+00	0.000000E+00
4.601416000000E+03	7.094590E+00	0.000000E+00	0.000000E+00	0.000000E+00
4.985867000000E+03	8.297228E+00	0.000000E+00	0.000000E+00	0.000000E+00
5.370318000000E+03	8.941297E+00	0.000000E+00	0.000000E+00	0.000000E+00
5.821032000000E+03	9.603009E+00	0.000000E+00	0.000000E+00	0.000000E+00
6.351722000000E+03	1.037811E+01	0.000000E+00	0.000000E+00	0.000000E+00
6.882412000000E+03	1.090016E+01	0.000000E+00	0.000000E+00	0.000000E+00
7.413102000000E+03	1.147400E+01	0.000000E+00	0.000000E+00	0.000000E+00
8.035261000000E+03	1.206883E+01	0.000000E+00	0.000000E+00	0.000000E+00
8.737935000000E+03	1.261979E+01	0.000000E+00	0.000000E+00	0.000000E+00
9.440609000000E+03	1.314629E+01	0.000000E+00	0.000000E+00	0.000000E+00
1.023293000000E+04	1.363143E+01	0.000000E+00	0.000000E+00	0.000000E+00
1.116584300000E+04	1.415086E+01	0.000000E+00	0.000000E+00	0.000000E+00
1.209875500000E+04	1.458565E+01	0.000000E+00	0.000000E+00	0.000000E+00
1.303166800000E+04	1.488630E+01	0.000000E+00	0.000000E+00	0.000000E+00
1.412537500000E+04	1.525976E+01	0.000000E+00	0.000000E+00	0.000000E+00
1.536062200000E+04	1.550427E+01	0.000000E+00	0.000000E+00	0.000000E+00
1.659586900000E+04	1.576214E+01	0.000000E+00	0.000000E+00	0.000000E+00
1.798870900000E+04	1.601128E+01	0.000000E+00	0.000000E+00	0.000000E+00
1.962869800000E+04	1.624688E+01	0.000000E+00	0.000000E+00	0.000000E+00
2.126868800000E+04	1.641499E+01	0.000000E+00	0.000000E+00	0.000000E+00
2.290867700000E+04	1.652702E+01	0.000000E+00	0.000000E+00	0.000000E+00
2.483133100000E+04	1.662878E+01	0.000000E+00	0.000000E+00	0.000000E+00
2.700280100000E+04	1.670484E+01	0.000000E+00	0.000000E+00	0.000000E+00
2.917427000000E+04	1.677598E+01	0.000000E+00	0.000000E+00	0.000000E+00
3.162277700000E+04	1.685206E+01	0.000000E+00	0.000000E+00	0.000000E+00
3.450575200000E+04	1.688862E+01	0.000000E+00	0.000000E+00	0.000000E+00
3.738872800000E+04	1.689567E+01	0.000000E+00	0.000000E+00	0.000000E+00
4.027170300000E+04	1.680655E+01	0.000000E+00	0.000000E+00	0.000000E+00
4.365158300000E+04	1.676182E+01	0.000000E+00	0.000000E+00	0.000000E+00
4.763119700000E+04	1.662168E+01	0.000000E+00	0.000000E+00	0.000000E+00
5.161081200000E+04	1.654127E+01	0.000000E+00	0.000000E+00	0.000000E+00
5.559042600000E+04	1.638211E+01	0.000000E+00	0.000000E+00	0.000000E+00
6.025595900000E+04	1.625158E+01	0.000000E+00	0.000000E+00	0.000000E+00
6.552526800000E+04	1.596883E+01	0.000000E+00	0.000000E+00	0.000000E+00
7.079457800000E+04	1.574739E+01	0.000000E+00	0.000000E+00	0.000000E+00
7.673614900000E+04	1.554467E+01	0.000000E+00	0.000000E+00	0.000000E+00
8.373200700000E+04	1.524897E+01	0.000000E+00	0.000000E+00	0.000000E+00
9.072786400000E+04	1.488361E+01	0.000000E+00	0.000000E+00	0.000000E+00
9.772372200000E+04	1.467032E+01	0.000000E+00	0.000000E+00	0.000000E+00
1.059253730000E+05	1.433770E+01	0.000000E+00	0.000000E+00	0.000000E+00
1.151884170000E+05	1.396243E+01	0.000000E+00	0.000000E+00	0.000000E+00
1.244514610000E+05	1.353054E+01	0.000000E+00	0.000000E+00	0.000000E+00
1.348962880000E+05	1.319274E+01	0.000000E+00	0.000000E+00	0.000000E+00
1.471944720000E+05	1.277220E+01	0.000000E+00	0.000000E+00	0.000000E+00
1.594926550000E+05	1.232300E+01	0.000000E+00	0.000000E+00	0.000000E+00
1.717908390000E+05	1.191521E+01	0.000000E+00	0.000000E+00	0.000000E+00
1.862087140000E+05	1.143428E+01	0.000000E+00	0.000000E+00	0.000000E+00
2.024924380000E+05	1.089261E+01	0.000000E+00	0.000000E+00	0.000000E+00
2.187761620000E+05	1.045241E+01	0.000000E+00	0.000000E+00	0.000000E+00
2.371373710000E+05	9.956808E+00	0.000000E+00	0.000000E+00	0.000000E+00
2.587566380000E+05	9.380451E+00	0.000000E+00	0.000000E+00	0.000000E+00
2.803759050000E+05	8.757295E+00	0.000000E+00	0.000000E+00	0.000000E+00
3.019951720000E+05	8.336742E+00	0.000000E+00	0.000000E+00	0.000000E+00
3.273406950000E+05	7.722036E+00	0.000000E+00	0.000000E+00	0.000000E+00
3.571835910000E+05	7.043269E+00	0.000000E+00	0.000000E+00	0.000000E+00
3.870264870000E+05	6.376013E+00	0.000000E+00	0.000000E+00	0.000000E+00
4.168693830000E+05	5.953993E+00	0.000000E+00	0.000000E+00	0.000000E+00
4.518559440000E+05	5.217000E+00	0.000000E+00	0.000000E+00	0.000000E+00
4.913701940000E+05	4.517776E+00	0.000000E+00	0.000000E+00	0.000000E+00
5.308844440000E+05	3.868045E+00	0.000000E+00	0.000000E+00	0.000000E+00
5.754399370000E+05	3.189451E+00	0.000000E+00	0.000000E+00	0.000000E+00
6.279014690000E+05	2.500502E+00	0.000000E+00	0.000000E+00	0.000000E+00
6.803630010000E+05	1.654139E+00	0.000000E+00	0.000000E+00	0.000000E+00
7.328245330000E+05	8.491500E-01	0.000000E+00	0.000000E+00	0.000000E+00
7.943282350000E+05	-2.816396E-01	0.000000E+00	0.000000E+00	0.000000E+00
8.637912680000E+05	-1.373087E+00	0.000000E+00	0.000000E+00	0.000000E+00
9.332543010000E+05	-2.573850E+00	0.000000E+00	0.000000E+00	0.000000E+00
1.011579454000E+06	-3.532946E+00	0.000000E+00	0.000000E+00	0.000000E+00
1.103802820000E+06	-4.787134E+00	0.000000E+00	0.000000E+00	0.000000E+00
1.196026186000E+06	-6.383874E+00	0.000000E+00	0.000000E+00	0.000000E+00
1.288249552000E+06	-8.133055E+00	0.000000E+00	0.000000E+00	0.000000E+00
1.396368361000E+06	-1.040378E+01	0.000000E+00	0.000000E+00	0.000000E+00
1.518479067000E+06	-1.334811E+01	0.000000E+00	0.000000E+00	0.000000E+00
1.640589773000E+06	-1.711385E+01	0.000000E+00	0.000000E+00	0.000000E+00
1.778279410000E+06	-2.104238E+01	0.000000E+00	0.000000E+00	0.000000E+00
1.940401043000E+06	-2.405211E+01	0.000000E+00	0.000000E+00	0.000000E+00
2.102522675000E+06	-2.476269E+01	0.000000E+00	0.000000E+00	0.000000E+00
2.264644308000E+06	-3.094536E+01	0.000000E+00	0.000000E+00	0.000000E+00
2.454708916000E+06	-3.372116E+01	0.000000E+00	0.000000E+00	0.000000E+00
2.678499066000E+06	-3.212308E+01	0.000000E+00	0.000000E+00	0.000000E+00
2.902289217000E+06	-3.987244E+01	0.000000E+00	0.000000E+00	0.000000E+00
3.126079367000E+06	-3.388119E+01	0.000000E+00	0.000000E+00	0.000000E+00
3.388441561000E+06	-3.589318E+01	0.000000E+00	0.000000E+00	0.000000E+00
3.684756634000E+06	-3.099114E+01	0.000000E+00	0.000000E+00	0.000000E+00
3.981071706000E+06	-3.679220E+01	0.000000E+00	0.000000E+00	0.000000E+00
4.315190768000E+06	-3.772516E+01	0.000000E+00	0.000000E+00	0.000000E+00
4.708596758000E+06	-4.647299E+01	0.000000E+00	0.000000E+00	0.000000E+00
5.102002749000E+06	-1.926592E+02	0.000000E+00	0.000000E+00	0.000000E+00
5.495408739000E+06	-4.091000E+01	0.000000E+00	0.000000E+00	0.000000E+00
5.956621435000E+06	-3.836704E+01	0.000000E+00	0.000000E+00	0.000000E+00
6.477520698000E+06	-4.157668E+01	0.000000E+00	0.000000E+00	0.000000E+00
6.998419960000E+06	-4.809872E+01	0.000000E+00	0.000000E+00	0.000000E+00
7.585775750000E+06	-3.929239E+01	0.000000E+00	0.000000E+00	0.000000E+00
8.277353430000E+06	-3.717466E+01	0.000000E+00	0.000000E+00	0.000000E+00
8.968931110000E+06	-4.408806E+01	0.000000E+00	0.000000E+00	0.000000E+00
9.660508790000E+06	-6.034554E+01	0.000000E+00	0.000000E+00	0.000000E+00
1.047128548100E+07	-4.292773E+01	0.000000E+00	0.000000E+00	0.000000E+00
1.138698659500E+07	-3.691320E+01	0.000000E+00	0.000000E+00	0.000000E+00
1.230268770800E+07	-4.851160E+01	0.000000E+00	0.000000E+00	0.000000E+00
1.333521432200E+07	-4.238862E+01	0.000000E+00	0.000000E+00	0.000000E+00
1.455095505600E+07	-4.648260E+01	0.000000E+00	0.000000E+00	0.000000E+00
1.576669579100E+07	-4.595649E+01	0.000000E+00	0.000000E+00	0.000000E+00
1.698243652500E+07	-5.434704E+01	0.000000E+00	0.000000E+00	0.000000E+00
1.840772001500E+07	-6.089887E+01	0.000000E+00	0.000000E+00	0.000000E+00
2.008590939400E+07	-2.584608E+01	0.000000E+00	0.000000E+00	0.000000E+00
2.176409877400E+07	-2.190312E+01	0.000000E+00	0.000000E+00	0.000000E+00
2.344228815300E+07	-4.128208E+01	0.000000E+00	0.000000E+00	0.000000E+00
2.540972705500E+07	-3.796556E+01	0.000000E+00	0.000000E+00	0.000000E+00
2.763177662200E+07	-5.289054E+01	0.000000E+00	0.000000E+00	0.000000E+00
2.985382618900E+07	-4.309546E+01	0.000000E+00	0.000000E+00	0.000000E+00
3.235936569300E+07	-5.030184E+01	0.000000E+00	0.000000E+00	0.000000E+00
3.530949443200E+07	-3.980849E+01	0.000000E+00	0.000000E+00	0.000000E+00
3.825962317100E+07	-4.767855E+01	0.000000E+00	0.000000E+00	0.000000E+00
4.120975191000E+07	-3.504026E+01	0.000000E+00	0.000000E+00	0.000000E+00
4.466835921500E+07	-5.842321E+01	0.000000E+00	0.000000E+00	0.000000E+00
4.857455262000E+07	-1.926592E+02	0.000000E+00	0.000000E+00	0.000000E+00
5.248074602500E+07	-5.231873E+01	0.000000E+00	0.000000E+00	0.000000E+00
5.688529308400E+07	-5.011276E+01	0.000000E+00	0.000000E+00	0.000000E+00
6.207139405800E+07	-5.147585E+01	0.000000E+00	0.000000E+00	0.000000E+00
6.725749503300E+07	-6.491856E+01	0.000000E+00	0.000000E+00	0.000000E+00
7.244359600700E+07	-6.070562E+01	0.000000E+00	0.000000E+00	0.000000E+00
7.852356346100E+07	-6.078580E+01	0.000000E+00	0.000000E+00	0.000000E+00
8.568237564100E+07	-7.268475E+01	0.000000E+00	0.000000E+00	0.000000E+00
9.284118782000E+07	-5.367409E+01	0.000000E+00	0.000000E+00	0.000000E+00
1.000000000000E+08	-4.579912E+01	0.000000E+00	0.000000E+00	0.000000E+00
0	0	0	0	0
1.000000000000E+01	5.035144E+01	0.000000E+00	0.000000E+00	0.000000E+00
1.091200000000E+01	4.867726E+01	0.000000E+00	0.000000E+00	0.000000E+00
1.182300000000E+01	4.697044E+01	0.000000E+00	0.000000E+00	0.000000E+00
1.273500000000E+01	4.130386E+01	0.000000E+00	0.000000E+00	0.000000E+00
1.380400000000E+01	4.447095E+01	0.000000E+00	0.000000E+00	0.000000E+00
1.506200000000E+01	3.941436E+01	0.000000E+00	0.000000E+00	0.000000E+00
1.632100000000E+01	3.497676E+01	0.000000E+00	0.000000E+00	0.000000E+00
1.757900000000E+01	3.237802E+01	0.000000E+00	0.000000E+00	0.000000E+00
1.905500000000E+01	3.214747E+01	0.000000E+00	0.000000E+00	0.000000E+00
2.072100000000E+01	2.775216E+01	0.000000E+00	0.000000E+00	0.000000E+00
2.238700000000E+01	2.598937E+01	0.000000E+00	0.000000E+00	0.000000E+00
2.426600000000E+01	2.549060E+01	0.000000E+00	0.000000E+00	0.000000E+00
2.647800000000E+01	2.260786E+01	0.000000E+00	0.000000E+00	0.000000E+00
2.869100000000E+01	2.332222E+01	0.000000E+00	0.000000E+00	0.000000E+00
3.090300000000E+01	1.883896E+01	0.000000E+00	0.000000E+00	0.000000E+00
3.349700000000E+01	1.818082E+01	0.000000E+00	0.000000E+00	0.000000E+00
3.642600000000E+01	1.790410E+01	0.000000E+00	0.000000E+00	0.000000E+00
3.935500000000E+01	1.713961E+01	0.000000E+00	0.000000E+00	0.000000E+00
4.265800000000E+01	1.653441E+01	0.000000E+00	0.000000E+00	0.000000E+00
4.654700000000E+01	1.470747E+01	0.000000E+00	0.000000E+00	0.000000E+00
5.043600000000E+01	8.038850E+00	0.000000E+00	0.000000E+00	0.000000E+00
5.432500000000E+01	9.221345E+00	0.000000E+00	0.000000E+00	0.000000E+00
5.888400000000E+01	1.022375E+01	0.000000E+00	0.000000E+00	0.000000E+00
6.403400000000E+01	9.286173E+00	0.000000E+00	0.000000E+00	0.000000E+00
6.918300000000E+01	7.583035E+00	0.000000E+00	0.000000E+00	0.000000E+00
7.498900000000E+01	6.751109E+00	0.000000E+00	0.000000E+00	0.000000E+00
8.182600000000E+01	4.936040E+00	0.000000E+00	0.000000E+00	0.000000E+00
8.866200000000E+01	4.480669E+00	0.000000E+00	0.000000E+00	0.000000E+00
9.549900000000E+01	4.824999E+00	0.000000E+00	0.000000E+00	0.000000E+00
1.035140000000E+02	4.856538E+00	0.000000E+00	0.000000E+00	0.000000E+00
1.129510000000E+02	4.275218E-01	0.000000E+00	0.000000E+00	0.000000E+00
1.223890000000E+02	1.064062E+00	0.000000E+00	0.000000E+00	0.000000E+00
1.318260000000E+02	-2.979602E+00	0.000000E+00	0.000000E+00	0.000000E+00
1.428890000000E+02	-6.467343E+00	0.000000E+00	0.000000E+00	0.000000E+00
1.553850000000E+02	-7.330126E+00	0.000000E+00	0.000000E+00	0.000000E+00
1.678800000000E+02	-8.526931E+00	0.000000E+00	0.000000E+00	0.000000E+00
1.819700000000E+02	-9.809058E+00	0.000000E+00	0.000000E+00	0.000000E+00
1.985600000000E+02	-8.536507E+00	0.000000E+00	0.000000E+00	0.000000E+00
2.151490000000E+02	-1.329580E+01	0.000000E+00	0.000000E+00	0.000000E+00
2.317390000000E+02	-1.603096E+01	0.000000E+00	0.000000E+00	0.000000E+00
2.511890000000E+02	-1.685209E+01	0.000000E+00	0.000000E+00	0.000000E+00
2.731550000000E+02	-2.194257E+01	0.000000E+00	0.000000E+00	0.000000E+00
2.951210000000E+02	-2.139594E+01	0.000000E+00	0.000000E+00	0.000000E+00
3.198900000000E+02	-2.592873E+01	0.000000E+00	0.000000E+00	0.000000E+00
3.490530000000E+02	-2.841000E+01	0.000000E+00	0.000000E+00	0.000000E+00
3.782170000000E+02	-3.137156E+01	0.000000E+00	0.000000E+00	0.000000E+00
4.073800000000E+02	-3.356016E+01	0.000000E+00	0.000000E+00	0.000000E+00
4.415700000000E+02	-3.702666E+01	0.000000E+00	0.000000E+00	0.000000E+00
4.801850000000E+02	-3.783667E+01	0.000000E+00	0.000000E+00	0.000000E+00
5.188000000000E+02	-4.102898E+01	0.000000E+00	0.000000E+00	0.000000E+00
5.623410000000E+02	-4.343225E+01	0.000000E+00	0.000000E+00	0.000000E+00
6.136080000000E+02	-4.491941E+01	0.000000E+00	0.000000E+00	0.000000E+00
6.648760000000E+02	-4.779832E+01	0.000000E+00	0.000000E+00	0.000000E+00
7.161430000000E+02	-4.819034E+01	0.000000E+00	0.000000E+00	0.000000E+00
7.762470000000E+02	-5.171029E+01	0.000000E+00	0.000000E+00	0.000000E+00
8.470160000000E+02	-5.646270E+01	0.000000E+00	0.000000E+00	0.000000E+00
9.177840000000E+02	-5.419851E+01	0.000000E+00	0.000000E+00	0.000000E+00
9.885530000000E+02	-5.523086E+01	0.000000E+00	0.000000E+00	0.000000E+00
1.071519000000E+03	-5.592390E+01	0.000000E+00	0.000000E+00	0.000000E+00
1.165222000000E+03	-5.495465E+01	0.000000E+00	0.000000E+00	0.000000E+00
1.258925000000E+03	-5.520103E+01	0.000000E+00	0.000000E+00	0.000000E+00
1.364583000000E+03	-5.942736E+01	0.000000E+00	0.000000E+00	0.000000E+00
1.488989000000E+03	-5.217607E+01	0.000000E+00	0.000000E+00	0.000000E+00
1.613395000000E+03	-5.465462E+01	0.000000E+00	0.000000E+00	0.000000E+00
1.737801000000E+03	-5.581263E+01	0.000000E+00	0.000000E+00	0.000000E+00
1.883649000000E+03	-4.403106E+01	0.000000E+00	0.000000E+00	0.000000E+00
2.048372000000E+03	-3.703781E+01	0.000000E+00	0.000000E+00	0.000000E+00
2.213095000000E+03	-3.105073E+01	0.000000E+00	0.000000E+00	0.000000E+00
2.398833000000E+03	-1.083440E+01	0.000000E+00	0.000000E+00	0.000000E+00
2.617529000000E+03	-1.986671E+00	0.000000E+00	0.000000E+00	0.000000E+00
2.836225000000E+03	3.811973E+01	0.000000E+00	0.000000E+00	0.000000E+00
3.054921000000E+03	5.508956E+01	0.000000E+00	0.000000E+00	0.000000E+00
3.311311000000E+03	4.284816E+01	0.000000E+00	0.000000E+00	0.000000E+00
3.600881000000E+03	4.359340E+01	0.000000E+00	0.000000E+00	0.000000E+00
3.890451000000E+03	4.263527E+01	0.000000E+00	0.000000E+00	0.000000E+00
4.216965000000E+03	3.922579E+01	0.000000E+00	0.000000E+00	0.000000E+00
4.601416000000E+03	3.993407E+01	0.000000E+00	0.000000E+00	0.000000E+00
4.985867000000E+03	4.251044E+01	0.000000E+00	0.000000E+00	0.000000E+00
5.370318000000E+03	4.371113E+01	0.000000E+00	0.000000E+00	0.000000E+00
5.821032000000E+03	4.645782E+01	0.000000E+00	0.000000E+00	0.000000E+00
6.351722000000E+03	4.698907E+01	0.000000E+00	0.000000E+00	0.000000E+00
6.882412000000E+03	4.465054E+01	0.000000E+00	0.000000E+00	0.000000E+00
7.413102000000E+03	4.208095E+01	0.000000E+00	0.000000E+00	0.000000E+00
8.035261000000E+03	4.136619E+01	0.000000E+00	0.000000E+00	0.000000E+00
8.737935000000E+03	3.821141E+01	0.000000E+00	0.000000E+00	0.000000E+00
9.440609000000E+03	3.629802E+01	0.000000E+00	0.000000E+00	0.000000E+00
1.023293000000E+04	3.526935E+01	0.000000E+00	0.000000E+00	0.000000E+00
1.116584300000E+04	3.261629E+01	0.000000E+00	0.000000E+00	0.000000E+00
1.209875500000E+04	2.985454E+01	0.000000E+00	0.000000E+00	0.000000E+00
1.303166800000E+04	2.805678E+01	0.000000E+00	0.000000E+00	0.000000E+00
1.412537500000E+04	2.515990E+01	0.000000E+00	0.000000E+00	0.000000E+00
1.536062200000E+04	2.250149E+01	0.000000E+00	0.000000E+00	0.000000E+00
1.659586900000E+04	1.991102E+01	0.000000E+00	0.000000E+00	0.000000E+00
1.798870900000E+04	1.726664E+01	0.000000E+00	0.000000E+00	0.000000E+00
1.962869800000E+04	1.404878E+01	0.000000E+00	0.000000E+00	0.000000E+00
2.126868800000E+04	1.154377E+01	0.000000E+00	0.000000E+00	0.000000E+00
2.290867700000E+04	8.667576E+00	0.000000E+00	0.000000E+00	0.000000E+00
2.483133100000E+04	5.931833E+00	0.000000E+00	0.000000E+00	0.000000E+00
2.700280100000E+04	2.853123E+00	0.000000E+00	0.000000E+00	0.000000E+00
2.917427000000E+04	-4.370106E-01	0.000000E+00	0.000000E+00	0.000000E+00
3.162277700000E+04	-3.834379E+00	0.000000E+00	0.000000E+00	0.000000E+00
3.450575200000E+04	-7.447961E+00	0.000000E+00	0.000000E+00	0.000000E+00
3.738872800000E+04	-1.084870E+01	0.000000E+00	0.000000E+00	0.000000E+00
4.027170300000E+04	-1.380024E+01	0.000000E+00	0.000000E+00	0.000000E+00
4.365158300000E+04	-1.706349E+01	0.000000E+00	0.000000E+00	0.000000E+00
4.763119700000E+04	-2.047012E+01	0.000000E+00	0.000000E+00	0.000000E+00
5.161081200000E+04	-2.400983E+01	0.000000E+00	0.000000E+00	0.000000E+00
5.559042600000E+04	-2.750754E+01	0.000000E+00	0.000000E+00	0.000000E+00
6.025595900000E+04	-3.114573E+01	0.000000E+00	0.000000E+00	0.000000E+00
6.552526800000E+04	-3.458617E+01	0.000000E+00	0.000000E+00	0.000000E+00
7.079457800000E+04	-3.833813E+01	0.000000E+00	0.000000E+00	0.000000E+00
7.673614900000E+04	-4.192092E+01	0.000000E+00	0.000000E+00	0.000000E+00
8.373200700000E+04	-4.578586E+01	0.000000E+00	0.000000E+00	0.000000E+00
9.072786400000E+04	-4.987373E+01	0.000000E+00	0.000000E+00	0.000000E+00
9.772372200000E+04	-5.404231E+01	0.000000E+00	0.000000E+00	0.000000E+00
1.059253730000E+05	-5.733185E+01	0.000000E+00	0.000000E+00	0.000000E+00
1.151884170000E+05	-6.192735E+01	0.000000E+00	0.000000E+00	0.000000E+00
1.244514610000E+05	-6.617654E+01	0.000000E+00	0.000000E+00	0.000000E+00
1.348962880000E+05	-7.046130E+01	0.000000E+00	0.000000E+00	0.000000E+00
1.471944720000E+05	-7.481956E+01	0.000000E+00	0.000000E+00	0.000000E+00
1.594926550000E+05	-7.980193E+01	0.000000E+00	0.000000E+00	0.000000E+00
1.717908390000E+05	-8.474316E+01	0.000000E+00	0.000000E+00	0.000000E+00
1.862087140000E+05	-8.912474E+01	0.000000E+00	0.000000E+00	0.000000E+00
2.024924380000E+05	-9.452136E+01	0.000000E+00	0.000000E+00	0.000000E+00
2.187761620000E+05	-9.864326E+01	0.000000E+00	0.000000E+00	0.000000E+00
2.371373710000E+05	-1.041085E+02	0.000000E+00	0.000000E+00	0.000000E+00
2.587566380000E+05	-1.107961E+02	0.000000E+00	0.000000E+00	0.000000E+00
2.803759050000E+05	-1.163027E+02	0.000000E+00	0.000000E+00	0.000000E+00
3.019951720000E+05	-1.219864E+02	0.000000E+00	0.000000E+00	0.000000E+00
3.273406950000E+05	-1.279860E+02	0.000000E+00	0.000000E+00	0.000000E+00
3.571835910000E+05	-1.360127E+02	0.000000E+00	0.000000E+00	0.000000E+00
3.870264870000E+05	-1.434048E+02	0.000000E+00	0.000000E+00	0.000000E+00
4.168693830000E+05	-1.515389E+02	0.000000E+00	0.000000E+00	0.000000E+00
4.518559440000E+05	-1.600508E+02	0.000000E+00	0.000000E+00	0.000000E+00
4.913701940000E+05	-1.684995E+02	0.000000E+00	0.000000E+00	0.000000E+00
5.308844440000E+05	-1.780139E+02	0.000000E+00	0.000000E+00	0.000000E+00
5.754399370000E+05	1.722012E+02	0.000000E+00	0.000000E+00	0.000000E+00
6.279014690000E+05	1.598220E+02	0.000000E+00	0.000000E+00	0.000000E+00
6.803630010000E+05	1.475910E+02	0.000000E+00	0.000000E+00	0.000000E+00
7.328245330000E+05	1.350358E+02	0.000000E+00	0.000000E+00	0.000000E+00
7.943282350000E+05	1.200180E+02	0.000000E+00	0.000000E+00	0.000000E+00
8.637912680000E+05	1.047748E+02	0.000000E+00	0.000000E+00	0.000000E+00
9.332543010000E+05	9.036352E+01	0.000000E+00	0.000000E+00	0.000000E+00
1.011579454000E+06	7.326817E+01	0.000000E+00	0.000000E+00	0.000000E+00
1.103802820000E+06	4.976781E+01	0.000000E+00	0.000000E+00	0.000000E+00
1.196026186000E+06	2.735641E+01	0.000000E+00	0.000000E+00	0.000000E+00
1.288249552000E+06	6.535254E+00	0.000000E+00	0.000000E+00	0.000000E+00
1.396368361000E+06	-1.925709E+01	0.000000E+00	0.000000E+00	0.000000E+00
1.518479067000E+06	-4.487545E+01	0.000000E+00	0.000000E+00	0.000000E+00
1.640589773000E+06	-6.588831E+01	0.000000E+00	0.000000E+00	0.000000E+00
1.778279410000E+06	-9.473506E+01	0.000000E+00	0.000000E+00	0.000000E+00
1.940401043000E+06	-1.074934E+02	0.000000E+00	0.000000E+00	0.000000E+00
2.102522675000E+06	-1.217378E+02	0.000000E+00	0.000000E+00	0.000000E+00
2.264644308000E+06	1.687773E+02	0.000000E+00	0.000000E+00	0.000000E+00
2.454708916000E+06	-1.430942E+02	0.000000E+00	0.000000E+00	0.000000E+00
2.678499066000E+06	-1.782844E+02	0.000000E+00	0.000000E+00	0.000000E+00
2.902289217000E+06	1.376034E+02	0.000000E+00	0.000000E+00	0.000000E+00
3.126079367000E+06	1.777389E+02	0.000000E+00	0.000000E+00	0.000000E+00
3.388441561000E+06	3.064711E+01	0.000000E+00	0.000000E+00	0.000000E+00
3.684756634000E+06	-1.904055E+01	0.000000E+00	0.000000E+00	0.000000E+00
3.981071706000E+06	1.184581E-01	0.000000E+00	0.000000E+00	0.000000E+00
4.315190768000E+06	1.201869E+02	0.000000E+00	0.000000E+00	0.000000E+00
4.708596758000E+06	-1.275558E+02	0.000000E+00	0.000000E+00	0.000000E+00
5.102002749000E+06	0.000000E+00	0.000000E+00	0.000000E+00	0.000000E+00
5.495408739000E+06	-1.398283E+01	0.000000E+00	0.000000E+00	0.000000E+00
5.956621435000E+06	5.079564E+01	0.000000E+00	0.000000E+00	0.000000E+00
6.477520698000E+06	1.742696E+02	0.000000E+00	0.000000E+00	0.000000E+00
6.998419960000E+06	1.586682E+02	0.000000E+00	0.000000E+00	0.000000E+00
7.585775750000E+06	-5.754619E+01	0.000000E+00	0.000000E+00	0.000000E+00
8.277353430000E+06	1.536543E+02	0.000000E+00	0.000000E+00	0.000000E+00
8.968931110000E+06	-1.642461E+02	0.000000E+00	0.000000E+00	0.000000E+00
9.660508790000E+06	-1.177826E+02	0.000000E+00	0.000000E+00	0.000000E+00
1.047128548100E+07	1.277386E+02	0.000000E+00	0.000000E+00	0.000000E+00
1.138698659500E+07	-2.545663E+01	0.000000E+00	0.000000E+00	0.000000E+00
1.230268770800E+07	1.098913E+01	0.000000E+00	0.000000E+00	0.000000E+00
1.333521432200E+07	-1.365814E+02	0.000000E+00	0.000000E+00	0.000000E+00
1.455095505600E+07	-9.366004E+01	0.000000E+00	0.000000E+00	0.000000E+00
1.576669579100E+07	-1.232221E+02	0.000000E+00	0.000000E+00	0.000000E+00
1.698243652500E+07	-1.305898E+02	0.000000E+00	0.000000E+00	0.000000E+00
1.840772001500E+07	-2.626378E+01	0.000000E+00	0.000000E+00	0.000000E+00
2.008590939400E+07	1.652658E+01	0.000000E+00	0.000000E+00	0.000000E+00
2.176409877400E+07	2.688311E+01	0.000000E+00	0.000000E+00	0.000000E+00
2.344228815300E+07	-7.548385E+01	0.000000E+00	0.000000E+00	0.000000E+00
2.540972705500E+07	1.283192E+02	0.000000E+00	0.000000E+00	0.000000E+00
2.763177662200E+07	2.437284E+00	0.000000E+00	0.000000E+00	0.000000E+00
2.985382618900E+07	-4.613445E+01	0.000000E+00	0.000000E+00	0.000000E+00
3.235936569300E+07	6.374841E+00	0.000000E+00	0.000000E+00	0.000000E+00
3.530949443200E+07	-1.012460E+02	0.000000E+00	0.000000E+00	0.000000E+00
3.825962317100E+07	1.091070E+02	0.000000E+00	0.000000E+00	0.000000E+00
4.120975191000E+07	-2.968258E+01	0.000000E+00	0.000000E+00	0.000000E+00
4.466835921500E+07	-9.726074E+01	0.000000E+00	0.000000E+00	0.000000E+00
4.857455262000E+07	0.000000E+00	0.000000E+00	0.000000E+00	0.000000E+00
5.248074602500E+07	1.489738E+02	0.000000E+00	0.000000E+00	0.000000E+00
5.688529308400E+07	-5.445576E+01	0.000000E+00	0.000000E+00	0.000000E+00
6.207139405800E+07	1.259057E+02	0.000000E+00	0.000000E+00	0.000000E+00
6.725749503300E+07	-3.518487E+00	0.000000E+00	0.000000E+00	0.000000E+00
7.244359600700E+07	1.065758E+02	0.000000E+00	0.000000E+00	0.000000E+00
7.852356346100E+07	1.027641E+02	0.000000E+00	0.000000E+00	0.000000E+00
8.568237564100E+07	-8.220329E+01	0.000000E+00	0.000000E+00	0.000000E+00
9.284118782000E+07	1.370864E+02	0.000000E+00	0.000000E+00	0.000000E+00
1.000000000000E+08	1.301287E+02	0.000000E+00	0.000000E+00	0.000000E+00
