  0.000000e+00   3.452687e-02   0.000000e+00   3.452687e-02   0.000000e+00 
  1.600000e+01   5.544249e-02   0.000000e+00   5.544249e-02   0.000000e+00 
  3.200000e+01   6.421418e-02   0.000000e+00   6.421418e-02   0.000000e+00 
  4.800000e+01   6.797655e-02   0.000000e+00   6.797655e-02   0.000000e+00 
  6.400000e+01   6.303666e-02   0.000000e+00   6.303666e-02   0.000000e+00 
  8.000000e+01   4.201323e-02   0.000000e+00   4.201323e-02   0.000000e+00 
  9.600000e+01   3.882947e-02   0.000000e+00   3.882947e-02   0.000000e+00 
  1.120000e+02   5.740650e-02   0.000000e+00   5.740650e-02   0.000000e+00 
  1.280000e+02   5.324554e-02   0.000000e+00   5.324554e-02   0.000000e+00 
  1.440000e+02   2.934220e-02   0.000000e+00   2.934220e-02   0.000000e+00 
  1.600000e+02   2.872811e-02   0.000000e+00   2.872811e-02   0.000000e+00 
  1.760000e+02   2.814749e-02   0.000000e+00   2.814749e-02   0.000000e+00 
  1.920000e+02   2.556238e-02   0.000000e+00   2.556238e-02   0.000000e+00 
  2.080000e+02   2.350717e-02   0.000000e+00   2.350717e-02   0.000000e+00 
  2.240000e+02   2.244839e-02   0.000000e+00   2.244839e-02   0.000000e+00 
  2.400000e+02   2.255946e-02   0.000000e+00   2.255946e-02   0.000000e+00 
  2.560000e+02   1.975243e-02   0.000000e+00   1.975243e-02   0.000000e+00 
  2.720000e+02   1.882004e-02   0.000000e+00   1.882004e-02   0.000000e+00 
  2.880000e+02   1.909243e-02   0.000000e+00   1.909243e-02   0.000000e+00 
  3.040000e+02   1.760879e-02   0.000000e+00   1.760879e-02   0.000000e+00 
  3.200000e+02   1.740985e-02   0.000000e+00   1.740985e-02   0.000000e+00 
  3.360000e+02   1.690814e-02   0.000000e+00   1.690814e-02   0.000000e+00 
  3.520000e+02   1.707213e-02   0.000000e+00   1.707213e-02   0.000000e+00 
  3.680000e+02   1.660186e-02   0.000000e+00   1.660186e-02   0.000000e+00 
  3.840000e+02   1.576557e-02   0.000000e+00   1.576557e-02   0.000000e+00 
  4.000000e+02   1.538831e-02   0.000000e+00   1.538831e-02   0.000000e+00 
  4.160000e+02   1.474416e-02   0.000000e+00   1.474416e-02   0.000000e+00 
  4.320000e+02   1.451648e-02   0.000000e+00   1.451648e-02   0.000000e+00 
  4.480000e+02   1.474512e-02   0.000000e+00   1.474512e-02   0.000000e+00 
  4.640000e+02   1.439142e-02   0.000000e+00   1.439142e-02   0.000000e+00 
  4.800000e+02   1.348485e-02   0.000000e+00   1.348485e-02   0.000000e+00 
  4.960000e+02   1.305274e-02   0.000000e+00   1.305274e-02   0.000000e+00 
  5.120000e+02   1.277936e-02   0.000000e+00   1.277936e-02   0.000000e+00 
  5.280000e+02   1.184086e-02   0.000000e+00   1.184086e-02   0.000000e+00 
  5.440000e+02   1.227768e-02   0.000000e+00   1.227768e-02   0.000000e+00 
  5.600000e+02   1.144719e-02   0.000000e+00   1.144719e-02   0.000000e+00 
  5.760000e+02   1.121972e-02   0.000000e+00   1.121972e-02   0.000000e+00 
  5.920000e+02   1.135033e-02   0.000000e+00   1.135033e-02   0.000000e+00 
  6.080000e+02   1.124851e-02   0.000000e+00   1.124851e-02   0.000000e+00 
  6.240000e+02   1.181985e-02   0.000000e+00   1.181985e-02   0.000000e+00 
  6.400000e+02   1.137522e-02   0.000000e+00   1.137522e-02   0.000000e+00 
  6.560000e+02   1.103795e-02   0.000000e+00   1.103795e-02   0.000000e+00 
  6.720000e+02   1.058004e-02   0.000000e+00   1.058004e-02   0.000000e+00 
  6.880000e+02   1.043901e-02   0.000000e+00   1.043901e-02   0.000000e+00 
  7.040000e+02   1.094660e-02   0.000000e+00   1.094660e-02   0.000000e+00 
  7.200000e+02   1.058331e-02   0.000000e+00   1.058331e-02   0.000000e+00 
  7.360000e+02   1.049905e-02   0.000000e+00   1.049905e-02   0.000000e+00 
  7.520000e+02   1.052993e-02   0.000000e+00   1.052993e-02   0.000000e+00 
  7.680000e+02   1.002737e-02   0.000000e+00   1.002737e-02   0.000000e+00 
  7.840000e+02   9.795205e-03   0.000000e+00   9.795205e-03   0.000000e+00 
  8.000000e+02   9.869641e-03   0.000000e+00   9.869641e-03   0.000000e+00 
  8.160000e+02   8.976682e-03   0.000000e+00   8.976682e-03   0.000000e+00 
  8.320000e+02   8.832060e-03   0.000000e+00   8.832060e-03   0.000000e+00 
  8.480000e+02   9.228553e-03   0.000000e+00   9.228553e-03   0.000000e+00 
  8.640000e+02   9.168256e-03   0.000000e+00   9.168256e-03   0.000000e+00 
  8.800000e+02   9.295647e-03   0.000000e+00   9.295647e-03   0.000000e+00 
  8.960000e+02   8.969725e-03   0.000000e+00   8.969725e-03   0.000000e+00 
  9.120000e+02   8.526140e-03   0.000000e+00   8.526140e-03   0.000000e+00 
  9.280000e+02   8.739187e-03   0.000000e+00   8.739187e-03   0.000000e+00 
  9.440000e+02   8.961150e-03   0.000000e+00   8.961150e-03   0.000000e+00 
  9.600000e+02   8.783124e-03   0.000000e+00   8.783124e-03   0.000000e+00 
  9.760000e+02   8.586459e-03   0.000000e+00   8.586459e-03   0.000000e+00 
  9.920000e+02   8.984017e-03   0.000000e+00   8.984017e-03   0.000000e+00 
  1.008000e+03   9.146584e-03   0.000000e+00   9.146584e-03   0.000000e+00 
  1.024000e+03   8.937340e-03   0.000000e+00   8.937340e-03   0.000000e+00 
  1.040000e+03   8.120862e-03   0.000000e+00   8.120862e-03   0.000000e+00 
  1.056000e+03   7.701040e-03   0.000000e+00   7.701040e-03   0.000000e+00 
  1.072000e+03   8.117135e-03   0.000000e+00   8.117135e-03   0.000000e+00 
  1.088000e+03   8.051032e-03   0.000000e+00   8.051032e-03   0.000000e+00 
  1.104000e+03   8.100786e-03   0.000000e+00   8.100786e-03   0.000000e+00 
  1.120000e+03   7.708478e-03   0.000000e+00   7.708478e-03   0.000000e+00 
  1.136000e+03   7.489019e-03   0.000000e+00   7.489019e-03   0.000000e+00 
  1.152000e+03   7.661751e-03   0.000000e+00   7.661751e-03   0.000000e+00 
  1.168000e+03   7.704078e-03   0.000000e+00   7.704078e-03   0.000000e+00 
  1.184000e+03   7.474453e-03   0.000000e+00   7.474453e-03   0.000000e+00 
  1.200000e+03   7.257762e-03   0.000000e+00   7.257762e-03   0.000000e+00 
  1.216000e+03   7.117886e-03   0.000000e+00   7.117886e-03   0.000000e+00 
  1.232000e+03   6.749091e-03   0.000000e+00   6.749091e-03   0.000000e+00 
  1.248000e+03   6.845273e-03   0.000000e+00   6.845273e-03   0.000000e+00 
  1.264000e+03   6.405950e-03   0.000000e+00   6.405950e-03   0.000000e+00 
  1.280000e+03   6.390992e-03   0.000000e+00   6.390992e-03   0.000000e+00 
  1.296000e+03   6.687666e-03   0.000000e+00   6.687666e-03   0.000000e+00 
  1.312000e+03   6.674123e-03   0.000000e+00   6.674123e-03   0.000000e+00 
  1.328000e+03   6.457585e-03   0.000000e+00   6.457585e-03   0.000000e+00 
  1.344000e+03   6.298381e-03   0.000000e+00   6.298381e-03   0.000000e+00 
  1.360000e+03   6.332975e-03   0.000000e+00   6.332975e-03   0.000000e+00 
  1.376000e+03   6.326667e-03   0.000000e+00   6.326667e-03   0.000000e+00 
  1.392000e+03   6.114793e-03   0.000000e+00   6.114793e-03   0.000000e+00 
  1.408000e+03   5.737694e-03   0.000000e+00   5.737694e-03   0.000000e+00 
  1.424000e+03   5.775084e-03   0.000000e+00   5.775084e-03   0.000000e+00 
  1.440000e+03   5.848436e-03   0.000000e+00   5.848436e-03   0.000000e+00 
  1.456000e+03   5.569912e-03   0.000000e+00   5.569912e-03   0.000000e+00 
  1.472000e+03   5.439973e-03   0.000000e+00   5.439973e-03   0.000000e+00 
  1.488000e+03   5.406839e-03   0.000000e+00   5.406839e-03   0.000000e+00 
  1.504000e+03   5.328859e-03   0.000000e+00   5.328859e-03   0.000000e+00 
  1.520000e+03   5.172161e-03   0.000000e+00   5.172161e-03   0.000000e+00 
  1.536000e+03   4.962123e-03   0.000000e+00   4.962123e-03   0.000000e+00 
  1.552000e+03   5.007201e-03   0.000000e+00   5.007201e-03   0.000000e+00 
  1.568000e+03   5.071731e-03   0.000000e+00   5.071731e-03   0.000000e+00 
  1.584000e+03   5.267636e-03   0.000000e+00   5.267636e-03   0.000000e+00 
  1.600000e+03   5.419941e-03   0.000000e+00   5.419941e-03   0.000000e+00 
  1.616000e+03   5.178604e-03   0.000000e+00   5.178604e-03   0.000000e+00 
  1.632000e+03   5.126064e-03   0.000000e+00   5.126064e-03   0.000000e+00 
  1.648000e+03   4.972732e-03   0.000000e+00   4.972732e-03   0.000000e+00 
  1.664000e+03   4.789791e-03   0.000000e+00   4.789791e-03   0.000000e+00 
  1.680000e+03   4.605897e-03   0.000000e+00   4.605897e-03   0.000000e+00 
  1.696000e+03   4.807892e-03   0.000000e+00   4.807892e-03   0.000000e+00 
  1.712000e+03   4.706629e-03   0.000000e+00   4.706629e-03   0.000000e+00 
  1.728000e+03   4.877785e-03   0.000000e+00   4.877785e-03   0.000000e+00 
  1.744000e+03   5.015426e-03   0.000000e+00   5.015426e-03   0.000000e+00 
  1.760000e+03   4.810078e-03   0.000000e+00   4.810078e-03   0.000000e+00 
  1.776000e+03   4.548518e-03   0.000000e+00   4.548518e-03   0.000000e+00 
  1.792000e+03   4.393264e-03   0.000000e+00   4.393264e-03   0.000000e+00 
  1.808000e+03   4.750438e-03   0.000000e+00   4.750438e-03   0.000000e+00 
  1.824000e+03   5.034246e-03   0.000000e+00   5.034246e-03   0.000000e+00 
  1.840000e+03   4.821221e-03   0.000000e+00   4.821221e-03   0.000000e+00 
  1.856000e+03   4.375540e-03   0.000000e+00   4.375540e-03   0.000000e+00 
  1.872000e+03   4.308777e-03   0.000000e+00   4.308777e-03   0.000000e+00 
  1.888000e+03   4.533959e-03   0.000000e+00   4.533959e-03   0.000000e+00 
  1.904000e+03   4.546370e-03   0.000000e+00   4.546370e-03   0.000000e+00 
  1.920000e+03   4.144794e-03   0.000000e+00   4.144794e-03   0.000000e+00 
  1.936000e+03   4.283099e-03   0.000000e+00   4.283099e-03   0.000000e+00 
  1.952000e+03   4.339697e-03   0.000000e+00   4.339697e-03   0.000000e+00 
  1.968000e+03   4.559327e-03   0.000000e+00   4.559327e-03   0.000000e+00 
  1.984000e+03   4.519380e-03   0.000000e+00   4.519380e-03   0.000000e+00 
  2.000000e+03   4.529328e-03   0.000000e+00   4.529328e-03   0.000000e+00 
  2.016000e+03   4.290349e-03   0.000000e+00   4.290349e-03   0.000000e+00 
  2.032000e+03   4.445985e-03   0.000000e+00   4.445985e-03   0.000000e+00 
  2.048000e+03   4.197759e-03   0.000000e+00   4.197759e-03   0.000000e+00 
  2.064000e+03   3.972372e-03   0.000000e+00   3.972372e-03   0.000000e+00 
  2.080000e+03   4.102566e-03   0.000000e+00   4.102566e-03   0.000000e+00 
  2.096000e+03   4.024793e-03   0.000000e+00   4.024793e-03   0.000000e+00 
  2.112000e+03   3.893581e-03   0.000000e+00   3.893581e-03   0.000000e+00 
  2.128000e+03   3.829665e-03   0.000000e+00   3.829665e-03   0.000000e+00 
  2.144000e+03   3.897344e-03   0.000000e+00   3.897344e-03   0.000000e+00 
  2.160000e+03   3.907334e-03   0.000000e+00   3.907334e-03   0.000000e+00 
  2.176000e+03   3.806167e-03   0.000000e+00   3.806167e-03   0.000000e+00 
  2.192000e+03   3.908983e-03   0.000000e+00   3.908983e-03   0.000000e+00 
  2.208000e+03   3.865139e-03   0.000000e+00   3.865139e-03   0.000000e+00 
  2.224000e+03   3.669755e-03   0.000000e+00   3.669755e-03   0.000000e+00 
  2.240000e+03   3.852108e-03   0.000000e+00   3.852108e-03   0.000000e+00 
  2.256000e+03   3.765159e-03   0.000000e+00   3.765159e-03   0.000000e+00 
  2.272000e+03   3.699598e-03   0.000000e+00   3.699598e-03   0.000000e+00 
  2.288000e+03   3.480562e-03   0.000000e+00   3.480562e-03   0.000000e+00 
  2.304000e+03   3.255688e-03   0.000000e+00   3.255688e-03   0.000000e+00 
  2.320000e+03   3.350615e-03   0.000000e+00   3.350615e-03   0.000000e+00 
  2.336000e+03   3.300615e-03   0.000000e+00   3.300615e-03   0.000000e+00 
  2.352000e+03   3.429121e-03   0.000000e+00   3.429121e-03   0.000000e+00 
  2.368000e+03   3.378293e-03   0.000000e+00   3.378293e-03   0.000000e+00 
  2.384000e+03   3.188353e-03   0.000000e+00   3.188353e-03   0.000000e+00 
  2.400000e+03   3.257692e-03   0.000000e+00   3.257692e-03   0.000000e+00 
  2.416000e+03   3.189172e-03   0.000000e+00   3.189172e-03   0.000000e+00 
  2.432000e+03   3.143763e-03   0.000000e+00   3.143763e-03   0.000000e+00 
  2.448000e+03   3.093070e-03   0.000000e+00   3.093070e-03   0.000000e+00 
  2.464000e+03   3.127843e-03   0.000000e+00   3.127843e-03   0.000000e+00 
  2.480000e+03   3.195392e-03   0.000000e+00   3.195392e-03   0.000000e+00 
  2.496000e+03   3.080749e-03   0.000000e+00   3.080749e-03   0.000000e+00 
  2.512000e+03   3.070910e-03   0.000000e+00   3.070910e-03   0.000000e+00 
  2.528000e+03   3.003082e-03   0.000000e+00   3.003082e-03   0.000000e+00 
  2.544000e+03   2.915662e-03   0.000000e+00   2.915662e-03   0.000000e+00 
  2.560000e+03   2.758600e-03   0.000000e+00   2.758600e-03   0.000000e+00 
  2.576000e+03   2.807740e-03   0.000000e+00   2.807740e-03   0.000000e+00 
  2.592000e+03   2.902838e-03   0.000000e+00   2.902838e-03   0.000000e+00 
  2.608000e+03   2.652708e-03   0.000000e+00   2.652708e-03   0.000000e+00 
  2.624000e+03   2.661672e-03   0.000000e+00   2.661672e-03   0.000000e+00 
  2.640000e+03   2.756445e-03   0.000000e+00   2.756445e-03   0.000000e+00 
  2.656000e+03   2.750265e-03   0.000000e+00   2.750265e-03   0.000000e+00 
  2.672000e+03   2.681953e-03   0.000000e+00   2.681953e-03   0.000000e+00 
  2.688000e+03   2.649954e-03   0.000000e+00   2.649954e-03   0.000000e+00 
  2.704000e+03   2.602157e-03   0.000000e+00   2.602157e-03   0.000000e+00 
  2.720000e+03   2.675971e-03   0.000000e+00   2.675971e-03   0.000000e+00 
  2.736000e+03   2.428137e-03   0.000000e+00   2.428137e-03   0.000000e+00 
  2.752000e+03   2.382909e-03   0.000000e+00   2.382909e-03   0.000000e+00 
  2.768000e+03   2.415724e-03   0.000000e+00   2.415724e-03   0.000000e+00 
  2.784000e+03   2.316745e-03   0.000000e+00   2.316745e-03   0.000000e+00 
  2.800000e+03   2.328062e-03   0.000000e+00   2.328062e-03   0.000000e+00 
  2.816000e+03   2.335366e-03   0.000000e+00   2.335366e-03   0.000000e+00 
  2.832000e+03   2.276957e-03   0.000000e+00   2.276957e-03   0.000000e+00 
  2.848000e+03   2.187200e-03   0.000000e+00   2.187200e-03   0.000000e+00 
  2.864000e+03   2.072199e-03   0.000000e+00   2.072199e-03   0.000000e+00 
  2.880000e+03   2.148906e-03   0.000000e+00   2.148906e-03   0.000000e+00 
  2.896000e+03   2.212931e-03   0.000000e+00   2.212931e-03   0.000000e+00 
  2.912000e+03   2.239029e-03   0.000000e+00   2.239029e-03   0.000000e+00 
  2.928000e+03   2.002896e-03   0.000000e+00   2.002896e-03   0.000000e+00 
  2.944000e+03   1.999601e-03   0.000000e+00   1.999601e-03   0.000000e+00 
  2.960000e+03   2.057423e-03   0.000000e+00   2.057423e-03   0.000000e+00 
  2.976000e+03   2.110452e-03   0.000000e+00   2.110452e-03   0.000000e+00 
  2.992000e+03   2.624776e-03   0.000000e+00   2.624776e-03   0.000000e+00 
  3.008000e+03   3.686868e-03   0.000000e+00   3.686868e-03   0.000000e+00 
  3.024000e+03   2.732894e-03   0.000000e+00   2.732894e-03   0.000000e+00 
  3.040000e+03   2.008808e-03   0.000000e+00   2.008808e-03   0.000000e+00 
  3.056000e+03   2.072429e-03   0.000000e+00   2.072429e-03   0.000000e+00 
  3.072000e+03   1.934251e-03   0.000000e+00   1.934251e-03   0.000000e+00 
  3.088000e+03   1.860938e-03   0.000000e+00   1.860938e-03   0.000000e+00 
  3.104000e+03   1.853600e-03   0.000000e+00   1.853600e-03   0.000000e+00 
  3.120000e+03   1.792793e-03   0.000000e+00   1.792793e-03   0.000000e+00 
  3.136000e+03   1.835971e-03   0.000000e+00   1.835971e-03   0.000000e+00 
  3.152000e+03   1.837457e-03   0.000000e+00   1.837457e-03   0.000000e+00 
  3.168000e+03   1.755139e-03   0.000000e+00   1.755139e-03   0.000000e+00 
  3.184000e+03   1.725802e-03   0.000000e+00   1.725802e-03   0.000000e+00 
  3.200000e+03   1.691422e-03   0.000000e+00   1.691422e-03   0.000000e+00 
  3.216000e+03   1.588762e-03   0.000000e+00   1.588762e-03   0.000000e+00 
  3.232000e+03   1.573945e-03   0.000000e+00   1.573945e-03   0.000000e+00 
  3.248000e+03   1.584722e-03   0.000000e+00   1.584722e-03   0.000000e+00 
  3.264000e+03   1.654924e-03   0.000000e+00   1.654924e-03   0.000000e+00 
  3.280000e+03   1.575659e-03   0.000000e+00   1.575659e-03   0.000000e+00 
  3.296000e+03   1.441696e-03   0.000000e+00   1.441696e-03   0.000000e+00 
  3.312000e+03   1.464377e-03   0.000000e+00   1.464377e-03   0.000000e+00 
  3.328000e+03   1.450909e-03   0.000000e+00   1.450909e-03   0.000000e+00 
  3.344000e+03   1.390069e-03   0.000000e+00   1.390069e-03   0.000000e+00 
  3.360000e+03   1.390585e-03   0.000000e+00   1.390585e-03   0.000000e+00 
  3.376000e+03   1.423032e-03   0.000000e+00   1.423032e-03   0.000000e+00 
  3.392000e+03   1.396454e-03   0.000000e+00   1.396454e-03   0.000000e+00 
  3.408000e+03   1.413977e-03   0.000000e+00   1.413977e-03   0.000000e+00 
  3.424000e+03   1.344064e-03   0.000000e+00   1.344064e-03   0.000000e+00 
  3.440000e+03   1.275798e-03   0.000000e+00   1.275798e-03   0.000000e+00 
  3.456000e+03   1.289159e-03   0.000000e+00   1.289159e-03   0.000000e+00 
  3.472000e+03   1.282476e-03   0.000000e+00   1.282476e-03   0.000000e+00 
  3.488000e+03   1.265329e-03   0.000000e+00   1.265329e-03   0.000000e+00 
  3.504000e+03   1.344887e-03   0.000000e+00   1.344887e-03   0.000000e+00 
  3.520000e+03   1.248238e-03   0.000000e+00   1.248238e-03   0.000000e+00 
  3.536000e+03   1.202210e-03   0.000000e+00   1.202210e-03   0.000000e+00 
  3.552000e+03   1.092595e-03   0.000000e+00   1.092595e-03   0.000000e+00 
  3.568000e+03   1.104023e-03   0.000000e+00   1.104023e-03   0.000000e+00 
  3.584000e+03   1.088230e-03   0.000000e+00   1.088230e-03   0.000000e+00 
  3.600000e+03   1.051564e-03   0.000000e+00   1.051564e-03   0.000000e+00 
  3.616000e+03   1.080843e-03   0.000000e+00   1.080843e-03   0.000000e+00 
  3.632000e+03   1.113724e-03   0.000000e+00   1.113724e-03   0.000000e+00 
  3.648000e+03   1.020147e-03   0.000000e+00   1.020147e-03   0.000000e+00 
  3.664000e+03   9.907590e-04   0.000000e+00   9.907590e-04   0.000000e+00 
  3.680000e+03   9.500568e-04   0.000000e+00   9.500568e-04   0.000000e+00 
  3.696000e+03   9.991035e-04   0.000000e+00   9.991035e-04   0.000000e+00 
  3.712000e+03   9.958838e-04   0.000000e+00   9.958838e-04   0.000000e+00 
  3.728000e+03   9.315689e-04   0.000000e+00   9.315689e-04   0.000000e+00 
  3.744000e+03   9.404114e-04   0.000000e+00   9.404114e-04   0.000000e+00 
  3.760000e+03   9.119787e-04   0.000000e+00   9.119787e-04   0.000000e+00 
  3.776000e+03   8.985340e-04   0.000000e+00   8.985340e-04   0.000000e+00 
  3.792000e+03   8.801589e-04   0.000000e+00   8.801589e-04   0.000000e+00 
  3.808000e+03   8.776561e-04   0.000000e+00   8.776561e-04   0.000000e+00 
  3.824000e+03   8.713599e-04   0.000000e+00   8.713599e-04   0.000000e+00 
  3.840000e+03   8.449710e-04   0.000000e+00   8.449710e-04   0.000000e+00 
  3.856000e+03   8.464244e-04   0.000000e+00   8.464244e-04   0.000000e+00 
  3.872000e+03   8.526881e-04   0.000000e+00   8.526881e-04   0.000000e+00 
  3.888000e+03   8.679226e-04   0.000000e+00   8.679226e-04   0.000000e+00 
  3.904000e+03   8.291308e-04   0.000000e+00   8.291308e-04   0.000000e+00 
  3.920000e+03   7.701048e-04   0.000000e+00   7.701048e-04   0.000000e+00 
  3.936000e+03   7.419208e-04   0.000000e+00   7.419208e-04   0.000000e+00 
  3.952000e+03   7.711496e-04   0.000000e+00   7.711496e-04   0.000000e+00 
  3.968000e+03   8.081085e-04   0.000000e+00   8.081085e-04   0.000000e+00 
  3.984000e+03   7.901147e-04   0.000000e+00   7.901147e-04   0.000000e+00 
  4.000000e+03   7.076880e-04   0.000000e+00   7.076880e-04   0.000000e+00 
  4.016000e+03   7.213713e-04   0.000000e+00   7.213713e-04   0.000000e+00 
  4.032000e+03   7.432229e-04   0.000000e+00   7.432229e-04   0.000000e+00 
  4.048000e+03   7.691656e-04   0.000000e+00   7.691656e-04   0.000000e+00 
  4.064000e+03   7.835446e-04   0.000000e+00   7.835446e-04   0.000000e+00 
  4.080000e+03   8.184525e-04   0.000000e+00   8.184525e-04   0.000000e+00 
  4.096000e+03   7.889916e-04   0.000000e+00   7.889916e-04   0.000000e+00 
  4.112000e+03   7.831672e-04   0.000000e+00   7.831672e-04   0.000000e+00 
  4.128000e+03   7.024099e-04   0.000000e+00   7.024099e-04   0.000000e+00 
  4.144000e+03   6.771852e-04   0.000000e+00   6.771852e-04   0.000000e+00 
  4.160000e+03   7.000018e-04   0.000000e+00   7.000018e-04   0.000000e+00 
  4.176000e+03   7.187815e-04   0.000000e+00   7.187815e-04   0.000000e+00 
  4.192000e+03   7.258290e-04   0.000000e+00   7.258290e-04   0.000000e+00 
  4.208000e+03   7.219544e-04   0.000000e+00   7.219544e-04   0.000000e+00 
  4.224000e+03   7.069142e-04   0.000000e+00   7.069142e-04   0.000000e+00 
  4.240000e+03   6.958974e-04   0.000000e+00   6.958974e-04   0.000000e+00 
  4.256000e+03   6.911502e-04   0.000000e+00   6.911502e-04   0.000000e+00 
  4.272000e+03   6.808587e-04   0.000000e+00   6.808587e-04   0.000000e+00 
  4.288000e+03   7.008446e-04   0.000000e+00   7.008446e-04   0.000000e+00 
  4.304000e+03   6.920349e-04   0.000000e+00   6.920349e-04   0.000000e+00 
  4.320000e+03   6.543527e-04   0.000000e+00   6.543527e-04   0.000000e+00 
  4.336000e+03   5.873737e-04   0.000000e+00   5.873737e-04   0.000000e+00 
  4.352000e+03   5.892947e-04   0.000000e+00   5.892947e-04   0.000000e+00 
  4.368000e+03   5.994983e-04   0.000000e+00   5.994983e-04   0.000000e+00 
  4.384000e+03   6.035151e-04   0.000000e+00   6.035151e-04   0.000000e+00 
  4.400000e+03   5.705447e-04   0.000000e+00   5.705447e-04   0.000000e+00 
  4.416000e+03   5.621302e-04   0.000000e+00   5.621302e-04   0.000000e+00 
  4.432000e+03   5.695377e-04   0.000000e+00   5.695377e-04   0.000000e+00 
  4.448000e+03   5.895449e-04   0.000000e+00   5.895449e-04   0.000000e+00 
  4.464000e+03   5.784930e-04   0.000000e+00   5.784930e-04   0.000000e+00 
  4.480000e+03   5.439097e-04   0.000000e+00   5.439097e-04   0.000000e+00 
  4.496000e+03   5.535777e-04   0.000000e+00   5.535777e-04   0.000000e+00 
  4.512000e+03   5.611253e-04   0.000000e+00   5.611253e-04   0.000000e+00 
  4.528000e+03   5.169864e-04   0.000000e+00   5.169864e-04   0.000000e+00 
  4.544000e+03   4.976318e-04   0.000000e+00   4.976318e-04   0.000000e+00 
  4.560000e+03   5.092899e-04   0.000000e+00   5.092899e-04   0.000000e+00 
  4.576000e+03   4.919581e-04   0.000000e+00   4.919581e-04   0.000000e+00 
  4.592000e+03   5.115349e-04   0.000000e+00   5.115349e-04   0.000000e+00 
  4.608000e+03   5.014983e-04   0.000000e+00   5.014983e-04   0.000000e+00 
  4.624000e+03   5.043740e-04   0.000000e+00   5.043740e-04   0.000000e+00 
  4.640000e+03   4.842012e-04   0.000000e+00   4.842012e-04   0.000000e+00 
  4.656000e+03   4.718560e-04   0.000000e+00   4.718560e-04   0.000000e+00 
  4.672000e+03   5.190309e-04   0.000000e+00   5.190309e-04   0.000000e+00 
  4.688000e+03   4.961733e-04   0.000000e+00   4.961733e-04   0.000000e+00 
  4.704000e+03   4.758077e-04   0.000000e+00   4.758077e-04   0.000000e+00 
  4.720000e+03   4.739410e-04   0.000000e+00   4.739410e-04   0.000000e+00 
  4.736000e+03   4.551008e-04   0.000000e+00   4.551008e-04   0.000000e+00 
  4.752000e+03   4.537059e-04   0.000000e+00   4.537059e-04   0.000000e+00 
  4.768000e+03   4.551995e-04   0.000000e+00   4.551995e-04   0.000000e+00 
  4.784000e+03   4.478667e-04   0.000000e+00   4.478667e-04   0.000000e+00 
  4.800000e+03   4.476479e-04   0.000000e+00   4.476479e-04   0.000000e+00 
  4.816000e+03   4.344758e-04   0.000000e+00   4.344758e-04   0.000000e+00 
  4.832000e+03   4.430178e-04   0.000000e+00   4.430178e-04   0.000000e+00 
  4.848000e+03   4.374978e-04   0.000000e+00   4.374978e-04   0.000000e+00 
  4.864000e+03   4.246952e-04   0.000000e+00   4.246952e-04   0.000000e+00 
  4.880000e+03   4.282164e-04   0.000000e+00   4.282164e-04   0.000000e+00 
  4.896000e+03   4.236482e-04   0.000000e+00   4.236482e-04   0.000000e+00 
  4.912000e+03   3.767163e-04   0.000000e+00   3.767163e-04   0.000000e+00 
  4.928000e+03   3.627834e-04   0.000000e+00   3.627834e-04   0.000000e+00 
  4.944000e+03   3.939147e-04   0.000000e+00   3.939147e-04   0.000000e+00 
  4.960000e+03   3.847997e-04   0.000000e+00   3.847997e-04   0.000000e+00 
  4.976000e+03   3.944490e-04   0.000000e+00   3.944490e-04   0.000000e+00 
  4.992000e+03   3.757663e-04   0.000000e+00   3.757663e-04   0.000000e+00 
  5.008000e+03   3.675238e-04   0.000000e+00   3.675238e-04   0.000000e+00 
  5.024000e+03   3.623517e-04   0.000000e+00   3.623517e-04   0.000000e+00 
  5.040000e+03   3.668423e-04   0.000000e+00   3.668423e-04   0.000000e+00 
  5.056000e+03   3.649048e-04   0.000000e+00   3.649048e-04   0.000000e+00 
  5.072000e+03   3.569493e-04   0.000000e+00   3.569493e-04   0.000000e+00 
  5.088000e+03   3.774287e-04   0.000000e+00   3.774287e-04   0.000000e+00 
  5.104000e+03   3.554323e-04   0.000000e+00   3.554323e-04   0.000000e+00 
  5.120000e+03   3.539331e-04   0.000000e+00   3.539331e-04   0.000000e+00 
  5.136000e+03   3.282398e-04   0.000000e+00   3.282398e-04   0.000000e+00 
  5.152000e+03   3.200831e-04   0.000000e+00   3.200831e-04   0.000000e+00 
  5.168000e+03   3.322904e-04   0.000000e+00   3.322904e-04   0.000000e+00 
  5.184000e+03   3.288669e-04   0.000000e+00   3.288669e-04   0.000000e+00 
  5.200000e+03   3.296056e-04   0.000000e+00   3.296056e-04   0.000000e+00 
  5.216000e+03   3.190318e-04   0.000000e+00   3.190318e-04   0.000000e+00 
  5.232000e+03   3.017725e-04   0.000000e+00   3.017725e-04   0.000000e+00 
  5.248000e+03   2.996111e-04   0.000000e+00   2.996111e-04   0.000000e+00 
  5.264000e+03   2.971310e-04   0.000000e+00   2.971310e-04   0.000000e+00 
  5.280000e+03   3.049759e-04   0.000000e+00   3.049759e-04   0.000000e+00 
  5.296000e+03   2.999041e-04   0.000000e+00   2.999041e-04   0.000000e+00 
  5.312000e+03   2.960806e-04   0.000000e+00   2.960806e-04   0.000000e+00 
  5.328000e+03   2.773258e-04   0.000000e+00   2.773258e-04   0.000000e+00 
  5.344000e+03   2.776532e-04   0.000000e+00   2.776532e-04   0.000000e+00 
  5.360000e+03   2.794223e-04   0.000000e+00   2.794223e-04   0.000000e+00 
  5.376000e+03   2.887329e-04   0.000000e+00   2.887329e-04   0.000000e+00 
  5.392000e+03   2.909414e-04   0.000000e+00   2.909414e-04   0.000000e+00 
  5.408000e+03   2.797933e-04   0.000000e+00   2.797933e-04   0.000000e+00 
  5.424000e+03   2.678599e-04   0.000000e+00   2.678599e-04   0.000000e+00 
  5.440000e+03   2.636148e-04   0.000000e+00   2.636148e-04   0.000000e+00 
  5.456000e+03   2.833224e-04   0.000000e+00   2.833224e-04   0.000000e+00 
  5.472000e+03   2.698473e-04   0.000000e+00   2.698473e-04   0.000000e+00 
  5.488000e+03   2.611693e-04   0.000000e+00   2.611693e-04   0.000000e+00 
  5.504000e+03   2.650447e-04   0.000000e+00   2.650447e-04   0.000000e+00 
  5.520000e+03   2.707574e-04   0.000000e+00   2.707574e-04   0.000000e+00 
  5.536000e+03   2.586564e-04   0.000000e+00   2.586564e-04   0.000000e+00 
  5.552000e+03   2.365449e-04   0.000000e+00   2.365449e-04   0.000000e+00 
  5.568000e+03   2.446890e-04   0.000000e+00   2.446890e-04   0.000000e+00 
  5.584000e+03   2.438752e-04   0.000000e+00   2.438752e-04   0.000000e+00 
  5.600000e+03   2.203420e-04   0.000000e+00   2.203420e-04   0.000000e+00 
  5.616000e+03   2.132692e-04   0.000000e+00   2.132692e-04   0.000000e+00 
  5.632000e+03   2.303200e-04   0.000000e+00   2.303200e-04   0.000000e+00 
  5.648000e+03   2.265322e-04   0.000000e+00   2.265322e-04   0.000000e+00 
  5.664000e+03   2.381805e-04   0.000000e+00   2.381805e-04   0.000000e+00 
  5.680000e+03   2.466655e-04   0.000000e+00   2.466655e-04   0.000000e+00 
  5.696000e+03   2.285714e-04   0.000000e+00   2.285714e-04   0.000000e+00 
  5.712000e+03   2.199621e-04   0.000000e+00   2.199621e-04   0.000000e+00 
  5.728000e+03   2.164676e-04   0.000000e+00   2.164676e-04   0.000000e+00 
  5.744000e+03   2.228398e-04   0.000000e+00   2.228398e-04   0.000000e+00 
  5.760000e+03   2.182531e-04   0.000000e+00   2.182531e-04   0.000000e+00 
  5.776000e+03   2.198448e-04   0.000000e+00   2.198448e-04   0.000000e+00 
  5.792000e+03   2.313078e-04   0.000000e+00   2.313078e-04   0.000000e+00 
  5.808000e+03   2.321067e-04   0.000000e+00   2.321067e-04   0.000000e+00 
  5.824000e+03   2.198669e-04   0.000000e+00   2.198669e-04   0.000000e+00 
  5.840000e+03   2.154134e-04   0.000000e+00   2.154134e-04   0.000000e+00 
  5.856000e+03   2.176289e-04   0.000000e+00   2.176289e-04   0.000000e+00 
  5.872000e+03   2.212121e-04   0.000000e+00   2.212121e-04   0.000000e+00 
  5.888000e+03   2.146143e-04   0.000000e+00   2.146143e-04   0.000000e+00 
  5.904000e+03   2.172741e-04   0.000000e+00   2.172741e-04   0.000000e+00 
  5.920000e+03   2.137013e-04   0.000000e+00   2.137013e-04   0.000000e+00 
  5.936000e+03   1.990858e-04   0.000000e+00   1.990858e-04   0.000000e+00 
  5.952000e+03   2.095947e-04   0.000000e+00   2.095947e-04   0.000000e+00 
  5.968000e+03   2.057216e-04   0.000000e+00   2.057216e-04   0.000000e+00 
  5.984000e+03   1.976633e-04   0.000000e+00   1.976633e-04   0.000000e+00 
  6.000000e+03   2.079861e-04   0.000000e+00   2.079861e-04   0.000000e+00 
  6.016000e+03   2.063215e-04   0.000000e+00   2.063215e-04   0.000000e+00 
  6.032000e+03   2.001825e-04   0.000000e+00   2.001825e-04   0.000000e+00 
  6.048000e+03   1.966755e-04   0.000000e+00   1.966755e-04   0.000000e+00 
  6.064000e+03   1.953072e-04   0.000000e+00   1.953072e-04   0.000000e+00 
  6.080000e+03   1.986582e-04   0.000000e+00   1.986582e-04   0.000000e+00 
  6.096000e+03   1.910802e-04   0.000000e+00   1.910802e-04   0.000000e+00 
  6.112000e+03   1.828746e-04   0.000000e+00   1.828746e-04   0.000000e+00 
  6.128000e+03   1.838945e-04   0.000000e+00   1.838945e-04   0.000000e+00 
  6.144000e+03   1.859477e-04   0.000000e+00   1.859477e-04   0.000000e+00 
  6.160000e+03   1.835583e-04   0.000000e+00   1.835583e-04   0.000000e+00 
  6.176000e+03   1.864381e-04   0.000000e+00   1.864381e-04   0.000000e+00 
  6.192000e+03   1.861659e-04   0.000000e+00   1.861659e-04   0.000000e+00 
  6.208000e+03   1.842515e-04   0.000000e+00   1.842515e-04   0.000000e+00 
  6.224000e+03   1.770880e-04   0.000000e+00   1.770880e-04   0.000000e+00 
  6.240000e+03   1.808502e-04   0.000000e+00   1.808502e-04   0.000000e+00 
  6.256000e+03   1.821272e-04   0.000000e+00   1.821272e-04   0.000000e+00 
  6.272000e+03   1.793088e-04   0.000000e+00   1.793088e-04   0.000000e+00 
  6.288000e+03   1.791567e-04   0.000000e+00   1.791567e-04   0.000000e+00 
  6.304000e+03   1.747421e-04   0.000000e+00   1.747421e-04   0.000000e+00 
  6.320000e+03   1.774734e-04   0.000000e+00   1.774734e-04   0.000000e+00 
  6.336000e+03   1.736834e-04   0.000000e+00   1.736834e-04   0.000000e+00 
  6.352000e+03   1.681250e-04   0.000000e+00   1.681250e-04   0.000000e+00 
  6.368000e+03   1.690074e-04   0.000000e+00   1.690074e-04   0.000000e+00 
  6.384000e+03   1.730267e-04   0.000000e+00   1.730267e-04   0.000000e+00 
  6.400000e+03   1.786800e-04   0.000000e+00   1.786800e-04   0.000000e+00 
  6.416000e+03   1.715404e-04   0.000000e+00   1.715404e-04   0.000000e+00 
  6.432000e+03   1.650112e-04   0.000000e+00   1.650112e-04   0.000000e+00 
  6.448000e+03   1.580380e-04   0.000000e+00   1.580380e-04   0.000000e+00 
  6.464000e+03   1.552537e-04   0.000000e+00   1.552537e-04   0.000000e+00 
  6.480000e+03   1.538732e-04   0.000000e+00   1.538732e-04   0.000000e+00 
  6.496000e+03   1.443501e-04   0.000000e+00   1.443501e-04   0.000000e+00 
  6.512000e+03   1.546597e-04   0.000000e+00   1.546597e-04   0.000000e+00 
  6.528000e+03   1.532955e-04   0.000000e+00   1.532955e-04   0.000000e+00 
  6.544000e+03   1.508694e-04   0.000000e+00   1.508694e-04   0.000000e+00 
  6.560000e+03   1.375546e-04   0.000000e+00   1.375546e-04   0.000000e+00 
  6.576000e+03   1.416315e-04   0.000000e+00   1.416315e-04   0.000000e+00 
  6.592000e+03   1.404422e-04   0.000000e+00   1.404422e-04   0.000000e+00 
  6.608000e+03   1.426345e-04   0.000000e+00   1.426345e-04   0.000000e+00 
  6.624000e+03   1.431000e-04   0.000000e+00   1.431000e-04   0.000000e+00 
  6.640000e+03   1.451967e-04   0.000000e+00   1.451967e-04   0.000000e+00 
  6.656000e+03   1.408553e-04   0.000000e+00   1.408553e-04   0.000000e+00 
  6.672000e+03   1.315627e-04   0.000000e+00   1.315627e-04   0.000000e+00 
  6.688000e+03   1.364821e-04   0.000000e+00   1.364821e-04   0.000000e+00 
  6.704000e+03   1.378656e-04   0.000000e+00   1.378656e-04   0.000000e+00 
  6.720000e+03   1.335554e-04   0.000000e+00   1.335554e-04   0.000000e+00 
  6.736000e+03   1.347263e-04   0.000000e+00   1.347263e-04   0.000000e+00 
  6.752000e+03   1.426504e-04   0.000000e+00   1.426504e-04   0.000000e+00 
  6.768000e+03   1.414357e-04   0.000000e+00   1.414357e-04   0.000000e+00 
  6.784000e+03   1.343565e-04   0.000000e+00   1.343565e-04   0.000000e+00 
  6.800000e+03   1.332668e-04   0.000000e+00   1.332668e-04   0.000000e+00 
  6.816000e+03   1.252680e-04   0.000000e+00   1.252680e-04   0.000000e+00 
  6.832000e+03   1.219041e-04   0.000000e+00   1.219041e-04   0.000000e+00 
  6.848000e+03   1.267162e-04   0.000000e+00   1.267162e-04   0.000000e+00 
  6.864000e+03   1.307724e-04   0.000000e+00   1.307724e-04   0.000000e+00 
  6.880000e+03   1.303541e-04   0.000000e+00   1.303541e-04   0.000000e+00 
  6.896000e+03   1.241958e-04   0.000000e+00   1.241958e-04   0.000000e+00 
  6.912000e+03   1.249932e-04   0.000000e+00   1.249932e-04   0.000000e+00 
  6.928000e+03   1.253432e-04   0.000000e+00   1.253432e-04   0.000000e+00 
  6.944000e+03   1.221241e-04   0.000000e+00   1.221241e-04   0.000000e+00 
  6.960000e+03   1.287628e-04   0.000000e+00   1.287628e-04   0.000000e+00 
  6.976000e+03   1.298133e-04   0.000000e+00   1.298133e-04   0.000000e+00 
  6.992000e+03   1.299898e-04   0.000000e+00   1.299898e-04   0.000000e+00 
  7.008000e+03   1.195372e-04   0.000000e+00   1.195372e-04   0.000000e+00 
  7.024000e+03   1.163315e-04   0.000000e+00   1.163315e-04   0.000000e+00 
  7.040000e+03   1.146918e-04   0.000000e+00   1.146918e-04   0.000000e+00 
  7.056000e+03   1.166797e-04   0.000000e+00   1.166797e-04   0.000000e+00 
  7.072000e+03   1.179919e-04   0.000000e+00   1.179919e-04   0.000000e+00 
  7.088000e+03   1.210299e-04   0.000000e+00   1.210299e-04   0.000000e+00 
  7.104000e+03   1.102823e-04   0.000000e+00   1.102823e-04   0.000000e+00 
  7.120000e+03   1.048054e-04   0.000000e+00   1.048054e-04   0.000000e+00 
  7.136000e+03   1.053479e-04   0.000000e+00   1.053479e-04   0.000000e+00 
  7.152000e+03   1.044735e-04   0.000000e+00   1.044735e-04   0.000000e+00 
  7.168000e+03   1.047546e-04   0.000000e+00   1.047546e-04   0.000000e+00 
  7.184000e+03   1.084522e-04   0.000000e+00   1.084522e-04   0.000000e+00 
  7.200000e+03   1.008892e-04   0.000000e+00   1.008892e-04   0.000000e+00 
  7.216000e+03   1.037030e-04   0.000000e+00   1.037030e-04   0.000000e+00 
  7.232000e+03   1.027033e-04   0.000000e+00   1.027033e-04   0.000000e+00 
  7.248000e+03   1.061535e-04   0.000000e+00   1.061535e-04   0.000000e+00 
  7.264000e+03   1.078234e-04   0.000000e+00   1.078234e-04   0.000000e+00 
  7.280000e+03   1.019625e-04   0.000000e+00   1.019625e-04   0.000000e+00 
  7.296000e+03   1.031175e-04   0.000000e+00   1.031175e-04   0.000000e+00 
  7.312000e+03   9.800735e-05   0.000000e+00   9.800735e-05   0.000000e+00 
  7.328000e+03   9.773431e-05   0.000000e+00   9.773431e-05   0.000000e+00 
  7.344000e+03   9.766612e-05   0.000000e+00   9.766612e-05   0.000000e+00 
  7.360000e+03   1.041063e-04   0.000000e+00   1.041063e-04   0.000000e+00 
  7.376000e+03   1.026275e-04   0.000000e+00   1.026275e-04   0.000000e+00 
  7.392000e+03   9.843942e-05   0.000000e+00   9.843942e-05   0.000000e+00 
  7.408000e+03   9.677125e-05   0.000000e+00   9.677125e-05   0.000000e+00 
  7.424000e+03   9.908649e-05   0.000000e+00   9.908649e-05   0.000000e+00 
  7.440000e+03   9.963441e-05   0.000000e+00   9.963441e-05   0.000000e+00 
  7.456000e+03   9.492644e-05   0.000000e+00   9.492644e-05   0.000000e+00 
  7.472000e+03   8.955526e-05   0.000000e+00   8.955526e-05   0.000000e+00 
  7.488000e+03   8.847973e-05   0.000000e+00   8.847973e-05   0.000000e+00 
  7.504000e+03   9.646745e-05   0.000000e+00   9.646745e-05   0.000000e+00 
  7.520000e+03   9.006078e-05   0.000000e+00   9.006078e-05   0.000000e+00 
  7.536000e+03   8.633373e-05   0.000000e+00   8.633373e-05   0.000000e+00 
  7.552000e+03   8.988373e-05   0.000000e+00   8.988373e-05   0.000000e+00 
  7.568000e+03   9.374379e-05   0.000000e+00   9.374379e-05   0.000000e+00 
  7.584000e+03   8.611947e-05   0.000000e+00   8.611947e-05   0.000000e+00 
  7.600000e+03   8.974756e-05   0.000000e+00   8.974756e-05   0.000000e+00 
  7.616000e+03   8.500217e-05   0.000000e+00   8.500217e-05   0.000000e+00 
  7.632000e+03   8.335174e-05   0.000000e+00   8.335174e-05   0.000000e+00 
  7.648000e+03   8.508974e-05   0.000000e+00   8.508974e-05   0.000000e+00 
  7.664000e+03   8.456400e-05   0.000000e+00   8.456400e-05   0.000000e+00 
  7.680000e+03   8.075224e-05   0.000000e+00   8.075224e-05   0.000000e+00 
  7.696000e+03   8.181603e-05   0.000000e+00   8.181603e-05   0.000000e+00 
  7.712000e+03   8.540160e-05   0.000000e+00   8.540160e-05   0.000000e+00 
  7.728000e+03   8.232104e-05   0.000000e+00   8.232104e-05   0.000000e+00 
  7.744000e+03   8.235322e-05   0.000000e+00   8.235322e-05   0.000000e+00 
  7.760000e+03   7.675568e-05   0.000000e+00   7.675568e-05   0.000000e+00 
  7.776000e+03   8.270407e-05   0.000000e+00   8.270407e-05   0.000000e+00 
  7.792000e+03   8.210133e-05   0.000000e+00   8.210133e-05   0.000000e+00 
  7.808000e+03   7.719985e-05   0.000000e+00   7.719985e-05   0.000000e+00 
  7.824000e+03   7.810966e-05   0.000000e+00   7.810966e-05   0.000000e+00 
  7.840000e+03   7.463344e-05   0.000000e+00   7.463344e-05   0.000000e+00 
  7.856000e+03   7.855619e-05   0.000000e+00   7.855619e-05   0.000000e+00 
  7.872000e+03   7.846911e-05   0.000000e+00   7.846911e-05   0.000000e+00 
  7.888000e+03   7.862702e-05   0.000000e+00   7.862702e-05   0.000000e+00 
  7.904000e+03   7.406708e-05   0.000000e+00   7.406708e-05   0.000000e+00 
  7.920000e+03   7.476719e-05   0.000000e+00   7.476719e-05   0.000000e+00 
  7.936000e+03   7.609193e-05   0.000000e+00   7.609193e-05   0.000000e+00 
  7.952000e+03   7.430700e-05   0.000000e+00   7.430700e-05   0.000000e+00 
  7.968000e+03   7.086436e-05   0.000000e+00   7.086436e-05   0.000000e+00 
  7.984000e+03   6.873638e-05   0.000000e+00   6.873638e-05   0.000000e+00 
  8.000000e+03   7.212064e-05   0.000000e+00   7.212064e-05   0.000000e+00 
  8.016000e+03   7.520487e-05   0.000000e+00   7.520487e-05   0.000000e+00 
  8.032000e+03   7.258408e-05   0.000000e+00   7.258408e-05   0.000000e+00 
  8.048000e+03   7.105228e-05   0.000000e+00   7.105228e-05   0.000000e+00 
  8.064000e+03   7.140205e-05   0.000000e+00   7.140205e-05   0.000000e+00 
  8.080000e+03   6.592884e-05   0.000000e+00   6.592884e-05   0.000000e+00 
  8.096000e+03   6.480284e-05   0.000000e+00   6.480284e-05   0.000000e+00 
  8.112000e+03   6.256840e-05   0.000000e+00   6.256840e-05   0.000000e+00 
  8.128000e+03   6.493062e-05   0.000000e+00   6.493062e-05   0.000000e+00 
  8.144000e+03   6.642897e-05   0.000000e+00   6.642897e-05   0.000000e+00 
  8.160000e+03   6.674200e-05   0.000000e+00   6.674200e-05   0.000000e+00 
  8.176000e+03   6.986642e-05   0.000000e+00   6.986642e-05   0.000000e+00 
  8.192000e+03   6.622671e-05   0.000000e+00   6.622671e-05   0.000000e+00 
  8.208000e+03   6.316898e-05   0.000000e+00   6.316898e-05   0.000000e+00 
  8.224000e+03   6.496550e-05   0.000000e+00   6.496550e-05   0.000000e+00 
  8.240000e+03   6.748938e-05   0.000000e+00   6.748938e-05   0.000000e+00 
  8.256000e+03   6.287048e-05   0.000000e+00   6.287048e-05   0.000000e+00 
  8.272000e+03   5.969923e-05   0.000000e+00   5.969923e-05   0.000000e+00 
  8.288000e+03   6.014124e-05   0.000000e+00   6.014124e-05   0.000000e+00 
  8.304000e+03   6.166220e-05   0.000000e+00   6.166220e-05   0.000000e+00 
  8.320000e+03   6.301086e-05   0.000000e+00   6.301086e-05   0.000000e+00 
  8.336000e+03   6.223919e-05   0.000000e+00   6.223919e-05   0.000000e+00 
  8.352000e+03   5.827290e-05   0.000000e+00   5.827290e-05   0.000000e+00 
  8.368000e+03   6.045295e-05   0.000000e+00   6.045295e-05   0.000000e+00 
  8.384000e+03   5.903419e-05   0.000000e+00   5.903419e-05   0.000000e+00 
  8.400000e+03   6.073225e-05   0.000000e+00   6.073225e-05   0.000000e+00 
  8.416000e+03   6.008190e-05   0.000000e+00   6.008190e-05   0.000000e+00 
  8.432000e+03   5.950749e-05   0.000000e+00   5.950749e-05   0.000000e+00 
  8.448000e+03   5.988127e-05   0.000000e+00   5.988127e-05   0.000000e+00 
  8.464000e+03   5.909811e-05   0.000000e+00   5.909811e-05   0.000000e+00 
  8.480000e+03   5.991133e-05   0.000000e+00   5.991133e-05   0.000000e+00 
  8.496000e+03   5.954040e-05   0.000000e+00   5.954040e-05   0.000000e+00 
  8.512000e+03   5.983396e-05   0.000000e+00   5.983396e-05   0.000000e+00 
  8.528000e+03   5.543387e-05   0.000000e+00   5.543387e-05   0.000000e+00 
  8.544000e+03   5.644592e-05   0.000000e+00   5.644592e-05   0.000000e+00 
  8.560000e+03   5.856963e-05   0.000000e+00   5.856963e-05   0.000000e+00 
  8.576000e+03   5.793984e-05   0.000000e+00   5.793984e-05   0.000000e+00 
  8.592000e+03   5.818799e-05   0.000000e+00   5.818799e-05   0.000000e+00 
  8.608000e+03   6.027378e-05   0.000000e+00   6.027378e-05   0.000000e+00 
  8.624000e+03   5.631464e-05   0.000000e+00   5.631464e-05   0.000000e+00 
  8.640000e+03   5.562633e-05   0.000000e+00   5.562633e-05   0.000000e+00 
  8.656000e+03   5.214170e-05   0.000000e+00   5.214170e-05   0.000000e+00 
  8.672000e+03   5.253516e-05   0.000000e+00   5.253516e-05   0.000000e+00 
  8.688000e+03   5.329811e-05   0.000000e+00   5.329811e-05   0.000000e+00 
  8.704000e+03   5.568448e-05   0.000000e+00   5.568448e-05   0.000000e+00 
  8.720000e+03   5.466658e-05   0.000000e+00   5.466658e-05   0.000000e+00 
  8.736000e+03   5.319815e-05   0.000000e+00   5.319815e-05   0.000000e+00 
  8.752000e+03   5.270350e-05   0.000000e+00   5.270350e-05   0.000000e+00 
  8.768000e+03   5.520645e-05   0.000000e+00   5.520645e-05   0.000000e+00 
  8.784000e+03   5.197815e-05   0.000000e+00   5.197815e-05   0.000000e+00 
  8.800000e+03   5.088237e-05   0.000000e+00   5.088237e-05   0.000000e+00 
  8.816000e+03   5.288978e-05   0.000000e+00   5.288978e-05   0.000000e+00 
  8.832000e+03   5.240028e-05   0.000000e+00   5.240028e-05   0.000000e+00 
  8.848000e+03   5.456780e-05   0.000000e+00   5.456780e-05   0.000000e+00 
  8.864000e+03   5.145123e-05   0.000000e+00   5.145123e-05   0.000000e+00 
  8.880000e+03   4.814153e-05   0.000000e+00   4.814153e-05   0.000000e+00 
  8.896000e+03   4.823318e-05   0.000000e+00   4.823318e-05   0.000000e+00 
  8.912000e+03   4.835486e-05   0.000000e+00   4.835486e-05   0.000000e+00 
  8.928000e+03   4.885820e-05   0.000000e+00   4.885820e-05   0.000000e+00 
  8.944000e+03   5.003400e-05   0.000000e+00   5.003400e-05   0.000000e+00 
  8.960000e+03   4.942436e-05   0.000000e+00   4.942436e-05   0.000000e+00 
  8.976000e+03   4.837791e-05   0.000000e+00   4.837791e-05   0.000000e+00 
  8.992000e+03   5.101337e-05   0.000000e+00   5.101337e-05   0.000000e+00 
  9.008000e+03   5.176814e-05   0.000000e+00   5.176814e-05   0.000000e+00 
  9.024000e+03   4.896152e-05   0.000000e+00   4.896152e-05   0.000000e+00 
  9.040000e+03   4.710137e-05   0.000000e+00   4.710137e-05   0.000000e+00 
  9.056000e+03   4.751137e-05   0.000000e+00   4.751137e-05   0.000000e+00 
  9.072000e+03   4.734589e-05   0.000000e+00   4.734589e-05   0.000000e+00 
  9.088000e+03   4.677514e-05   0.000000e+00   4.677514e-05   0.000000e+00 
  9.104000e+03   4.620224e-05   0.000000e+00   4.620224e-05   0.000000e+00 
  9.120000e+03   4.420570e-05   0.000000e+00   4.420570e-05   0.000000e+00 
  9.136000e+03   4.496249e-05   0.000000e+00   4.496249e-05   0.000000e+00 
  9.152000e+03   4.563238e-05   0.000000e+00   4.563238e-05   0.000000e+00 
  9.168000e+03   4.758112e-05   0.000000e+00   4.758112e-05   0.000000e+00 
  9.184000e+03   4.549823e-05   0.000000e+00   4.549823e-05   0.000000e+00 
  9.200000e+03   4.694440e-05   0.000000e+00   4.694440e-05   0.000000e+00 
  9.216000e+03   4.797671e-05   0.000000e+00   4.797671e-05   0.000000e+00 
  9.232000e+03   4.533685e-05   0.000000e+00   4.533685e-05   0.000000e+00 
  9.248000e+03   4.514222e-05   0.000000e+00   4.514222e-05   0.000000e+00 
  9.264000e+03   4.531554e-05   0.000000e+00   4.531554e-05   0.000000e+00 
  9.280000e+03   4.682584e-05   0.000000e+00   4.682584e-05   0.000000e+00 
  9.296000e+03   4.717379e-05   0.000000e+00   4.717379e-05   0.000000e+00 
  9.312000e+03   4.638599e-05   0.000000e+00   4.638599e-05   0.000000e+00 
  9.328000e+03   4.496680e-05   0.000000e+00   4.496680e-05   0.000000e+00 
  9.344000e+03   4.213980e-05   0.000000e+00   4.213980e-05   0.000000e+00 
  9.360000e+03   4.155859e-05   0.000000e+00   4.155859e-05   0.000000e+00 
  9.376000e+03   4.251704e-05   0.000000e+00   4.251704e-05   0.000000e+00 
  9.392000e+03   4.394424e-05   0.000000e+00   4.394424e-05   0.000000e+00 
  9.408000e+03   4.302216e-05   0.000000e+00   4.302216e-05   0.000000e+00 
  9.424000e+03   4.291030e-05   0.000000e+00   4.291030e-05   0.000000e+00 
  9.440000e+03   4.312567e-05   0.000000e+00   4.312567e-05   0.000000e+00 
  9.456000e+03   4.269389e-05   0.000000e+00   4.269389e-05   0.000000e+00 
  9.472000e+03   4.206068e-05   0.000000e+00   4.206068e-05   0.000000e+00 
  9.488000e+03   4.349732e-05   0.000000e+00   4.349732e-05   0.000000e+00 
  9.504000e+03   4.279075e-05   0.000000e+00   4.279075e-05   0.000000e+00 
  9.520000e+03   4.178243e-05   0.000000e+00   4.178243e-05   0.000000e+00 
  9.536000e+03   3.879243e-05   0.000000e+00   3.879243e-05   0.000000e+00 
  9.552000e+03   3.956462e-05   0.000000e+00   3.956462e-05   0.000000e+00 
  9.568000e+03   3.812485e-05   0.000000e+00   3.812485e-05   0.000000e+00 
  9.584000e+03   3.928641e-05   0.000000e+00   3.928641e-05   0.000000e+00 
  9.600000e+03   4.133128e-05   0.000000e+00   4.133128e-05   0.000000e+00 
  9.616000e+03   4.195141e-05   0.000000e+00   4.195141e-05   0.000000e+00 
  9.632000e+03   4.281160e-05   0.000000e+00   4.281160e-05   0.000000e+00 
  9.648000e+03   4.111831e-05   0.000000e+00   4.111831e-05   0.000000e+00 
  9.664000e+03   3.910181e-05   0.000000e+00   3.910181e-05   0.000000e+00 
  9.680000e+03   3.978753e-05   0.000000e+00   3.978753e-05   0.000000e+00 
  9.696000e+03   4.198532e-05   0.000000e+00   4.198532e-05   0.000000e+00 
  9.712000e+03   4.015091e-05   0.000000e+00   4.015091e-05   0.000000e+00 
  9.728000e+03   3.741434e-05   0.000000e+00   3.741434e-05   0.000000e+00 
  9.744000e+03   3.835824e-05   0.000000e+00   3.835824e-05   0.000000e+00 
  9.760000e+03   3.831073e-05   0.000000e+00   3.831073e-05   0.000000e+00 
  9.776000e+03   3.975966e-05   0.000000e+00   3.975966e-05   0.000000e+00 
  9.792000e+03   3.782853e-05   0.000000e+00   3.782853e-05   0.000000e+00 
  9.808000e+03   3.721493e-05   0.000000e+00   3.721493e-05   0.000000e+00 
  9.824000e+03   3.781732e-05   0.000000e+00   3.781732e-05   0.000000e+00 
  9.840000e+03   3.900727e-05   0.000000e+00   3.900727e-05   0.000000e+00 
  9.856000e+03   3.720876e-05   0.000000e+00   3.720876e-05   0.000000e+00 
  9.872000e+03   3.628293e-05   0.000000e+00   3.628293e-05   0.000000e+00 
  9.888000e+03   3.602833e-05   0.000000e+00   3.602833e-05   0.000000e+00 
  9.904000e+03   3.525929e-05   0.000000e+00   3.525929e-05   0.000000e+00 
  9.920000e+03   3.726406e-05   0.000000e+00   3.726406e-05   0.000000e+00 
  9.936000e+03   3.578859e-05   0.000000e+00   3.578859e-05   0.000000e+00 
  9.952000e+03   3.538183e-05   0.000000e+00   3.538183e-05   0.000000e+00 
  9.968000e+03   3.683274e-05   0.000000e+00   3.683274e-05   0.000000e+00 
  9.984000e+03   3.705062e-05   0.000000e+00   3.705062e-05   0.000000e+00 
  1.000000e+04   3.801606e-05   0.000000e+00   3.801606e-05   0.000000e+00 
  1.001600e+04   3.712016e-05   0.000000e+00   3.712016e-05   0.000000e+00 
  1.003200e+04   3.551102e-05   0.000000e+00   3.551102e-05   0.000000e+00 
  1.004800e+04   3.509775e-05   0.000000e+00   3.509775e-05   0.000000e+00 
  1.006400e+04   3.520989e-05   0.000000e+00   3.520989e-05   0.000000e+00 
  1.008000e+04   3.624605e-05   0.000000e+00   3.624605e-05   0.000000e+00 
  1.009600e+04   3.757959e-05   0.000000e+00   3.757959e-05   0.000000e+00 
  1.011200e+04   3.608030e-05   0.000000e+00   3.608030e-05   0.000000e+00 
  1.012800e+04   3.474565e-05   0.000000e+00   3.474565e-05   0.000000e+00 
  1.014400e+04   3.423030e-05   0.000000e+00   3.423030e-05   0.000000e+00 
  1.016000e+04   3.422610e-05   0.000000e+00   3.422610e-05   0.000000e+00 
  1.017600e+04   3.387126e-05   0.000000e+00   3.387126e-05   0.000000e+00 
  1.019200e+04   3.485130e-05   0.000000e+00   3.485130e-05   0.000000e+00 
  1.020800e+04   3.418594e-05   0.000000e+00   3.418594e-05   0.000000e+00 
  1.022400e+04   3.203807e-05   0.000000e+00   3.203807e-05   0.000000e+00 
  1.024000e+04   3.337659e-05   0.000000e+00   3.337659e-05   0.000000e+00 
  1.025600e+04   3.330094e-05   0.000000e+00   3.330094e-05   0.000000e+00 
  1.027200e+04   3.110825e-05   0.000000e+00   3.110825e-05   0.000000e+00 
  1.028800e+04   3.259004e-05   0.000000e+00   3.259004e-05   0.000000e+00 
  1.030400e+04   3.292154e-05   0.000000e+00   3.292154e-05   0.000000e+00 
  1.032000e+04   3.239217e-05   0.000000e+00   3.239217e-05   0.000000e+00 
  1.033600e+04   3.178919e-05   0.000000e+00   3.178919e-05   0.000000e+00 
  1.035200e+04   3.186773e-05   0.000000e+00   3.186773e-05   0.000000e+00 
  1.036800e+04   3.230133e-05   0.000000e+00   3.230133e-05   0.000000e+00 
  1.038400e+04   3.098262e-05   0.000000e+00   3.098262e-05   0.000000e+00 
  1.040000e+04   3.142453e-05   0.000000e+00   3.142453e-05   0.000000e+00 
  1.041600e+04   3.167682e-05   0.000000e+00   3.167682e-05   0.000000e+00 
  1.043200e+04   3.022767e-05   0.000000e+00   3.022767e-05   0.000000e+00 
  1.044800e+04   3.101460e-05   0.000000e+00   3.101460e-05   0.000000e+00 
  1.046400e+04   3.151213e-05   0.000000e+00   3.151213e-05   0.000000e+00 
  1.048000e+04   3.089036e-05   0.000000e+00   3.089036e-05   0.000000e+00 
  1.049600e+04   3.041487e-05   0.000000e+00   3.041487e-05   0.000000e+00 
  1.051200e+04   3.053464e-05   0.000000e+00   3.053464e-05   0.000000e+00 
  1.052800e+04   2.922164e-05   0.000000e+00   2.922164e-05   0.000000e+00 
  1.054400e+04   2.848075e-05   0.000000e+00   2.848075e-05   0.000000e+00 
  1.056000e+04   2.977231e-05   0.000000e+00   2.977231e-05   0.000000e+00 
  1.057600e+04   2.834160e-05   0.000000e+00   2.834160e-05   0.000000e+00 
  1.059200e+04   2.630464e-05   0.000000e+00   2.630464e-05   0.000000e+00 
  1.060800e+04   2.679836e-05   0.000000e+00   2.679836e-05   0.000000e+00 
  1.062400e+04   2.860738e-05   0.000000e+00   2.860738e-05   0.000000e+00 
  1.064000e+04   2.730427e-05   0.000000e+00   2.730427e-05   0.000000e+00 
  1.065600e+04   2.825199e-05   0.000000e+00   2.825199e-05   0.000000e+00 
  1.067200e+04   3.006252e-05   0.000000e+00   3.006252e-05   0.000000e+00 
  1.068800e+04   2.945266e-05   0.000000e+00   2.945266e-05   0.000000e+00 
  1.070400e+04   2.815616e-05   0.000000e+00   2.815616e-05   0.000000e+00 
  1.072000e+04   2.725535e-05   0.000000e+00   2.725535e-05   0.000000e+00 
  1.073600e+04   2.786770e-05   0.000000e+00   2.786770e-05   0.000000e+00 
  1.075200e+04   2.809034e-05   0.000000e+00   2.809034e-05   0.000000e+00 
  1.076800e+04   2.753367e-05   0.000000e+00   2.753367e-05   0.000000e+00 
  1.078400e+04   2.711677e-05   0.000000e+00   2.711677e-05   0.000000e+00 
  1.080000e+04   2.586468e-05   0.000000e+00   2.586468e-05   0.000000e+00 
  1.081600e+04   2.734229e-05   0.000000e+00   2.734229e-05   0.000000e+00 
  1.083200e+04   2.803504e-05   0.000000e+00   2.803504e-05   0.000000e+00 
  1.084800e+04   2.650668e-05   0.000000e+00   2.650668e-05   0.000000e+00 
  1.086400e+04   2.591293e-05   0.000000e+00   2.591293e-05   0.000000e+00 
  1.088000e+04   2.772250e-05   0.000000e+00   2.772250e-05   0.000000e+00 
  1.089600e+04   2.692833e-05   0.000000e+00   2.692833e-05   0.000000e+00 
  1.091200e+04   2.582451e-05   0.000000e+00   2.582451e-05   0.000000e+00 
  1.092800e+04   2.645333e-05   0.000000e+00   2.645333e-05   0.000000e+00 
  1.094400e+04   2.637317e-05   0.000000e+00   2.637317e-05   0.000000e+00 
  1.096000e+04   2.568176e-05   0.000000e+00   2.568176e-05   0.000000e+00 
  1.097600e+04   2.480740e-05   0.000000e+00   2.480740e-05   0.000000e+00 
  1.099200e+04   2.542762e-05   0.000000e+00   2.542762e-05   0.000000e+00 
  1.100800e+04   2.508832e-05   0.000000e+00   2.508832e-05   0.000000e+00 
  1.102400e+04   2.695185e-05   0.000000e+00   2.695185e-05   0.000000e+00 
  1.104000e+04   2.570497e-05   0.000000e+00   2.570497e-05   0.000000e+00 
  1.105600e+04   2.549905e-05   0.000000e+00   2.549905e-05   0.000000e+00 
  1.107200e+04   2.522942e-05   0.000000e+00   2.522942e-05   0.000000e+00 
  1.108800e+04   2.437773e-05   0.000000e+00   2.437773e-05   0.000000e+00 
  1.110400e+04   2.294315e-05   0.000000e+00   2.294315e-05   0.000000e+00 
  1.112000e+04   2.447820e-05   0.000000e+00   2.447820e-05   0.000000e+00 
  1.113600e+04   2.447001e-05   0.000000e+00   2.447001e-05   0.000000e+00 
  1.115200e+04   2.428911e-05   0.000000e+00   2.428911e-05   0.000000e+00 
  1.116800e+04   2.310945e-05   0.000000e+00   2.310945e-05   0.000000e+00 
  1.118400e+04   2.342431e-05   0.000000e+00   2.342431e-05   0.000000e+00 
  1.120000e+04   2.469038e-05   0.000000e+00   2.469038e-05   0.000000e+00 
  1.121600e+04   2.394652e-05   0.000000e+00   2.394652e-05   0.000000e+00 
  1.123200e+04   2.425657e-05   0.000000e+00   2.425657e-05   0.000000e+00 
  1.124800e+04   2.487929e-05   0.000000e+00   2.487929e-05   0.000000e+00 
  1.126400e+04   2.446896e-05   0.000000e+00   2.446896e-05   0.000000e+00 
  1.128000e+04   2.424949e-05   0.000000e+00   2.424949e-05   0.000000e+00 
  1.129600e+04   2.349090e-05   0.000000e+00   2.349090e-05   0.000000e+00 
  1.131200e+04   2.285814e-05   0.000000e+00   2.285814e-05   0.000000e+00 
  1.132800e+04   2.189123e-05   0.000000e+00   2.189123e-05   0.000000e+00 
  1.134400e+04   2.144275e-05   0.000000e+00   2.144275e-05   0.000000e+00 
  1.136000e+04   2.275555e-05   0.000000e+00   2.275555e-05   0.000000e+00 
  1.137600e+04   2.310506e-05   0.000000e+00   2.310506e-05   0.000000e+00 
  1.139200e+04   2.251825e-05   0.000000e+00   2.251825e-05   0.000000e+00 
  1.140800e+04   2.324461e-05   0.000000e+00   2.324461e-05   0.000000e+00 
  1.142400e+04   2.230349e-05   0.000000e+00   2.230349e-05   0.000000e+00 
  1.144000e+04   2.185062e-05   0.000000e+00   2.185062e-05   0.000000e+00 
  1.145600e+04   2.215957e-05   0.000000e+00   2.215957e-05   0.000000e+00 
  1.147200e+04   2.153165e-05   0.000000e+00   2.153165e-05   0.000000e+00 
  1.148800e+04   2.193646e-05   0.000000e+00   2.193646e-05   0.000000e+00 
  1.150400e+04   2.112317e-05   0.000000e+00   2.112317e-05   0.000000e+00 
  1.152000e+04   2.033992e-05   0.000000e+00   2.033992e-05   0.000000e+00 
  1.153600e+04   2.155651e-05   0.000000e+00   2.155651e-05   0.000000e+00 
  1.155200e+04   2.189668e-05   0.000000e+00   2.189668e-05   0.000000e+00 
  1.156800e+04   2.114038e-05   0.000000e+00   2.114038e-05   0.000000e+00 
  1.158400e+04   2.177537e-05   0.000000e+00   2.177537e-05   0.000000e+00 
  1.160000e+04   2.237004e-05   0.000000e+00   2.237004e-05   0.000000e+00 
  1.161600e+04   2.160880e-05   0.000000e+00   2.160880e-05   0.000000e+00 
  1.163200e+04   2.192450e-05   0.000000e+00   2.192450e-05   0.000000e+00 
  1.164800e+04   2.165070e-05   0.000000e+00   2.165070e-05   0.000000e+00 
  1.166400e+04   2.273720e-05   0.000000e+00   2.273720e-05   0.000000e+00 
  1.168000e+04   2.197805e-05   0.000000e+00   2.197805e-05   0.000000e+00 
  1.169600e+04   2.115920e-05   0.000000e+00   2.115920e-05   0.000000e+00 
  1.171200e+04   2.076221e-05   0.000000e+00   2.076221e-05   0.000000e+00 
  1.172800e+04   2.046889e-05   0.000000e+00   2.046889e-05   0.000000e+00 
  1.174400e+04   2.027087e-05   0.000000e+00   2.027087e-05   0.000000e+00 
  1.176000e+04   2.138364e-05   0.000000e+00   2.138364e-05   0.000000e+00 
  1.177600e+04   2.110782e-05   0.000000e+00   2.110782e-05   0.000000e+00 
  1.179200e+04   2.208843e-05   0.000000e+00   2.208843e-05   0.000000e+00 
  1.180800e+04   2.192892e-05   0.000000e+00   2.192892e-05   0.000000e+00 
  1.182400e+04   2.083475e-05   0.000000e+00   2.083475e-05   0.000000e+00 
  1.184000e+04   2.011421e-05   0.000000e+00   2.011421e-05   0.000000e+00 
  1.185600e+04   2.071144e-05   0.000000e+00   2.071144e-05   0.000000e+00 
  1.187200e+04   2.048033e-05   0.000000e+00   2.048033e-05   0.000000e+00 
  1.188800e+04   2.029852e-05   0.000000e+00   2.029852e-05   0.000000e+00 
  1.190400e+04   2.126326e-05   0.000000e+00   2.126326e-05   0.000000e+00 
  1.192000e+04   2.108444e-05   0.000000e+00   2.108444e-05   0.000000e+00 
  1.193600e+04   2.004750e-05   0.000000e+00   2.004750e-05   0.000000e+00 
  1.195200e+04   1.995611e-05   0.000000e+00   1.995611e-05   0.000000e+00 
  1.196800e+04   2.131018e-05   0.000000e+00   2.131018e-05   0.000000e+00 
  1.198400e+04   2.140637e-05   0.000000e+00   2.140637e-05   0.000000e+00 
  1.200000e+04   1.977715e-05   0.000000e+00   1.977715e-05   0.000000e+00 
  1.201600e+04   1.975131e-05   0.000000e+00   1.975131e-05   0.000000e+00 
  1.203200e+04   2.149363e-05   0.000000e+00   2.149363e-05   0.000000e+00 
  1.204800e+04   2.183731e-05   0.000000e+00   2.183731e-05   0.000000e+00 
  1.206400e+04   2.180967e-05   0.000000e+00   2.180967e-05   0.000000e+00 
  1.208000e+04   1.992079e-05   0.000000e+00   1.992079e-05   0.000000e+00 
  1.209600e+04   1.988049e-05   0.000000e+00   1.988049e-05   0.000000e+00 
  1.211200e+04   1.972703e-05   0.000000e+00   1.972703e-05   0.000000e+00 
  1.212800e+04   2.133348e-05   0.000000e+00   2.133348e-05   0.000000e+00 
  1.214400e+04   2.046548e-05   0.000000e+00   2.046548e-05   0.000000e+00 
  1.216000e+04   2.066297e-05   0.000000e+00   2.066297e-05   0.000000e+00 
  1.217600e+04   2.072516e-05   0.000000e+00   2.072516e-05   0.000000e+00 
  1.219200e+04   1.886251e-05   0.000000e+00   1.886251e-05   0.000000e+00 
  1.220800e+04   1.879441e-05   0.000000e+00   1.879441e-05   0.000000e+00 
  1.222400e+04   1.900191e-05   0.000000e+00   1.900191e-05   0.000000e+00 
  1.224000e+04   1.882129e-05   0.000000e+00   1.882129e-05   0.000000e+00 
  1.225600e+04   1.995423e-05   0.000000e+00   1.995423e-05   0.000000e+00 
  1.227200e+04   2.025344e-05   0.000000e+00   2.025344e-05   0.000000e+00 
  1.228800e+04   1.906515e-05   0.000000e+00   1.906515e-05   0.000000e+00 
  1.230400e+04   1.952438e-05   0.000000e+00   1.952438e-05   0.000000e+00 
  1.232000e+04   1.869097e-05   0.000000e+00   1.869097e-05   0.000000e+00 
  1.233600e+04   1.959550e-05   0.000000e+00   1.959550e-05   0.000000e+00 
  1.235200e+04   1.943009e-05   0.000000e+00   1.943009e-05   0.000000e+00 
  1.236800e+04   1.824389e-05   0.000000e+00   1.824389e-05   0.000000e+00 
  1.238400e+04   1.893513e-05   0.000000e+00   1.893513e-05   0.000000e+00 
  1.240000e+04   1.830510e-05   0.000000e+00   1.830510e-05   0.000000e+00 
  1.241600e+04   1.827935e-05   0.000000e+00   1.827935e-05   0.000000e+00 
  1.243200e+04   1.993538e-05   0.000000e+00   1.993538e-05   0.000000e+00 
  1.244800e+04   1.949880e-05   0.000000e+00   1.949880e-05   0.000000e+00 
  1.246400e+04   1.892113e-05   0.000000e+00   1.892113e-05   0.000000e+00 
  1.248000e+04   1.921502e-05   0.000000e+00   1.921502e-05   0.000000e+00 
  1.249600e+04   1.999999e-05   0.000000e+00   1.999999e-05   0.000000e+00 
  1.251200e+04   1.890848e-05   0.000000e+00   1.890848e-05   0.000000e+00 
  1.252800e+04   1.859148e-05   0.000000e+00   1.859148e-05   0.000000e+00 
  1.254400e+04   1.886558e-05   0.000000e+00   1.886558e-05   0.000000e+00 
  1.256000e+04   1.870618e-05   0.000000e+00   1.870618e-05   0.000000e+00 
  1.257600e+04   1.918862e-05   0.000000e+00   1.918862e-05   0.000000e+00 
  1.259200e+04   2.021769e-05   0.000000e+00   2.021769e-05   0.000000e+00 
  1.260800e+04   1.868856e-05   0.000000e+00   1.868856e-05   0.000000e+00 
  1.262400e+04   1.811673e-05   0.000000e+00   1.811673e-05   0.000000e+00 
  1.264000e+04   1.768043e-05   0.000000e+00   1.768043e-05   0.000000e+00 
  1.265600e+04   1.853625e-05   0.000000e+00   1.853625e-05   0.000000e+00 
  1.267200e+04   1.866253e-05   0.000000e+00   1.866253e-05   0.000000e+00 
  1.268800e+04   1.786734e-05   0.000000e+00   1.786734e-05   0.000000e+00 
  1.270400e+04   1.850076e-05   0.000000e+00   1.850076e-05   0.000000e+00 
  1.272000e+04   1.869707e-05   0.000000e+00   1.869707e-05   0.000000e+00 
  1.273600e+04   1.857248e-05   0.000000e+00   1.857248e-05   0.000000e+00 
  1.275200e+04   1.899468e-05   0.000000e+00   1.899468e-05   0.000000e+00 
  1.276800e+04   1.827668e-05   0.000000e+00   1.827668e-05   0.000000e+00 
  1.278400e+04   1.874227e-05   0.000000e+00   1.874227e-05   0.000000e+00 
  1.280000e+04   1.809883e-05   0.000000e+00   1.809883e-05   0.000000e+00 
