  1.000000e+01   4.251582e-01  -4.554292e-02  -7.379438e+00  -6.114205e+00 
  1.097762e+01   4.431548e-01  -6.386127e-02  -6.979626e+00  -8.200212e+00 
  1.205081e+01   4.266704e-01  -6.055653e-02  -7.311536e+00  -8.077931e+00 
  1.322892e+01   4.325444e-01  -5.277164e-02  -7.215219e+00  -6.955870e+00 
  1.452220e+01   4.209628e-01  -6.928243e-02  -7.399054e+00  -9.346006e+00 
  1.594191e+01   4.124392e-01  -5.491203e-02  -7.616492e+00  -7.583742e+00 
  1.750042e+01   4.256416e-01  -7.318468e-02  -7.292588e+00  -9.756023e+00 
  1.921129e+01   4.049126e-01  -6.105054e-02  -7.755153e+00  -8.574165e+00 
  2.108942e+01   3.978831e-01  -8.113212e-02  -7.827967e+00  -1.152515e+01 
  2.315116e+01   4.027624e-01  -9.016812e-02  -7.686635e+00  -1.261898e+01 
  2.541446e+01   3.970051e-01  -8.225232e-02  -7.841550e+00  -1.170505e+01 
  2.789902e+01   3.900537e-01  -7.931989e-02  -8.001528e+00  -1.149472e+01 
  3.062647e+01   3.727640e-01  -9.225830e-02  -8.313122e+00  -1.390124e+01 
  3.362057e+01   3.704834e-01  -9.954839e-02  -8.321872e+00  -1.504006e+01 
  3.690737e+01   3.634251e-01  -9.910475e-02  -8.480190e+00  -1.525348e+01 
  4.051550e+01   3.491703e-01  -9.745730e-02  -8.813458e+00  -1.559501e+01 
  4.447636e+01   3.442984e-01  -1.060497e-01  -8.867657e+00  -1.711971e+01 
  4.882445e+01   3.309412e-01  -1.101956e-01  -9.148337e+00  -1.841653e+01 
  5.359761e+01   3.221302e-01  -1.046802e-01  -9.403390e+00  -1.800221e+01 
  5.883741e+01   3.105483e-01  -1.077935e-01  -9.663363e+00  -1.914225e+01 
  6.458945e+01   3.038061e-01  -1.083922e-01  -9.827703e+00  -1.963542e+01 
  7.090383e+01   2.923833e-01  -1.056876e-01  -1.014763e+01  -1.987337e+01 
  7.783551e+01   2.800756e-01  -1.025485e-01  -1.050812e+01  -2.010999e+01 
  8.544484e+01   2.757129e-01  -1.001284e-01  -1.065283e+01  -1.995909e+01 
  9.379807e+01   2.679190e-01  -9.491555e-02  -1.092645e+01  -1.950769e+01 
  1.029679e+02   2.605580e-01  -9.208437e-02  -1.117077e+01  -1.946403e+01 
  1.130343e+02   2.527862e-01  -8.892787e-02  -1.143821e+01  -1.938140e+01 
  1.240847e+02   2.476537e-01  -8.172560e-02  -1.167418e+01  -1.826286e+01 
  1.362154e+02   2.415600e-01  -7.536870e-02  -1.193605e+01  -1.732835e+01 
  1.495321e+02   2.347647e-01  -7.391949e-02  -1.217681e+01  -1.747746e+01 
  1.641506e+02   2.350298e-01  -6.734498e-02  -1.223485e+01  -1.598902e+01 
  1.801982e+02   2.327285e-01  -6.323581e-02  -1.235366e+01  -1.520112e+01 
  1.978147e+02   2.291583e-01  -5.994603e-02  -1.250982e+01  -1.465963e+01 
  2.171534e+02   2.270648e-01  -5.634221e-02  -1.261752e+01  -1.393550e+01 
  2.383827e+02   2.235870e-01  -5.266173e-02  -1.277659e+01  -1.325340e+01 
  2.616874e+02   2.245335e-01  -4.733391e-02  -1.278554e+01  -1.190422e+01 
  2.872704e+02   2.193499e-01  -4.672355e-02  -1.298454e+01  -1.202481e+01 
  3.153545e+02   2.209861e-01  -4.232681e-02  -1.295623e+01  -1.084289e+01 
  3.461841e+02   2.188652e-01  -3.746125e-02  -1.307106e+01  -9.712702e+00 
  3.800276e+02   2.187475e-01  -3.610282e-02  -1.308442e+01  -9.371802e+00 
  4.171797e+02   2.180038e-01  -3.232353e-02  -1.313628e+01  -8.433825e+00 
  4.579640e+02   2.194925e-01  -3.012018e-02  -1.309059e+01  -7.813694e+00 
  5.027353e+02   2.189989e-01  -2.565992e-02  -1.313194e+01  -6.682829e+00 
  5.518835e+02   2.163441e-01  -2.480967e-02  -1.324036e+01  -6.541925e+00 
  6.058367e+02   2.154610e-01  -2.230403e-02  -1.328633e+01  -5.910076e+00 
  6.650643e+02   2.115241e-01  -1.937108e-02  -1.345653e+01  -5.232473e+00 
  7.300821e+02   2.156039e-01  -1.549839e-02  -1.330449e+01  -4.111557e+00 
  8.014562e+02   2.155474e-01  -1.387720e-02  -1.331118e+01  -3.683687e+00 
  8.798079e+02   2.122641e-01  -1.121534e-02  -1.345036e+01  -3.024508e+00 
  9.658195e+02   2.120839e-01  -1.035683e-02  -1.345950e+01  -2.795740e+00 
  1.060240e+03   2.154572e-01  -7.061061e-03  -1.332812e+01  -1.877051e+00 
  1.163890e+03   2.114994e-01  -6.133134e-03  -1.349017e+01  -1.661017e+00 
  1.277674e+03   2.132296e-01  -4.208927e-03  -1.342136e+01  -1.130811e+00 
  1.402582e+03   2.125059e-01  -3.141005e-03  -1.345163e+01  -8.468154e-01 
  1.539701e+03   2.132625e-01  -1.866275e-03  -1.342138e+01  -5.013866e-01 
  1.690225e+03   2.133819e-01   1.027495e-03  -1.341675e+01   2.758934e-01 
  1.855464e+03   2.140414e-01   2.721811e-03  -1.338934e+01   7.285500e-01 
  2.036857e+03   2.147224e-01   3.619966e-03  -1.336122e+01   9.658476e-01 
  2.235984e+03   2.160615e-01   5.155962e-03  -1.330598e+01   1.367013e+00 
  2.454577e+03   2.190732e-01   4.724965e-03  -1.318619e+01   1.235562e+00 
  2.694541e+03   2.188721e-01   8.900298e-03  -1.318902e+01   2.328614e+00 
  2.957964e+03   2.228721e-01   8.913454e-03  -1.303194e+01   2.290242e+00 
  3.247140e+03   2.235049e-01   9.618419e-03  -1.300622e+01   2.464175e+00 
  3.564586e+03   2.257256e-01   9.805068e-03  -1.292020e+01   2.487251e+00 
  3.913066e+03   2.297537e-01   1.040285e-02  -1.276585e+01   2.592483e+00 
  4.295614e+03   2.320461e-01   1.036632e-02  -1.267986e+01   2.557903e+00 
  4.715561e+03   2.345429e-01   9.905271e-03  -1.258781e+01   2.418291e+00 
  5.176562e+03   2.387233e-01   8.383370e-03  -1.243675e+01   2.011259e+00 
  5.682631e+03   2.417912e-01   6.314897e-03  -1.232823e+01   1.496062e+00 
  6.238175e+03   2.463254e-01   2.654795e-03  -1.216931e+01   6.174865e-01 
  6.848030e+03   2.504468e-01  -6.194746e-04  -1.202566e+01  -1.417195e-01 
  7.517505e+03   2.560717e-01  -7.016704e-03  -1.182951e+01  -1.569587e+00 
  8.252429e+03   2.581142e-01  -1.145200e-02  -1.175522e+01  -2.540431e+00 
  9.059200e+03   2.610625e-01  -1.965736e-02  -1.164056e+01  -4.306105e+00 
  9.944844e+03   2.645126e-01  -2.754899e-02  -1.150422e+01  -5.945919e+00 
  1.091707e+04   2.656290e-01  -3.619882e-02  -1.143458e+01  -7.760228e+00 
  1.198434e+04   2.675020e-01  -4.519253e-02  -1.133124e+01  -9.589162e+00 
  1.315595e+04   2.648445e-01  -5.725356e-02  -1.134182e+01  -1.219838e+01 
  1.444210e+04   2.615137e-01  -6.706724e-02  -1.137347e+01  -1.438395e+01 
  1.585398e+04   2.584175e-01  -7.919315e-02  -1.136373e+01  -1.703791e+01 
  1.740389e+04   2.551191e-01  -8.975733e-02  -1.135833e+01  -1.938316e+01 
  1.910533e+04   2.466897e-01  -1.015087e-01  -1.147765e+01  -2.236634e+01 
  2.097310e+04   2.393326e-01  -1.123737e-01  -1.155474e+01  -2.515144e+01 
  2.302346e+04   2.299192e-01  -1.219653e-01  -1.169165e+01  -2.794462e+01 
  2.527428e+04   2.199932e-01  -1.330422e-01  -1.179817e+01  -3.116371e+01 
  2.774513e+04   2.054530e-01  -1.436787e-01  -1.201664e+01  -3.496610e+01 
  3.045755e+04   1.925326e-01  -1.466808e-01  -1.232221e+01  -3.730192e+01 
  3.343513e+04   1.807452e-01  -1.546515e-01  -1.247292e+01  -4.055137e+01 
  3.670380e+04   1.660538e-01  -1.601483e-01  -1.273914e+01  -4.396283e+01 
  4.029203e+04   1.513417e-01  -1.649059e-01  -1.300177e+01  -4.745597e+01 
  4.423105e+04   1.358474e-01  -1.693931e-01  -1.326532e+01  -5.127159e+01 
  4.855515e+04   1.188870e-01  -1.718848e-01  -1.359732e+01  -5.532968e+01 
  5.330199e+04   1.011545e-01  -1.752769e-01  -1.387701e+01  -6.001022e+01 
  5.851288e+04   7.969113e-02  -1.741193e-01  -1.435710e+01  -6.540733e+01 
  6.423320e+04   6.134334e-02  -1.621989e-01  -1.521845e+01  -6.928347e+01 
  7.051275e+04   5.400003e-02  -1.569255e-01  -1.560010e+01  -7.101102e+01 
  7.740620e+04   4.081042e-02  -1.564843e-01  -1.582481e+01  -7.538309e+01 
  8.497355e+04   2.571274e-02  -1.528052e-01  -1.619597e+01  -8.044823e+01 
  9.328072e+04   1.074773e-02  -1.466636e-01  -1.665029e+01  -8.580877e+01 
  1.024000e+05  -4.051641e-03  -1.385465e-01  -1.716438e+01  -9.167506e+01 
