  0.000000e+00   5.013148e-04   0.000000e+00   5.013148e-04   0.000000e+00 
  2.500000e-01   2.736697e-04   0.000000e+00   2.736697e-04   0.000000e+00 
  5.000000e-01   4.683320e-05   0.000000e+00   4.683320e-05   0.000000e+00 
  7.500000e-01   2.772732e-05   0.000000e+00   2.772732e-05   0.000000e+00 
  1.000000e+00   2.044060e-05   0.000000e+00   2.044060e-05   0.000000e+00 
  1.250000e+00   1.330509e-05   0.000000e+00   1.330509e-05   0.000000e+00 
  1.500000e+00   6.520404e-06   0.000000e+00   6.520404e-06   0.000000e+00 
  1.750000e+00   5.618454e-06   0.000000e+00   5.618454e-06   0.000000e+00 
  2.000000e+00   7.303957e-06   0.000000e+00   7.303957e-06   0.000000e+00 
  2.250000e+00   4.315707e-06   0.000000e+00   4.315707e-06   0.000000e+00 
  2.500000e+00   1.478985e-06   0.000000e+00   1.478985e-06   0.000000e+00 
  2.750000e+00   2.497085e-06   0.000000e+00   2.497085e-06   0.000000e+00 
  3.000000e+00   2.741062e-06   0.000000e+00   2.741062e-06   0.000000e+00 
  3.250000e+00   1.579352e-06   0.000000e+00   1.579352e-06   0.000000e+00 
  3.500000e+00   1.062441e-06   0.000000e+00   1.062441e-06   0.000000e+00 
  3.750000e+00   1.438296e-06   0.000000e+00   1.438296e-06   0.000000e+00 
  4.000000e+00   1.097229e-06   0.000000e+00   1.097229e-06   0.000000e+00 
  4.250000e+00   7.156513e-07   0.000000e+00   7.156513e-07   0.000000e+00 
  4.500000e+00   8.125578e-07   0.000000e+00   8.125578e-07   0.000000e+00 
  4.750000e+00   7.807668e-07   0.000000e+00   7.807668e-07   0.000000e+00 
  5.000000e+00   6.359057e-07   0.000000e+00   6.359057e-07   0.000000e+00 
  5.250000e+00   4.906858e-07   0.000000e+00   4.906858e-07   0.000000e+00 
  5.500000e+00   3.650214e-07   0.000000e+00   3.650214e-07   0.000000e+00 
  5.750000e+00   3.871205e-07   0.000000e+00   3.871205e-07   0.000000e+00 
  6.000000e+00   3.884644e-07   0.000000e+00   3.884644e-07   0.000000e+00 
  6.250000e+00   3.733870e-07   0.000000e+00   3.733870e-07   0.000000e+00 
  6.500000e+00   3.556538e-07   0.000000e+00   3.556538e-07   0.000000e+00 
  6.750000e+00   3.308229e-07   0.000000e+00   3.308229e-07   0.000000e+00 
  7.000000e+00   3.014300e-07   0.000000e+00   3.014300e-07   0.000000e+00 
  7.250000e+00   2.812327e-07   0.000000e+00   2.812327e-07   0.000000e+00 
  7.500000e+00   2.567368e-07   0.000000e+00   2.567368e-07   0.000000e+00 
  7.750000e+00   3.092119e-07   0.000000e+00   3.092119e-07   0.000000e+00 
  8.000000e+00   3.121826e-07   0.000000e+00   3.121826e-07   0.000000e+00 
  8.250000e+00   2.595621e-07   0.000000e+00   2.595621e-07   0.000000e+00 
  8.500000e+00   2.503427e-07   0.000000e+00   2.503427e-07   0.000000e+00 
  8.750000e+00   2.235885e-07   0.000000e+00   2.235885e-07   0.000000e+00 
  9.000000e+00   2.399890e-07   0.000000e+00   2.399890e-07   0.000000e+00 
  9.250000e+00   2.443367e-07   0.000000e+00   2.443367e-07   0.000000e+00 
  9.500000e+00   2.324574e-07   0.000000e+00   2.324574e-07   0.000000e+00 
  9.750000e+00   2.683462e-07   0.000000e+00   2.683462e-07   0.000000e+00 
  1.000000e+01   2.723652e-07   0.000000e+00   2.723652e-07   0.000000e+00 
  1.025000e+01   2.136106e-07   0.000000e+00   2.136106e-07   0.000000e+00 
  1.050000e+01   1.920665e-07   0.000000e+00   1.920665e-07   0.000000e+00 
  1.075000e+01   2.312751e-07   0.000000e+00   2.312751e-07   0.000000e+00 
  1.100000e+01   2.829283e-07   0.000000e+00   2.829283e-07   0.000000e+00 
  1.125000e+01   2.577462e-07   0.000000e+00   2.577462e-07   0.000000e+00 
  1.150000e+01   2.827641e-07   0.000000e+00   2.827641e-07   0.000000e+00 
  1.175000e+01   2.584497e-07   0.000000e+00   2.584497e-07   0.000000e+00 
  1.200000e+01   2.796057e-07   0.000000e+00   2.796057e-07   0.000000e+00 
  1.225000e+01   2.634145e-07   0.000000e+00   2.634145e-07   0.000000e+00 
  1.250000e+01   2.284068e-07   0.000000e+00   2.284068e-07   0.000000e+00 
  1.275000e+01   2.145435e-07   0.000000e+00   2.145435e-07   0.000000e+00 
  1.300000e+01   1.799559e-07   0.000000e+00   1.799559e-07   0.000000e+00 
  1.325000e+01   2.798882e-07   0.000000e+00   2.798882e-07   0.000000e+00 
  1.350000e+01   4.182478e-07   0.000000e+00   4.182478e-07   0.000000e+00 
  1.375000e+01   3.123209e-07   0.000000e+00   3.123209e-07   0.000000e+00 
  1.400000e+01   2.673585e-07   0.000000e+00   2.673585e-07   0.000000e+00 
  1.425000e+01   2.457043e-07   0.000000e+00   2.457043e-07   0.000000e+00 
  1.450000e+01   1.967130e-07   0.000000e+00   1.967130e-07   0.000000e+00 
  1.475000e+01   1.952956e-07   0.000000e+00   1.952956e-07   0.000000e+00 
  1.500000e+01   2.299247e-07   0.000000e+00   2.299247e-07   0.000000e+00 
  1.525000e+01   2.466097e-07   0.000000e+00   2.466097e-07   0.000000e+00 
  1.550000e+01   2.371629e-07   0.000000e+00   2.371629e-07   0.000000e+00 
  1.575000e+01   2.775010e-07   0.000000e+00   2.775010e-07   0.000000e+00 
  1.600000e+01   2.928768e-07   0.000000e+00   2.928768e-07   0.000000e+00 
  1.625000e+01   2.435207e-07   0.000000e+00   2.435207e-07   0.000000e+00 
  1.650000e+01   1.845871e-07   0.000000e+00   1.845871e-07   0.000000e+00 
  1.675000e+01   2.387863e-07   0.000000e+00   2.387863e-07   0.000000e+00 
  1.700000e+01   2.493673e-07   0.000000e+00   2.493673e-07   0.000000e+00 
  1.725000e+01   2.196405e-07   0.000000e+00   2.196405e-07   0.000000e+00 
  1.750000e+01   1.851027e-07   0.000000e+00   1.851027e-07   0.000000e+00 
  1.775000e+01   2.246398e-07   0.000000e+00   2.246398e-07   0.000000e+00 
  1.800000e+01   2.259118e-07   0.000000e+00   2.259118e-07   0.000000e+00 
  1.825000e+01   2.531520e-07   0.000000e+00   2.531520e-07   0.000000e+00 
  1.850000e+01   2.552478e-07   0.000000e+00   2.552478e-07   0.000000e+00 
  1.875000e+01   1.932514e-07   0.000000e+00   1.932514e-07   0.000000e+00 
  1.900000e+01   1.878471e-07   0.000000e+00   1.878471e-07   0.000000e+00 
  1.925000e+01   2.103551e-07   0.000000e+00   2.103551e-07   0.000000e+00 
  1.950000e+01   2.114493e-07   0.000000e+00   2.114493e-07   0.000000e+00 
  1.975000e+01   2.691968e-07   0.000000e+00   2.691968e-07   0.000000e+00 
  2.000000e+01   3.376702e-07   0.000000e+00   3.376702e-07   0.000000e+00 
  2.025000e+01   2.624213e-07   0.000000e+00   2.624213e-07   0.000000e+00 
  2.050000e+01   2.083168e-07   0.000000e+00   2.083168e-07   0.000000e+00 
  2.075000e+01   2.710526e-07   0.000000e+00   2.710526e-07   0.000000e+00 
  2.100000e+01   3.304586e-07   0.000000e+00   3.304586e-07   0.000000e+00 
  2.125000e+01   2.797534e-07   0.000000e+00   2.797534e-07   0.000000e+00 
  2.150000e+01   3.778229e-07   0.000000e+00   3.778229e-07   0.000000e+00 
  2.175000e+01   3.632553e-07   0.000000e+00   3.632553e-07   0.000000e+00 
  2.200000e+01   3.165779e-07   0.000000e+00   3.165779e-07   0.000000e+00 
  2.225000e+01   3.925997e-07   0.000000e+00   3.925997e-07   0.000000e+00 
  2.250000e+01   3.824120e-07   0.000000e+00   3.824120e-07   0.000000e+00 
  2.275000e+01   3.257805e-07   0.000000e+00   3.257805e-07   0.000000e+00 
  2.300000e+01   2.527827e-07   0.000000e+00   2.527827e-07   0.000000e+00 
  2.325000e+01   2.659440e-07   0.000000e+00   2.659440e-07   0.000000e+00 
  2.350000e+01   3.909692e-07   0.000000e+00   3.909692e-07   0.000000e+00 
  2.375000e+01   4.042681e-07   0.000000e+00   4.042681e-07   0.000000e+00 
  2.400000e+01   4.334444e-07   0.000000e+00   4.334444e-07   0.000000e+00 
  2.425000e+01   4.167152e-07   0.000000e+00   4.167152e-07   0.000000e+00 
  2.450000e+01   3.171085e-07   0.000000e+00   3.171085e-07   0.000000e+00 
  2.475000e+01   2.893056e-07   0.000000e+00   2.893056e-07   0.000000e+00 
  2.500000e+01   3.177522e-07   0.000000e+00   3.177522e-07   0.000000e+00 
  2.525000e+01   3.135015e-07   0.000000e+00   3.135015e-07   0.000000e+00 
  2.550000e+01   2.924738e-07   0.000000e+00   2.924738e-07   0.000000e+00 
  2.575000e+01   2.498632e-07   0.000000e+00   2.498632e-07   0.000000e+00 
  2.600000e+01   2.306150e-07   0.000000e+00   2.306150e-07   0.000000e+00 
  2.625000e+01   2.255965e-07   0.000000e+00   2.255965e-07   0.000000e+00 
  2.650000e+01   1.997215e-07   0.000000e+00   1.997215e-07   0.000000e+00 
  2.675000e+01   2.215243e-07   0.000000e+00   2.215243e-07   0.000000e+00 
  2.700000e+01   4.419137e-07   0.000000e+00   4.419137e-07   0.000000e+00 
  2.725000e+01   3.193803e-07   0.000000e+00   3.193803e-07   0.000000e+00 
  2.750000e+01   1.756809e-07   0.000000e+00   1.756809e-07   0.000000e+00 
  2.775000e+01   2.242647e-07   0.000000e+00   2.242647e-07   0.000000e+00 
  2.800000e+01   2.033806e-07   0.000000e+00   2.033806e-07   0.000000e+00 
  2.825000e+01   1.882831e-07   0.000000e+00   1.882831e-07   0.000000e+00 
  2.850000e+01   1.648198e-07   0.000000e+00   1.648198e-07   0.000000e+00 
  2.875000e+01   1.907881e-07   0.000000e+00   1.907881e-07   0.000000e+00 
  2.900000e+01   1.687931e-07   0.000000e+00   1.687931e-07   0.000000e+00 
  2.925000e+01   1.679329e-07   0.000000e+00   1.679329e-07   0.000000e+00 
  2.950000e+01   2.203700e-07   0.000000e+00   2.203700e-07   0.000000e+00 
  2.975000e+01   2.480731e-07   0.000000e+00   2.480731e-07   0.000000e+00 
  3.000000e+01   1.932207e-07   0.000000e+00   1.932207e-07   0.000000e+00 
  3.025000e+01   1.801511e-07   0.000000e+00   1.801511e-07   0.000000e+00 
  3.050000e+01   1.956355e-07   0.000000e+00   1.956355e-07   0.000000e+00 
  3.075000e+01   2.000490e-07   0.000000e+00   2.000490e-07   0.000000e+00 
  3.100000e+01   2.221022e-07   0.000000e+00   2.221022e-07   0.000000e+00 
  3.125000e+01   1.968604e-07   0.000000e+00   1.968604e-07   0.000000e+00 
  3.150000e+01   2.187567e-07   0.000000e+00   2.187567e-07   0.000000e+00 
  3.175000e+01   2.103531e-07   0.000000e+00   2.103531e-07   0.000000e+00 
  3.200000e+01   2.053301e-07   0.000000e+00   2.053301e-07   0.000000e+00 
  3.225000e+01   1.700063e-07   0.000000e+00   1.700063e-07   0.000000e+00 
  3.250000e+01   1.755885e-07   0.000000e+00   1.755885e-07   0.000000e+00 
  3.275000e+01   1.403219e-07   0.000000e+00   1.403219e-07   0.000000e+00 
  3.300000e+01   1.445980e-07   0.000000e+00   1.445980e-07   0.000000e+00 
  3.325000e+01   2.237704e-07   0.000000e+00   2.237704e-07   0.000000e+00 
  3.350000e+01   2.069588e-07   0.000000e+00   2.069588e-07   0.000000e+00 
  3.375000e+01   1.812076e-07   0.000000e+00   1.812076e-07   0.000000e+00 
  3.400000e+01   1.637469e-07   0.000000e+00   1.637469e-07   0.000000e+00 
  3.425000e+01   1.705284e-07   0.000000e+00   1.705284e-07   0.000000e+00 
  3.450000e+01   1.808064e-07   0.000000e+00   1.808064e-07   0.000000e+00 
  3.475000e+01   1.364999e-07   0.000000e+00   1.364999e-07   0.000000e+00 
  3.500000e+01   1.695831e-07   0.000000e+00   1.695831e-07   0.000000e+00 
  3.525000e+01   1.585004e-07   0.000000e+00   1.585004e-07   0.000000e+00 
  3.550000e+01   1.483777e-07   0.000000e+00   1.483777e-07   0.000000e+00 
  3.575000e+01   2.447206e-07   0.000000e+00   2.447206e-07   0.000000e+00 
  3.600000e+01   2.239193e-07   0.000000e+00   2.239193e-07   0.000000e+00 
  3.625000e+01   1.906022e-07   0.000000e+00   1.906022e-07   0.000000e+00 
  3.650000e+01   1.932121e-07   0.000000e+00   1.932121e-07   0.000000e+00 
  3.675000e+01   2.229681e-07   0.000000e+00   2.229681e-07   0.000000e+00 
  3.700000e+01   2.423112e-07   0.000000e+00   2.423112e-07   0.000000e+00 
  3.725000e+01   3.894925e-07   0.000000e+00   3.894925e-07   0.000000e+00 
  3.750000e+01   3.636108e-07   0.000000e+00   3.636108e-07   0.000000e+00 
  3.775000e+01   1.830712e-07   0.000000e+00   1.830712e-07   0.000000e+00 
  3.800000e+01   1.710979e-07   0.000000e+00   1.710979e-07   0.000000e+00 
  3.825000e+01   1.772283e-07   0.000000e+00   1.772283e-07   0.000000e+00 
  3.850000e+01   2.084767e-07   0.000000e+00   2.084767e-07   0.000000e+00 
  3.875000e+01   1.793328e-07   0.000000e+00   1.793328e-07   0.000000e+00 
  3.900000e+01   1.629617e-07   0.000000e+00   1.629617e-07   0.000000e+00 
  3.925000e+01   1.767512e-07   0.000000e+00   1.767512e-07   0.000000e+00 
  3.950000e+01   1.769914e-07   0.000000e+00   1.769914e-07   0.000000e+00 
  3.975000e+01   2.371292e-07   0.000000e+00   2.371292e-07   0.000000e+00 
  4.000000e+01   2.042917e-07   0.000000e+00   2.042917e-07   0.000000e+00 
  4.025000e+01   1.406764e-07   0.000000e+00   1.406764e-07   0.000000e+00 
  4.050000e+01   1.669742e-07   0.000000e+00   1.669742e-07   0.000000e+00 
  4.075000e+01   1.807409e-07   0.000000e+00   1.807409e-07   0.000000e+00 
  4.100000e+01   1.731549e-07   0.000000e+00   1.731549e-07   0.000000e+00 
  4.125000e+01   2.016872e-07   0.000000e+00   2.016872e-07   0.000000e+00 
  4.150000e+01   2.020355e-07   0.000000e+00   2.020355e-07   0.000000e+00 
  4.175000e+01   1.691279e-07   0.000000e+00   1.691279e-07   0.000000e+00 
  4.200000e+01   1.840720e-07   0.000000e+00   1.840720e-07   0.000000e+00 
  4.225000e+01   2.352135e-07   0.000000e+00   2.352135e-07   0.000000e+00 
  4.250000e+01   2.483220e-07   0.000000e+00   2.483220e-07   0.000000e+00 
  4.275000e+01   1.982899e-07   0.000000e+00   1.982899e-07   0.000000e+00 
  4.300000e+01   1.855649e-07   0.000000e+00   1.855649e-07   0.000000e+00 
  4.325000e+01   1.832504e-07   0.000000e+00   1.832504e-07   0.000000e+00 
  4.350000e+01   1.838285e-07   0.000000e+00   1.838285e-07   0.000000e+00 
  4.375000e+01   1.638144e-07   0.000000e+00   1.638144e-07   0.000000e+00 
  4.400000e+01   2.215126e-07   0.000000e+00   2.215126e-07   0.000000e+00 
  4.425000e+01   2.273224e-07   0.000000e+00   2.273224e-07   0.000000e+00 
  4.450000e+01   2.131188e-07   0.000000e+00   2.131188e-07   0.000000e+00 
  4.475000e+01   2.351021e-07   0.000000e+00   2.351021e-07   0.000000e+00 
  4.500000e+01   2.274489e-07   0.000000e+00   2.274489e-07   0.000000e+00 
  4.525000e+01   2.389120e-07   0.000000e+00   2.389120e-07   0.000000e+00 
  4.550000e+01   2.614478e-07   0.000000e+00   2.614478e-07   0.000000e+00 
  4.575000e+01   1.994381e-07   0.000000e+00   1.994381e-07   0.000000e+00 
  4.600000e+01   1.796956e-07   0.000000e+00   1.796956e-07   0.000000e+00 
  4.625000e+01   1.811341e-07   0.000000e+00   1.811341e-07   0.000000e+00 
  4.650000e+01   1.964893e-07   0.000000e+00   1.964893e-07   0.000000e+00 
  4.675000e+01   1.930275e-07   0.000000e+00   1.930275e-07   0.000000e+00 
  4.700000e+01   1.703795e-07   0.000000e+00   1.703795e-07   0.000000e+00 
  4.725000e+01   1.511431e-07   0.000000e+00   1.511431e-07   0.000000e+00 
  4.750000e+01   2.444439e-07   0.000000e+00   2.444439e-07   0.000000e+00 
  4.775000e+01   4.427427e-07   0.000000e+00   4.427427e-07   0.000000e+00 
  4.800000e+01   3.168131e-07   0.000000e+00   3.168131e-07   0.000000e+00 
  4.825000e+01   1.790180e-07   0.000000e+00   1.790180e-07   0.000000e+00 
  4.850000e+01   1.605805e-07   0.000000e+00   1.605805e-07   0.000000e+00 
  4.875000e+01   1.982753e-07   0.000000e+00   1.982753e-07   0.000000e+00 
  4.900000e+01   1.928751e-07   0.000000e+00   1.928751e-07   0.000000e+00 
  4.925000e+01   1.701825e-07   0.000000e+00   1.701825e-07   0.000000e+00 
  4.950000e+01   2.128321e-07   0.000000e+00   2.128321e-07   0.000000e+00 
  4.975000e+01   1.882446e-07   0.000000e+00   1.882446e-07   0.000000e+00 
  5.000000e+01   1.540061e-07   0.000000e+00   1.540061e-07   0.000000e+00 
  5.025000e+01   1.705556e-07   0.000000e+00   1.705556e-07   0.000000e+00 
  5.050000e+01   2.166105e-07   0.000000e+00   2.166105e-07   0.000000e+00 
  5.075000e+01   2.152316e-07   0.000000e+00   2.152316e-07   0.000000e+00 
  5.100000e+01   1.596790e-07   0.000000e+00   1.596790e-07   0.000000e+00 
  5.125000e+01   1.739308e-07   0.000000e+00   1.739308e-07   0.000000e+00 
  5.150000e+01   2.042127e-07   0.000000e+00   2.042127e-07   0.000000e+00 
  5.175000e+01   1.709049e-07   0.000000e+00   1.709049e-07   0.000000e+00 
  5.200000e+01   1.562141e-07   0.000000e+00   1.562141e-07   0.000000e+00 
  5.225000e+01   1.752503e-07   0.000000e+00   1.752503e-07   0.000000e+00 
  5.250000e+01   1.689689e-07   0.000000e+00   1.689689e-07   0.000000e+00 
  5.275000e+01   1.537692e-07   0.000000e+00   1.537692e-07   0.000000e+00 
  5.300000e+01   1.792626e-07   0.000000e+00   1.792626e-07   0.000000e+00 
  5.325000e+01   1.627164e-07   0.000000e+00   1.627164e-07   0.000000e+00 
  5.350000e+01   1.291369e-07   0.000000e+00   1.291369e-07   0.000000e+00 
  5.375000e+01   1.482203e-07   0.000000e+00   1.482203e-07   0.000000e+00 
  5.400000e+01   1.551458e-07   0.000000e+00   1.551458e-07   0.000000e+00 
  5.425000e+01   1.677823e-07   0.000000e+00   1.677823e-07   0.000000e+00 
  5.450000e+01   1.747176e-07   0.000000e+00   1.747176e-07   0.000000e+00 
  5.475000e+01   1.836732e-07   0.000000e+00   1.836732e-07   0.000000e+00 
  5.500000e+01   2.054254e-07   0.000000e+00   2.054254e-07   0.000000e+00 
  5.525000e+01   1.927722e-07   0.000000e+00   1.927722e-07   0.000000e+00 
  5.550000e+01   1.782762e-07   0.000000e+00   1.782762e-07   0.000000e+00 
  5.575000e+01   1.227261e-07   0.000000e+00   1.227261e-07   0.000000e+00 
  5.600000e+01   1.555205e-07   0.000000e+00   1.555205e-07   0.000000e+00 
  5.625000e+01   1.952422e-07   0.000000e+00   1.952422e-07   0.000000e+00 
  5.650000e+01   2.078566e-07   0.000000e+00   2.078566e-07   0.000000e+00 
  5.675000e+01   2.016437e-07   0.000000e+00   2.016437e-07   0.000000e+00 
  5.700000e+01   1.686050e-07   0.000000e+00   1.686050e-07   0.000000e+00 
  5.725000e+01   1.550998e-07   0.000000e+00   1.550998e-07   0.000000e+00 
  5.750000e+01   1.949799e-07   0.000000e+00   1.949799e-07   0.000000e+00 
  5.775000e+01   1.989712e-07   0.000000e+00   1.989712e-07   0.000000e+00 
  5.800000e+01   2.090468e-07   0.000000e+00   2.090468e-07   0.000000e+00 
  5.825000e+01   2.003167e-07   0.000000e+00   2.003167e-07   0.000000e+00 
  5.850000e+01   1.928279e-07   0.000000e+00   1.928279e-07   0.000000e+00 
  5.875000e+01   2.092531e-07   0.000000e+00   2.092531e-07   0.000000e+00 
  5.900000e+01   2.018891e-07   0.000000e+00   2.018891e-07   0.000000e+00 
  5.925000e+01   1.870036e-07   0.000000e+00   1.870036e-07   0.000000e+00 
  5.950000e+01   2.072047e-07   0.000000e+00   2.072047e-07   0.000000e+00 
  5.975000e+01   2.251991e-07   0.000000e+00   2.251991e-07   0.000000e+00 
  6.000000e+01   1.918686e-07   0.000000e+00   1.918686e-07   0.000000e+00 
  6.025000e+01   1.241260e-07   0.000000e+00   1.241260e-07   0.000000e+00 
  6.050000e+01   1.542201e-07   0.000000e+00   1.542201e-07   0.000000e+00 
  6.075000e+01   1.665092e-07   0.000000e+00   1.665092e-07   0.000000e+00 
  6.100000e+01   1.822305e-07   0.000000e+00   1.822305e-07   0.000000e+00 
  6.125000e+01   1.787978e-07   0.000000e+00   1.787978e-07   0.000000e+00 
  6.150000e+01   1.608450e-07   0.000000e+00   1.608450e-07   0.000000e+00 
  6.175000e+01   1.273537e-07   0.000000e+00   1.273537e-07   0.000000e+00 
  6.200000e+01   1.366685e-07   0.000000e+00   1.366685e-07   0.000000e+00 
  6.225000e+01   1.541362e-07   0.000000e+00   1.541362e-07   0.000000e+00 
  6.250000e+01   1.646845e-07   0.000000e+00   1.646845e-07   0.000000e+00 
  6.275000e+01   1.739236e-07   0.000000e+00   1.739236e-07   0.000000e+00 
  6.300000e+01   1.796663e-07   0.000000e+00   1.796663e-07   0.000000e+00 
  6.325000e+01   1.769202e-07   0.000000e+00   1.769202e-07   0.000000e+00 
  6.350000e+01   2.028480e-07   0.000000e+00   2.028480e-07   0.000000e+00 
  6.375000e+01   2.303425e-07   0.000000e+00   2.303425e-07   0.000000e+00 
  6.400000e+01   1.997889e-07   0.000000e+00   1.997889e-07   0.000000e+00 
  6.425000e+01   1.423760e-07   0.000000e+00   1.423760e-07   0.000000e+00 
  6.450000e+01   1.928523e-07   0.000000e+00   1.928523e-07   0.000000e+00 
  6.475000e+01   1.967494e-07   0.000000e+00   1.967494e-07   0.000000e+00 
  6.500000e+01   1.620795e-07   0.000000e+00   1.620795e-07   0.000000e+00 
  6.525000e+01   1.720211e-07   0.000000e+00   1.720211e-07   0.000000e+00 
  6.550000e+01   1.907044e-07   0.000000e+00   1.907044e-07   0.000000e+00 
  6.575000e+01   2.016540e-07   0.000000e+00   2.016540e-07   0.000000e+00 
  6.600000e+01   1.539016e-07   0.000000e+00   1.539016e-07   0.000000e+00 
  6.625000e+01   1.811787e-07   0.000000e+00   1.811787e-07   0.000000e+00 
  6.650000e+01   2.040665e-07   0.000000e+00   2.040665e-07   0.000000e+00 
  6.675000e+01   2.035294e-07   0.000000e+00   2.035294e-07   0.000000e+00 
  6.700000e+01   1.655639e-07   0.000000e+00   1.655639e-07   0.000000e+00 
  6.725000e+01   1.734197e-07   0.000000e+00   1.734197e-07   0.000000e+00 
  6.750000e+01   2.032727e-07   0.000000e+00   2.032727e-07   0.000000e+00 
  6.775000e+01   1.852349e-07   0.000000e+00   1.852349e-07   0.000000e+00 
  6.800000e+01   1.546935e-07   0.000000e+00   1.546935e-07   0.000000e+00 
  6.825000e+01   1.497249e-07   0.000000e+00   1.497249e-07   0.000000e+00 
  6.850000e+01   1.720833e-07   0.000000e+00   1.720833e-07   0.000000e+00 
  6.875000e+01   1.846162e-07   0.000000e+00   1.846162e-07   0.000000e+00 
  6.900000e+01   1.356665e-07   0.000000e+00   1.356665e-07   0.000000e+00 
  6.925000e+01   1.455282e-07   0.000000e+00   1.455282e-07   0.000000e+00 
  6.950000e+01   1.874793e-07   0.000000e+00   1.874793e-07   0.000000e+00 
  6.975000e+01   1.640873e-07   0.000000e+00   1.640873e-07   0.000000e+00 
  7.000000e+01   1.525748e-07   0.000000e+00   1.525748e-07   0.000000e+00 
  7.025000e+01   1.547755e-07   0.000000e+00   1.547755e-07   0.000000e+00 
  7.050000e+01   1.621958e-07   0.000000e+00   1.621958e-07   0.000000e+00 
  7.075000e+01   1.756434e-07   0.000000e+00   1.756434e-07   0.000000e+00 
  7.100000e+01   1.748931e-07   0.000000e+00   1.748931e-07   0.000000e+00 
  7.125000e+01   1.500358e-07   0.000000e+00   1.500358e-07   0.000000e+00 
  7.150000e+01   1.707334e-07   0.000000e+00   1.707334e-07   0.000000e+00 
  7.175000e+01   1.873263e-07   0.000000e+00   1.873263e-07   0.000000e+00 
  7.200000e+01   1.786883e-07   0.000000e+00   1.786883e-07   0.000000e+00 
  7.225000e+01   1.608240e-07   0.000000e+00   1.608240e-07   0.000000e+00 
  7.250000e+01   1.644772e-07   0.000000e+00   1.644772e-07   0.000000e+00 
  7.275000e+01   1.848052e-07   0.000000e+00   1.848052e-07   0.000000e+00 
  7.300000e+01   1.750865e-07   0.000000e+00   1.750865e-07   0.000000e+00 
  7.325000e+01   1.655587e-07   0.000000e+00   1.655587e-07   0.000000e+00 
  7.350000e+01   1.582556e-07   0.000000e+00   1.582556e-07   0.000000e+00 
  7.375000e+01   1.677126e-07   0.000000e+00   1.677126e-07   0.000000e+00 
  7.400000e+01   1.721326e-07   0.000000e+00   1.721326e-07   0.000000e+00 
  7.425000e+01   1.504188e-07   0.000000e+00   1.504188e-07   0.000000e+00 
  7.450000e+01   1.930588e-07   0.000000e+00   1.930588e-07   0.000000e+00 
  7.475000e+01   2.107878e-07   0.000000e+00   2.107878e-07   0.000000e+00 
  7.500000e+01   2.041270e-07   0.000000e+00   2.041270e-07   0.000000e+00 
  7.525000e+01   1.997545e-07   0.000000e+00   1.997545e-07   0.000000e+00 
  7.550000e+01   1.655114e-07   0.000000e+00   1.655114e-07   0.000000e+00 
  7.575000e+01   1.247778e-07   0.000000e+00   1.247778e-07   0.000000e+00 
  7.600000e+01   1.662603e-07   0.000000e+00   1.662603e-07   0.000000e+00 
  7.625000e+01   1.580317e-07   0.000000e+00   1.580317e-07   0.000000e+00 
  7.650000e+01   1.426369e-07   0.000000e+00   1.426369e-07   0.000000e+00 
  7.675000e+01   1.675158e-07   0.000000e+00   1.675158e-07   0.000000e+00 
  7.700000e+01   1.453360e-07   0.000000e+00   1.453360e-07   0.000000e+00 
  7.725000e+01   1.728365e-07   0.000000e+00   1.728365e-07   0.000000e+00 
  7.750000e+01   1.487854e-07   0.000000e+00   1.487854e-07   0.000000e+00 
  7.775000e+01   1.592866e-07   0.000000e+00   1.592866e-07   0.000000e+00 
  7.800000e+01   1.599126e-07   0.000000e+00   1.599126e-07   0.000000e+00 
  7.825000e+01   1.519573e-07   0.000000e+00   1.519573e-07   0.000000e+00 
  7.850000e+01   1.367803e-07   0.000000e+00   1.367803e-07   0.000000e+00 
  7.875000e+01   1.520960e-07   0.000000e+00   1.520960e-07   0.000000e+00 
  7.900000e+01   1.845120e-07   0.000000e+00   1.845120e-07   0.000000e+00 
  7.925000e+01   1.735607e-07   0.000000e+00   1.735607e-07   0.000000e+00 
  7.950000e+01   1.701929e-07   0.000000e+00   1.701929e-07   0.000000e+00 
  7.975000e+01   1.836589e-07   0.000000e+00   1.836589e-07   0.000000e+00 
  8.000000e+01   1.687020e-07   0.000000e+00   1.687020e-07   0.000000e+00 
  8.025000e+01   1.297144e-07   0.000000e+00   1.297144e-07   0.000000e+00 
  8.050000e+01   1.400686e-07   0.000000e+00   1.400686e-07   0.000000e+00 
  8.075000e+01   1.664470e-07   0.000000e+00   1.664470e-07   0.000000e+00 
  8.100000e+01   1.546116e-07   0.000000e+00   1.546116e-07   0.000000e+00 
  8.125000e+01   1.453493e-07   0.000000e+00   1.453493e-07   0.000000e+00 
  8.150000e+01   1.584485e-07   0.000000e+00   1.584485e-07   0.000000e+00 
  8.175000e+01   1.492472e-07   0.000000e+00   1.492472e-07   0.000000e+00 
  8.200000e+01   1.752398e-07   0.000000e+00   1.752398e-07   0.000000e+00 
  8.225000e+01   1.881559e-07   0.000000e+00   1.881559e-07   0.000000e+00 
  8.250000e+01   1.807337e-07   0.000000e+00   1.807337e-07   0.000000e+00 
  8.275000e+01   1.561591e-07   0.000000e+00   1.561591e-07   0.000000e+00 
  8.300000e+01   1.610184e-07   0.000000e+00   1.610184e-07   0.000000e+00 
  8.325000e+01   1.590623e-07   0.000000e+00   1.590623e-07   0.000000e+00 
  8.350000e+01   1.710236e-07   0.000000e+00   1.710236e-07   0.000000e+00 
  8.375000e+01   1.477157e-07   0.000000e+00   1.477157e-07   0.000000e+00 
  8.400000e+01   2.015224e-07   0.000000e+00   2.015224e-07   0.000000e+00 
  8.425000e+01   2.093438e-07   0.000000e+00   2.093438e-07   0.000000e+00 
  8.450000e+01   1.807913e-07   0.000000e+00   1.807913e-07   0.000000e+00 
  8.475000e+01   1.653185e-07   0.000000e+00   1.653185e-07   0.000000e+00 
  8.500000e+01   1.285929e-07   0.000000e+00   1.285929e-07   0.000000e+00 
  8.525000e+01   1.269022e-07   0.000000e+00   1.269022e-07   0.000000e+00 
  8.550000e+01   1.603522e-07   0.000000e+00   1.603522e-07   0.000000e+00 
  8.575000e+01   1.727725e-07   0.000000e+00   1.727725e-07   0.000000e+00 
  8.600000e+01   1.617917e-07   0.000000e+00   1.617917e-07   0.000000e+00 
  8.625000e+01   1.495540e-07   0.000000e+00   1.495540e-07   0.000000e+00 
  8.650000e+01   1.391545e-07   0.000000e+00   1.391545e-07   0.000000e+00 
  8.675000e+01   1.463367e-07   0.000000e+00   1.463367e-07   0.000000e+00 
  8.700000e+01   1.398362e-07   0.000000e+00   1.398362e-07   0.000000e+00 
  8.725000e+01   1.549864e-07   0.000000e+00   1.549864e-07   0.000000e+00 
  8.750000e+01   1.553497e-07   0.000000e+00   1.553497e-07   0.000000e+00 
  8.775000e+01   1.659236e-07   0.000000e+00   1.659236e-07   0.000000e+00 
  8.800000e+01   1.634787e-07   0.000000e+00   1.634787e-07   0.000000e+00 
  8.825000e+01   1.475771e-07   0.000000e+00   1.475771e-07   0.000000e+00 
  8.850000e+01   1.812900e-07   0.000000e+00   1.812900e-07   0.000000e+00 
  8.875000e+01   1.763804e-07   0.000000e+00   1.763804e-07   0.000000e+00 
  8.900000e+01   1.552307e-07   0.000000e+00   1.552307e-07   0.000000e+00 
  8.925000e+01   1.287034e-07   0.000000e+00   1.287034e-07   0.000000e+00 
  8.950000e+01   1.484798e-07   0.000000e+00   1.484798e-07   0.000000e+00 
  8.975000e+01   1.429556e-07   0.000000e+00   1.429556e-07   0.000000e+00 
  9.000000e+01   1.527668e-07   0.000000e+00   1.527668e-07   0.000000e+00 
  9.025000e+01   1.593771e-07   0.000000e+00   1.593771e-07   0.000000e+00 
  9.050000e+01   1.831156e-07   0.000000e+00   1.831156e-07   0.000000e+00 
  9.075000e+01   1.525827e-07   0.000000e+00   1.525827e-07   0.000000e+00 
  9.100000e+01   1.339750e-07   0.000000e+00   1.339750e-07   0.000000e+00 
  9.125000e+01   1.819468e-07   0.000000e+00   1.819468e-07   0.000000e+00 
  9.150000e+01   1.789004e-07   0.000000e+00   1.789004e-07   0.000000e+00 
  9.175000e+01   1.560391e-07   0.000000e+00   1.560391e-07   0.000000e+00 
  9.200000e+01   1.459146e-07   0.000000e+00   1.459146e-07   0.000000e+00 
  9.225000e+01   1.521842e-07   0.000000e+00   1.521842e-07   0.000000e+00 
  9.250000e+01   1.746990e-07   0.000000e+00   1.746990e-07   0.000000e+00 
  9.275000e+01   1.654794e-07   0.000000e+00   1.654794e-07   0.000000e+00 
  9.300000e+01   1.786397e-07   0.000000e+00   1.786397e-07   0.000000e+00 
  9.325000e+01   1.886841e-07   0.000000e+00   1.886841e-07   0.000000e+00 
  9.350000e+01   1.750122e-07   0.000000e+00   1.750122e-07   0.000000e+00 
  9.375000e+01   1.577578e-07   0.000000e+00   1.577578e-07   0.000000e+00 
  9.400000e+01   1.882398e-07   0.000000e+00   1.882398e-07   0.000000e+00 
  9.425000e+01   1.747082e-07   0.000000e+00   1.747082e-07   0.000000e+00 
  9.450000e+01   1.495568e-07   0.000000e+00   1.495568e-07   0.000000e+00 
  9.475000e+01   1.513121e-07   0.000000e+00   1.513121e-07   0.000000e+00 
  9.500000e+01   1.790041e-07   0.000000e+00   1.790041e-07   0.000000e+00 
  9.525000e+01   1.946940e-07   0.000000e+00   1.946940e-07   0.000000e+00 
  9.550000e+01   1.827230e-07   0.000000e+00   1.827230e-07   0.000000e+00 
  9.575000e+01   1.711458e-07   0.000000e+00   1.711458e-07   0.000000e+00 
  9.600000e+01   1.533844e-07   0.000000e+00   1.533844e-07   0.000000e+00 
  9.625000e+01   1.660737e-07   0.000000e+00   1.660737e-07   0.000000e+00 
  9.650000e+01   1.494688e-07   0.000000e+00   1.494688e-07   0.000000e+00 
  9.675000e+01   1.793281e-07   0.000000e+00   1.793281e-07   0.000000e+00 
  9.700000e+01   1.986441e-07   0.000000e+00   1.986441e-07   0.000000e+00 
  9.725000e+01   1.865894e-07   0.000000e+00   1.865894e-07   0.000000e+00 
  9.750000e+01   1.300538e-07   0.000000e+00   1.300538e-07   0.000000e+00 
  9.775000e+01   1.394917e-07   0.000000e+00   1.394917e-07   0.000000e+00 
  9.800000e+01   1.513398e-07   0.000000e+00   1.513398e-07   0.000000e+00 
  9.825000e+01   1.764849e-07   0.000000e+00   1.764849e-07   0.000000e+00 
  9.850000e+01   1.604884e-07   0.000000e+00   1.604884e-07   0.000000e+00 
  9.875000e+01   1.363681e-07   0.000000e+00   1.363681e-07   0.000000e+00 
  9.900000e+01   1.582399e-07   0.000000e+00   1.582399e-07   0.000000e+00 
  9.925000e+01   1.254595e-07   0.000000e+00   1.254595e-07   0.000000e+00 
  9.950000e+01   1.236436e-07   0.000000e+00   1.236436e-07   0.000000e+00 
  9.975000e+01   1.735992e-07   0.000000e+00   1.735992e-07   0.000000e+00 
  1.000000e+02   1.851199e-07   0.000000e+00   1.851199e-07   0.000000e+00 
  1.002500e+02   1.996662e-07   0.000000e+00   1.996662e-07   0.000000e+00 
  1.005000e+02   1.935313e-07   0.000000e+00   1.935313e-07   0.000000e+00 
  1.007500e+02   1.584416e-07   0.000000e+00   1.584416e-07   0.000000e+00 
  1.010000e+02   1.775413e-07   0.000000e+00   1.775413e-07   0.000000e+00 
  1.012500e+02   1.831593e-07   0.000000e+00   1.831593e-07   0.000000e+00 
  1.015000e+02   1.731013e-07   0.000000e+00   1.731013e-07   0.000000e+00 
  1.017500e+02   1.347434e-07   0.000000e+00   1.347434e-07   0.000000e+00 
  1.020000e+02   1.513965e-07   0.000000e+00   1.513965e-07   0.000000e+00 
  1.022500e+02   1.589578e-07   0.000000e+00   1.589578e-07   0.000000e+00 
  1.025000e+02   1.762335e-07   0.000000e+00   1.762335e-07   0.000000e+00 
  1.027500e+02   1.536661e-07   0.000000e+00   1.536661e-07   0.000000e+00 
  1.030000e+02   1.566087e-07   0.000000e+00   1.566087e-07   0.000000e+00 
  1.032500e+02   1.983728e-07   0.000000e+00   1.983728e-07   0.000000e+00 
  1.035000e+02   1.839238e-07   0.000000e+00   1.839238e-07   0.000000e+00 
  1.037500e+02   1.833467e-07   0.000000e+00   1.833467e-07   0.000000e+00 
  1.040000e+02   1.805909e-07   0.000000e+00   1.805909e-07   0.000000e+00 
  1.042500e+02   1.487838e-07   0.000000e+00   1.487838e-07   0.000000e+00 
  1.045000e+02   1.707818e-07   0.000000e+00   1.707818e-07   0.000000e+00 
  1.047500e+02   1.622825e-07   0.000000e+00   1.622825e-07   0.000000e+00 
  1.050000e+02   1.693481e-07   0.000000e+00   1.693481e-07   0.000000e+00 
  1.052500e+02   1.651028e-07   0.000000e+00   1.651028e-07   0.000000e+00 
  1.055000e+02   1.509708e-07   0.000000e+00   1.509708e-07   0.000000e+00 
  1.057500e+02   1.519762e-07   0.000000e+00   1.519762e-07   0.000000e+00 
  1.060000e+02   1.716492e-07   0.000000e+00   1.716492e-07   0.000000e+00 
  1.062500e+02   1.767056e-07   0.000000e+00   1.767056e-07   0.000000e+00 
  1.065000e+02   1.362575e-07   0.000000e+00   1.362575e-07   0.000000e+00 
  1.067500e+02   1.466015e-07   0.000000e+00   1.466015e-07   0.000000e+00 
  1.070000e+02   1.971760e-07   0.000000e+00   1.971760e-07   0.000000e+00 
  1.072500e+02   2.175198e-07   0.000000e+00   2.175198e-07   0.000000e+00 
  1.075000e+02   1.930812e-07   0.000000e+00   1.930812e-07   0.000000e+00 
  1.077500e+02   1.502540e-07   0.000000e+00   1.502540e-07   0.000000e+00 
  1.080000e+02   1.672769e-07   0.000000e+00   1.672769e-07   0.000000e+00 
  1.082500e+02   1.754374e-07   0.000000e+00   1.754374e-07   0.000000e+00 
  1.085000e+02   1.761600e-07   0.000000e+00   1.761600e-07   0.000000e+00 
  1.087500e+02   1.653915e-07   0.000000e+00   1.653915e-07   0.000000e+00 
  1.090000e+02   1.523983e-07   0.000000e+00   1.523983e-07   0.000000e+00 
  1.092500e+02   1.495576e-07   0.000000e+00   1.495576e-07   0.000000e+00 
  1.095000e+02   1.394213e-07   0.000000e+00   1.394213e-07   0.000000e+00 
  1.097500e+02   1.800179e-07   0.000000e+00   1.800179e-07   0.000000e+00 
  1.100000e+02   1.661258e-07   0.000000e+00   1.661258e-07   0.000000e+00 
  1.102500e+02   1.146357e-07   0.000000e+00   1.146357e-07   0.000000e+00 
  1.105000e+02   1.444245e-07   0.000000e+00   1.444245e-07   0.000000e+00 
  1.107500e+02   1.577355e-07   0.000000e+00   1.577355e-07   0.000000e+00 
  1.110000e+02   1.476146e-07   0.000000e+00   1.476146e-07   0.000000e+00 
  1.112500e+02   1.428593e-07   0.000000e+00   1.428593e-07   0.000000e+00 
  1.115000e+02   1.622326e-07   0.000000e+00   1.622326e-07   0.000000e+00 
  1.117500e+02   2.190107e-07   0.000000e+00   2.190107e-07   0.000000e+00 
  1.120000e+02   2.335259e-07   0.000000e+00   2.335259e-07   0.000000e+00 
  1.122500e+02   2.044644e-07   0.000000e+00   2.044644e-07   0.000000e+00 
  1.125000e+02   1.552064e-07   0.000000e+00   1.552064e-07   0.000000e+00 
  1.127500e+02   1.852926e-07   0.000000e+00   1.852926e-07   0.000000e+00 
  1.130000e+02   1.589921e-07   0.000000e+00   1.589921e-07   0.000000e+00 
  1.132500e+02   1.656067e-07   0.000000e+00   1.656067e-07   0.000000e+00 
  1.135000e+02   1.705916e-07   0.000000e+00   1.705916e-07   0.000000e+00 
  1.137500e+02   1.532446e-07   0.000000e+00   1.532446e-07   0.000000e+00 
  1.140000e+02   1.712807e-07   0.000000e+00   1.712807e-07   0.000000e+00 
  1.142500e+02   1.607719e-07   0.000000e+00   1.607719e-07   0.000000e+00 
  1.145000e+02   1.666370e-07   0.000000e+00   1.666370e-07   0.000000e+00 
  1.147500e+02   1.663053e-07   0.000000e+00   1.663053e-07   0.000000e+00 
  1.150000e+02   1.427846e-07   0.000000e+00   1.427846e-07   0.000000e+00 
  1.152500e+02   1.299989e-07   0.000000e+00   1.299989e-07   0.000000e+00 
  1.155000e+02   1.381391e-07   0.000000e+00   1.381391e-07   0.000000e+00 
  1.157500e+02   1.660850e-07   0.000000e+00   1.660850e-07   0.000000e+00 
  1.160000e+02   1.819127e-07   0.000000e+00   1.819127e-07   0.000000e+00 
  1.162500e+02   1.496057e-07   0.000000e+00   1.496057e-07   0.000000e+00 
  1.165000e+02   1.620356e-07   0.000000e+00   1.620356e-07   0.000000e+00 
  1.167500e+02   1.761774e-07   0.000000e+00   1.761774e-07   0.000000e+00 
  1.170000e+02   1.802669e-07   0.000000e+00   1.802669e-07   0.000000e+00 
  1.172500e+02   1.568331e-07   0.000000e+00   1.568331e-07   0.000000e+00 
  1.175000e+02   1.868810e-07   0.000000e+00   1.868810e-07   0.000000e+00 
  1.177500e+02   1.881795e-07   0.000000e+00   1.881795e-07   0.000000e+00 
  1.180000e+02   1.736687e-07   0.000000e+00   1.736687e-07   0.000000e+00 
  1.182500e+02   1.576440e-07   0.000000e+00   1.576440e-07   0.000000e+00 
  1.185000e+02   1.417784e-07   0.000000e+00   1.417784e-07   0.000000e+00 
  1.187500e+02   1.702129e-07   0.000000e+00   1.702129e-07   0.000000e+00 
  1.190000e+02   1.763822e-07   0.000000e+00   1.763822e-07   0.000000e+00 
  1.192500e+02   1.913723e-07   0.000000e+00   1.913723e-07   0.000000e+00 
  1.195000e+02   1.993531e-07   0.000000e+00   1.993531e-07   0.000000e+00 
  1.197500e+02   1.853707e-07   0.000000e+00   1.853707e-07   0.000000e+00 
  1.200000e+02   2.298892e-07   0.000000e+00   2.298892e-07   0.000000e+00 
  1.202500e+02   1.861186e-07   0.000000e+00   1.861186e-07   0.000000e+00 
  1.205000e+02   1.921147e-07   0.000000e+00   1.921147e-07   0.000000e+00 
  1.207500e+02   1.775588e-07   0.000000e+00   1.775588e-07   0.000000e+00 
  1.210000e+02   1.374323e-07   0.000000e+00   1.374323e-07   0.000000e+00 
  1.212500e+02   1.807200e-07   0.000000e+00   1.807200e-07   0.000000e+00 
  1.215000e+02   1.743154e-07   0.000000e+00   1.743154e-07   0.000000e+00 
  1.217500e+02   1.699433e-07   0.000000e+00   1.699433e-07   0.000000e+00 
  1.220000e+02   1.762395e-07   0.000000e+00   1.762395e-07   0.000000e+00 
  1.222500e+02   1.616520e-07   0.000000e+00   1.616520e-07   0.000000e+00 
  1.225000e+02   1.795470e-07   0.000000e+00   1.795470e-07   0.000000e+00 
  1.227500e+02   1.868903e-07   0.000000e+00   1.868903e-07   0.000000e+00 
  1.230000e+02   1.747761e-07   0.000000e+00   1.747761e-07   0.000000e+00 
  1.232500e+02   1.771513e-07   0.000000e+00   1.771513e-07   0.000000e+00 
  1.235000e+02   1.755894e-07   0.000000e+00   1.755894e-07   0.000000e+00 
  1.237500e+02   1.503301e-07   0.000000e+00   1.503301e-07   0.000000e+00 
  1.240000e+02   1.717997e-07   0.000000e+00   1.717997e-07   0.000000e+00 
  1.242500e+02   1.928155e-07   0.000000e+00   1.928155e-07   0.000000e+00 
  1.245000e+02   1.846880e-07   0.000000e+00   1.846880e-07   0.000000e+00 
  1.247500e+02   2.089177e-07   0.000000e+00   2.089177e-07   0.000000e+00 
  1.250000e+02   1.981631e-07   0.000000e+00   1.981631e-07   0.000000e+00 
  1.252500e+02   1.850789e-07   0.000000e+00   1.850789e-07   0.000000e+00 
  1.255000e+02   1.690312e-07   0.000000e+00   1.690312e-07   0.000000e+00 
  1.257500e+02   1.700123e-07   0.000000e+00   1.700123e-07   0.000000e+00 
  1.260000e+02   1.814460e-07   0.000000e+00   1.814460e-07   0.000000e+00 
  1.262500e+02   1.376916e-07   0.000000e+00   1.376916e-07   0.000000e+00 
  1.265000e+02   1.591838e-07   0.000000e+00   1.591838e-07   0.000000e+00 
  1.267500e+02   1.880816e-07   0.000000e+00   1.880816e-07   0.000000e+00 
  1.270000e+02   1.961844e-07   0.000000e+00   1.961844e-07   0.000000e+00 
  1.272500e+02   2.182888e-07   0.000000e+00   2.182888e-07   0.000000e+00 
  1.275000e+02   1.963316e-07   0.000000e+00   1.963316e-07   0.000000e+00 
  1.277500e+02   1.653806e-07   0.000000e+00   1.653806e-07   0.000000e+00 
  1.280000e+02   1.335443e-07   0.000000e+00   1.335443e-07   0.000000e+00 
  1.282500e+02   1.437967e-07   0.000000e+00   1.437967e-07   0.000000e+00 
  1.285000e+02   1.765400e-07   0.000000e+00   1.765400e-07   0.000000e+00 
  1.287500e+02   1.746019e-07   0.000000e+00   1.746019e-07   0.000000e+00 
  1.290000e+02   1.376388e-07   0.000000e+00   1.376388e-07   0.000000e+00 
  1.292500e+02   1.581109e-07   0.000000e+00   1.581109e-07   0.000000e+00 
  1.295000e+02   1.378178e-07   0.000000e+00   1.378178e-07   0.000000e+00 
  1.297500e+02   1.568664e-07   0.000000e+00   1.568664e-07   0.000000e+00 
  1.300000e+02   1.738867e-07   0.000000e+00   1.738867e-07   0.000000e+00 
  1.302500e+02   1.569892e-07   0.000000e+00   1.569892e-07   0.000000e+00 
  1.305000e+02   1.315806e-07   0.000000e+00   1.315806e-07   0.000000e+00 
  1.307500e+02   1.488729e-07   0.000000e+00   1.488729e-07   0.000000e+00 
  1.310000e+02   1.501928e-07   0.000000e+00   1.501928e-07   0.000000e+00 
  1.312500e+02   1.709005e-07   0.000000e+00   1.709005e-07   0.000000e+00 
  1.315000e+02   1.759570e-07   0.000000e+00   1.759570e-07   0.000000e+00 
  1.317500e+02   1.680396e-07   0.000000e+00   1.680396e-07   0.000000e+00 
  1.320000e+02   1.527536e-07   0.000000e+00   1.527536e-07   0.000000e+00 
  1.322500e+02   1.935663e-07   0.000000e+00   1.935663e-07   0.000000e+00 
  1.325000e+02   1.911135e-07   0.000000e+00   1.911135e-07   0.000000e+00 
  1.327500e+02   1.737707e-07   0.000000e+00   1.737707e-07   0.000000e+00 
  1.330000e+02   1.490372e-07   0.000000e+00   1.490372e-07   0.000000e+00 
  1.332500e+02   1.785798e-07   0.000000e+00   1.785798e-07   0.000000e+00 
  1.335000e+02   1.930446e-07   0.000000e+00   1.930446e-07   0.000000e+00 
  1.337500e+02   1.600954e-07   0.000000e+00   1.600954e-07   0.000000e+00 
  1.340000e+02   1.627747e-07   0.000000e+00   1.627747e-07   0.000000e+00 
  1.342500e+02   1.683874e-07   0.000000e+00   1.683874e-07   0.000000e+00 
  1.345000e+02   1.999249e-07   0.000000e+00   1.999249e-07   0.000000e+00 
  1.347500e+02   2.489899e-07   0.000000e+00   2.489899e-07   0.000000e+00 
  1.350000e+02   2.315125e-07   0.000000e+00   2.315125e-07   0.000000e+00 
  1.352500e+02   1.786627e-07   0.000000e+00   1.786627e-07   0.000000e+00 
  1.355000e+02   1.356790e-07   0.000000e+00   1.356790e-07   0.000000e+00 
  1.357500e+02   1.606070e-07   0.000000e+00   1.606070e-07   0.000000e+00 
  1.360000e+02   2.100164e-07   0.000000e+00   2.100164e-07   0.000000e+00 
  1.362500e+02   1.953179e-07   0.000000e+00   1.953179e-07   0.000000e+00 
  1.365000e+02   2.081288e-07   0.000000e+00   2.081288e-07   0.000000e+00 
  1.367500e+02   1.545644e-07   0.000000e+00   1.545644e-07   0.000000e+00 
  1.370000e+02   1.412464e-07   0.000000e+00   1.412464e-07   0.000000e+00 
  1.372500e+02   1.528322e-07   0.000000e+00   1.528322e-07   0.000000e+00 
  1.375000e+02   1.930252e-07   0.000000e+00   1.930252e-07   0.000000e+00 
  1.377500e+02   1.710425e-07   0.000000e+00   1.710425e-07   0.000000e+00 
  1.380000e+02   1.862621e-07   0.000000e+00   1.862621e-07   0.000000e+00 
  1.382500e+02   1.781267e-07   0.000000e+00   1.781267e-07   0.000000e+00 
  1.385000e+02   1.557126e-07   0.000000e+00   1.557126e-07   0.000000e+00 
  1.387500e+02   1.600000e-07   0.000000e+00   1.600000e-07   0.000000e+00 
  1.390000e+02   1.923856e-07   0.000000e+00   1.923856e-07   0.000000e+00 
  1.392500e+02   1.682015e-07   0.000000e+00   1.682015e-07   0.000000e+00 
  1.395000e+02   1.575414e-07   0.000000e+00   1.575414e-07   0.000000e+00 
  1.397500e+02   1.791660e-07   0.000000e+00   1.791660e-07   0.000000e+00 
  1.400000e+02   1.935515e-07   0.000000e+00   1.935515e-07   0.000000e+00 
  1.402500e+02   1.946322e-07   0.000000e+00   1.946322e-07   0.000000e+00 
  1.405000e+02   2.226477e-07   0.000000e+00   2.226477e-07   0.000000e+00 
  1.407500e+02   2.164008e-07   0.000000e+00   2.164008e-07   0.000000e+00 
  1.410000e+02   1.513480e-07   0.000000e+00   1.513480e-07   0.000000e+00 
  1.412500e+02   1.753368e-07   0.000000e+00   1.753368e-07   0.000000e+00 
  1.415000e+02   1.893620e-07   0.000000e+00   1.893620e-07   0.000000e+00 
  1.417500e+02   1.654878e-07   0.000000e+00   1.654878e-07   0.000000e+00 
  1.420000e+02   1.876012e-07   0.000000e+00   1.876012e-07   0.000000e+00 
  1.422500e+02   2.248654e-07   0.000000e+00   2.248654e-07   0.000000e+00 
  1.425000e+02   2.047726e-07   0.000000e+00   2.047726e-07   0.000000e+00 
  1.427500e+02   1.680526e-07   0.000000e+00   1.680526e-07   0.000000e+00 
  1.430000e+02   1.552106e-07   0.000000e+00   1.552106e-07   0.000000e+00 
  1.432500e+02   1.286525e-07   0.000000e+00   1.286525e-07   0.000000e+00 
  1.435000e+02   1.707796e-07   0.000000e+00   1.707796e-07   0.000000e+00 
  1.437500e+02   1.629568e-07   0.000000e+00   1.629568e-07   0.000000e+00 
  1.440000e+02   1.681800e-07   0.000000e+00   1.681800e-07   0.000000e+00 
  1.442500e+02   1.714831e-07   0.000000e+00   1.714831e-07   0.000000e+00 
  1.445000e+02   1.563999e-07   0.000000e+00   1.563999e-07   0.000000e+00 
  1.447500e+02   1.298721e-07   0.000000e+00   1.298721e-07   0.000000e+00 
  1.450000e+02   1.638636e-07   0.000000e+00   1.638636e-07   0.000000e+00 
  1.452500e+02   1.818478e-07   0.000000e+00   1.818478e-07   0.000000e+00 
  1.455000e+02   1.441484e-07   0.000000e+00   1.441484e-07   0.000000e+00 
  1.457500e+02   1.958976e-07   0.000000e+00   1.958976e-07   0.000000e+00 
  1.460000e+02   2.353788e-07   0.000000e+00   2.353788e-07   0.000000e+00 
  1.462500e+02   2.077310e-07   0.000000e+00   2.077310e-07   0.000000e+00 
  1.465000e+02   1.618789e-07   0.000000e+00   1.618789e-07   0.000000e+00 
  1.467500e+02   1.321485e-07   0.000000e+00   1.321485e-07   0.000000e+00 
  1.470000e+02   1.849761e-07   0.000000e+00   1.849761e-07   0.000000e+00 
  1.472500e+02   1.894854e-07   0.000000e+00   1.894854e-07   0.000000e+00 
  1.475000e+02   1.652547e-07   0.000000e+00   1.652547e-07   0.000000e+00 
  1.477500e+02   1.681587e-07   0.000000e+00   1.681587e-07   0.000000e+00 
  1.480000e+02   1.397590e-07   0.000000e+00   1.397590e-07   0.000000e+00 
  1.482500e+02   1.678185e-07   0.000000e+00   1.678185e-07   0.000000e+00 
  1.485000e+02   1.892887e-07   0.000000e+00   1.892887e-07   0.000000e+00 
  1.487500e+02   1.909813e-07   0.000000e+00   1.909813e-07   0.000000e+00 
  1.490000e+02   1.413882e-07   0.000000e+00   1.413882e-07   0.000000e+00 
  1.492500e+02   1.491717e-07   0.000000e+00   1.491717e-07   0.000000e+00 
  1.495000e+02   1.504689e-07   0.000000e+00   1.504689e-07   0.000000e+00 
  1.497500e+02   1.884329e-07   0.000000e+00   1.884329e-07   0.000000e+00 
  1.500000e+02   1.585566e-07   0.000000e+00   1.585566e-07   0.000000e+00 
  1.502500e+02   1.506565e-07   0.000000e+00   1.506565e-07   0.000000e+00 
  1.505000e+02   1.584098e-07   0.000000e+00   1.584098e-07   0.000000e+00 
  1.507500e+02   1.805703e-07   0.000000e+00   1.805703e-07   0.000000e+00 
  1.510000e+02   1.776036e-07   0.000000e+00   1.776036e-07   0.000000e+00 
  1.512500e+02   1.447292e-07   0.000000e+00   1.447292e-07   0.000000e+00 
  1.515000e+02   1.529902e-07   0.000000e+00   1.529902e-07   0.000000e+00 
  1.517500e+02   1.715109e-07   0.000000e+00   1.715109e-07   0.000000e+00 
  1.520000e+02   1.786231e-07   0.000000e+00   1.786231e-07   0.000000e+00 
  1.522500e+02   1.439261e-07   0.000000e+00   1.439261e-07   0.000000e+00 
  1.525000e+02   1.722885e-07   0.000000e+00   1.722885e-07   0.000000e+00 
  1.527500e+02   1.897418e-07   0.000000e+00   1.897418e-07   0.000000e+00 
  1.530000e+02   1.645408e-07   0.000000e+00   1.645408e-07   0.000000e+00 
  1.532500e+02   1.793690e-07   0.000000e+00   1.793690e-07   0.000000e+00 
  1.535000e+02   1.935773e-07   0.000000e+00   1.935773e-07   0.000000e+00 
  1.537500e+02   1.990327e-07   0.000000e+00   1.990327e-07   0.000000e+00 
  1.540000e+02   1.689924e-07   0.000000e+00   1.689924e-07   0.000000e+00 
  1.542500e+02   2.088732e-07   0.000000e+00   2.088732e-07   0.000000e+00 
  1.545000e+02   1.663598e-07   0.000000e+00   1.663598e-07   0.000000e+00 
  1.547500e+02   1.429269e-07   0.000000e+00   1.429269e-07   0.000000e+00 
  1.550000e+02   1.665417e-07   0.000000e+00   1.665417e-07   0.000000e+00 
  1.552500e+02   1.823833e-07   0.000000e+00   1.823833e-07   0.000000e+00 
  1.555000e+02   1.857638e-07   0.000000e+00   1.857638e-07   0.000000e+00 
  1.557500e+02   1.895227e-07   0.000000e+00   1.895227e-07   0.000000e+00 
  1.560000e+02   1.698077e-07   0.000000e+00   1.698077e-07   0.000000e+00 
  1.562500e+02   1.977475e-07   0.000000e+00   1.977475e-07   0.000000e+00 
  1.565000e+02   2.152460e-07   0.000000e+00   2.152460e-07   0.000000e+00 
  1.567500e+02   1.631003e-07   0.000000e+00   1.631003e-07   0.000000e+00 
  1.570000e+02   1.589661e-07   0.000000e+00   1.589661e-07   0.000000e+00 
  1.572500e+02   1.927239e-07   0.000000e+00   1.927239e-07   0.000000e+00 
  1.575000e+02   2.010951e-07   0.000000e+00   2.010951e-07   0.000000e+00 
  1.577500e+02   2.748372e-07   0.000000e+00   2.748372e-07   0.000000e+00 
  1.580000e+02   2.440927e-07   0.000000e+00   2.440927e-07   0.000000e+00 
  1.582500e+02   2.462191e-07   0.000000e+00   2.462191e-07   0.000000e+00 
  1.585000e+02   1.922480e-07   0.000000e+00   1.922480e-07   0.000000e+00 
  1.587500e+02   1.765222e-07   0.000000e+00   1.765222e-07   0.000000e+00 
  1.590000e+02   2.249816e-07   0.000000e+00   2.249816e-07   0.000000e+00 
  1.592500e+02   2.023484e-07   0.000000e+00   2.023484e-07   0.000000e+00 
  1.595000e+02   2.088405e-07   0.000000e+00   2.088405e-07   0.000000e+00 
  1.597500e+02   1.695218e-07   0.000000e+00   1.695218e-07   0.000000e+00 
  1.600000e+02   1.680693e-07   0.000000e+00   1.680693e-07   0.000000e+00 
  1.602500e+02   1.511144e-07   0.000000e+00   1.511144e-07   0.000000e+00 
  1.605000e+02   1.812888e-07   0.000000e+00   1.812888e-07   0.000000e+00 
  1.607500e+02   2.082827e-07   0.000000e+00   2.082827e-07   0.000000e+00 
  1.610000e+02   1.942842e-07   0.000000e+00   1.942842e-07   0.000000e+00 
  1.612500e+02   1.719098e-07   0.000000e+00   1.719098e-07   0.000000e+00 
  1.615000e+02   1.717296e-07   0.000000e+00   1.717296e-07   0.000000e+00 
  1.617500e+02   1.974362e-07   0.000000e+00   1.974362e-07   0.000000e+00 
  1.620000e+02   2.135524e-07   0.000000e+00   2.135524e-07   0.000000e+00 
  1.622500e+02   2.005613e-07   0.000000e+00   2.005613e-07   0.000000e+00 
  1.625000e+02   1.711316e-07   0.000000e+00   1.711316e-07   0.000000e+00 
  1.627500e+02   1.533422e-07   0.000000e+00   1.533422e-07   0.000000e+00 
  1.630000e+02   2.482209e-07   0.000000e+00   2.482209e-07   0.000000e+00 
  1.632500e+02   2.372821e-07   0.000000e+00   2.372821e-07   0.000000e+00 
  1.635000e+02   2.165061e-07   0.000000e+00   2.165061e-07   0.000000e+00 
  1.637500e+02   2.213356e-07   0.000000e+00   2.213356e-07   0.000000e+00 
  1.640000e+02   1.873878e-07   0.000000e+00   1.873878e-07   0.000000e+00 
  1.642500e+02   2.047669e-07   0.000000e+00   2.047669e-07   0.000000e+00 
  1.645000e+02   2.165676e-07   0.000000e+00   2.165676e-07   0.000000e+00 
  1.647500e+02   1.733229e-07   0.000000e+00   1.733229e-07   0.000000e+00 
  1.650000e+02   1.649748e-07   0.000000e+00   1.649748e-07   0.000000e+00 
  1.652500e+02   1.596790e-07   0.000000e+00   1.596790e-07   0.000000e+00 
  1.655000e+02   1.609538e-07   0.000000e+00   1.609538e-07   0.000000e+00 
  1.657500e+02   1.823872e-07   0.000000e+00   1.823872e-07   0.000000e+00 
  1.660000e+02   1.662505e-07   0.000000e+00   1.662505e-07   0.000000e+00 
  1.662500e+02   1.883354e-07   0.000000e+00   1.883354e-07   0.000000e+00 
  1.665000e+02   1.845538e-07   0.000000e+00   1.845538e-07   0.000000e+00 
  1.667500e+02   1.945331e-07   0.000000e+00   1.945331e-07   0.000000e+00 
  1.670000e+02   1.931928e-07   0.000000e+00   1.931928e-07   0.000000e+00 
  1.672500e+02   1.648390e-07   0.000000e+00   1.648390e-07   0.000000e+00 
  1.675000e+02   1.744746e-07   0.000000e+00   1.744746e-07   0.000000e+00 
  1.677500e+02   1.774721e-07   0.000000e+00   1.774721e-07   0.000000e+00 
  1.680000e+02   1.905887e-07   0.000000e+00   1.905887e-07   0.000000e+00 
  1.682500e+02   1.581121e-07   0.000000e+00   1.581121e-07   0.000000e+00 
  1.685000e+02   2.064440e-07   0.000000e+00   2.064440e-07   0.000000e+00 
  1.687500e+02   2.037764e-07   0.000000e+00   2.037764e-07   0.000000e+00 
  1.690000e+02   1.774544e-07   0.000000e+00   1.774544e-07   0.000000e+00 
  1.692500e+02   1.755019e-07   0.000000e+00   1.755019e-07   0.000000e+00 
  1.695000e+02   2.091100e-07   0.000000e+00   2.091100e-07   0.000000e+00 
  1.697500e+02   2.808612e-07   0.000000e+00   2.808612e-07   0.000000e+00 
  1.700000e+02   2.834999e-07   0.000000e+00   2.834999e-07   0.000000e+00 
  1.702500e+02   2.293026e-07   0.000000e+00   2.293026e-07   0.000000e+00 
  1.705000e+02   1.585293e-07   0.000000e+00   1.585293e-07   0.000000e+00 
  1.707500e+02   1.811114e-07   0.000000e+00   1.811114e-07   0.000000e+00 
  1.710000e+02   1.857327e-07   0.000000e+00   1.857327e-07   0.000000e+00 
  1.712500e+02   2.064610e-07   0.000000e+00   2.064610e-07   0.000000e+00 
  1.715000e+02   1.949668e-07   0.000000e+00   1.949668e-07   0.000000e+00 
  1.717500e+02   2.033975e-07   0.000000e+00   2.033975e-07   0.000000e+00 
  1.720000e+02   2.310547e-07   0.000000e+00   2.310547e-07   0.000000e+00 
  1.722500e+02   2.312358e-07   0.000000e+00   2.312358e-07   0.000000e+00 
  1.725000e+02   2.363118e-07   0.000000e+00   2.363118e-07   0.000000e+00 
  1.727500e+02   2.613296e-07   0.000000e+00   2.613296e-07   0.000000e+00 
  1.730000e+02   2.241620e-07   0.000000e+00   2.241620e-07   0.000000e+00 
  1.732500e+02   2.492720e-07   0.000000e+00   2.492720e-07   0.000000e+00 
  1.735000e+02   2.823470e-07   0.000000e+00   2.823470e-07   0.000000e+00 
  1.737500e+02   2.102375e-07   0.000000e+00   2.102375e-07   0.000000e+00 
  1.740000e+02   2.481033e-07   0.000000e+00   2.481033e-07   0.000000e+00 
  1.742500e+02   2.191722e-07   0.000000e+00   2.191722e-07   0.000000e+00 
  1.745000e+02   1.977659e-07   0.000000e+00   1.977659e-07   0.000000e+00 
  1.747500e+02   2.303317e-07   0.000000e+00   2.303317e-07   0.000000e+00 
  1.750000e+02   1.910802e-07   0.000000e+00   1.910802e-07   0.000000e+00 
  1.752500e+02   2.276393e-07   0.000000e+00   2.276393e-07   0.000000e+00 
  1.755000e+02   2.758502e-07   0.000000e+00   2.758502e-07   0.000000e+00 
  1.757500e+02   2.348742e-07   0.000000e+00   2.348742e-07   0.000000e+00 
  1.760000e+02   2.455595e-07   0.000000e+00   2.455595e-07   0.000000e+00 
  1.762500e+02   2.373069e-07   0.000000e+00   2.373069e-07   0.000000e+00 
  1.765000e+02   2.085142e-07   0.000000e+00   2.085142e-07   0.000000e+00 
  1.767500e+02   2.040369e-07   0.000000e+00   2.040369e-07   0.000000e+00 
  1.770000e+02   2.245537e-07   0.000000e+00   2.245537e-07   0.000000e+00 
  1.772500e+02   2.742865e-07   0.000000e+00   2.742865e-07   0.000000e+00 
  1.775000e+02   3.239406e-07   0.000000e+00   3.239406e-07   0.000000e+00 
  1.777500e+02   4.877361e-07   0.000000e+00   4.877361e-07   0.000000e+00 
  1.780000e+02   4.342198e-07   0.000000e+00   4.342198e-07   0.000000e+00 
  1.782500e+02   4.193387e-07   0.000000e+00   4.193387e-07   0.000000e+00 
  1.785000e+02   4.663503e-07   0.000000e+00   4.663503e-07   0.000000e+00 
  1.787500e+02   3.723174e-07   0.000000e+00   3.723174e-07   0.000000e+00 
  1.790000e+02   2.930929e-07   0.000000e+00   2.930929e-07   0.000000e+00 
  1.792500e+02   2.897449e-07   0.000000e+00   2.897449e-07   0.000000e+00 
  1.795000e+02   2.547237e-07   0.000000e+00   2.547237e-07   0.000000e+00 
  1.797500e+02   3.275956e-07   0.000000e+00   3.275956e-07   0.000000e+00 
  1.800000e+02   3.876623e-07   0.000000e+00   3.876623e-07   0.000000e+00 
  1.802500e+02   2.974644e-07   0.000000e+00   2.974644e-07   0.000000e+00 
  1.805000e+02   2.101510e-07   0.000000e+00   2.101510e-07   0.000000e+00 
  1.807500e+02   2.090145e-07   0.000000e+00   2.090145e-07   0.000000e+00 
  1.810000e+02   2.033748e-07   0.000000e+00   2.033748e-07   0.000000e+00 
  1.812500e+02   2.214757e-07   0.000000e+00   2.214757e-07   0.000000e+00 
  1.815000e+02   1.786999e-07   0.000000e+00   1.786999e-07   0.000000e+00 
  1.817500e+02   1.826752e-07   0.000000e+00   1.826752e-07   0.000000e+00 
  1.820000e+02   2.059758e-07   0.000000e+00   2.059758e-07   0.000000e+00 
  1.822500e+02   2.102789e-07   0.000000e+00   2.102789e-07   0.000000e+00 
  1.825000e+02   2.015308e-07   0.000000e+00   2.015308e-07   0.000000e+00 
  1.827500e+02   2.065020e-07   0.000000e+00   2.065020e-07   0.000000e+00 
  1.830000e+02   2.248908e-07   0.000000e+00   2.248908e-07   0.000000e+00 
  1.832500e+02   2.373948e-07   0.000000e+00   2.373948e-07   0.000000e+00 
  1.835000e+02   2.388762e-07   0.000000e+00   2.388762e-07   0.000000e+00 
  1.837500e+02   2.270384e-07   0.000000e+00   2.270384e-07   0.000000e+00 
  1.840000e+02   2.266260e-07   0.000000e+00   2.266260e-07   0.000000e+00 
  1.842500e+02   2.213294e-07   0.000000e+00   2.213294e-07   0.000000e+00 
  1.845000e+02   1.953066e-07   0.000000e+00   1.953066e-07   0.000000e+00 
  1.847500e+02   1.838666e-07   0.000000e+00   1.838666e-07   0.000000e+00 
  1.850000e+02   2.205059e-07   0.000000e+00   2.205059e-07   0.000000e+00 
  1.852500e+02   1.882234e-07   0.000000e+00   1.882234e-07   0.000000e+00 
  1.855000e+02   1.953250e-07   0.000000e+00   1.953250e-07   0.000000e+00 
  1.857500e+02   1.865990e-07   0.000000e+00   1.865990e-07   0.000000e+00 
  1.860000e+02   1.656283e-07   0.000000e+00   1.656283e-07   0.000000e+00 
  1.862500e+02   1.564392e-07   0.000000e+00   1.564392e-07   0.000000e+00 
  1.865000e+02   1.874217e-07   0.000000e+00   1.874217e-07   0.000000e+00 
  1.867500e+02   1.978934e-07   0.000000e+00   1.978934e-07   0.000000e+00 
  1.870000e+02   1.812371e-07   0.000000e+00   1.812371e-07   0.000000e+00 
  1.872500e+02   2.153900e-07   0.000000e+00   2.153900e-07   0.000000e+00 
  1.875000e+02   2.376059e-07   0.000000e+00   2.376059e-07   0.000000e+00 
  1.877500e+02   2.200212e-07   0.000000e+00   2.200212e-07   0.000000e+00 
  1.880000e+02   1.919289e-07   0.000000e+00   1.919289e-07   0.000000e+00 
  1.882500e+02   1.660342e-07   0.000000e+00   1.660342e-07   0.000000e+00 
  1.885000e+02   1.801570e-07   0.000000e+00   1.801570e-07   0.000000e+00 
  1.887500e+02   2.239898e-07   0.000000e+00   2.239898e-07   0.000000e+00 
  1.890000e+02   2.348349e-07   0.000000e+00   2.348349e-07   0.000000e+00 
  1.892500e+02   2.348576e-07   0.000000e+00   2.348576e-07   0.000000e+00 
  1.895000e+02   1.651998e-07   0.000000e+00   1.651998e-07   0.000000e+00 
  1.897500e+02   2.101765e-07   0.000000e+00   2.101765e-07   0.000000e+00 
  1.900000e+02   2.232055e-07   0.000000e+00   2.232055e-07   0.000000e+00 
  1.902500e+02   2.199753e-07   0.000000e+00   2.199753e-07   0.000000e+00 
  1.905000e+02   2.229887e-07   0.000000e+00   2.229887e-07   0.000000e+00 
  1.907500e+02   1.837005e-07   0.000000e+00   1.837005e-07   0.000000e+00 
  1.910000e+02   1.987504e-07   0.000000e+00   1.987504e-07   0.000000e+00 
  1.912500e+02   2.066966e-07   0.000000e+00   2.066966e-07   0.000000e+00 
  1.915000e+02   1.884748e-07   0.000000e+00   1.884748e-07   0.000000e+00 
  1.917500e+02   1.699647e-07   0.000000e+00   1.699647e-07   0.000000e+00 
  1.920000e+02   1.968566e-07   0.000000e+00   1.968566e-07   0.000000e+00 
  1.922500e+02   2.081119e-07   0.000000e+00   2.081119e-07   0.000000e+00 
  1.925000e+02   2.041266e-07   0.000000e+00   2.041266e-07   0.000000e+00 
  1.927500e+02   1.861240e-07   0.000000e+00   1.861240e-07   0.000000e+00 
  1.930000e+02   1.698896e-07   0.000000e+00   1.698896e-07   0.000000e+00 
  1.932500e+02   1.943036e-07   0.000000e+00   1.943036e-07   0.000000e+00 
  1.935000e+02   1.936288e-07   0.000000e+00   1.936288e-07   0.000000e+00 
  1.937500e+02   1.741571e-07   0.000000e+00   1.741571e-07   0.000000e+00 
  1.940000e+02   1.934956e-07   0.000000e+00   1.934956e-07   0.000000e+00 
  1.942500e+02   1.745580e-07   0.000000e+00   1.745580e-07   0.000000e+00 
  1.945000e+02   1.768732e-07   0.000000e+00   1.768732e-07   0.000000e+00 
  1.947500e+02   1.935299e-07   0.000000e+00   1.935299e-07   0.000000e+00 
  1.950000e+02   2.361841e-07   0.000000e+00   2.361841e-07   0.000000e+00 
  1.952500e+02   2.256840e-07   0.000000e+00   2.256840e-07   0.000000e+00 
  1.955000e+02   1.781306e-07   0.000000e+00   1.781306e-07   0.000000e+00 
  1.957500e+02   1.980795e-07   0.000000e+00   1.980795e-07   0.000000e+00 
  1.960000e+02   2.395629e-07   0.000000e+00   2.395629e-07   0.000000e+00 
  1.962500e+02   2.435654e-07   0.000000e+00   2.435654e-07   0.000000e+00 
  1.965000e+02   2.155974e-07   0.000000e+00   2.155974e-07   0.000000e+00 
  1.967500e+02   1.781055e-07   0.000000e+00   1.781055e-07   0.000000e+00 
  1.970000e+02   1.895380e-07   0.000000e+00   1.895380e-07   0.000000e+00 
  1.972500e+02   2.241559e-07   0.000000e+00   2.241559e-07   0.000000e+00 
  1.975000e+02   2.113511e-07   0.000000e+00   2.113511e-07   0.000000e+00 
  1.977500e+02   2.263597e-07   0.000000e+00   2.263597e-07   0.000000e+00 
  1.980000e+02   2.193119e-07   0.000000e+00   2.193119e-07   0.000000e+00 
  1.982500e+02   1.858015e-07   0.000000e+00   1.858015e-07   0.000000e+00 
  1.985000e+02   2.125371e-07   0.000000e+00   2.125371e-07   0.000000e+00 
  1.987500e+02   2.058041e-07   0.000000e+00   2.058041e-07   0.000000e+00 
  1.990000e+02   2.606813e-07   0.000000e+00   2.606813e-07   0.000000e+00 
  1.992500e+02   1.997528e-07   0.000000e+00   1.997528e-07   0.000000e+00 
  1.995000e+02   1.908421e-07   0.000000e+00   1.908421e-07   0.000000e+00 
  1.997500e+02   1.822190e-07   0.000000e+00   1.822190e-07   0.000000e+00 
  2.000000e+02   2.028907e-07   0.000000e+00   2.028907e-07   0.000000e+00 
