  1.000000e+01   1.982513e-02  -6.316970e-02  -2.358184e+01  -7.257609e+01 
  1.023403e+01   1.634463e-02  -6.042217e-02  -2.406937e+01  -7.486334e+01 
  1.047353e+01   1.915066e-02  -6.071644e-02  -2.392198e+01  -7.249413e+01 
  1.071864e+01   1.480533e-02  -5.754560e-02  -2.452140e+01  -7.557185e+01 
  1.096949e+01   1.799224e-02  -5.819262e-02  -2.430614e+01  -7.281922e+01 
  1.122621e+01   9.997233e-03  -6.205800e-02  -2.403278e+01  -8.084856e+01 
  1.148893e+01   1.192919e-02  -5.988788e-02  -2.428424e+01  -7.873458e+01 
  1.175781e+01   7.741320e-03  -6.186859e-02  -2.410313e+01  -8.286791e+01 
  1.203297e+01   6.289196e-03  -5.690259e-02  -2.484463e+01  -8.369294e+01 
  1.231458e+01   9.174314e-03  -5.681022e-02  -2.479966e+01  -8.082647e+01 
  1.260277e+01   6.081411e-03  -6.338895e-02  -2.391994e+01  -8.451993e+01 
  1.289772e+01   3.720642e-03  -6.298949e-02  -2.399951e+01  -8.661959e+01 
  1.319956e+01   1.695950e-03  -6.006680e-02  -2.442385e+01  -8.838271e+01 
  1.350847e+01   6.603937e-04  -6.036168e-02  -2.438425e+01  -8.937317e+01 
  1.382460e+01  -1.777516e-04  -6.089654e-02  -2.430811e+01  -9.016724e+01 
  1.414814e+01  -1.148270e-03  -6.085792e-02  -2.431211e+01  -9.108093e+01 
  1.447924e+01  -2.397149e-03  -5.961496e-02  -2.448588e+01  -9.230264e+01 
  1.481810e+01  -4.860011e-03  -5.579731e-02  -2.503491e+01  -9.497796e+01 
  1.516488e+01  -5.154063e-03  -5.721932e-02  -2.481405e+01  -9.514706e+01 
  1.551979e+01  -3.786793e-03  -5.992102e-02  -2.443110e+01  -9.361607e+01 
  1.588299e+01  -7.540962e-03  -5.966633e-02  -2.441659e+01  -9.720316e+01 
  1.625470e+01  -6.506767e-03  -5.819302e-02  -2.464862e+01  -9.637994e+01 
  1.663511e+01  -1.173069e-02  -5.815916e-02  -2.453445e+01  -1.014035e+02 
  1.702441e+01  -1.097956e-02  -5.720781e-02  -2.469380e+01  -1.008643e+02 
  1.742283e+01  -1.315927e-02  -5.496069e-02  -2.495686e+01  -1.034649e+02 
  1.783058e+01  -1.343413e-02  -5.431623e-02  -2.504354e+01  -1.038923e+02 
  1.824786e+01  -1.643730e-02  -5.638578e-02  -2.462239e+01  -1.062522e+02 
  1.867492e+01  -1.447537e-02  -5.612092e-02  -2.473778e+01  -1.044632e+02 
  1.911196e+01  -1.661523e-02  -5.553350e-02  -2.473656e+01  -1.066568e+02 
  1.955924e+01  -2.104336e-02  -5.514352e-02  -2.457968e+01  -1.108874e+02 
  2.001698e+01  -1.931681e-02  -5.967643e-02  -2.405120e+01  -1.079364e+02 
  2.048543e+01  -1.910045e-02  -5.529501e-02  -2.465674e+01  -1.090564e+02 
  2.096485e+01  -2.448610e-02  -5.454068e-02  -2.446815e+01  -1.141777e+02 
  2.145549e+01  -1.975771e-02  -5.837799e-02  -2.420404e+01  -1.086981e+02 
  2.195761e+01  -2.405864e-02  -5.528700e-02  -2.439439e+01  -1.135167e+02 
  2.247148e+01  -2.341979e-02  -5.265400e-02  -2.478740e+01  -1.139789e+02 
  2.299737e+01  -2.527050e-02  -5.590094e-02  -2.424407e+01  -1.143258e+02 
  2.353558e+01  -2.829489e-02  -4.849049e-02  -2.501424e+01  -1.202642e+02 
  2.408637e+01  -2.691883e-02  -5.268079e-02  -2.455946e+01  -1.170661e+02 
  2.465006e+01  -2.954361e-02  -4.700455e-02  -2.511132e+01  -1.221504e+02 
  2.522695e+01  -2.861992e-02  -5.181034e-02  -2.455509e+01  -1.189162e+02 
  2.581733e+01  -3.075522e-02  -5.226152e-02  -2.434489e+01  -1.204762e+02 
  2.642153e+01  -3.364524e-02  -5.125216e-02  -2.424952e+01  -1.232835e+02 
  2.703987e+01  -3.350355e-02  -4.896526e-02  -2.453447e+01  -1.243811e+02 
  2.767268e+01  -3.346199e-02  -5.031158e-02  -2.437593e+01  -1.236277e+02 
  2.832030e+01  -3.635061e-02  -4.729268e-02  -2.448798e+01  -1.275470e+02 
  2.898307e+01  -3.731894e-02  -4.792395e-02  -2.433043e+01  -1.279083e+02 
  2.966136e+01  -3.704424e-02  -4.590355e-02  -2.458494e+01  -1.289036e+02 
  3.035552e+01  -3.883535e-02  -4.523899e-02  -2.449191e+01  -1.306444e+02 
  3.106592e+01  -4.117462e-02  -4.079966e-02  -2.473666e+01  -1.352621e+02 
  3.179295e+01  -4.324910e-02  -4.094332e-02  -2.450158e+01  -1.365688e+02 
  3.253700e+01  -4.251356e-02  -4.262590e-02  -2.440767e+01  -1.349244e+02 
  3.329845e+01  -4.227572e-02  -4.172130e-02  -2.452483e+01  -1.353782e+02 
  3.407773e+01  -4.298607e-02  -4.067189e-02  -2.455683e+01  -1.365845e+02 
  3.487525e+01  -4.425381e-02  -4.011016e-02  -2.447670e+01  -1.378119e+02 
  3.569143e+01  -4.435417e-02  -3.977142e-02  -2.449887e+01  -1.381181e+02 
  3.652671e+01  -4.595685e-02  -3.708384e-02  -2.457518e+01  -1.410990e+02 
  3.738154e+01  -4.568566e-02  -3.690123e-02  -2.462322e+01  -1.410715e+02 
  3.825637e+01  -4.747909e-02  -3.594481e-02  -2.450225e+01  -1.428719e+02 
  3.915168e+01  -4.852619e-02  -3.477443e-02  -2.448056e+01  -1.443742e+02 
  4.006794e+01  -4.904605e-02  -3.423507e-02  -2.446414e+01  -1.450842e+02 
  4.100564e+01  -4.925121e-02  -3.328674e-02  -2.451772e+01  -1.459470e+02 
  4.196529e+01  -4.970074e-02  -3.258506e-02  -2.451986e+01  -1.467501e+02 
  4.294740e+01  -4.991750e-02  -3.134177e-02  -2.459162e+01  -1.478764e+02 
  4.395249e+01  -5.072868e-02  -3.061311e-02  -2.454623e+01  -1.488904e+02 
  4.498110e+01  -5.110155e-02  -2.961322e-02  -2.457385e+01  -1.499078e+02 
  4.603379e+01  -5.164603e-02  -2.777291e-02  -2.463613e+01  -1.517306e+02 
  4.711111e+01  -5.208480e-02  -2.727466e-02  -2.461334e+01  -1.523608e+02 
  4.821364e+01  -5.244424e-02  -2.703990e-02  -2.458227e+01  -1.527247e+02 
  4.934198e+01  -5.283501e-02  -2.558354e-02  -2.462678e+01  -1.541630e+02 
  5.049672e+01  -5.205151e-02  -2.481418e-02  -2.478195e+01  -1.545117e+02 
  5.167849e+01  -5.270097e-02  -2.281824e-02  -2.481741e+01  -1.565885e+02 
  5.288791e+01  -5.315034e-02  -2.167890e-02  -2.482153e+01  -1.578105e+02 
  5.412564e+01  -5.395545e-02  -2.156508e-02  -2.471566e+01  -1.582142e+02 
  5.539233e+01  -5.397435e-02  -2.089168e-02  -2.474995e+01  -1.588402e+02 
  5.668867e+01  -5.391804e-02  -1.979098e-02  -2.481639e+01  -1.598440e+02 
  5.801535e+01  -5.400443e-02  -1.876084e-02  -2.485658e+01  -1.608430e+02 
  5.937307e+01  -5.441105e-02  -1.825390e-02  -2.482307e+01  -1.614543e+02 
  6.076257e+01  -5.378040e-02  -1.763807e-02  -2.494384e+01  -1.618423e+02 
  6.218459e+01  -5.391365e-02  -1.676922e-02  -2.496497e+01  -1.627223e+02 
  6.363988e+01  -5.456813e-02  -1.510649e-02  -2.494052e+01  -1.645259e+02 
  6.512923e+01  -5.477366e-02  -1.495861e-02  -2.491617e+01  -1.647251e+02 
  6.665344e+01  -5.460408e-02  -1.410546e-02  -2.497495e+01  -1.655158e+02 
  6.821333e+01  -5.481016e-02  -1.346337e-02  -2.496834e+01  -1.661993e+02 
  6.980971e+01  -5.437541e-02  -1.224124e-02  -2.507724e+01  -1.673128e+02 
  7.144345e+01  -5.421058e-02  -1.181285e-02  -2.511685e+01  -1.677070e+02 
  7.311543e+01  -5.479108e-02  -1.092651e-02  -2.505643e+01  -1.687219e+02 
  7.482655e+01  -5.485468e-02  -1.027698e-02  -2.506590e+01  -1.693887e+02 
  7.657770e+01  -5.420244e-02  -9.659816e-03  -2.518383e+01  -1.698950e+02 
  7.836983e+01  -5.416409e-02  -9.266071e-03  -2.520049e+01  -1.702921e+02 
  8.020391e+01  -5.335830e-02  -8.882958e-03  -2.533723e+01  -1.705482e+02 
  8.208091e+01  -5.356358e-02  -8.611158e-03  -2.531179e+01  -1.708670e+02 
  8.400183e+01  -5.328420e-02  -7.197988e-03  -2.538949e+01  -1.723067e+02 
  8.596771e+01  -5.353687e-02  -7.230652e-03  -2.534844e+01  -1.723082e+02 
  8.797960e+01  -5.312771e-02  -6.106344e-03  -2.543658e+01  -1.734434e+02 
  9.003857e+01  -5.261908e-02  -6.087825e-03  -2.551939e+01  -1.734004e+02 
  9.214574e+01  -5.293474e-02  -5.459324e-03  -2.547923e+01  -1.741117e+02 
  9.430221e+01  -5.217066e-02  -4.545420e-03  -2.561863e+01  -1.750206e+02 
  9.650915e+01  -5.181998e-02  -4.012979e-03  -2.568409e+01  -1.755718e+02 
  9.876773e+01  -5.209351e-02  -3.487960e-03  -2.564490e+01  -1.761694e+02 
  1.010792e+02  -5.199672e-02  -3.655754e-03  -2.565907e+01  -1.759783e+02 
  1.034447e+02  -5.133697e-02  -2.744321e-03  -2.577900e+01  -1.769400e+02 
  1.058656e+02  -5.112245e-02  -2.397371e-03  -2.581823e+01  -1.773151e+02 
  1.083432e+02  -5.137794e-02  -2.427007e-03  -2.577479e+01  -1.772954e+02 
  1.108787e+02  -5.089593e-02  -1.995792e-03  -2.585966e+01  -1.777544e+02 
  1.134736e+02  -5.101449e-02  -1.342548e-03  -2.584312e+01  -1.784925e+02 
  1.161292e+02  -5.030847e-02  -1.329209e-03  -2.596415e+01  -1.784865e+02 
  1.188469e+02  -5.033679e-02  -8.902272e-04  -2.596093e+01  -1.789868e+02 
  1.216283e+02  -5.001705e-02  -8.612355e-04  -2.601635e+01  -1.790135e+02 
  1.244747e+02  -4.981447e-02  -4.612148e-04  -2.605252e+01  -1.794695e+02 
  1.273878e+02  -4.936304e-02  -1.321852e-04  -2.613193e+01  -1.798466e+02 
  1.303690e+02  -4.919768e-02   3.167560e-04  -2.616093e+01   1.796311e+02 
  1.334200e+02  -4.791763e-02  -3.019760e-04  -2.638992e+01  -1.796389e+02 
  1.365425e+02  -4.870799e-02  -2.044111e-04  -2.624792e+01  -1.797596e+02 
  1.397379e+02  -4.807930e-02   1.179004e-03  -2.635823e+01   1.785953e+02 
  1.430082e+02  -4.756625e-02   9.569874e-04  -2.645226e+01   1.788474e+02 
  1.463550e+02  -4.823028e-02   1.255888e-03  -2.633066e+01   1.785084e+02 
  1.497801e+02  -4.790618e-02   9.405933e-04  -2.639050e+01   1.788752e+02 
  1.532854e+02  -4.735491e-02   1.490609e-03  -2.648840e+01   1.781971e+02 
  1.568727e+02  -4.799905e-02   1.497696e-03  -2.637112e+01   1.782128e+02 
  1.605440e+02  -4.562932e-02   1.193899e-03  -2.681215e+01   1.785012e+02 
  1.643012e+02  -4.839714e-02   1.562448e-03  -2.629908e+01   1.781509e+02 
  1.681463e+02  -4.593677e-02   1.592053e-03  -2.675158e+01   1.780151e+02 
  1.720814e+02  -4.612388e-02   2.509661e-03  -2.670864e+01   1.768855e+02 
  1.761086e+02  -4.729946e-02   1.943666e-03  -2.649555e+01   1.776469e+02 
  1.802300e+02  -4.637402e-02   1.843037e-03  -2.666765e+01   1.777241e+02 
  1.844479e+02  -4.653809e-02   1.045497e-03  -2.664164e+01   1.787130e+02 
  1.887645e+02  -4.489386e-02   1.793838e-03  -2.694933e+01   1.777118e+02 
  1.931821e+02  -4.459204e-02   1.144230e-03  -2.701199e+01   1.785301e+02 
  1.977032e+02  -4.515655e-02   1.872394e-03  -2.689812e+01   1.776256e+02 
  2.023300e+02  -4.486820e-02   1.167407e-03  -2.695829e+01   1.785096e+02 
  2.070651e+02  -4.419625e-02   2.981990e-03  -2.707257e+01   1.761400e+02 
  2.119110e+02  -4.512405e-02   3.303649e-03  -2.688862e+01   1.758127e+02 
  2.168703e+02  -4.637099e-02   2.615221e-03  -2.666128e+01   1.767721e+02 
  2.219457e+02  -4.526110e-02   2.668696e-03  -2.687042e+01   1.766256e+02 
  2.271398e+02  -4.418024e-02   3.841431e-03  -2.706273e+01   1.750307e+02 
  2.324556e+02  -4.459444e-02   2.380050e-03  -2.700203e+01   1.769450e+02 
  2.378957e+02  -4.524948e-02   1.963323e-03  -2.687956e+01   1.775155e+02 
  2.434631e+02  -4.475359e-02   3.118817e-03  -2.696240e+01   1.760136e+02 
  2.491608e+02  -4.288106e-02   8.534353e-04  -2.735297e+01   1.788598e+02 
  2.549919e+02  -4.401817e-02   2.588279e-03  -2.711237e+01   1.766349e+02 
  2.609594e+02  -4.451727e-02   3.410097e-03  -2.700402e+01   1.756196e+02 
  2.670666e+02  -4.507280e-02   4.748665e-03  -2.687377e+01   1.739857e+02 
  2.733167e+02  -4.292146e-02   2.961799e-03  -2.732588e+01   1.760525e+02 
  2.797131e+02  -4.272497e-02   3.910377e-03  -2.735014e+01   1.747706e+02 
  2.862592e+02  -4.401389e-02   2.776264e-03  -2.711096e+01   1.763907e+02 
  2.929585e+02  -4.319403e-02   2.450806e-03  -2.727757e+01   1.767525e+02 
  2.998145e+02  -4.278088e-02   3.492423e-03  -2.734616e+01   1.753330e+02 
  3.068311e+02  -4.357992e-02   3.762843e-03  -2.718201e+01   1.750651e+02 
  3.140118e+02  -4.435760e-02   2.706819e-03  -2.704450e+01   1.765080e+02 
  3.213605e+02  -4.362546e-02   2.656396e-03  -2.718913e+01   1.765155e+02 
  3.288813e+02  -4.268090e-02   3.271716e-03  -2.736988e+01   1.756165e+02 
  3.365780e+02  -4.314815e-02   2.809620e-03  -2.728238e+01   1.762744e+02 
  3.444549e+02  -4.143967e-02   2.397679e-03  -2.763716e+01   1.766886e+02 
  3.525161e+02  -4.317917e-02   2.558229e-03  -2.727929e+01   1.766094e+02 
  3.607660e+02  -4.288398e-02   4.401985e-03  -2.730858e+01   1.741392e+02 
  3.692090e+02  -4.178266e-02   3.114398e-03  -2.755602e+01   1.757372e+02 
  3.778495e+02  -4.202066e-02   3.444016e-03  -2.750167e+01   1.753145e+02 
  3.866923e+02  -4.200927e-02   2.614363e-03  -2.751631e+01   1.764389e+02 
  3.957419e+02  -4.234026e-02   2.757430e-03  -2.744655e+01   1.762738e+02 
  4.050034e+02  -4.277157e-02   4.111559e-03  -2.733695e+01   1.745091e+02 
  4.144817e+02  -4.186004e-02   2.655603e-03  -2.754656e+01   1.763700e+02 
  4.241817e+02  -4.217114e-02   2.070341e-03  -2.748924e+01   1.771894e+02 
  4.341088e+02  -4.162887e-02   3.356975e-03  -2.758396e+01   1.753896e+02 
  4.442682e+02  -4.202927e-02   2.138600e-03  -2.751773e+01   1.770871e+02 
  4.546653e+02  -4.197463e-02   2.479883e-03  -2.752513e+01   1.766189e+02 
  4.653058e+02  -4.217128e-02   2.684053e-03  -2.748211e+01   1.763582e+02 
  4.761952e+02  -4.116624e-02   2.876670e-03  -2.768802e+01   1.760027e+02 
  4.873395e+02  -4.160348e-02   1.608966e-03  -2.761091e+01   1.777852e+02 
  4.987447e+02  -4.261406e-02   2.650638e-03  -2.739217e+01   1.764407e+02 
  5.104167e+02  -4.211477e-02   1.695752e-03  -2.750428e+01   1.776942e+02 
  5.223619e+02  -4.232944e-02   2.130780e-03  -2.745616e+01   1.771183e+02 
  5.345867e+02  -4.110187e-02   7.498744e-04  -2.772132e+01   1.789548e+02 
  5.470975e+02  -4.202053e-02   2.502043e-03  -2.751540e+01   1.765924e+02 
  5.599011e+02  -4.069957e-02   1.651998e-03  -2.780105e+01   1.776756e+02 
  5.730044e+02  -4.115073e-02   1.226245e-03  -2.770860e+01   1.782932e+02 
  5.864144e+02  -4.095999e-02   2.487318e-03  -2.773682e+01   1.765249e+02 
  6.001381e+02  -4.063273e-02   1.789438e-03  -2.781407e+01   1.774784e+02 
  6.141830e+02  -4.030605e-02   2.197559e-03  -2.787970e+01   1.768792e+02 
  6.285566e+02  -4.076949e-02   2.164610e-03  -2.778107e+01   1.769608e+02 
  6.432667e+02  -4.101742e-02   1.699535e-03  -2.773318e+01   1.776273e+02 
  6.583209e+02  -4.025418e-02   1.385596e-03  -2.789864e+01   1.780286e+02 
  6.737275e+02  -4.059632e-02   1.664676e-03  -2.782297e+01   1.776519e+02 
  6.894946e+02  -4.042973e-02   2.363251e-03  -2.785117e+01   1.766547e+02 
  7.056308e+02  -4.016806e-02   1.406945e-03  -2.791706e+01   1.779939e+02 
  7.221445e+02  -4.063166e-02   1.863693e-03  -2.781358e+01   1.773738e+02 
  7.390448e+02  -4.087832e-02   1.188102e-03  -2.776647e+01   1.783352e+02 
  7.563405e+02  -4.112823e-02   1.604932e-03  -2.771059e+01   1.777653e+02 
  7.740410e+02  -4.092357e-02   8.817647e-04  -2.775851e+01   1.787657e+02 
  7.921558e+02  -4.120468e-02   9.157762e-04  -2.769892e+01   1.787268e+02 
  8.106945e+02  -4.113558e-02   8.388386e-04  -2.771384e+01   1.788318e+02 
  8.296671e+02  -4.188253e-02   1.216992e-03  -2.755568e+01   1.783356e+02 
  8.490836e+02  -4.129480e-02   7.990001e-04  -2.768047e+01   1.788915e+02 
  8.689546e+02  -4.103483e-02   8.169788e-04  -2.773523e+01   1.788594e+02 
  8.892906e+02  -4.037339e-02   8.761177e-04  -2.787605e+01   1.787569e+02 
  9.101025e+02  -4.130606e-02   8.776899e-04  -2.767776e+01   1.787827e+02 
  9.314015e+02  -4.070730e-02   4.517087e-04  -2.780602e+01   1.793642e+02 
  9.531989e+02  -4.103600e-02   5.968066e-04  -2.773578e+01   1.791668e+02 
  9.755065e+02  -4.074944e-02   6.819303e-04  -2.779635e+01   1.790413e+02 
  9.983361e+02  -4.100212e-02   9.047614e-04  -2.774176e+01   1.787359e+02 
  1.021700e+03  -4.121002e-02   7.473533e-04  -2.769851e+01   1.789610e+02 
  1.045611e+03  -4.123674e-02   5.810502e-04  -2.769345e+01   1.791927e+02 
  1.070081e+03  -4.074999e-02   3.374570e-04  -2.779715e+01   1.795255e+02 
  1.095124e+03  -4.061822e-02   8.621424e-04  -2.782363e+01   1.787840e+02 
  1.120753e+03  -4.124096e-02   4.432207e-04  -2.769292e+01   1.793842e+02 
  1.146982e+03  -4.102998e-02   1.279236e-04  -2.773793e+01   1.798214e+02 
  1.173824e+03  -4.098517e-02   1.027410e-03  -2.774474e+01   1.785640e+02 
  1.201295e+03  -4.136004e-02   8.181602e-05  -2.766836e+01   1.798867e+02 
  1.229409e+03  -4.167456e-02   5.252368e-05  -2.760257e+01   1.799278e+02 
  1.258181e+03  -4.175407e-02   5.399101e-04  -2.758530e+01   1.792592e+02 
  1.287625e+03  -4.178465e-02  -2.750177e-05  -2.757966e+01  -1.799623e+02 
  1.317760e+03  -4.097810e-02   2.316914e-04  -2.774882e+01   1.796760e+02 
  1.348599e+03  -4.141743e-02  -1.681705e-04  -2.765627e+01  -1.797673e+02 
  1.380160e+03  -4.117806e-02  -1.413309e-04  -2.770663e+01  -1.798033e+02 
  1.412460e+03  -4.172667e-02   2.391807e-04  -2.759158e+01   1.796716e+02 
  1.445515e+03  -4.169481e-02  -1.707010e-04  -2.759829e+01  -1.797654e+02 
  1.479344e+03  -4.116983e-02   9.217886e-05  -2.770840e+01   1.798717e+02 
  1.513965e+03  -4.148812e-02  -4.294008e-04  -2.764106e+01  -1.794070e+02 
  1.549396e+03  -4.166243e-02   1.840591e-04  -2.760502e+01   1.797469e+02 
  1.585656e+03  -4.160530e-02   2.539061e-04  -2.761686e+01   1.796503e+02 
  1.622765e+03  -4.120588e-02  -3.283688e-04  -2.770054e+01  -1.795434e+02 
  1.660743e+03  -4.136993e-02  -3.525796e-04  -2.766599e+01  -1.795117e+02 
  1.699609e+03  -4.137071e-02  -3.228538e-05  -2.766614e+01  -1.799553e+02 
  1.739384e+03  -4.142142e-02  -1.438649e-04  -2.765545e+01  -1.798010e+02 
  1.780091e+03  -4.114339e-02   1.918206e-04  -2.771390e+01   1.797329e+02 
  1.821750e+03  -4.105202e-02  -1.397702e-04  -2.773326e+01  -1.798049e+02 
  1.864384e+03  -4.108237e-02  -2.519154e-04  -2.772673e+01  -1.796487e+02 
  1.908016e+03  -4.055480e-02  -1.024696e-04  -2.783913e+01  -1.798552e+02 
  1.952669e+03  -4.110015e-02   2.066391e-05  -2.772313e+01   1.799712e+02 
  1.998367e+03  -4.147398e-02  -5.103496e-04  -2.764383e+01  -1.792950e+02 
  2.045135e+03  -4.143874e-02  -4.185489e-04  -2.765143e+01  -1.794213e+02 
  2.092997e+03  -4.121975e-02  -4.094021e-04  -2.769746e+01  -1.794309e+02 
  2.141979e+03  -4.115605e-02  -4.342313e-04  -2.771084e+01  -1.793955e+02 
  2.192107e+03  -4.200580e-02  -7.713953e-04  -2.753235e+01  -1.789479e+02 
  2.243408e+03  -4.159471e-02  -5.954176e-04  -2.761835e+01  -1.791799e+02 
  2.295911e+03  -4.173049e-02  -3.873146e-04  -2.759056e+01  -1.794682e+02 
  2.349642e+03  -4.186993e-02  -2.936025e-04  -2.756174e+01  -1.795982e+02 
  2.404630e+03  -4.171256e-02  -4.770381e-04  -2.759410e+01  -1.793448e+02 
  2.460905e+03  -4.119452e-02  -4.451431e-04  -2.770270e+01  -1.793809e+02 
  2.518497e+03  -4.124663e-02  -5.696723e-04  -2.769140e+01  -1.792087e+02 
  2.577437e+03  -4.122204e-02  -1.120652e-03  -2.769420e+01  -1.784427e+02 
  2.637756e+03  -4.195009e-02  -7.223225e-04  -2.754406e+01  -1.790135e+02 
  2.699487e+03  -4.187506e-02  -6.855169e-04  -2.755973e+01  -1.790621e+02 
  2.762663e+03  -4.203262e-02  -6.442750e-04  -2.752725e+01  -1.791218e+02 
  2.827317e+03  -4.173657e-02  -7.678884e-04  -2.758820e+01  -1.789460e+02 
  2.893484e+03  -4.207452e-02  -7.945700e-04  -2.751807e+01  -1.789181e+02 
  2.961200e+03  -4.206137e-02  -4.891667e-04  -2.752175e+01  -1.793337e+02 
  3.030501e+03  -4.213228e-02  -7.451561e-04  -2.750634e+01  -1.789868e+02 
  3.101423e+03  -4.225078e-02  -7.391087e-04  -2.748198e+01  -1.789978e+02 
  3.174005e+03  -4.220925e-02  -7.253881e-04  -2.749056e+01  -1.790154e+02 
  3.248286e+03  -4.230281e-02  -6.811180e-04  -2.747149e+01  -1.790775e+02 
  3.324305e+03  -4.231755e-02  -9.592677e-04  -2.746736e+01  -1.787014e+02 
  3.402103e+03  -4.248916e-02  -6.862943e-04  -2.743330e+01  -1.790746e+02 
  3.481722e+03  -4.160440e-02  -1.505461e-03  -2.761153e+01  -1.779276e+02 
  3.563204e+03  -4.224729e-02  -1.185777e-03  -2.748060e+01  -1.783923e+02 
  3.646593e+03  -4.269827e-02  -7.671130e-04  -2.739039e+01  -1.789707e+02 
  3.731934e+03  -4.289550e-02  -9.916304e-04  -2.734945e+01  -1.786757e+02 
  3.819272e+03  -4.297301e-02  -7.896598e-04  -2.733462e+01  -1.789473e+02 
  3.908654e+03  -4.293812e-02  -7.452355e-04  -2.734183e+01  -1.790057e+02 
  4.000127e+03  -4.321857e-02  -6.773230e-04  -2.728552e+01  -1.791021e+02 
  4.093741e+03  -4.339243e-02  -7.619023e-04  -2.725038e+01  -1.789941e+02 
  4.189547e+03  -4.353181e-02  -6.066337e-04  -2.722302e+01  -1.792016e+02 
  4.287594e+03  -4.359075e-02  -7.374220e-04  -2.721087e+01  -1.790308e+02 
  4.387936e+03  -4.373348e-02  -6.849381e-04  -2.718265e+01  -1.791027e+02 
  4.490626e+03  -4.401013e-02  -6.704714e-04  -2.712794e+01  -1.791272e+02 
  4.595719e+03  -4.393173e-02  -6.224616e-04  -2.714356e+01  -1.791882e+02 
  4.703272e+03  -4.394416e-02  -3.660040e-04  -2.714168e+01  -1.795228e+02 
  4.813342e+03  -4.391014e-02  -3.642061e-04  -2.714841e+01  -1.795248e+02 
  4.925988e+03  -4.416101e-02  -2.609497e-04  -2.709907e+01  -1.796614e+02 
  5.041270e+03  -4.353258e-02  -3.185772e-04  -2.722348e+01  -1.795807e+02 
  5.159250e+03  -4.503003e-02  -6.301439e-04  -2.692910e+01  -1.791983e+02 
  5.279991e+03  -4.498754e-02  -1.752125e-04  -2.693809e+01  -1.797768e+02 
  5.403558e+03  -4.530331e-02   1.935700e-05  -2.687740e+01   1.799755e+02 
  5.530017e+03  -4.532611e-02   5.744512e-05  -2.687302e+01   1.799274e+02 
  5.659435e+03  -4.550003e-02   1.255088e-04  -2.683973e+01   1.798419e+02 
  5.791881e+03  -4.557269e-02   2.963156e-04  -2.682572e+01   1.796275e+02 
  5.927428e+03  -4.549634e-02   2.400665e-04  -2.684035e+01   1.796977e+02 
  6.066146e+03  -4.523551e-02   5.533656e-04  -2.688976e+01   1.792991e+02 
  6.208112e+03  -4.510031e-02   4.308796e-04  -2.691601e+01   1.794526e+02 
  6.353399e+03  -4.553013e-02   6.273638e-04  -2.683320e+01   1.792106e+02 
  6.502086e+03  -4.571160e-02   8.716228e-04  -2.679789e+01   1.789076e+02 
  6.654254e+03  -4.617622e-02   1.157374e-03  -2.670890e+01   1.785642e+02 
  6.809982e+03  -4.653277e-02   1.352079e-03  -2.664116e+01   1.783356e+02 
  6.969355e+03  -4.635357e-02   1.262458e-03  -2.667512e+01   1.784399e+02 
  7.132458e+03  -4.654908e-02   1.534199e-03  -2.663706e+01   1.781123e+02 
  7.299378e+03  -4.669765e-02   1.788885e-03  -2.660773e+01   1.778062e+02 
  7.470204e+03  -4.690740e-02   1.969096e-03  -2.656753e+01   1.775962e+02 
  7.645028e+03  -4.706275e-02   2.367406e-03  -2.653548e+01   1.771203e+02 
  7.823943e+03  -4.771277e-02   2.764222e-03  -2.641275e+01   1.766843e+02 
  8.007046e+03  -4.801211e-02   2.898708e-03  -2.635718e+01   1.765450e+02 
  8.194434e+03  -4.782600e-02   3.270453e-03  -2.638646e+01   1.760881e+02 
  8.386206e+03  -4.758916e-02   3.358887e-03  -2.642826e+01   1.759627e+02 
  8.582467e+03  -4.757037e-02   3.527728e-03  -2.642945e+01   1.757588e+02 
  8.783321e+03  -4.737885e-02   3.728247e-03  -2.646150e+01   1.755007e+02 
  8.988876e+03  -4.777245e-02   4.300353e-03  -2.638140e+01   1.748562e+02 
  9.199241e+03  -4.839487e-02   4.870940e-03  -2.626024e+01   1.742525e+02 
  9.414529e+03  -4.881645e-02   5.410400e-03  -2.617565e+01   1.736756e+02 
  9.634856e+03  -4.826935e-02   5.696351e-03  -2.626650e+01   1.732695e+02 
  9.860339e+03  -4.857196e-02   5.745586e-03  -2.621194e+01   1.732538e+02 
  1.009110e+04  -4.892945e-02   6.242117e-03  -2.613848e+01   1.727298e+02 
  1.032726e+04  -4.865944e-02   6.530422e-03  -2.617913e+01   1.723562e+02 
  1.056895e+04  -4.886932e-02   6.949401e-03  -2.613233e+01   1.719066e+02 
  1.081629e+04  -4.855271e-02   7.331491e-03  -2.617782e+01   1.714132e+02 
  1.106942e+04  -4.835198e-02   7.520106e-03  -2.620791e+01   1.711597e+02 
  1.132848e+04  -4.860393e-02   8.409238e-03  -2.613848e+01   1.701841e+02 
  1.159360e+04  -4.795061e-02   8.471067e-03  -2.625065e+01   1.699814e+02 
  1.186492e+04  -4.920311e-02   7.592499e-03  -2.605795e+01   1.712279e+02 
  1.214259e+04  -4.976496e-02   9.388223e-03  -2.590965e+01   1.693166e+02 
  1.242676e+04  -4.945172e-02   1.029064e-02  -2.593227e+01   1.682448e+02 
  1.271758e+04  -4.920673e-02   1.097177e-02  -2.594879e+01   1.674302e+02 
  1.301521e+04  -4.864061e-02   1.126636e-02  -2.603306e+01   1.669588e+02 
  1.331981e+04  -4.861001e-02   1.220771e-02  -2.599987e+01   1.659025e+02 
  1.363153e+04  -4.757379e-02   1.170245e-02  -2.619750e+01   1.661805e+02 
  1.395054e+04  -4.798024e-02   1.192052e-02  -2.611863e+01   1.660475e+02 
  1.427703e+04  -4.765006e-02   1.255616e-02  -2.614718e+01   1.652377e+02 
  1.461115e+04  -4.775487e-02   1.306521e-02  -2.610616e+01   1.646989e+02 
  1.495309e+04  -4.767209e-02   1.351779e-02  -2.609885e+01   1.641689e+02 
  1.530304e+04  -4.791217e-02   1.399994e-02  -2.603526e+01   1.637116e+02 
  1.566117e+04  -4.773685e-02   1.484179e-02  -2.602219e+01   1.627291e+02 
  1.602769e+04  -4.710401e-02   1.528059e-02  -2.610429e+01   1.620269e+02 
  1.640278e+04  -4.678047e-02   1.590274e-02  -2.612377e+01   1.612248e+02 
  1.678665e+04  -4.562852e-02   1.530229e-02  -2.635239e+01   1.614603e+02 
  1.717951e+04  -4.733269e-02   1.620551e-02  -2.601539e+01   1.611001e+02 
  1.758155e+04  -4.689285e-02   1.756756e-02  -2.600749e+01   1.594624e+02 
  1.799301e+04  -4.596365e-02   1.800044e-02  -2.613203e+01   1.586135e+02 
  1.841410e+04  -4.577138e-02   1.859188e-02  -2.612490e+01   1.578935e+02 
  1.884504e+04  -4.529478e-02   1.893106e-02  -2.617982e+01   1.573174e+02 
  1.928607e+04  -4.478743e-02   1.914894e-02  -2.624776e+01   1.568508e+02 
  1.973742e+04  -4.465909e-02   1.976844e-02  -2.622470e+01   1.561233e+02 
  2.019933e+04  -4.440005e-02   2.015224e-02  -2.623884e+01   1.555877e+02 
  2.067205e+04  -4.384115e-02   2.060759e-02  -2.629539e+01   1.548241e+02 
  2.115584e+04  -4.334928e-02   2.080671e-02  -2.635997e+01   1.543600e+02 
  2.165094e+04  -4.311441e-02   2.118195e-02  -2.636853e+01   1.538353e+02 
  2.215764e+04  -4.270895e-02   2.193633e-02  -2.637281e+01   1.528139e+02 
  2.267619e+04  -4.219347e-02   2.209762e-02  -2.644243e+01   1.523580e+02 
  2.320688e+04  -4.197893e-02   2.233703e-02  -2.645666e+01   1.519825e+02 
  2.374998e+04  -4.147582e-02   2.280908e-02  -2.649656e+01   1.511920e+02 
  2.430580e+04  -4.103708e-02   2.330412e-02  -2.652256e+01   1.504086e+02 
  2.487462e+04  -4.040613e-02   2.388530e-02  -2.656953e+01   1.494114e+02 
  2.545676e+04  -4.037036e-02   2.428793e-02  -2.653712e+01   1.489677e+02 
  2.605252e+04  -3.974287e-02   2.502201e-02  -2.656474e+01   1.478056e+02 
  2.666222e+04  -4.022741e-02   2.663689e-02  -2.633060e+01   1.464892e+02 
  2.728620e+04  -3.903839e-02   2.638541e-02  -2.653611e+01   1.459459e+02 
  2.792477e+04  -3.749369e-02   2.724923e-02  -2.667906e+01   1.439915e+02 
  2.857829e+04  -3.811241e-02   2.704687e-02  -2.660730e+01   1.446382e+02 
  2.924710e+04  -3.596015e-02   2.712921e-02  -2.692691e+01   1.429682e+02 
  2.993157e+04  -3.586930e-02   2.899909e-02  -2.672120e+01   1.410457e+02 
  3.063205e+04  -3.458044e-02   2.792113e-02  -2.704346e+01   1.410817e+02 
  3.134893e+04  -3.413958e-02   2.784601e-02  -2.711994e+01   1.407975e+02 
  3.208258e+04  -3.387551e-02   2.850556e-02  -2.707718e+01   1.399200e+02 
  3.283341e+04  -3.247586e-02   2.809094e-02  -2.734290e+01   1.391409e+02 
  3.360180e+04  -3.178009e-02   2.839100e-02  -2.740878e+01   1.382237e+02 
  3.438818e+04  -3.137122e-02   2.849693e-02  -2.745638e+01   1.377487e+02 
  3.519296e+04  -3.083832e-02   2.894601e-02  -2.747420e+01   1.368129e+02 
  3.601657e+04  -3.033203e-02   2.903531e-02  -2.753728e+01   1.362513e+02 
  3.685946e+04  -2.932204e-02   2.912277e-02  -2.767533e+01   1.351953e+02 
  3.772208e+04  -2.857140e-02   2.929268e-02  -2.776144e+01   1.342858e+02 
  3.860488e+04  -2.803306e-02   2.963327e-02  -2.778851e+01   1.334105e+02 
  3.950835e+04  -2.756825e-02   2.966431e-02  -2.785161e+01   1.329026e+02 
  4.043296e+04  -2.715413e-02   2.987611e-02  -2.787831e+01   1.322674e+02 
  4.137920e+04  -2.628595e-02   3.008176e-02  -2.797004e+01   1.311475e+02 
  4.234759e+04  -2.554091e-02   3.012013e-02  -2.806998e+01   1.302969e+02 
  4.333865e+04  -2.486682e-02   3.028031e-02  -2.813819e+01   1.293935e+02 
  4.435289e+04  -2.437851e-02   3.056065e-02  -2.815801e+01   1.285797e+02 
  4.539088e+04  -2.368762e-02   3.064205e-02  -2.823898e+01   1.277056e+02 
  4.645315e+04  -2.298265e-02   3.073366e-02  -2.831868e+01   1.267891e+02 
  4.754029e+04  -2.221935e-02   3.095549e-02  -2.838051e+01   1.256702e+02 
  4.865287e+04  -2.159629e-02   3.108175e-02  -2.843913e+01   1.247924e+02 
  4.979148e+04  -2.062049e-02   3.120365e-02  -2.854222e+01   1.234581e+02 
  5.095674e+04  -1.968605e-02   3.132601e-02  -2.863641e+01   1.221463e+02 
  5.214928e+04  -1.882330e-02   3.125237e-02  -2.875813e+01   1.210605e+02 
  5.336971e+04  -1.812593e-02   3.131266e-02  -2.883050e+01   1.200652e+02 
  5.461872e+04  -1.729719e-02   3.126790e-02  -2.893852e+01   1.189511e+02 
  5.589695e+04  -1.652403e-02   3.132848e-02  -2.901523e+01   1.178091e+02 
  5.720510e+04  -1.542670e-02   3.101996e-02  -2.920739e+01   1.164418e+02 
  5.854386e+04  -1.445597e-02   3.085313e-02  -2.935209e+01   1.151050e+02 
  5.991395e+04  -1.362935e-02   3.089194e-02  -2.943068e+01   1.138068e+02 
  6.131611e+04  -1.248281e-02   3.019407e-02  -2.971631e+01   1.124611e+02 
  6.275108e+04  -1.163268e-02   2.918162e-02  -3.005733e+01   1.117337e+02 
  6.421964e+04  -1.116158e-02   2.890308e-02  -3.017743e+01   1.111152e+02 
  6.572255e+04  -1.089745e-02   2.850512e-02  -3.030912e+01   1.109217e+02 
  6.726065e+04  -1.053564e-02   2.809021e-02  -3.045729e+01   1.105593e+02 
  6.883474e+04  -1.058369e-02   2.774936e-02  -3.054511e+01   1.108770e+02 
  7.044567e+04  -1.035530e-02   2.788406e-02  -3.053178e+01   1.103735e+02 
  7.209430e+04  -9.877699e-03   2.798763e-02  -3.055085e+01   1.094395e+02 
  7.378151e+04  -9.251328e-03   2.809810e-02  -3.057947e+01   1.082242e+02 
  7.550820e+04  -8.571410e-03   2.788508e-02  -3.070046e+01   1.070865e+02 
  7.727531e+04  -7.892142e-03   2.785575e-02  -3.076637e+01   1.058186e+02 
  7.908377e+04  -7.156825e-03   2.786971e-02  -3.082001e+01   1.044021e+02 
  8.093455e+04  -6.559925e-03   2.764520e-02  -3.092970e+01   1.033488e+02 
  8.282866e+04  -5.926699e-03   2.745324e-02  -3.103030e+01   1.021823e+02 
  8.476709e+04  -5.273625e-03   2.711051e-02  -3.117595e+01   1.010079e+02 
  8.675088e+04  -4.619731e-03   2.688958e-02  -3.128199e+01   9.974845e+01 
  8.878109e+04  -4.049641e-03   2.651562e-02  -3.142983e+01   9.868348e+01 
  9.085882e+04  -3.406315e-03   2.596079e-02  -3.163951e+01   9.747507e+01 
  9.298517e+04  -2.774544e-03   2.551217e-02  -3.181399e+01   9.620673e+01 
  9.516129e+04  -2.238319e-03   2.495078e-02  -3.202351e+01   9.512624e+01 
  9.738834e+04  -1.529196e-03   2.433905e-02  -3.225682e+01   9.359510e+01 
  9.966750e+04  -1.187647e-03   2.358059e-02  -3.253790e+01   9.288329e+01 
  1.020000e+05  -9.912243e-04   2.336759e-02  -3.261992e+01   9.242896e+01 
