  1.000000e+01   5.704158e-02   1.527038e-01   1.630098e-01   6.951713e+01 
  1.097762e+01   5.816882e-02   1.516853e-01   1.624563e-01   6.901900e+01 
  1.205081e+01   7.147617e-02   1.406879e-01   1.578034e-01   6.306725e+01 
  1.322892e+01   8.119424e-02   1.541068e-01   1.741878e-01   6.221659e+01 
  1.452220e+01   1.010800e-01   1.502929e-01   1.811219e-01   5.607706e+01 
  1.594191e+01   1.040767e-01   1.426081e-01   1.765475e-01   5.387769e+01 
  1.750042e+01   1.256674e-01   1.423088e-01   1.898528e-01   4.855351e+01 
  1.921129e+01   1.371033e-01   1.351872e-01   1.925433e-01   4.459682e+01 
  2.108942e+01   1.373595e-01   1.326237e-01   1.909363e-01   4.399506e+01 
  2.315116e+01   1.516003e-01   1.211822e-01   1.940819e-01   3.863720e+01 
  2.541446e+01   1.692436e-01   1.188922e-01   2.068303e-01   3.508770e+01 
  2.789902e+01   1.684772e-01   1.198395e-01   2.067512e-01   3.542463e+01 
  3.062647e+01   1.873202e-01   1.087430e-01   2.165961e-01   3.013600e+01 
  3.362057e+01   1.922197e-01   9.442408e-02   2.141595e-01   2.616166e+01 
  3.690737e+01   2.020820e-01   8.602796e-02   2.196314e-01   2.305985e+01 
  4.051550e+01   2.029228e-01   7.745194e-02   2.172014e-01   2.089095e+01 
  4.447636e+01   2.090943e-01   6.310993e-02   2.184108e-01   1.679514e+01 
  4.882445e+01   2.109264e-01   5.103946e-02   2.170137e-01   1.360282e+01 
  5.359761e+01   2.108125e-01   4.386620e-02   2.153280e-01   1.175446e+01 
  5.883741e+01   2.106026e-01   2.930984e-02   2.126324e-01   7.923037e+00 
  6.458945e+01   2.046229e-01   2.475559e-02   2.061149e-01   6.898205e+00 
  7.090383e+01   2.059764e-01   1.465718e-02   2.064973e-01   4.070278e+00 
  7.783551e+01   2.018990e-01   6.919625e-03   2.020175e-01   1.962913e+00 
  8.544484e+01   1.963680e-01   3.457723e-03   1.963985e-01   1.008782e+00 
  9.379807e+01   1.939399e-01  -1.831680e-03   1.939485e-01  -5.411182e-01 
  1.029679e+02   1.870288e-01  -9.447522e-03   1.872673e-01  -2.891765e+00 
  1.130343e+02   1.854716e-01  -9.876149e-03   1.857344e-01  -3.048055e+00 
  1.240847e+02   1.788197e-01  -1.428737e-02   1.793895e-01  -4.568126e+00 
  1.362154e+02   1.787703e-01  -1.401470e-02   1.793188e-01  -4.482535e+00 
  1.495321e+02   1.748213e-01  -1.594050e-02   1.755466e-01  -5.209919e+00 
  1.641506e+02   1.729539e-01  -1.501673e-02   1.736045e-01  -4.962265e+00 
  1.801982e+02   1.686363e-01  -1.560847e-02   1.693571e-01  -5.288059e+00 
  1.978147e+02   1.653207e-01  -1.839865e-02   1.663413e-01  -6.350355e+00 
  2.171534e+02   1.603557e-01  -1.595827e-02   1.611478e-01  -5.683245e+00 
  2.383827e+02   1.635313e-01  -1.405048e-02   1.641338e-01  -4.910748e+00 
  2.616874e+02   1.565499e-01  -1.415741e-02   1.571887e-01  -5.167421e+00 
  2.872704e+02   1.543123e-01  -1.051079e-02   1.546699e-01  -3.896613e+00 
  3.153545e+02   1.522907e-01  -9.686743e-03   1.525985e-01  -3.639504e+00 
  3.461841e+02   1.540188e-01  -1.269053e-02   1.545407e-01  -4.710303e+00 
  3.800276e+02   1.503900e-01  -9.232763e-03   1.506732e-01  -3.513101e+00 
  4.171797e+02   1.548610e-01  -8.278964e-03   1.550822e-01  -3.060154e+00 
  4.579640e+02   1.540612e-01  -5.419648e-03   1.541565e-01  -2.014751e+00 
  5.027353e+02   1.500288e-01  -4.219439e-03   1.500881e-01  -1.610973e+00 
  5.518835e+02   1.538712e-01  -1.364025e-03   1.538773e-01  -5.078975e-01 
  6.058367e+02   1.509482e-01  -1.079662e-03   1.509520e-01  -4.098029e-01 
  6.650643e+02   1.508832e-01   9.166208e-04   1.508860e-01   3.480695e-01 
  7.300821e+02   1.495527e-01   2.453348e-03   1.495728e-01   9.398288e-01 
  8.014562e+02   1.511916e-01   4.233030e-03   1.512509e-01   1.603736e+00 
  8.798079e+02   1.508175e-01   4.505021e-03   1.508847e-01   1.710955e+00 
  9.658195e+02   1.479524e-01   7.681190e-03   1.481517e-01   2.971935e+00 
  1.060240e+03   1.515198e-01   9.240411e-03   1.518013e-01   3.489852e+00 
  1.163890e+03   1.507056e-01   1.277370e-02   1.512459e-01   4.844770e+00 
  1.277674e+03   1.529344e-01   1.129058e-02   1.533506e-01   4.222275e+00 
  1.402582e+03   1.498493e-01   1.490401e-02   1.505886e-01   5.679959e+00 
  1.539701e+03   1.527807e-01   1.796770e-02   1.538336e-01   6.707433e+00 
  1.690225e+03   1.535907e-01   1.806613e-02   1.546495e-01   6.708601e+00 
  1.855464e+03   1.553046e-01   2.273023e-02   1.569592e-01   8.326632e+00 
  2.036857e+03   1.556465e-01   2.391934e-02   1.574737e-01   8.736710e+00 
  2.235984e+03   1.585824e-01   2.641551e-02   1.607675e-01   9.457086e+00 
  2.454577e+03   1.591992e-01   2.971666e-02   1.619489e-01   1.057334e+01 
  2.694541e+03   1.635177e-01   3.504723e-02   1.672314e-01   1.209735e+01 
  2.957964e+03   1.649580e-01   3.441729e-02   1.685102e-01   1.178528e+01 
  3.247140e+03   1.699965e-01   3.672541e-02   1.739183e-01   1.219062e+01 
  3.564586e+03   1.726892e-01   3.923457e-02   1.770901e-01   1.280017e+01 
  3.913066e+03   1.789453e-01   4.359162e-02   1.841783e-01   1.369077e+01 
  4.295614e+03   1.825403e-01   4.493540e-02   1.879897e-01   1.382936e+01 
  4.715561e+03   1.876260e-01   4.728029e-02   1.934914e-01   1.414362e+01 
  5.176562e+03   1.943614e-01   4.750460e-02   2.000826e-01   1.373461e+01 
  5.682631e+03   2.025458e-01   4.647848e-02   2.078102e-01   1.292400e+01 
  6.238175e+03   2.123566e-01   4.508558e-02   2.170899e-01   1.198652e+01 
  6.848030e+03   2.184036e-01   4.118469e-02   2.222528e-01   1.067895e+01 
  7.517505e+03   2.281820e-01   3.781410e-02   2.312940e-01   9.409487e+00 
  8.252429e+03   2.347326e-01   3.354688e-02   2.371176e-01   8.133370e+00 
  9.059200e+03   2.423895e-01   2.584239e-02   2.437632e-01   6.085608e+00 
  9.944844e+03   2.487071e-01   1.661678e-02   2.492616e-01   3.822401e+00 
  1.091707e+04   2.543060e-01   6.969661e-03   2.544014e-01   1.569889e+00 
  1.198434e+04   2.590050e-01  -6.959458e-04   2.590059e-01  -1.539532e-01 
  1.315595e+04   2.619408e-01  -1.548936e-02   2.623984e-01  -3.384134e+00 
  1.444210e+04   2.604003e-01  -2.614573e-02   2.617096e-01  -5.733618e+00 
  1.585398e+04   2.621961e-01  -3.792445e-02   2.649246e-01  -8.230271e+00 
  1.740389e+04   2.617223e-01  -4.913473e-02   2.662945e-01  -1.063272e+01 
  1.910533e+04   2.575152e-01  -6.443605e-02   2.654545e-01  -1.404823e+01 
  2.097310e+04   2.502097e-01  -7.614444e-02   2.615395e-01  -1.692618e+01 
  2.302346e+04   2.459224e-01  -8.676131e-02   2.607784e-01  -1.943282e+01 
  2.527428e+04   2.397020e-01  -9.988381e-02   2.596802e-01  -2.262149e+01 
  2.774513e+04   2.351788e-01  -1.150246e-01   2.618009e-01  -2.606298e+01 
  3.045755e+04   2.152392e-01  -1.279040e-01   2.503744e-01  -3.072052e+01 
  3.343513e+04   2.098894e-01  -1.391533e-01   2.518277e-01  -3.354372e+01 
  3.670380e+04   1.941395e-01  -1.508896e-01   2.458817e-01  -3.785516e+01 
  4.029203e+04   1.787354e-01  -1.589253e-01   2.391727e-01  -4.164237e+01 
  4.423105e+04   1.631776e-01  -1.677172e-01   2.340000e-01  -4.578599e+01 
  4.855515e+04   1.453083e-01  -1.767900e-01   2.288432e-01  -5.058234e+01 
  5.330199e+04   1.231491e-01  -1.825279e-01   2.201866e-01  -5.599298e+01 
  5.851288e+04   9.967379e-02  -1.857945e-01   2.108422e-01  -6.178762e+01 
  6.423320e+04   7.223081e-02  -1.798135e-01   1.937787e-01  -6.811474e+01 
  7.051275e+04   6.570861e-02  -1.677417e-01   1.801524e-01  -6.860847e+01 
  7.740620e+04   5.086526e-02  -1.697964e-01   1.772515e-01  -7.332356e+01 
  8.497355e+04   3.205802e-02  -1.669999e-01   1.700491e-01  -7.913344e+01 
  9.328072e+04   1.461920e-02  -1.598252e-01   1.604924e-01  -8.477370e+01 
  1.024000e+05  -3.068059e-03  -1.522547e-01   1.522856e-01  -9.115440e+01 
