  0.000000e+00   1.083461e-03   0.000000e+00   1.083461e-03   0.000000e+00 
  2.000000e+00   6.071875e-04   0.000000e+00   6.071875e-04   0.000000e+00 
  4.000000e+00   1.040509e-04   0.000000e+00   1.040509e-04   0.000000e+00 
  6.000000e+00   3.338293e-05   0.000000e+00   3.338293e-05   0.000000e+00 
  8.000000e+00   3.998061e-05   0.000000e+00   3.998061e-05   0.000000e+00 
  1.000000e+01   2.922164e-05   0.000000e+00   2.922164e-05   0.000000e+00 
  1.200000e+01   3.984380e-05   0.000000e+00   3.984380e-05   0.000000e+00 
  1.400000e+01   2.964811e-05   0.000000e+00   2.964811e-05   0.000000e+00 
  1.600000e+01   3.451237e-05   0.000000e+00   3.451237e-05   0.000000e+00 
  1.800000e+01   2.781316e-05   0.000000e+00   2.781316e-05   0.000000e+00 
  2.000000e+01   2.911970e-05   0.000000e+00   2.911970e-05   0.000000e+00 
  2.200000e+01   2.448209e-05   0.000000e+00   2.448209e-05   0.000000e+00 
  2.400000e+01   2.236193e-05   0.000000e+00   2.236193e-05   0.000000e+00 
  2.600000e+01   2.233897e-05   0.000000e+00   2.233897e-05   0.000000e+00 
  2.800000e+01   1.835390e-05   0.000000e+00   1.835390e-05   0.000000e+00 
  3.000000e+01   2.051604e-05   0.000000e+00   2.051604e-05   0.000000e+00 
  3.200000e+01   1.651486e-05   0.000000e+00   1.651486e-05   0.000000e+00 
  3.400000e+01   1.916881e-05   0.000000e+00   1.916881e-05   0.000000e+00 
  3.600000e+01   1.696637e-05   0.000000e+00   1.696637e-05   0.000000e+00 
  3.800000e+01   1.858638e-05   0.000000e+00   1.858638e-05   0.000000e+00 
  4.000000e+01   1.861081e-05   0.000000e+00   1.861081e-05   0.000000e+00 
  4.200000e+01   1.753246e-05   0.000000e+00   1.753246e-05   0.000000e+00 
  4.400000e+01   1.853529e-05   0.000000e+00   1.853529e-05   0.000000e+00 
  4.600000e+01   1.525143e-05   0.000000e+00   1.525143e-05   0.000000e+00 
  4.800000e+01   1.534889e-05   0.000000e+00   1.534889e-05   0.000000e+00 
  5.000000e+01   1.735601e-05   0.000000e+00   1.735601e-05   0.000000e+00 
  5.200000e+01   1.490200e-05   0.000000e+00   1.490200e-05   0.000000e+00 
  5.400000e+01   1.526325e-05   0.000000e+00   1.526325e-05   0.000000e+00 
  5.600000e+01   1.581130e-05   0.000000e+00   1.581130e-05   0.000000e+00 
  5.800000e+01   1.851498e-05   0.000000e+00   1.851498e-05   0.000000e+00 
  6.000000e+01   2.663492e-05   0.000000e+00   2.663492e-05   0.000000e+00 
  6.200000e+01   1.581942e-05   0.000000e+00   1.581942e-05   0.000000e+00 
  6.400000e+01   1.279737e-05   0.000000e+00   1.279737e-05   0.000000e+00 
  6.600000e+01   1.160860e-05   0.000000e+00   1.160860e-05   0.000000e+00 
  6.800000e+01   1.033407e-05   0.000000e+00   1.033407e-05   0.000000e+00 
  7.000000e+01   1.152656e-05   0.000000e+00   1.152656e-05   0.000000e+00 
  7.200000e+01   1.102309e-05   0.000000e+00   1.102309e-05   0.000000e+00 
  7.400000e+01   1.331927e-05   0.000000e+00   1.331927e-05   0.000000e+00 
  7.600000e+01   1.199215e-05   0.000000e+00   1.199215e-05   0.000000e+00 
  7.800000e+01   1.129305e-05   0.000000e+00   1.129305e-05   0.000000e+00 
  8.000000e+01   1.237341e-05   0.000000e+00   1.237341e-05   0.000000e+00 
  8.200000e+01   1.145567e-05   0.000000e+00   1.145567e-05   0.000000e+00 
  8.400000e+01   1.316777e-05   0.000000e+00   1.316777e-05   0.000000e+00 
  8.600000e+01   1.555331e-05   0.000000e+00   1.555331e-05   0.000000e+00 
  8.800000e+01   1.590009e-05   0.000000e+00   1.590009e-05   0.000000e+00 
  9.000000e+01   1.475774e-05   0.000000e+00   1.475774e-05   0.000000e+00 
  9.200000e+01   1.354525e-05   0.000000e+00   1.354525e-05   0.000000e+00 
  9.400000e+01   1.300360e-05   0.000000e+00   1.300360e-05   0.000000e+00 
  9.600000e+01   1.215047e-05   0.000000e+00   1.215047e-05   0.000000e+00 
  9.800000e+01   3.659979e-05   0.000000e+00   3.659979e-05   0.000000e+00 
  1.000000e+02   7.001272e-05   0.000000e+00   7.001272e-05   0.000000e+00 
  1.020000e+02   3.675564e-05   0.000000e+00   3.675564e-05   0.000000e+00 
  1.040000e+02   1.382192e-05   0.000000e+00   1.382192e-05   0.000000e+00 
  1.060000e+02   1.331096e-05   0.000000e+00   1.331096e-05   0.000000e+00 
  1.080000e+02   1.389758e-05   0.000000e+00   1.389758e-05   0.000000e+00 
  1.100000e+02   1.332141e-05   0.000000e+00   1.332141e-05   0.000000e+00 
  1.120000e+02   1.310646e-05   0.000000e+00   1.310646e-05   0.000000e+00 
  1.140000e+02   1.446740e-05   0.000000e+00   1.446740e-05   0.000000e+00 
  1.160000e+02   2.007339e-05   0.000000e+00   2.007339e-05   0.000000e+00 
  1.180000e+02   3.110839e-05   0.000000e+00   3.110839e-05   0.000000e+00 
  1.200000e+02   5.271605e-05   0.000000e+00   5.271605e-05   0.000000e+00 
  1.220000e+02   3.080802e-05   0.000000e+00   3.080802e-05   0.000000e+00 
  1.240000e+02   2.060276e-05   0.000000e+00   2.060276e-05   0.000000e+00 
  1.260000e+02   1.627095e-05   0.000000e+00   1.627095e-05   0.000000e+00 
  1.280000e+02   1.571428e-05   0.000000e+00   1.571428e-05   0.000000e+00 
  1.300000e+02   1.654985e-05   0.000000e+00   1.654985e-05   0.000000e+00 
  1.320000e+02   1.806746e-05   0.000000e+00   1.806746e-05   0.000000e+00 
  1.340000e+02   1.756564e-05   0.000000e+00   1.756564e-05   0.000000e+00 
  1.360000e+02   1.973239e-05   0.000000e+00   1.973239e-05   0.000000e+00 
  1.380000e+02   2.092131e-05   0.000000e+00   2.092131e-05   0.000000e+00 
  1.400000e+02   1.876075e-05   0.000000e+00   1.876075e-05   0.000000e+00 
  1.420000e+02   1.684567e-05   0.000000e+00   1.684567e-05   0.000000e+00 
  1.440000e+02   1.960446e-05   0.000000e+00   1.960446e-05   0.000000e+00 
  1.460000e+02   2.034269e-05   0.000000e+00   2.034269e-05   0.000000e+00 
  1.480000e+02   2.247253e-05   0.000000e+00   2.247253e-05   0.000000e+00 
  1.500000e+02   2.752454e-05   0.000000e+00   2.752454e-05   0.000000e+00 
  1.520000e+02   3.119773e-05   0.000000e+00   3.119773e-05   0.000000e+00 
  1.540000e+02   3.832101e-05   0.000000e+00   3.832101e-05   0.000000e+00 
  1.560000e+02   4.892360e-05   0.000000e+00   4.892360e-05   0.000000e+00 
  1.580000e+02   5.694206e-05   0.000000e+00   5.694206e-05   0.000000e+00 
  1.600000e+02   6.536474e-05   0.000000e+00   6.536474e-05   0.000000e+00 
  1.620000e+02   5.003712e-05   0.000000e+00   5.003712e-05   0.000000e+00 
  1.640000e+02   4.394281e-05   0.000000e+00   4.394281e-05   0.000000e+00 
  1.660000e+02   4.648858e-05   0.000000e+00   4.648858e-05   0.000000e+00 
  1.680000e+02   7.324154e-05   0.000000e+00   7.324154e-05   0.000000e+00 
  1.700000e+02   1.773551e-04   0.000000e+00   1.773551e-04   0.000000e+00 
  1.720000e+02   1.708123e-04   0.000000e+00   1.708123e-04   0.000000e+00 
  1.740000e+02   9.351243e-05   0.000000e+00   9.351243e-05   0.000000e+00 
  1.760000e+02   7.869681e-05   0.000000e+00   7.869681e-05   0.000000e+00 
  1.780000e+02   6.798914e-05   0.000000e+00   6.798914e-05   0.000000e+00 
  1.800000e+02   7.330145e-05   0.000000e+00   7.330145e-05   0.000000e+00 
  1.820000e+02   6.304806e-05   0.000000e+00   6.304806e-05   0.000000e+00 
  1.840000e+02   4.109407e-05   0.000000e+00   4.109407e-05   0.000000e+00 
  1.860000e+02   3.168931e-05   0.000000e+00   3.168931e-05   0.000000e+00 
  1.880000e+02   3.462816e-05   0.000000e+00   3.462816e-05   0.000000e+00 
  1.900000e+02   3.372203e-05   0.000000e+00   3.372203e-05   0.000000e+00 
  1.920000e+02   2.819128e-05   0.000000e+00   2.819128e-05   0.000000e+00 
  1.940000e+02   2.729950e-05   0.000000e+00   2.729950e-05   0.000000e+00 
  1.960000e+02   3.024478e-05   0.000000e+00   3.024478e-05   0.000000e+00 
  1.980000e+02   3.261789e-05   0.000000e+00   3.261789e-05   0.000000e+00 
  2.000000e+02   3.983511e-05   0.000000e+00   3.983511e-05   0.000000e+00 
  2.020000e+02   3.576725e-05   0.000000e+00   3.576725e-05   0.000000e+00 
  2.040000e+02   3.373758e-05   0.000000e+00   3.373758e-05   0.000000e+00 
  2.060000e+02   3.194091e-05   0.000000e+00   3.194091e-05   0.000000e+00 
  2.080000e+02   3.351714e-05   0.000000e+00   3.351714e-05   0.000000e+00 
  2.100000e+02   3.395144e-05   0.000000e+00   3.395144e-05   0.000000e+00 
  2.120000e+02   3.328619e-05   0.000000e+00   3.328619e-05   0.000000e+00 
  2.140000e+02   3.907330e-05   0.000000e+00   3.907330e-05   0.000000e+00 
  2.160000e+02   3.690816e-05   0.000000e+00   3.690816e-05   0.000000e+00 
  2.180000e+02   3.038528e-05   0.000000e+00   3.038528e-05   0.000000e+00 
  2.200000e+02   2.716030e-05   0.000000e+00   2.716030e-05   0.000000e+00 
  2.220000e+02   2.700755e-05   0.000000e+00   2.700755e-05   0.000000e+00 
  2.240000e+02   2.732128e-05   0.000000e+00   2.732128e-05   0.000000e+00 
  2.260000e+02   2.381284e-05   0.000000e+00   2.381284e-05   0.000000e+00 
  2.280000e+02   2.084633e-05   0.000000e+00   2.084633e-05   0.000000e+00 
  2.300000e+02   2.192393e-05   0.000000e+00   2.192393e-05   0.000000e+00 
  2.320000e+02   1.987716e-05   0.000000e+00   1.987716e-05   0.000000e+00 
  2.340000e+02   2.446967e-05   0.000000e+00   2.446967e-05   0.000000e+00 
  2.360000e+02   2.360235e-05   0.000000e+00   2.360235e-05   0.000000e+00 
  2.380000e+02   2.110897e-05   0.000000e+00   2.110897e-05   0.000000e+00 
  2.400000e+02   2.479601e-05   0.000000e+00   2.479601e-05   0.000000e+00 
  2.420000e+02   1.728801e-05   0.000000e+00   1.728801e-05   0.000000e+00 
  2.440000e+02   1.445383e-05   0.000000e+00   1.445383e-05   0.000000e+00 
  2.460000e+02   1.603917e-05   0.000000e+00   1.603917e-05   0.000000e+00 
  2.480000e+02   1.510014e-05   0.000000e+00   1.510014e-05   0.000000e+00 
  2.500000e+02   1.425895e-05   0.000000e+00   1.425895e-05   0.000000e+00 
  2.520000e+02   1.461932e-05   0.000000e+00   1.461932e-05   0.000000e+00 
  2.540000e+02   1.403364e-05   0.000000e+00   1.403364e-05   0.000000e+00 
  2.560000e+02   1.553299e-05   0.000000e+00   1.553299e-05   0.000000e+00 
  2.580000e+02   1.665451e-05   0.000000e+00   1.665451e-05   0.000000e+00 
  2.600000e+02   1.707277e-05   0.000000e+00   1.707277e-05   0.000000e+00 
  2.620000e+02   1.902253e-05   0.000000e+00   1.902253e-05   0.000000e+00 
  2.640000e+02   1.869255e-05   0.000000e+00   1.869255e-05   0.000000e+00 
  2.660000e+02   1.707408e-05   0.000000e+00   1.707408e-05   0.000000e+00 
  2.680000e+02   1.361742e-05   0.000000e+00   1.361742e-05   0.000000e+00 
  2.700000e+02   1.309988e-05   0.000000e+00   1.309988e-05   0.000000e+00 
  2.720000e+02   1.558291e-05   0.000000e+00   1.558291e-05   0.000000e+00 
  2.740000e+02   1.795806e-05   0.000000e+00   1.795806e-05   0.000000e+00 
  2.760000e+02   1.817993e-05   0.000000e+00   1.817993e-05   0.000000e+00 
  2.780000e+02   1.303966e-05   0.000000e+00   1.303966e-05   0.000000e+00 
  2.800000e+02   1.323910e-05   0.000000e+00   1.323910e-05   0.000000e+00 
  2.820000e+02   1.367621e-05   0.000000e+00   1.367621e-05   0.000000e+00 
  2.840000e+02   1.224433e-05   0.000000e+00   1.224433e-05   0.000000e+00 
  2.860000e+02   1.159462e-05   0.000000e+00   1.159462e-05   0.000000e+00 
  2.880000e+02   1.216469e-05   0.000000e+00   1.216469e-05   0.000000e+00 
  2.900000e+02   1.161409e-05   0.000000e+00   1.161409e-05   0.000000e+00 
  2.920000e+02   1.497603e-05   0.000000e+00   1.497603e-05   0.000000e+00 
  2.940000e+02   1.661294e-05   0.000000e+00   1.661294e-05   0.000000e+00 
  2.960000e+02   1.369016e-05   0.000000e+00   1.369016e-05   0.000000e+00 
  2.980000e+02   1.563648e-05   0.000000e+00   1.563648e-05   0.000000e+00 
  3.000000e+02   2.037801e-05   0.000000e+00   2.037801e-05   0.000000e+00 
  3.020000e+02   2.022859e-05   0.000000e+00   2.022859e-05   0.000000e+00 
  3.040000e+02   1.685036e-05   0.000000e+00   1.685036e-05   0.000000e+00 
  3.060000e+02   1.435694e-05   0.000000e+00   1.435694e-05   0.000000e+00 
  3.080000e+02   1.507677e-05   0.000000e+00   1.507677e-05   0.000000e+00 
  3.100000e+02   1.596074e-05   0.000000e+00   1.596074e-05   0.000000e+00 
  3.120000e+02   1.509799e-05   0.000000e+00   1.509799e-05   0.000000e+00 
  3.140000e+02   1.483594e-05   0.000000e+00   1.483594e-05   0.000000e+00 
  3.160000e+02   1.400857e-05   0.000000e+00   1.400857e-05   0.000000e+00 
  3.180000e+02   1.377936e-05   0.000000e+00   1.377936e-05   0.000000e+00 
  3.200000e+02   1.459338e-05   0.000000e+00   1.459338e-05   0.000000e+00 
  3.220000e+02   1.433197e-05   0.000000e+00   1.433197e-05   0.000000e+00 
  3.240000e+02   1.384295e-05   0.000000e+00   1.384295e-05   0.000000e+00 
  3.260000e+02   1.399569e-05   0.000000e+00   1.399569e-05   0.000000e+00 
  3.280000e+02   1.544862e-05   0.000000e+00   1.544862e-05   0.000000e+00 
  3.300000e+02   1.684998e-05   0.000000e+00   1.684998e-05   0.000000e+00 
  3.320000e+02   1.580639e-05   0.000000e+00   1.580639e-05   0.000000e+00 
  3.340000e+02   1.336227e-05   0.000000e+00   1.336227e-05   0.000000e+00 
  3.360000e+02   1.242491e-05   0.000000e+00   1.242491e-05   0.000000e+00 
  3.380000e+02   1.490532e-05   0.000000e+00   1.490532e-05   0.000000e+00 
  3.400000e+02   1.394426e-05   0.000000e+00   1.394426e-05   0.000000e+00 
  3.420000e+02   1.418074e-05   0.000000e+00   1.418074e-05   0.000000e+00 
  3.440000e+02   1.361479e-05   0.000000e+00   1.361479e-05   0.000000e+00 
  3.460000e+02   1.519870e-05   0.000000e+00   1.519870e-05   0.000000e+00 
  3.480000e+02   1.429736e-05   0.000000e+00   1.429736e-05   0.000000e+00 
  3.500000e+02   1.398518e-05   0.000000e+00   1.398518e-05   0.000000e+00 
  3.520000e+02   1.550839e-05   0.000000e+00   1.550839e-05   0.000000e+00 
  3.540000e+02   1.600346e-05   0.000000e+00   1.600346e-05   0.000000e+00 
  3.560000e+02   1.506899e-05   0.000000e+00   1.506899e-05   0.000000e+00 
  3.580000e+02   1.655414e-05   0.000000e+00   1.655414e-05   0.000000e+00 
  3.600000e+02   2.220777e-05   0.000000e+00   2.220777e-05   0.000000e+00 
  3.620000e+02   1.639095e-05   0.000000e+00   1.639095e-05   0.000000e+00 
  3.640000e+02   1.474520e-05   0.000000e+00   1.474520e-05   0.000000e+00 
  3.660000e+02   1.563310e-05   0.000000e+00   1.563310e-05   0.000000e+00 
  3.680000e+02   1.518189e-05   0.000000e+00   1.518189e-05   0.000000e+00 
  3.700000e+02   1.393464e-05   0.000000e+00   1.393464e-05   0.000000e+00 
  3.720000e+02   1.447686e-05   0.000000e+00   1.447686e-05   0.000000e+00 
  3.740000e+02   1.492209e-05   0.000000e+00   1.492209e-05   0.000000e+00 
  3.760000e+02   1.387983e-05   0.000000e+00   1.387983e-05   0.000000e+00 
  3.780000e+02   1.185958e-05   0.000000e+00   1.185958e-05   0.000000e+00 
  3.800000e+02   1.351892e-05   0.000000e+00   1.351892e-05   0.000000e+00 
  3.820000e+02   1.461773e-05   0.000000e+00   1.461773e-05   0.000000e+00 
  3.840000e+02   1.410965e-05   0.000000e+00   1.410965e-05   0.000000e+00 
  3.860000e+02   1.515412e-05   0.000000e+00   1.515412e-05   0.000000e+00 
  3.880000e+02   1.826186e-05   0.000000e+00   1.826186e-05   0.000000e+00 
  3.900000e+02   1.621367e-05   0.000000e+00   1.621367e-05   0.000000e+00 
  3.920000e+02   1.541229e-05   0.000000e+00   1.541229e-05   0.000000e+00 
  3.940000e+02   1.522074e-05   0.000000e+00   1.522074e-05   0.000000e+00 
  3.960000e+02   1.314751e-05   0.000000e+00   1.314751e-05   0.000000e+00 
  3.980000e+02   1.420464e-05   0.000000e+00   1.420464e-05   0.000000e+00 
  4.000000e+02   1.450912e-05   0.000000e+00   1.450912e-05   0.000000e+00 
  4.020000e+02   1.539457e-05   0.000000e+00   1.539457e-05   0.000000e+00 
  4.040000e+02   1.455846e-05   0.000000e+00   1.455846e-05   0.000000e+00 
  4.060000e+02   1.549557e-05   0.000000e+00   1.549557e-05   0.000000e+00 
  4.080000e+02   1.531962e-05   0.000000e+00   1.531962e-05   0.000000e+00 
  4.100000e+02   1.515815e-05   0.000000e+00   1.515815e-05   0.000000e+00 
  4.120000e+02   1.514295e-05   0.000000e+00   1.514295e-05   0.000000e+00 
  4.140000e+02   1.863450e-05   0.000000e+00   1.863450e-05   0.000000e+00 
  4.160000e+02   1.513950e-05   0.000000e+00   1.513950e-05   0.000000e+00 
  4.180000e+02   1.559114e-05   0.000000e+00   1.559114e-05   0.000000e+00 
  4.200000e+02   1.945313e-05   0.000000e+00   1.945313e-05   0.000000e+00 
  4.220000e+02   1.613731e-05   0.000000e+00   1.613731e-05   0.000000e+00 
  4.240000e+02   1.424160e-05   0.000000e+00   1.424160e-05   0.000000e+00 
  4.260000e+02   1.449830e-05   0.000000e+00   1.449830e-05   0.000000e+00 
  4.280000e+02   1.586515e-05   0.000000e+00   1.586515e-05   0.000000e+00 
  4.300000e+02   1.498531e-05   0.000000e+00   1.498531e-05   0.000000e+00 
  4.320000e+02   1.764253e-05   0.000000e+00   1.764253e-05   0.000000e+00 
  4.340000e+02   1.683211e-05   0.000000e+00   1.683211e-05   0.000000e+00 
  4.360000e+02   1.666312e-05   0.000000e+00   1.666312e-05   0.000000e+00 
  4.380000e+02   1.558195e-05   0.000000e+00   1.558195e-05   0.000000e+00 
  4.400000e+02   1.595788e-05   0.000000e+00   1.595788e-05   0.000000e+00 
  4.420000e+02   1.801877e-05   0.000000e+00   1.801877e-05   0.000000e+00 
  4.440000e+02   1.711591e-05   0.000000e+00   1.711591e-05   0.000000e+00 
  4.460000e+02   1.616454e-05   0.000000e+00   1.616454e-05   0.000000e+00 
  4.480000e+02   1.636509e-05   0.000000e+00   1.636509e-05   0.000000e+00 
  4.500000e+02   1.701652e-05   0.000000e+00   1.701652e-05   0.000000e+00 
  4.520000e+02   1.580605e-05   0.000000e+00   1.580605e-05   0.000000e+00 
  4.540000e+02   1.547469e-05   0.000000e+00   1.547469e-05   0.000000e+00 
  4.560000e+02   1.591122e-05   0.000000e+00   1.591122e-05   0.000000e+00 
  4.580000e+02   1.569929e-05   0.000000e+00   1.569929e-05   0.000000e+00 
  4.600000e+02   1.706487e-05   0.000000e+00   1.706487e-05   0.000000e+00 
  4.620000e+02   1.623427e-05   0.000000e+00   1.623427e-05   0.000000e+00 
  4.640000e+02   1.768854e-05   0.000000e+00   1.768854e-05   0.000000e+00 
  4.660000e+02   1.692156e-05   0.000000e+00   1.692156e-05   0.000000e+00 
  4.680000e+02   1.705623e-05   0.000000e+00   1.705623e-05   0.000000e+00 
  4.700000e+02   1.927240e-05   0.000000e+00   1.927240e-05   0.000000e+00 
  4.720000e+02   2.076971e-05   0.000000e+00   2.076971e-05   0.000000e+00 
  4.740000e+02   1.772815e-05   0.000000e+00   1.772815e-05   0.000000e+00 
  4.760000e+02   1.947224e-05   0.000000e+00   1.947224e-05   0.000000e+00 
  4.780000e+02   2.261552e-05   0.000000e+00   2.261552e-05   0.000000e+00 
  4.800000e+02   2.079523e-05   0.000000e+00   2.079523e-05   0.000000e+00 
  4.820000e+02   1.984857e-05   0.000000e+00   1.984857e-05   0.000000e+00 
  4.840000e+02   1.788198e-05   0.000000e+00   1.788198e-05   0.000000e+00 
  4.860000e+02   1.651349e-05   0.000000e+00   1.651349e-05   0.000000e+00 
  4.880000e+02   1.768952e-05   0.000000e+00   1.768952e-05   0.000000e+00 
  4.900000e+02   1.807119e-05   0.000000e+00   1.807119e-05   0.000000e+00 
  4.920000e+02   1.950440e-05   0.000000e+00   1.950440e-05   0.000000e+00 
  4.940000e+02   2.007442e-05   0.000000e+00   2.007442e-05   0.000000e+00 
  4.960000e+02   1.713644e-05   0.000000e+00   1.713644e-05   0.000000e+00 
  4.980000e+02   1.707965e-05   0.000000e+00   1.707965e-05   0.000000e+00 
  5.000000e+02   1.966491e-05   0.000000e+00   1.966491e-05   0.000000e+00 
  5.020000e+02   2.242571e-05   0.000000e+00   2.242571e-05   0.000000e+00 
  5.040000e+02   2.099652e-05   0.000000e+00   2.099652e-05   0.000000e+00 
  5.060000e+02   2.007651e-05   0.000000e+00   2.007651e-05   0.000000e+00 
  5.080000e+02   2.120842e-05   0.000000e+00   2.120842e-05   0.000000e+00 
  5.100000e+02   1.671584e-05   0.000000e+00   1.671584e-05   0.000000e+00 
  5.120000e+02   2.001822e-05   0.000000e+00   2.001822e-05   0.000000e+00 
  5.140000e+02   2.339400e-05   0.000000e+00   2.339400e-05   0.000000e+00 
  5.160000e+02   2.260573e-05   0.000000e+00   2.260573e-05   0.000000e+00 
  5.180000e+02   1.939941e-05   0.000000e+00   1.939941e-05   0.000000e+00 
  5.200000e+02   1.881090e-05   0.000000e+00   1.881090e-05   0.000000e+00 
  5.220000e+02   2.219619e-05   0.000000e+00   2.219619e-05   0.000000e+00 
  5.240000e+02   2.296527e-05   0.000000e+00   2.296527e-05   0.000000e+00 
  5.260000e+02   2.069259e-05   0.000000e+00   2.069259e-05   0.000000e+00 
  5.280000e+02   1.867636e-05   0.000000e+00   1.867636e-05   0.000000e+00 
  5.300000e+02   1.797858e-05   0.000000e+00   1.797858e-05   0.000000e+00 
  5.320000e+02   1.804838e-05   0.000000e+00   1.804838e-05   0.000000e+00 
  5.340000e+02   1.780391e-05   0.000000e+00   1.780391e-05   0.000000e+00 
  5.360000e+02   1.504237e-05   0.000000e+00   1.504237e-05   0.000000e+00 
  5.380000e+02   2.636049e-05   0.000000e+00   2.636049e-05   0.000000e+00 
  5.400000e+02   4.460719e-05   0.000000e+00   4.460719e-05   0.000000e+00 
  5.420000e+02   2.847152e-05   0.000000e+00   2.847152e-05   0.000000e+00 
  5.440000e+02   2.025642e-05   0.000000e+00   2.025642e-05   0.000000e+00 
  5.460000e+02   4.531048e-05   0.000000e+00   4.531048e-05   0.000000e+00 
  5.480000e+02   6.056249e-05   0.000000e+00   6.056249e-05   0.000000e+00 
  5.500000e+02   4.283084e-05   0.000000e+00   4.283084e-05   0.000000e+00 
  5.520000e+02   6.651074e-05   0.000000e+00   6.651074e-05   0.000000e+00 
  5.540000e+02   4.275611e-05   0.000000e+00   4.275611e-05   0.000000e+00 
  5.560000e+02   2.044567e-05   0.000000e+00   2.044567e-05   0.000000e+00 
  5.580000e+02   2.022757e-05   0.000000e+00   2.022757e-05   0.000000e+00 
  5.600000e+02   5.548932e-05   0.000000e+00   5.548932e-05   0.000000e+00 
  5.620000e+02   8.840269e-05   0.000000e+00   8.840269e-05   0.000000e+00 
  5.640000e+02   4.107870e-05   0.000000e+00   4.107870e-05   0.000000e+00 
  5.660000e+02   1.984583e-05   0.000000e+00   1.984583e-05   0.000000e+00 
  5.680000e+02   1.686950e-05   0.000000e+00   1.686950e-05   0.000000e+00 
  5.700000e+02   1.762865e-05   0.000000e+00   1.762865e-05   0.000000e+00 
  5.720000e+02   1.698860e-05   0.000000e+00   1.698860e-05   0.000000e+00 
  5.740000e+02   1.787731e-05   0.000000e+00   1.787731e-05   0.000000e+00 
  5.760000e+02   1.709909e-05   0.000000e+00   1.709909e-05   0.000000e+00 
  5.780000e+02   1.751706e-05   0.000000e+00   1.751706e-05   0.000000e+00 
  5.800000e+02   1.741430e-05   0.000000e+00   1.741430e-05   0.000000e+00 
  5.820000e+02   1.921560e-05   0.000000e+00   1.921560e-05   0.000000e+00 
  5.840000e+02   2.087461e-05   0.000000e+00   2.087461e-05   0.000000e+00 
  5.860000e+02   1.893442e-05   0.000000e+00   1.893442e-05   0.000000e+00 
  5.880000e+02   1.905217e-05   0.000000e+00   1.905217e-05   0.000000e+00 
  5.900000e+02   2.050459e-05   0.000000e+00   2.050459e-05   0.000000e+00 
  5.920000e+02   2.015050e-05   0.000000e+00   2.015050e-05   0.000000e+00 
  5.940000e+02   1.660087e-05   0.000000e+00   1.660087e-05   0.000000e+00 
  5.960000e+02   1.829602e-05   0.000000e+00   1.829602e-05   0.000000e+00 
  5.980000e+02   1.946146e-05   0.000000e+00   1.946146e-05   0.000000e+00 
  6.000000e+02   2.286173e-05   0.000000e+00   2.286173e-05   0.000000e+00 
  6.020000e+02   2.447070e-05   0.000000e+00   2.447070e-05   0.000000e+00 
  6.040000e+02   4.721938e-05   0.000000e+00   4.721938e-05   0.000000e+00 
  6.060000e+02   4.138221e-05   0.000000e+00   4.138221e-05   0.000000e+00 
  6.080000e+02   2.142091e-05   0.000000e+00   2.142091e-05   0.000000e+00 
  6.100000e+02   2.333845e-05   0.000000e+00   2.333845e-05   0.000000e+00 
  6.120000e+02   3.771062e-05   0.000000e+00   3.771062e-05   0.000000e+00 
  6.140000e+02   3.130183e-05   0.000000e+00   3.130183e-05   0.000000e+00 
  6.160000e+02   1.953860e-05   0.000000e+00   1.953860e-05   0.000000e+00 
  6.180000e+02   1.844334e-05   0.000000e+00   1.844334e-05   0.000000e+00 
  6.200000e+02   1.722839e-05   0.000000e+00   1.722839e-05   0.000000e+00 
  6.220000e+02   1.714707e-05   0.000000e+00   1.714707e-05   0.000000e+00 
  6.240000e+02   1.678595e-05   0.000000e+00   1.678595e-05   0.000000e+00 
  6.260000e+02   1.891708e-05   0.000000e+00   1.891708e-05   0.000000e+00 
  6.280000e+02   2.004850e-05   0.000000e+00   2.004850e-05   0.000000e+00 
  6.300000e+02   1.981065e-05   0.000000e+00   1.981065e-05   0.000000e+00 
  6.320000e+02   2.024128e-05   0.000000e+00   2.024128e-05   0.000000e+00 
  6.340000e+02   1.816344e-05   0.000000e+00   1.816344e-05   0.000000e+00 
  6.360000e+02   1.815152e-05   0.000000e+00   1.815152e-05   0.000000e+00 
  6.380000e+02   1.565116e-05   0.000000e+00   1.565116e-05   0.000000e+00 
  6.400000e+02   1.583013e-05   0.000000e+00   1.583013e-05   0.000000e+00 
  6.420000e+02   1.788049e-05   0.000000e+00   1.788049e-05   0.000000e+00 
  6.440000e+02   1.708142e-05   0.000000e+00   1.708142e-05   0.000000e+00 
  6.460000e+02   1.816004e-05   0.000000e+00   1.816004e-05   0.000000e+00 
  6.480000e+02   1.794667e-05   0.000000e+00   1.794667e-05   0.000000e+00 
  6.500000e+02   1.813726e-05   0.000000e+00   1.813726e-05   0.000000e+00 
  6.520000e+02   2.131224e-05   0.000000e+00   2.131224e-05   0.000000e+00 
  6.540000e+02   1.989317e-05   0.000000e+00   1.989317e-05   0.000000e+00 
  6.560000e+02   1.902970e-05   0.000000e+00   1.902970e-05   0.000000e+00 
  6.580000e+02   2.604587e-05   0.000000e+00   2.604587e-05   0.000000e+00 
  6.600000e+02   3.663391e-05   0.000000e+00   3.663391e-05   0.000000e+00 
  6.620000e+02   2.330686e-05   0.000000e+00   2.330686e-05   0.000000e+00 
  6.640000e+02   1.860879e-05   0.000000e+00   1.860879e-05   0.000000e+00 
  6.660000e+02   1.806624e-05   0.000000e+00   1.806624e-05   0.000000e+00 
  6.680000e+02   1.837318e-05   0.000000e+00   1.837318e-05   0.000000e+00 
  6.700000e+02   1.804072e-05   0.000000e+00   1.804072e-05   0.000000e+00 
  6.720000e+02   1.699978e-05   0.000000e+00   1.699978e-05   0.000000e+00 
  6.740000e+02   1.936930e-05   0.000000e+00   1.936930e-05   0.000000e+00 
  6.760000e+02   1.940593e-05   0.000000e+00   1.940593e-05   0.000000e+00 
  6.780000e+02   1.922798e-05   0.000000e+00   1.922798e-05   0.000000e+00 
  6.800000e+02   1.947988e-05   0.000000e+00   1.947988e-05   0.000000e+00 
  6.820000e+02   2.293870e-05   0.000000e+00   2.293870e-05   0.000000e+00 
  6.840000e+02   2.212635e-05   0.000000e+00   2.212635e-05   0.000000e+00 
  6.860000e+02   2.321157e-05   0.000000e+00   2.321157e-05   0.000000e+00 
  6.880000e+02   2.737677e-05   0.000000e+00   2.737677e-05   0.000000e+00 
  6.900000e+02   3.020937e-05   0.000000e+00   3.020937e-05   0.000000e+00 
  6.920000e+02   3.158785e-05   0.000000e+00   3.158785e-05   0.000000e+00 
  6.940000e+02   3.227712e-05   0.000000e+00   3.227712e-05   0.000000e+00 
  6.960000e+02   3.001293e-05   0.000000e+00   3.001293e-05   0.000000e+00 
  6.980000e+02   2.818733e-05   0.000000e+00   2.818733e-05   0.000000e+00 
  7.000000e+02   3.107418e-05   0.000000e+00   3.107418e-05   0.000000e+00 
  7.020000e+02   3.030906e-05   0.000000e+00   3.030906e-05   0.000000e+00 
  7.040000e+02   2.354833e-05   0.000000e+00   2.354833e-05   0.000000e+00 
  7.060000e+02   2.484420e-05   0.000000e+00   2.484420e-05   0.000000e+00 
  7.080000e+02   2.613013e-05   0.000000e+00   2.613013e-05   0.000000e+00 
  7.100000e+02   2.110229e-05   0.000000e+00   2.110229e-05   0.000000e+00 
  7.120000e+02   2.072619e-05   0.000000e+00   2.072619e-05   0.000000e+00 
  7.140000e+02   2.173847e-05   0.000000e+00   2.173847e-05   0.000000e+00 
  7.160000e+02   2.089143e-05   0.000000e+00   2.089143e-05   0.000000e+00 
  7.180000e+02   2.006982e-05   0.000000e+00   2.006982e-05   0.000000e+00 
  7.200000e+02   1.948565e-05   0.000000e+00   1.948565e-05   0.000000e+00 
  7.220000e+02   1.952134e-05   0.000000e+00   1.952134e-05   0.000000e+00 
  7.240000e+02   2.053589e-05   0.000000e+00   2.053589e-05   0.000000e+00 
  7.260000e+02   1.767894e-05   0.000000e+00   1.767894e-05   0.000000e+00 
  7.280000e+02   1.797500e-05   0.000000e+00   1.797500e-05   0.000000e+00 
  7.300000e+02   1.508620e-05   0.000000e+00   1.508620e-05   0.000000e+00 
  7.320000e+02   1.867441e-05   0.000000e+00   1.867441e-05   0.000000e+00 
  7.340000e+02   2.183508e-05   0.000000e+00   2.183508e-05   0.000000e+00 
  7.360000e+02   2.182291e-05   0.000000e+00   2.182291e-05   0.000000e+00 
  7.380000e+02   2.020028e-05   0.000000e+00   2.020028e-05   0.000000e+00 
  7.400000e+02   2.035904e-05   0.000000e+00   2.035904e-05   0.000000e+00 
  7.420000e+02   2.050324e-05   0.000000e+00   2.050324e-05   0.000000e+00 
  7.440000e+02   2.087155e-05   0.000000e+00   2.087155e-05   0.000000e+00 
  7.460000e+02   2.082704e-05   0.000000e+00   2.082704e-05   0.000000e+00 
  7.480000e+02   1.929679e-05   0.000000e+00   1.929679e-05   0.000000e+00 
  7.500000e+02   2.133783e-05   0.000000e+00   2.133783e-05   0.000000e+00 
  7.520000e+02   2.474091e-05   0.000000e+00   2.474091e-05   0.000000e+00 
  7.540000e+02   2.846601e-05   0.000000e+00   2.846601e-05   0.000000e+00 
  7.560000e+02   3.716128e-05   0.000000e+00   3.716128e-05   0.000000e+00 
  7.580000e+02   4.790419e-05   0.000000e+00   4.790419e-05   0.000000e+00 
  7.600000e+02   5.271153e-05   0.000000e+00   5.271153e-05   0.000000e+00 
  7.620000e+02   4.499483e-05   0.000000e+00   4.499483e-05   0.000000e+00 
  7.640000e+02   3.822840e-05   0.000000e+00   3.822840e-05   0.000000e+00 
  7.660000e+02   3.948832e-05   0.000000e+00   3.948832e-05   0.000000e+00 
  7.680000e+02   3.602614e-05   0.000000e+00   3.602614e-05   0.000000e+00 
  7.700000e+02   3.385428e-05   0.000000e+00   3.385428e-05   0.000000e+00 
  7.720000e+02   2.887680e-05   0.000000e+00   2.887680e-05   0.000000e+00 
  7.740000e+02   2.782294e-05   0.000000e+00   2.782294e-05   0.000000e+00 
  7.760000e+02   3.273219e-05   0.000000e+00   3.273219e-05   0.000000e+00 
  7.780000e+02   3.596945e-05   0.000000e+00   3.596945e-05   0.000000e+00 
  7.800000e+02   3.370105e-05   0.000000e+00   3.370105e-05   0.000000e+00 
  7.820000e+02   2.985062e-05   0.000000e+00   2.985062e-05   0.000000e+00 
  7.840000e+02   2.865258e-05   0.000000e+00   2.865258e-05   0.000000e+00 
  7.860000e+02   2.585932e-05   0.000000e+00   2.585932e-05   0.000000e+00 
  7.880000e+02   2.563813e-05   0.000000e+00   2.563813e-05   0.000000e+00 
  7.900000e+02   2.836750e-05   0.000000e+00   2.836750e-05   0.000000e+00 
  7.920000e+02   2.757305e-05   0.000000e+00   2.757305e-05   0.000000e+00 
  7.940000e+02   3.353848e-05   0.000000e+00   3.353848e-05   0.000000e+00 
  7.960000e+02   3.030987e-05   0.000000e+00   3.030987e-05   0.000000e+00 
  7.980000e+02   3.041858e-05   0.000000e+00   3.041858e-05   0.000000e+00 
  8.000000e+02   3.309035e-05   0.000000e+00   3.309035e-05   0.000000e+00 
  8.020000e+02   2.967634e-05   0.000000e+00   2.967634e-05   0.000000e+00 
  8.040000e+02   2.872118e-05   0.000000e+00   2.872118e-05   0.000000e+00 
  8.060000e+02   3.015671e-05   0.000000e+00   3.015671e-05   0.000000e+00 
  8.080000e+02   2.882476e-05   0.000000e+00   2.882476e-05   0.000000e+00 
  8.100000e+02   2.730616e-05   0.000000e+00   2.730616e-05   0.000000e+00 
  8.120000e+02   2.693494e-05   0.000000e+00   2.693494e-05   0.000000e+00 
  8.140000e+02   2.779852e-05   0.000000e+00   2.779852e-05   0.000000e+00 
  8.160000e+02   2.242625e-05   0.000000e+00   2.242625e-05   0.000000e+00 
  8.180000e+02   2.526066e-05   0.000000e+00   2.526066e-05   0.000000e+00 
  8.200000e+02   2.471249e-05   0.000000e+00   2.471249e-05   0.000000e+00 
  8.220000e+02   2.812382e-05   0.000000e+00   2.812382e-05   0.000000e+00 
  8.240000e+02   2.679392e-05   0.000000e+00   2.679392e-05   0.000000e+00 
  8.260000e+02   2.425799e-05   0.000000e+00   2.425799e-05   0.000000e+00 
  8.280000e+02   2.942549e-05   0.000000e+00   2.942549e-05   0.000000e+00 
  8.300000e+02   2.554152e-05   0.000000e+00   2.554152e-05   0.000000e+00 
  8.320000e+02   2.419580e-05   0.000000e+00   2.419580e-05   0.000000e+00 
  8.340000e+02   2.556731e-05   0.000000e+00   2.556731e-05   0.000000e+00 
  8.360000e+02   2.114609e-05   0.000000e+00   2.114609e-05   0.000000e+00 
  8.380000e+02   2.107756e-05   0.000000e+00   2.107756e-05   0.000000e+00 
  8.400000e+02   2.430596e-05   0.000000e+00   2.430596e-05   0.000000e+00 
  8.420000e+02   2.065421e-05   0.000000e+00   2.065421e-05   0.000000e+00 
  8.440000e+02   2.236466e-05   0.000000e+00   2.236466e-05   0.000000e+00 
  8.460000e+02   2.239121e-05   0.000000e+00   2.239121e-05   0.000000e+00 
  8.480000e+02   2.365451e-05   0.000000e+00   2.365451e-05   0.000000e+00 
  8.500000e+02   2.328255e-05   0.000000e+00   2.328255e-05   0.000000e+00 
  8.520000e+02   2.418927e-05   0.000000e+00   2.418927e-05   0.000000e+00 
  8.540000e+02   2.663452e-05   0.000000e+00   2.663452e-05   0.000000e+00 
  8.560000e+02   2.548746e-05   0.000000e+00   2.548746e-05   0.000000e+00 
  8.580000e+02   2.348810e-05   0.000000e+00   2.348810e-05   0.000000e+00 
  8.600000e+02   2.296800e-05   0.000000e+00   2.296800e-05   0.000000e+00 
  8.620000e+02   2.752887e-05   0.000000e+00   2.752887e-05   0.000000e+00 
  8.640000e+02   4.112475e-05   0.000000e+00   4.112475e-05   0.000000e+00 
  8.660000e+02   3.375926e-05   0.000000e+00   3.375926e-05   0.000000e+00 
  8.680000e+02   2.060708e-05   0.000000e+00   2.060708e-05   0.000000e+00 
  8.700000e+02   2.060643e-05   0.000000e+00   2.060643e-05   0.000000e+00 
  8.720000e+02   2.212130e-05   0.000000e+00   2.212130e-05   0.000000e+00 
  8.740000e+02   2.249592e-05   0.000000e+00   2.249592e-05   0.000000e+00 
  8.760000e+02   2.336051e-05   0.000000e+00   2.336051e-05   0.000000e+00 
  8.780000e+02   2.280221e-05   0.000000e+00   2.280221e-05   0.000000e+00 
  8.800000e+02   2.142641e-05   0.000000e+00   2.142641e-05   0.000000e+00 
  8.820000e+02   2.008365e-05   0.000000e+00   2.008365e-05   0.000000e+00 
  8.840000e+02   1.979560e-05   0.000000e+00   1.979560e-05   0.000000e+00 
  8.860000e+02   2.226508e-05   0.000000e+00   2.226508e-05   0.000000e+00 
  8.880000e+02   2.032632e-05   0.000000e+00   2.032632e-05   0.000000e+00 
  8.900000e+02   1.981572e-05   0.000000e+00   1.981572e-05   0.000000e+00 
  8.920000e+02   2.158009e-05   0.000000e+00   2.158009e-05   0.000000e+00 
  8.940000e+02   2.109287e-05   0.000000e+00   2.109287e-05   0.000000e+00 
  8.960000e+02   2.026814e-05   0.000000e+00   2.026814e-05   0.000000e+00 
  8.980000e+02   2.154439e-05   0.000000e+00   2.154439e-05   0.000000e+00 
  9.000000e+02   3.088973e-05   0.000000e+00   3.088973e-05   0.000000e+00 
  9.020000e+02   2.168212e-05   0.000000e+00   2.168212e-05   0.000000e+00 
  9.040000e+02   2.089508e-05   0.000000e+00   2.089508e-05   0.000000e+00 
  9.060000e+02   2.855358e-05   0.000000e+00   2.855358e-05   0.000000e+00 
  9.080000e+02   2.881352e-05   0.000000e+00   2.881352e-05   0.000000e+00 
  9.100000e+02   2.076868e-05   0.000000e+00   2.076868e-05   0.000000e+00 
  9.120000e+02   2.075065e-05   0.000000e+00   2.075065e-05   0.000000e+00 
  9.140000e+02   2.122731e-05   0.000000e+00   2.122731e-05   0.000000e+00 
  9.160000e+02   2.276838e-05   0.000000e+00   2.276838e-05   0.000000e+00 
  9.180000e+02   2.699848e-05   0.000000e+00   2.699848e-05   0.000000e+00 
  9.200000e+02   2.821095e-05   0.000000e+00   2.821095e-05   0.000000e+00 
  9.220000e+02   3.051025e-05   0.000000e+00   3.051025e-05   0.000000e+00 
  9.240000e+02   3.244796e-05   0.000000e+00   3.244796e-05   0.000000e+00 
  9.260000e+02   3.112594e-05   0.000000e+00   3.112594e-05   0.000000e+00 
  9.280000e+02   3.345352e-05   0.000000e+00   3.345352e-05   0.000000e+00 
  9.300000e+02   3.020741e-05   0.000000e+00   3.020741e-05   0.000000e+00 
  9.320000e+02   2.909090e-05   0.000000e+00   2.909090e-05   0.000000e+00 
  9.340000e+02   2.665802e-05   0.000000e+00   2.665802e-05   0.000000e+00 
  9.360000e+02   2.735769e-05   0.000000e+00   2.735769e-05   0.000000e+00 
  9.380000e+02   2.817937e-05   0.000000e+00   2.817937e-05   0.000000e+00 
  9.400000e+02   2.642122e-05   0.000000e+00   2.642122e-05   0.000000e+00 
  9.420000e+02   2.658959e-05   0.000000e+00   2.658959e-05   0.000000e+00 
  9.440000e+02   2.649139e-05   0.000000e+00   2.649139e-05   0.000000e+00 
  9.460000e+02   2.964510e-05   0.000000e+00   2.964510e-05   0.000000e+00 
  9.480000e+02   2.689898e-05   0.000000e+00   2.689898e-05   0.000000e+00 
  9.500000e+02   2.435690e-05   0.000000e+00   2.435690e-05   0.000000e+00 
  9.520000e+02   2.526459e-05   0.000000e+00   2.526459e-05   0.000000e+00 
  9.540000e+02   2.858111e-05   0.000000e+00   2.858111e-05   0.000000e+00 
  9.560000e+02   2.635474e-05   0.000000e+00   2.635474e-05   0.000000e+00 
  9.580000e+02   2.177698e-05   0.000000e+00   2.177698e-05   0.000000e+00 
  9.600000e+02   2.173979e-05   0.000000e+00   2.173979e-05   0.000000e+00 
  9.620000e+02   2.146508e-05   0.000000e+00   2.146508e-05   0.000000e+00 
  9.640000e+02   2.320018e-05   0.000000e+00   2.320018e-05   0.000000e+00 
  9.660000e+02   2.317243e-05   0.000000e+00   2.317243e-05   0.000000e+00 
  9.680000e+02   2.121840e-05   0.000000e+00   2.121840e-05   0.000000e+00 
  9.700000e+02   2.164038e-05   0.000000e+00   2.164038e-05   0.000000e+00 
  9.720000e+02   2.132349e-05   0.000000e+00   2.132349e-05   0.000000e+00 
  9.740000e+02   2.175673e-05   0.000000e+00   2.175673e-05   0.000000e+00 
  9.760000e+02   2.009935e-05   0.000000e+00   2.009935e-05   0.000000e+00 
  9.780000e+02   2.151563e-05   0.000000e+00   2.151563e-05   0.000000e+00 
  9.800000e+02   1.961824e-05   0.000000e+00   1.961824e-05   0.000000e+00 
  9.820000e+02   2.040748e-05   0.000000e+00   2.040748e-05   0.000000e+00 
  9.840000e+02   2.439619e-05   0.000000e+00   2.439619e-05   0.000000e+00 
  9.860000e+02   2.441940e-05   0.000000e+00   2.441940e-05   0.000000e+00 
  9.880000e+02   2.672623e-05   0.000000e+00   2.672623e-05   0.000000e+00 
  9.900000e+02   2.806102e-05   0.000000e+00   2.806102e-05   0.000000e+00 
  9.920000e+02   2.848460e-05   0.000000e+00   2.848460e-05   0.000000e+00 
  9.940000e+02   2.368610e-05   0.000000e+00   2.368610e-05   0.000000e+00 
  9.960000e+02   2.917022e-05   0.000000e+00   2.917022e-05   0.000000e+00 
  9.980000e+02   3.287341e-05   0.000000e+00   3.287341e-05   0.000000e+00 
  1.000000e+03   2.868102e-05   0.000000e+00   2.868102e-05   0.000000e+00 
  1.002000e+03   2.347142e-05   0.000000e+00   2.347142e-05   0.000000e+00 
  1.004000e+03   2.585789e-05   0.000000e+00   2.585789e-05   0.000000e+00 
  1.006000e+03   2.420547e-05   0.000000e+00   2.420547e-05   0.000000e+00 
  1.008000e+03   2.176985e-05   0.000000e+00   2.176985e-05   0.000000e+00 
  1.010000e+03   2.073631e-05   0.000000e+00   2.073631e-05   0.000000e+00 
  1.012000e+03   2.080332e-05   0.000000e+00   2.080332e-05   0.000000e+00 
  1.014000e+03   2.455118e-05   0.000000e+00   2.455118e-05   0.000000e+00 
  1.016000e+03   2.764515e-05   0.000000e+00   2.764515e-05   0.000000e+00 
  1.018000e+03   2.805282e-05   0.000000e+00   2.805282e-05   0.000000e+00 
  1.020000e+03   3.662127e-05   0.000000e+00   3.662127e-05   0.000000e+00 
  1.022000e+03   3.653789e-05   0.000000e+00   3.653789e-05   0.000000e+00 
  1.024000e+03   2.715285e-05   0.000000e+00   2.715285e-05   0.000000e+00 
  1.026000e+03   2.757415e-05   0.000000e+00   2.757415e-05   0.000000e+00 
  1.028000e+03   2.439829e-05   0.000000e+00   2.439829e-05   0.000000e+00 
  1.030000e+03   2.428050e-05   0.000000e+00   2.428050e-05   0.000000e+00 
  1.032000e+03   2.639596e-05   0.000000e+00   2.639596e-05   0.000000e+00 
  1.034000e+03   2.562577e-05   0.000000e+00   2.562577e-05   0.000000e+00 
  1.036000e+03   2.409457e-05   0.000000e+00   2.409457e-05   0.000000e+00 
  1.038000e+03   2.330728e-05   0.000000e+00   2.330728e-05   0.000000e+00 
  1.040000e+03   2.392403e-05   0.000000e+00   2.392403e-05   0.000000e+00 
  1.042000e+03   2.533410e-05   0.000000e+00   2.533410e-05   0.000000e+00 
  1.044000e+03   3.051183e-05   0.000000e+00   3.051183e-05   0.000000e+00 
  1.046000e+03   3.369547e-05   0.000000e+00   3.369547e-05   0.000000e+00 
  1.048000e+03   2.775831e-05   0.000000e+00   2.775831e-05   0.000000e+00 
  1.050000e+03   2.600592e-05   0.000000e+00   2.600592e-05   0.000000e+00 
  1.052000e+03   2.482841e-05   0.000000e+00   2.482841e-05   0.000000e+00 
  1.054000e+03   3.297314e-05   0.000000e+00   3.297314e-05   0.000000e+00 
  1.056000e+03   3.008162e-05   0.000000e+00   3.008162e-05   0.000000e+00 
  1.058000e+03   2.817492e-05   0.000000e+00   2.817492e-05   0.000000e+00 
  1.060000e+03   2.840877e-05   0.000000e+00   2.840877e-05   0.000000e+00 
  1.062000e+03   3.112920e-05   0.000000e+00   3.112920e-05   0.000000e+00 
  1.064000e+03   2.704935e-05   0.000000e+00   2.704935e-05   0.000000e+00 
  1.066000e+03   2.888984e-05   0.000000e+00   2.888984e-05   0.000000e+00 
  1.068000e+03   2.612720e-05   0.000000e+00   2.612720e-05   0.000000e+00 
  1.070000e+03   2.357982e-05   0.000000e+00   2.357982e-05   0.000000e+00 
  1.072000e+03   2.681502e-05   0.000000e+00   2.681502e-05   0.000000e+00 
  1.074000e+03   2.639184e-05   0.000000e+00   2.639184e-05   0.000000e+00 
  1.076000e+03   2.785570e-05   0.000000e+00   2.785570e-05   0.000000e+00 
  1.078000e+03   2.761104e-05   0.000000e+00   2.761104e-05   0.000000e+00 
  1.080000e+03   2.725927e-05   0.000000e+00   2.725927e-05   0.000000e+00 
  1.082000e+03   2.657696e-05   0.000000e+00   2.657696e-05   0.000000e+00 
  1.084000e+03   2.428733e-05   0.000000e+00   2.428733e-05   0.000000e+00 
  1.086000e+03   2.448757e-05   0.000000e+00   2.448757e-05   0.000000e+00 
  1.088000e+03   2.428559e-05   0.000000e+00   2.428559e-05   0.000000e+00 
  1.090000e+03   2.398329e-05   0.000000e+00   2.398329e-05   0.000000e+00 
  1.092000e+03   2.087263e-05   0.000000e+00   2.087263e-05   0.000000e+00 
  1.094000e+03   2.189537e-05   0.000000e+00   2.189537e-05   0.000000e+00 
  1.096000e+03   1.976145e-05   0.000000e+00   1.976145e-05   0.000000e+00 
  1.098000e+03   1.701659e-05   0.000000e+00   1.701659e-05   0.000000e+00 
  1.100000e+03   1.716267e-05   0.000000e+00   1.716267e-05   0.000000e+00 
  1.102000e+03   1.833223e-05   0.000000e+00   1.833223e-05   0.000000e+00 
  1.104000e+03   1.828721e-05   0.000000e+00   1.828721e-05   0.000000e+00 
  1.106000e+03   1.718785e-05   0.000000e+00   1.718785e-05   0.000000e+00 
  1.108000e+03   1.820808e-05   0.000000e+00   1.820808e-05   0.000000e+00 
  1.110000e+03   1.775689e-05   0.000000e+00   1.775689e-05   0.000000e+00 
  1.112000e+03   1.667770e-05   0.000000e+00   1.667770e-05   0.000000e+00 
  1.114000e+03   1.677773e-05   0.000000e+00   1.677773e-05   0.000000e+00 
  1.116000e+03   1.614057e-05   0.000000e+00   1.614057e-05   0.000000e+00 
  1.118000e+03   1.664683e-05   0.000000e+00   1.664683e-05   0.000000e+00 
  1.120000e+03   1.710105e-05   0.000000e+00   1.710105e-05   0.000000e+00 
  1.122000e+03   1.533111e-05   0.000000e+00   1.533111e-05   0.000000e+00 
  1.124000e+03   1.403913e-05   0.000000e+00   1.403913e-05   0.000000e+00 
  1.126000e+03   1.576687e-05   0.000000e+00   1.576687e-05   0.000000e+00 
  1.128000e+03   1.542098e-05   0.000000e+00   1.542098e-05   0.000000e+00 
  1.130000e+03   1.396471e-05   0.000000e+00   1.396471e-05   0.000000e+00 
  1.132000e+03   1.514934e-05   0.000000e+00   1.514934e-05   0.000000e+00 
  1.134000e+03   1.431900e-05   0.000000e+00   1.431900e-05   0.000000e+00 
  1.136000e+03   1.472626e-05   0.000000e+00   1.472626e-05   0.000000e+00 
  1.138000e+03   1.520201e-05   0.000000e+00   1.520201e-05   0.000000e+00 
  1.140000e+03   1.692525e-05   0.000000e+00   1.692525e-05   0.000000e+00 
  1.142000e+03   1.379703e-05   0.000000e+00   1.379703e-05   0.000000e+00 
  1.144000e+03   1.464663e-05   0.000000e+00   1.464663e-05   0.000000e+00 
  1.146000e+03   1.606253e-05   0.000000e+00   1.606253e-05   0.000000e+00 
  1.148000e+03   1.674404e-05   0.000000e+00   1.674404e-05   0.000000e+00 
  1.150000e+03   1.554389e-05   0.000000e+00   1.554389e-05   0.000000e+00 
  1.152000e+03   1.546445e-05   0.000000e+00   1.546445e-05   0.000000e+00 
  1.154000e+03   1.565931e-05   0.000000e+00   1.565931e-05   0.000000e+00 
  1.156000e+03   1.535932e-05   0.000000e+00   1.535932e-05   0.000000e+00 
  1.158000e+03   1.448581e-05   0.000000e+00   1.448581e-05   0.000000e+00 
  1.160000e+03   1.487384e-05   0.000000e+00   1.487384e-05   0.000000e+00 
  1.162000e+03   1.506408e-05   0.000000e+00   1.506408e-05   0.000000e+00 
  1.164000e+03   1.415494e-05   0.000000e+00   1.415494e-05   0.000000e+00 
  1.166000e+03   1.351310e-05   0.000000e+00   1.351310e-05   0.000000e+00 
  1.168000e+03   1.376043e-05   0.000000e+00   1.376043e-05   0.000000e+00 
  1.170000e+03   1.500197e-05   0.000000e+00   1.500197e-05   0.000000e+00 
  1.172000e+03   1.568357e-05   0.000000e+00   1.568357e-05   0.000000e+00 
  1.174000e+03   1.346765e-05   0.000000e+00   1.346765e-05   0.000000e+00 
  1.176000e+03   1.347568e-05   0.000000e+00   1.347568e-05   0.000000e+00 
  1.178000e+03   1.427932e-05   0.000000e+00   1.427932e-05   0.000000e+00 
  1.180000e+03   1.357406e-05   0.000000e+00   1.357406e-05   0.000000e+00 
  1.182000e+03   1.324014e-05   0.000000e+00   1.324014e-05   0.000000e+00 
  1.184000e+03   1.337613e-05   0.000000e+00   1.337613e-05   0.000000e+00 
  1.186000e+03   1.297238e-05   0.000000e+00   1.297238e-05   0.000000e+00 
  1.188000e+03   1.262601e-05   0.000000e+00   1.262601e-05   0.000000e+00 
  1.190000e+03   1.334947e-05   0.000000e+00   1.334947e-05   0.000000e+00 
  1.192000e+03   1.429515e-05   0.000000e+00   1.429515e-05   0.000000e+00 
  1.194000e+03   1.551848e-05   0.000000e+00   1.551848e-05   0.000000e+00 
  1.196000e+03   1.384722e-05   0.000000e+00   1.384722e-05   0.000000e+00 
  1.198000e+03   1.344092e-05   0.000000e+00   1.344092e-05   0.000000e+00 
  1.200000e+03   1.168232e-05   0.000000e+00   1.168232e-05   0.000000e+00 
  1.202000e+03   1.176149e-05   0.000000e+00   1.176149e-05   0.000000e+00 
  1.204000e+03   1.296707e-05   0.000000e+00   1.296707e-05   0.000000e+00 
  1.206000e+03   1.211897e-05   0.000000e+00   1.211897e-05   0.000000e+00 
  1.208000e+03   1.667966e-05   0.000000e+00   1.667966e-05   0.000000e+00 
  1.210000e+03   2.078809e-05   0.000000e+00   2.078809e-05   0.000000e+00 
  1.212000e+03   1.425334e-05   0.000000e+00   1.425334e-05   0.000000e+00 
  1.214000e+03   1.300808e-05   0.000000e+00   1.300808e-05   0.000000e+00 
  1.216000e+03   1.238718e-05   0.000000e+00   1.238718e-05   0.000000e+00 
  1.218000e+03   1.248323e-05   0.000000e+00   1.248323e-05   0.000000e+00 
  1.220000e+03   1.321091e-05   0.000000e+00   1.321091e-05   0.000000e+00 
  1.222000e+03   1.307864e-05   0.000000e+00   1.307864e-05   0.000000e+00 
  1.224000e+03   1.194414e-05   0.000000e+00   1.194414e-05   0.000000e+00 
  1.226000e+03   1.253066e-05   0.000000e+00   1.253066e-05   0.000000e+00 
  1.228000e+03   1.437847e-05   0.000000e+00   1.437847e-05   0.000000e+00 
  1.230000e+03   1.377278e-05   0.000000e+00   1.377278e-05   0.000000e+00 
  1.232000e+03   1.326467e-05   0.000000e+00   1.326467e-05   0.000000e+00 
  1.234000e+03   1.339833e-05   0.000000e+00   1.339833e-05   0.000000e+00 
  1.236000e+03   1.392287e-05   0.000000e+00   1.392287e-05   0.000000e+00 
  1.238000e+03   1.143754e-05   0.000000e+00   1.143754e-05   0.000000e+00 
  1.240000e+03   1.186960e-05   0.000000e+00   1.186960e-05   0.000000e+00 
  1.242000e+03   1.422381e-05   0.000000e+00   1.422381e-05   0.000000e+00 
  1.244000e+03   1.307336e-05   0.000000e+00   1.307336e-05   0.000000e+00 
  1.246000e+03   1.207919e-05   0.000000e+00   1.207919e-05   0.000000e+00 
  1.248000e+03   1.258648e-05   0.000000e+00   1.258648e-05   0.000000e+00 
  1.250000e+03   1.246633e-05   0.000000e+00   1.246633e-05   0.000000e+00 
  1.252000e+03   1.263004e-05   0.000000e+00   1.263004e-05   0.000000e+00 
  1.254000e+03   1.230668e-05   0.000000e+00   1.230668e-05   0.000000e+00 
  1.256000e+03   1.197223e-05   0.000000e+00   1.197223e-05   0.000000e+00 
  1.258000e+03   1.232395e-05   0.000000e+00   1.232395e-05   0.000000e+00 
  1.260000e+03   1.181755e-05   0.000000e+00   1.181755e-05   0.000000e+00 
  1.262000e+03   1.117280e-05   0.000000e+00   1.117280e-05   0.000000e+00 
  1.264000e+03   1.315540e-05   0.000000e+00   1.315540e-05   0.000000e+00 
  1.266000e+03   1.179238e-05   0.000000e+00   1.179238e-05   0.000000e+00 
  1.268000e+03   1.163476e-05   0.000000e+00   1.163476e-05   0.000000e+00 
  1.270000e+03   1.128313e-05   0.000000e+00   1.128313e-05   0.000000e+00 
  1.272000e+03   1.158318e-05   0.000000e+00   1.158318e-05   0.000000e+00 
  1.274000e+03   1.280447e-05   0.000000e+00   1.280447e-05   0.000000e+00 
  1.276000e+03   1.364756e-05   0.000000e+00   1.364756e-05   0.000000e+00 
  1.278000e+03   1.271952e-05   0.000000e+00   1.271952e-05   0.000000e+00 
  1.280000e+03   1.163432e-05   0.000000e+00   1.163432e-05   0.000000e+00 
  1.282000e+03   1.257810e-05   0.000000e+00   1.257810e-05   0.000000e+00 
  1.284000e+03   1.214250e-05   0.000000e+00   1.214250e-05   0.000000e+00 
  1.286000e+03   1.186326e-05   0.000000e+00   1.186326e-05   0.000000e+00 
  1.288000e+03   1.244080e-05   0.000000e+00   1.244080e-05   0.000000e+00 
  1.290000e+03   1.268453e-05   0.000000e+00   1.268453e-05   0.000000e+00 
  1.292000e+03   1.231016e-05   0.000000e+00   1.231016e-05   0.000000e+00 
  1.294000e+03   1.098106e-05   0.000000e+00   1.098106e-05   0.000000e+00 
  1.296000e+03   1.104472e-05   0.000000e+00   1.104472e-05   0.000000e+00 
  1.298000e+03   1.100891e-05   0.000000e+00   1.100891e-05   0.000000e+00 
  1.300000e+03   1.166114e-05   0.000000e+00   1.166114e-05   0.000000e+00 
  1.302000e+03   1.074852e-05   0.000000e+00   1.074852e-05   0.000000e+00 
  1.304000e+03   1.233428e-05   0.000000e+00   1.233428e-05   0.000000e+00 
  1.306000e+03   1.225841e-05   0.000000e+00   1.225841e-05   0.000000e+00 
  1.308000e+03   1.164299e-05   0.000000e+00   1.164299e-05   0.000000e+00 
  1.310000e+03   1.112783e-05   0.000000e+00   1.112783e-05   0.000000e+00 
  1.312000e+03   1.181377e-05   0.000000e+00   1.181377e-05   0.000000e+00 
  1.314000e+03   1.094090e-05   0.000000e+00   1.094090e-05   0.000000e+00 
  1.316000e+03   1.218847e-05   0.000000e+00   1.218847e-05   0.000000e+00 
  1.318000e+03   1.138632e-05   0.000000e+00   1.138632e-05   0.000000e+00 
  1.320000e+03   1.204647e-05   0.000000e+00   1.204647e-05   0.000000e+00 
  1.322000e+03   1.264214e-05   0.000000e+00   1.264214e-05   0.000000e+00 
  1.324000e+03   1.281606e-05   0.000000e+00   1.281606e-05   0.000000e+00 
  1.326000e+03   1.225862e-05   0.000000e+00   1.225862e-05   0.000000e+00 
  1.328000e+03   1.321967e-05   0.000000e+00   1.321967e-05   0.000000e+00 
  1.330000e+03   1.303004e-05   0.000000e+00   1.303004e-05   0.000000e+00 
  1.332000e+03   1.283383e-05   0.000000e+00   1.283383e-05   0.000000e+00 
  1.334000e+03   1.158300e-05   0.000000e+00   1.158300e-05   0.000000e+00 
  1.336000e+03   1.092216e-05   0.000000e+00   1.092216e-05   0.000000e+00 
  1.338000e+03   1.152992e-05   0.000000e+00   1.152992e-05   0.000000e+00 
  1.340000e+03   1.159600e-05   0.000000e+00   1.159600e-05   0.000000e+00 
  1.342000e+03   1.110262e-05   0.000000e+00   1.110262e-05   0.000000e+00 
  1.344000e+03   1.213648e-05   0.000000e+00   1.213648e-05   0.000000e+00 
  1.346000e+03   1.079652e-05   0.000000e+00   1.079652e-05   0.000000e+00 
  1.348000e+03   1.045657e-05   0.000000e+00   1.045657e-05   0.000000e+00 
  1.350000e+03   1.038204e-05   0.000000e+00   1.038204e-05   0.000000e+00 
  1.352000e+03   1.030556e-05   0.000000e+00   1.030556e-05   0.000000e+00 
  1.354000e+03   1.161043e-05   0.000000e+00   1.161043e-05   0.000000e+00 
  1.356000e+03   1.183224e-05   0.000000e+00   1.183224e-05   0.000000e+00 
  1.358000e+03   1.000032e-05   0.000000e+00   1.000032e-05   0.000000e+00 
  1.360000e+03   1.007031e-05   0.000000e+00   1.007031e-05   0.000000e+00 
  1.362000e+03   1.174736e-05   0.000000e+00   1.174736e-05   0.000000e+00 
  1.364000e+03   1.259801e-05   0.000000e+00   1.259801e-05   0.000000e+00 
  1.366000e+03   1.200879e-05   0.000000e+00   1.200879e-05   0.000000e+00 
  1.368000e+03   1.064884e-05   0.000000e+00   1.064884e-05   0.000000e+00 
  1.370000e+03   1.108004e-05   0.000000e+00   1.108004e-05   0.000000e+00 
  1.372000e+03   1.124419e-05   0.000000e+00   1.124419e-05   0.000000e+00 
  1.374000e+03   1.278607e-05   0.000000e+00   1.278607e-05   0.000000e+00 
  1.376000e+03   1.267125e-05   0.000000e+00   1.267125e-05   0.000000e+00 
  1.378000e+03   1.275407e-05   0.000000e+00   1.275407e-05   0.000000e+00 
  1.380000e+03   1.357723e-05   0.000000e+00   1.357723e-05   0.000000e+00 
  1.382000e+03   1.219352e-05   0.000000e+00   1.219352e-05   0.000000e+00 
  1.384000e+03   1.128990e-05   0.000000e+00   1.128990e-05   0.000000e+00 
  1.386000e+03   9.938940e-06   0.000000e+00   9.938940e-06   0.000000e+00 
  1.388000e+03   9.739144e-06   0.000000e+00   9.739144e-06   0.000000e+00 
  1.390000e+03   1.025218e-05   0.000000e+00   1.025218e-05   0.000000e+00 
  1.392000e+03   1.025797e-05   0.000000e+00   1.025797e-05   0.000000e+00 
  1.394000e+03   1.155300e-05   0.000000e+00   1.155300e-05   0.000000e+00 
  1.396000e+03   1.130694e-05   0.000000e+00   1.130694e-05   0.000000e+00 
  1.398000e+03   1.029479e-05   0.000000e+00   1.029479e-05   0.000000e+00 
  1.400000e+03   1.016682e-05   0.000000e+00   1.016682e-05   0.000000e+00 
  1.402000e+03   9.469578e-06   0.000000e+00   9.469578e-06   0.000000e+00 
  1.404000e+03   1.001793e-05   0.000000e+00   1.001793e-05   0.000000e+00 
  1.406000e+03   1.069933e-05   0.000000e+00   1.069933e-05   0.000000e+00 
  1.408000e+03   1.058045e-05   0.000000e+00   1.058045e-05   0.000000e+00 
  1.410000e+03   1.132682e-05   0.000000e+00   1.132682e-05   0.000000e+00 
  1.412000e+03   1.304359e-05   0.000000e+00   1.304359e-05   0.000000e+00 
  1.414000e+03   1.180591e-05   0.000000e+00   1.180591e-05   0.000000e+00 
  1.416000e+03   1.064316e-05   0.000000e+00   1.064316e-05   0.000000e+00 
  1.418000e+03   1.134917e-05   0.000000e+00   1.134917e-05   0.000000e+00 
  1.420000e+03   1.146198e-05   0.000000e+00   1.146198e-05   0.000000e+00 
  1.422000e+03   1.101891e-05   0.000000e+00   1.101891e-05   0.000000e+00 
  1.424000e+03   1.141853e-05   0.000000e+00   1.141853e-05   0.000000e+00 
  1.426000e+03   1.140509e-05   0.000000e+00   1.140509e-05   0.000000e+00 
  1.428000e+03   1.195538e-05   0.000000e+00   1.195538e-05   0.000000e+00 
  1.430000e+03   1.199171e-05   0.000000e+00   1.199171e-05   0.000000e+00 
  1.432000e+03   1.267600e-05   0.000000e+00   1.267600e-05   0.000000e+00 
  1.434000e+03   1.429369e-05   0.000000e+00   1.429369e-05   0.000000e+00 
  1.436000e+03   1.570478e-05   0.000000e+00   1.570478e-05   0.000000e+00 
  1.438000e+03   1.344540e-05   0.000000e+00   1.344540e-05   0.000000e+00 
  1.440000e+03   1.239446e-05   0.000000e+00   1.239446e-05   0.000000e+00 
  1.442000e+03   1.188604e-05   0.000000e+00   1.188604e-05   0.000000e+00 
  1.444000e+03   1.255471e-05   0.000000e+00   1.255471e-05   0.000000e+00 
  1.446000e+03   1.301578e-05   0.000000e+00   1.301578e-05   0.000000e+00 
  1.448000e+03   1.227226e-05   0.000000e+00   1.227226e-05   0.000000e+00 
  1.450000e+03   1.364282e-05   0.000000e+00   1.364282e-05   0.000000e+00 
  1.452000e+03   1.444952e-05   0.000000e+00   1.444952e-05   0.000000e+00 
  1.454000e+03   1.277232e-05   0.000000e+00   1.277232e-05   0.000000e+00 
  1.456000e+03   1.109714e-05   0.000000e+00   1.109714e-05   0.000000e+00 
  1.458000e+03   1.163153e-05   0.000000e+00   1.163153e-05   0.000000e+00 
  1.460000e+03   1.088607e-05   0.000000e+00   1.088607e-05   0.000000e+00 
  1.462000e+03   1.011495e-05   0.000000e+00   1.011495e-05   0.000000e+00 
  1.464000e+03   1.091351e-05   0.000000e+00   1.091351e-05   0.000000e+00 
  1.466000e+03   1.173197e-05   0.000000e+00   1.173197e-05   0.000000e+00 
  1.468000e+03   1.190226e-05   0.000000e+00   1.190226e-05   0.000000e+00 
  1.470000e+03   1.232704e-05   0.000000e+00   1.232704e-05   0.000000e+00 
  1.472000e+03   1.278314e-05   0.000000e+00   1.278314e-05   0.000000e+00 
  1.474000e+03   1.260206e-05   0.000000e+00   1.260206e-05   0.000000e+00 
  1.476000e+03   1.204432e-05   0.000000e+00   1.204432e-05   0.000000e+00 
  1.478000e+03   1.183184e-05   0.000000e+00   1.183184e-05   0.000000e+00 
  1.480000e+03   1.067580e-05   0.000000e+00   1.067580e-05   0.000000e+00 
  1.482000e+03   9.256893e-06   0.000000e+00   9.256893e-06   0.000000e+00 
  1.484000e+03   9.784802e-06   0.000000e+00   9.784802e-06   0.000000e+00 
  1.486000e+03   1.037861e-05   0.000000e+00   1.037861e-05   0.000000e+00 
  1.488000e+03   1.113446e-05   0.000000e+00   1.113446e-05   0.000000e+00 
  1.490000e+03   1.032403e-05   0.000000e+00   1.032403e-05   0.000000e+00 
  1.492000e+03   1.099135e-05   0.000000e+00   1.099135e-05   0.000000e+00 
  1.494000e+03   1.094385e-05   0.000000e+00   1.094385e-05   0.000000e+00 
  1.496000e+03   1.104646e-05   0.000000e+00   1.104646e-05   0.000000e+00 
  1.498000e+03   1.234524e-05   0.000000e+00   1.234524e-05   0.000000e+00 
  1.500000e+03   1.731881e-05   0.000000e+00   1.731881e-05   0.000000e+00 
  1.502000e+03   1.385731e-05   0.000000e+00   1.385731e-05   0.000000e+00 
  1.504000e+03   1.221681e-05   0.000000e+00   1.221681e-05   0.000000e+00 
  1.506000e+03   1.241221e-05   0.000000e+00   1.241221e-05   0.000000e+00 
  1.508000e+03   1.273692e-05   0.000000e+00   1.273692e-05   0.000000e+00 
  1.510000e+03   1.609721e-05   0.000000e+00   1.609721e-05   0.000000e+00 
  1.512000e+03   2.127372e-05   0.000000e+00   2.127372e-05   0.000000e+00 
  1.514000e+03   1.397702e-05   0.000000e+00   1.397702e-05   0.000000e+00 
  1.516000e+03   1.272839e-05   0.000000e+00   1.272839e-05   0.000000e+00 
  1.518000e+03   1.436951e-05   0.000000e+00   1.436951e-05   0.000000e+00 
  1.520000e+03   1.415804e-05   0.000000e+00   1.415804e-05   0.000000e+00 
  1.522000e+03   1.396920e-05   0.000000e+00   1.396920e-05   0.000000e+00 
  1.524000e+03   1.324117e-05   0.000000e+00   1.324117e-05   0.000000e+00 
  1.526000e+03   1.205326e-05   0.000000e+00   1.205326e-05   0.000000e+00 
  1.528000e+03   1.228076e-05   0.000000e+00   1.228076e-05   0.000000e+00 
  1.530000e+03   1.128277e-05   0.000000e+00   1.128277e-05   0.000000e+00 
  1.532000e+03   1.010767e-05   0.000000e+00   1.010767e-05   0.000000e+00 
  1.534000e+03   1.061362e-05   0.000000e+00   1.061362e-05   0.000000e+00 
  1.536000e+03   1.096935e-05   0.000000e+00   1.096935e-05   0.000000e+00 
  1.538000e+03   1.015316e-05   0.000000e+00   1.015316e-05   0.000000e+00 
  1.540000e+03   1.181504e-05   0.000000e+00   1.181504e-05   0.000000e+00 
  1.542000e+03   1.330599e-05   0.000000e+00   1.330599e-05   0.000000e+00 
  1.544000e+03   1.178487e-05   0.000000e+00   1.178487e-05   0.000000e+00 
  1.546000e+03   1.123093e-05   0.000000e+00   1.123093e-05   0.000000e+00 
  1.548000e+03   1.130456e-05   0.000000e+00   1.130456e-05   0.000000e+00 
  1.550000e+03   1.138848e-05   0.000000e+00   1.138848e-05   0.000000e+00 
  1.552000e+03   1.218828e-05   0.000000e+00   1.218828e-05   0.000000e+00 
  1.554000e+03   1.144346e-05   0.000000e+00   1.144346e-05   0.000000e+00 
  1.556000e+03   1.154474e-05   0.000000e+00   1.154474e-05   0.000000e+00 
  1.558000e+03   1.057941e-05   0.000000e+00   1.057941e-05   0.000000e+00 
  1.560000e+03   1.074603e-05   0.000000e+00   1.074603e-05   0.000000e+00 
  1.562000e+03   1.101298e-05   0.000000e+00   1.101298e-05   0.000000e+00 
  1.564000e+03   1.065711e-05   0.000000e+00   1.065711e-05   0.000000e+00 
  1.566000e+03   1.136275e-05   0.000000e+00   1.136275e-05   0.000000e+00 
  1.568000e+03   1.152288e-05   0.000000e+00   1.152288e-05   0.000000e+00 
  1.570000e+03   1.076353e-05   0.000000e+00   1.076353e-05   0.000000e+00 
  1.572000e+03   9.868071e-06   0.000000e+00   9.868071e-06   0.000000e+00 
  1.574000e+03   1.004319e-05   0.000000e+00   1.004319e-05   0.000000e+00 
  1.576000e+03   1.048525e-05   0.000000e+00   1.048525e-05   0.000000e+00 
  1.578000e+03   1.085709e-05   0.000000e+00   1.085709e-05   0.000000e+00 
  1.580000e+03   1.114979e-05   0.000000e+00   1.114979e-05   0.000000e+00 
  1.582000e+03   1.058266e-05   0.000000e+00   1.058266e-05   0.000000e+00 
  1.584000e+03   1.012264e-05   0.000000e+00   1.012264e-05   0.000000e+00 
  1.586000e+03   9.400967e-06   0.000000e+00   9.400967e-06   0.000000e+00 
  1.588000e+03   8.833325e-06   0.000000e+00   8.833325e-06   0.000000e+00 
  1.590000e+03   9.402146e-06   0.000000e+00   9.402146e-06   0.000000e+00 
  1.592000e+03   1.033772e-05   0.000000e+00   1.033772e-05   0.000000e+00 
  1.594000e+03   1.071937e-05   0.000000e+00   1.071937e-05   0.000000e+00 
  1.596000e+03   1.037911e-05   0.000000e+00   1.037911e-05   0.000000e+00 
  1.598000e+03   9.780547e-06   0.000000e+00   9.780547e-06   0.000000e+00 
  1.600000e+03   9.493026e-06   0.000000e+00   9.493026e-06   0.000000e+00 
