  0.000000e+00   3.994839e-05   0.000000e+00   3.994839e-05   0.000000e+00 
  1.280000e+02   4.280779e-05   0.000000e+00   4.280779e-05   0.000000e+00 
  2.560000e+02   4.625433e-05   0.000000e+00   4.625433e-05   0.000000e+00 
  3.840000e+02   4.442208e-05   0.000000e+00   4.442208e-05   0.000000e+00 
  5.120000e+02   4.669083e-05   0.000000e+00   4.669083e-05   0.000000e+00 
  6.400000e+02   5.062698e-05   0.000000e+00   5.062698e-05   0.000000e+00 
  7.680000e+02   5.481708e-05   0.000000e+00   5.481708e-05   0.000000e+00 
  8.960000e+02   5.986613e-05   0.000000e+00   5.986613e-05   0.000000e+00 
  1.024000e+03   6.756759e-05   0.000000e+00   6.756759e-05   0.000000e+00 
  1.152000e+03   7.030565e-05   0.000000e+00   7.030565e-05   0.000000e+00 
  1.280000e+03   7.343521e-05   0.000000e+00   7.343521e-05   0.000000e+00 
  1.408000e+03   8.011068e-05   0.000000e+00   8.011068e-05   0.000000e+00 
  1.536000e+03   8.650559e-05   0.000000e+00   8.650559e-05   0.000000e+00 
  1.664000e+03   9.472440e-05   0.000000e+00   9.472440e-05   0.000000e+00 
  1.792000e+03   9.681656e-05   0.000000e+00   9.681656e-05   0.000000e+00 
  1.920000e+03   1.014721e-04   0.000000e+00   1.014721e-04   0.000000e+00 
  2.048000e+03   1.063123e-04   0.000000e+00   1.063123e-04   0.000000e+00 
  2.176000e+03   1.163094e-04   0.000000e+00   1.163094e-04   0.000000e+00 
  2.304000e+03   1.337694e-04   0.000000e+00   1.337694e-04   0.000000e+00 
  2.432000e+03   1.376405e-04   0.000000e+00   1.376405e-04   0.000000e+00 
  2.560000e+03   1.310890e-04   0.000000e+00   1.310890e-04   0.000000e+00 
  2.688000e+03   1.368021e-04   0.000000e+00   1.368021e-04   0.000000e+00 
  2.816000e+03   1.518384e-04   0.000000e+00   1.518384e-04   0.000000e+00 
  2.944000e+03   1.526073e-04   0.000000e+00   1.526073e-04   0.000000e+00 
  3.072000e+03   1.503041e-04   0.000000e+00   1.503041e-04   0.000000e+00 
  3.200000e+03   1.554488e-04   0.000000e+00   1.554488e-04   0.000000e+00 
  3.328000e+03   1.646037e-04   0.000000e+00   1.646037e-04   0.000000e+00 
  3.456000e+03   1.666422e-04   0.000000e+00   1.666422e-04   0.000000e+00 
  3.584000e+03   1.756353e-04   0.000000e+00   1.756353e-04   0.000000e+00 
  3.712000e+03   1.813739e-04   0.000000e+00   1.813739e-04   0.000000e+00 
  3.840000e+03   1.795369e-04   0.000000e+00   1.795369e-04   0.000000e+00 
  3.968000e+03   1.840779e-04   0.000000e+00   1.840779e-04   0.000000e+00 
  4.096000e+03   1.896931e-04   0.000000e+00   1.896931e-04   0.000000e+00 
  4.224000e+03   1.972821e-04   0.000000e+00   1.972821e-04   0.000000e+00 
  4.352000e+03   2.042593e-04   0.000000e+00   2.042593e-04   0.000000e+00 
  4.480000e+03   2.131181e-04   0.000000e+00   2.131181e-04   0.000000e+00 
  4.608000e+03   2.258072e-04   0.000000e+00   2.258072e-04   0.000000e+00 
  4.736000e+03   2.263804e-04   0.000000e+00   2.263804e-04   0.000000e+00 
  4.864000e+03   2.430201e-04   0.000000e+00   2.430201e-04   0.000000e+00 
  4.992000e+03   2.808078e-04   0.000000e+00   2.808078e-04   0.000000e+00 
  5.120000e+03   3.123028e-04   0.000000e+00   3.123028e-04   0.000000e+00 
  5.248000e+03   4.074902e-04   0.000000e+00   4.074902e-04   0.000000e+00 
  5.376000e+03   3.865618e-04   0.000000e+00   3.865618e-04   0.000000e+00 
  5.504000e+03   2.883309e-04   0.000000e+00   2.883309e-04   0.000000e+00 
  5.632000e+03   2.764246e-04   0.000000e+00   2.764246e-04   0.000000e+00 
  5.760000e+03   2.555870e-04   0.000000e+00   2.555870e-04   0.000000e+00 
  5.888000e+03   2.496986e-04   0.000000e+00   2.496986e-04   0.000000e+00 
  6.016000e+03   2.588904e-04   0.000000e+00   2.588904e-04   0.000000e+00 
  6.144000e+03   2.633546e-04   0.000000e+00   2.633546e-04   0.000000e+00 
  6.272000e+03   2.741132e-04   0.000000e+00   2.741132e-04   0.000000e+00 
  6.400000e+03   2.788760e-04   0.000000e+00   2.788760e-04   0.000000e+00 
  6.528000e+03   2.717290e-04   0.000000e+00   2.717290e-04   0.000000e+00 
  6.656000e+03   2.778828e-04   0.000000e+00   2.778828e-04   0.000000e+00 
  6.784000e+03   2.863683e-04   0.000000e+00   2.863683e-04   0.000000e+00 
  6.912000e+03   3.157095e-04   0.000000e+00   3.157095e-04   0.000000e+00 
  7.040000e+03   3.231309e-04   0.000000e+00   3.231309e-04   0.000000e+00 
  7.168000e+03   2.954813e-04   0.000000e+00   2.954813e-04   0.000000e+00 
  7.296000e+03   2.970877e-04   0.000000e+00   2.970877e-04   0.000000e+00 
  7.424000e+03   2.980865e-04   0.000000e+00   2.980865e-04   0.000000e+00 
  7.552000e+03   2.957929e-04   0.000000e+00   2.957929e-04   0.000000e+00 
  7.680000e+03   2.953591e-04   0.000000e+00   2.953591e-04   0.000000e+00 
  7.808000e+03   3.100919e-04   0.000000e+00   3.100919e-04   0.000000e+00 
  7.936000e+03   3.080677e-04   0.000000e+00   3.080677e-04   0.000000e+00 
  8.064000e+03   3.099786e-04   0.000000e+00   3.099786e-04   0.000000e+00 
  8.192000e+03   3.150201e-04   0.000000e+00   3.150201e-04   0.000000e+00 
  8.320000e+03   3.207400e-04   0.000000e+00   3.207400e-04   0.000000e+00 
  8.448000e+03   3.148463e-04   0.000000e+00   3.148463e-04   0.000000e+00 
  8.576000e+03   3.207272e-04   0.000000e+00   3.207272e-04   0.000000e+00 
  8.704000e+03   3.158222e-04   0.000000e+00   3.158222e-04   0.000000e+00 
  8.832000e+03   3.223979e-04   0.000000e+00   3.223979e-04   0.000000e+00 
  8.960000e+03   3.301057e-04   0.000000e+00   3.301057e-04   0.000000e+00 
  9.088000e+03   3.375818e-04   0.000000e+00   3.375818e-04   0.000000e+00 
  9.216000e+03   4.339017e-04   0.000000e+00   4.339017e-04   0.000000e+00 
  9.344000e+03   4.999281e-04   0.000000e+00   4.999281e-04   0.000000e+00 
  9.472000e+03   3.783101e-04   0.000000e+00   3.783101e-04   0.000000e+00 
  9.600000e+03   3.531041e-04   0.000000e+00   3.531041e-04   0.000000e+00 
  9.728000e+03   3.628248e-04   0.000000e+00   3.628248e-04   0.000000e+00 
  9.856000e+03   3.555796e-04   0.000000e+00   3.555796e-04   0.000000e+00 
  9.984000e+03   3.470890e-04   0.000000e+00   3.470890e-04   0.000000e+00 
  1.011200e+04   4.034835e-04   0.000000e+00   4.034835e-04   0.000000e+00 
  1.024000e+04   5.781337e-04   0.000000e+00   5.781337e-04   0.000000e+00 
  1.036800e+04   5.207253e-04   0.000000e+00   5.207253e-04   0.000000e+00 
  1.049600e+04   3.875271e-04   0.000000e+00   3.875271e-04   0.000000e+00 
  1.062400e+04   3.670871e-04   0.000000e+00   3.670871e-04   0.000000e+00 
  1.075200e+04   3.640958e-04   0.000000e+00   3.640958e-04   0.000000e+00 
  1.088000e+04   3.606326e-04   0.000000e+00   3.606326e-04   0.000000e+00 
  1.100800e+04   3.563184e-04   0.000000e+00   3.563184e-04   0.000000e+00 
  1.113600e+04   3.527710e-04   0.000000e+00   3.527710e-04   0.000000e+00 
  1.126400e+04   3.474772e-04   0.000000e+00   3.474772e-04   0.000000e+00 
  1.139200e+04   3.549178e-04   0.000000e+00   3.549178e-04   0.000000e+00 
  1.152000e+04   3.706686e-04   0.000000e+00   3.706686e-04   0.000000e+00 
  1.164800e+04   3.843777e-04   0.000000e+00   3.843777e-04   0.000000e+00 
  1.177600e+04   3.732402e-04   0.000000e+00   3.732402e-04   0.000000e+00 
  1.190400e+04   3.692725e-04   0.000000e+00   3.692725e-04   0.000000e+00 
  1.203200e+04   3.742704e-04   0.000000e+00   3.742704e-04   0.000000e+00 
  1.216000e+04   3.718114e-04   0.000000e+00   3.718114e-04   0.000000e+00 
  1.228800e+04   3.771778e-04   0.000000e+00   3.771778e-04   0.000000e+00 
  1.241600e+04   3.751882e-04   0.000000e+00   3.751882e-04   0.000000e+00 
  1.254400e+04   3.867264e-04   0.000000e+00   3.867264e-04   0.000000e+00 
  1.267200e+04   3.795419e-04   0.000000e+00   3.795419e-04   0.000000e+00 
  1.280000e+04   3.828588e-04   0.000000e+00   3.828588e-04   0.000000e+00 
  1.292800e+04   3.825936e-04   0.000000e+00   3.825936e-04   0.000000e+00 
  1.305600e+04   3.904743e-04   0.000000e+00   3.904743e-04   0.000000e+00 
  1.318400e+04   3.903788e-04   0.000000e+00   3.903788e-04   0.000000e+00 
  1.331200e+04   4.081533e-04   0.000000e+00   4.081533e-04   0.000000e+00 
  1.344000e+04   4.097153e-04   0.000000e+00   4.097153e-04   0.000000e+00 
  1.356800e+04   4.191492e-04   0.000000e+00   4.191492e-04   0.000000e+00 
  1.369600e+04   4.161430e-04   0.000000e+00   4.161430e-04   0.000000e+00 
  1.382400e+04   4.163932e-04   0.000000e+00   4.163932e-04   0.000000e+00 
  1.395200e+04   4.960250e-04   0.000000e+00   4.960250e-04   0.000000e+00 
  1.408000e+04   4.177270e-04   0.000000e+00   4.177270e-04   0.000000e+00 
  1.420800e+04   3.806460e-04   0.000000e+00   3.806460e-04   0.000000e+00 
  1.433600e+04   3.820161e-04   0.000000e+00   3.820161e-04   0.000000e+00 
  1.446400e+04   3.847147e-04   0.000000e+00   3.847147e-04   0.000000e+00 
  1.459200e+04   3.845257e-04   0.000000e+00   3.845257e-04   0.000000e+00 
  1.472000e+04   3.958274e-04   0.000000e+00   3.958274e-04   0.000000e+00 
  1.484800e+04   4.116601e-04   0.000000e+00   4.116601e-04   0.000000e+00 
  1.497600e+04   3.935222e-04   0.000000e+00   3.935222e-04   0.000000e+00 
  1.510400e+04   3.814738e-04   0.000000e+00   3.814738e-04   0.000000e+00 
  1.523200e+04   3.755184e-04   0.000000e+00   3.755184e-04   0.000000e+00 
  1.536000e+04   3.856878e-04   0.000000e+00   3.856878e-04   0.000000e+00 
  1.548800e+04   4.174802e-04   0.000000e+00   4.174802e-04   0.000000e+00 
  1.561600e+04   4.356909e-04   0.000000e+00   4.356909e-04   0.000000e+00 
  1.574400e+04   3.953624e-04   0.000000e+00   3.953624e-04   0.000000e+00 
  1.587200e+04   4.057233e-04   0.000000e+00   4.057233e-04   0.000000e+00 
  1.600000e+04   4.201604e-04   0.000000e+00   4.201604e-04   0.000000e+00 
  1.612800e+04   4.291459e-04   0.000000e+00   4.291459e-04   0.000000e+00 
  1.625600e+04   4.222653e-04   0.000000e+00   4.222653e-04   0.000000e+00 
  1.638400e+04   4.176895e-04   0.000000e+00   4.176895e-04   0.000000e+00 
  1.651200e+04   4.518039e-04   0.000000e+00   4.518039e-04   0.000000e+00 
  1.664000e+04   4.714155e-04   0.000000e+00   4.714155e-04   0.000000e+00 
  1.676800e+04   4.424083e-04   0.000000e+00   4.424083e-04   0.000000e+00 
  1.689600e+04   3.959789e-04   0.000000e+00   3.959789e-04   0.000000e+00 
  1.702400e+04   3.924058e-04   0.000000e+00   3.924058e-04   0.000000e+00 
  1.715200e+04   4.320502e-04   0.000000e+00   4.320502e-04   0.000000e+00 
  1.728000e+04   4.575558e-04   0.000000e+00   4.575558e-04   0.000000e+00 
  1.740800e+04   4.091489e-04   0.000000e+00   4.091489e-04   0.000000e+00 
  1.753600e+04   3.901811e-04   0.000000e+00   3.901811e-04   0.000000e+00 
  1.766400e+04   4.074626e-04   0.000000e+00   4.074626e-04   0.000000e+00 
  1.779200e+04   4.119872e-04   0.000000e+00   4.119872e-04   0.000000e+00 
  1.792000e+04   4.134365e-04   0.000000e+00   4.134365e-04   0.000000e+00 
  1.804800e+04   4.097480e-04   0.000000e+00   4.097480e-04   0.000000e+00 
  1.817600e+04   3.903644e-04   0.000000e+00   3.903644e-04   0.000000e+00 
  1.830400e+04   3.964176e-04   0.000000e+00   3.964176e-04   0.000000e+00 
  1.843200e+04   4.275296e-04   0.000000e+00   4.275296e-04   0.000000e+00 
  1.856000e+04   5.633679e-04   0.000000e+00   5.633679e-04   0.000000e+00 
  1.868800e+04   5.382605e-04   0.000000e+00   5.382605e-04   0.000000e+00 
  1.881600e+04   4.252427e-04   0.000000e+00   4.252427e-04   0.000000e+00 
  1.894400e+04   4.117111e-04   0.000000e+00   4.117111e-04   0.000000e+00 
  1.907200e+04   4.164697e-04   0.000000e+00   4.164697e-04   0.000000e+00 
  1.920000e+04   4.132426e-04   0.000000e+00   4.132426e-04   0.000000e+00 
  1.932800e+04   3.980054e-04   0.000000e+00   3.980054e-04   0.000000e+00 
  1.945600e+04   4.166077e-04   0.000000e+00   4.166077e-04   0.000000e+00 
  1.958400e+04   4.479044e-04   0.000000e+00   4.479044e-04   0.000000e+00 
  1.971200e+04   4.153471e-04   0.000000e+00   4.153471e-04   0.000000e+00 
  1.984000e+04   4.062653e-04   0.000000e+00   4.062653e-04   0.000000e+00 
  1.996800e+04   4.038399e-04   0.000000e+00   4.038399e-04   0.000000e+00 
  2.009600e+04   4.176200e-04   0.000000e+00   4.176200e-04   0.000000e+00 
  2.022400e+04   4.184232e-04   0.000000e+00   4.184232e-04   0.000000e+00 
  2.035200e+04   4.305100e-04   0.000000e+00   4.305100e-04   0.000000e+00 
  2.048000e+04   4.272588e-04   0.000000e+00   4.272588e-04   0.000000e+00 
  2.060800e+04   4.195322e-04   0.000000e+00   4.195322e-04   0.000000e+00 
  2.073600e+04   4.088549e-04   0.000000e+00   4.088549e-04   0.000000e+00 
  2.086400e+04   4.217228e-04   0.000000e+00   4.217228e-04   0.000000e+00 
  2.099200e+04   4.166896e-04   0.000000e+00   4.166896e-04   0.000000e+00 
  2.112000e+04   3.906912e-04   0.000000e+00   3.906912e-04   0.000000e+00 
  2.124800e+04   3.922345e-04   0.000000e+00   3.922345e-04   0.000000e+00 
  2.137600e+04   4.004087e-04   0.000000e+00   4.004087e-04   0.000000e+00 
  2.150400e+04   4.333932e-04   0.000000e+00   4.333932e-04   0.000000e+00 
  2.163200e+04   4.256285e-04   0.000000e+00   4.256285e-04   0.000000e+00 
  2.176000e+04   6.038100e-04   0.000000e+00   6.038100e-04   0.000000e+00 
  2.188800e+04   7.486375e-04   0.000000e+00   7.486375e-04   0.000000e+00 
  2.201600e+04   4.788544e-04   0.000000e+00   4.788544e-04   0.000000e+00 
  2.214400e+04   4.109668e-04   0.000000e+00   4.109668e-04   0.000000e+00 
  2.227200e+04   4.214848e-04   0.000000e+00   4.214848e-04   0.000000e+00 
  2.240000e+04   4.154789e-04   0.000000e+00   4.154789e-04   0.000000e+00 
  2.252800e+04   3.983760e-04   0.000000e+00   3.983760e-04   0.000000e+00 
  2.265600e+04   4.005625e-04   0.000000e+00   4.005625e-04   0.000000e+00 
  2.278400e+04   4.000865e-04   0.000000e+00   4.000865e-04   0.000000e+00 
  2.291200e+04   4.173769e-04   0.000000e+00   4.173769e-04   0.000000e+00 
  2.304000e+04   4.172958e-04   0.000000e+00   4.172958e-04   0.000000e+00 
  2.316800e+04   4.041306e-04   0.000000e+00   4.041306e-04   0.000000e+00 
  2.329600e+04   3.878596e-04   0.000000e+00   3.878596e-04   0.000000e+00 
  2.342400e+04   3.835355e-04   0.000000e+00   3.835355e-04   0.000000e+00 
  2.355200e+04   3.923775e-04   0.000000e+00   3.923775e-04   0.000000e+00 
  2.368000e+04   4.031789e-04   0.000000e+00   4.031789e-04   0.000000e+00 
  2.380800e+04   4.176360e-04   0.000000e+00   4.176360e-04   0.000000e+00 
  2.393600e+04   4.532868e-04   0.000000e+00   4.532868e-04   0.000000e+00 
  2.406400e+04   4.949073e-04   0.000000e+00   4.949073e-04   0.000000e+00 
  2.419200e+04   4.724898e-04   0.000000e+00   4.724898e-04   0.000000e+00 
  2.432000e+04   4.221782e-04   0.000000e+00   4.221782e-04   0.000000e+00 
  2.444800e+04   3.962599e-04   0.000000e+00   3.962599e-04   0.000000e+00 
  2.457600e+04   3.890063e-04   0.000000e+00   3.890063e-04   0.000000e+00 
  2.470400e+04   3.997068e-04   0.000000e+00   3.997068e-04   0.000000e+00 
  2.483200e+04   3.959329e-04   0.000000e+00   3.959329e-04   0.000000e+00 
  2.496000e+04   4.020779e-04   0.000000e+00   4.020779e-04   0.000000e+00 
  2.508800e+04   4.045988e-04   0.000000e+00   4.045988e-04   0.000000e+00 
  2.521600e+04   4.185242e-04   0.000000e+00   4.185242e-04   0.000000e+00 
  2.534400e+04   4.642092e-04   0.000000e+00   4.642092e-04   0.000000e+00 
  2.547200e+04   4.320695e-04   0.000000e+00   4.320695e-04   0.000000e+00 
  2.560000e+04   4.288391e-04   0.000000e+00   4.288391e-04   0.000000e+00 
  2.572800e+04   4.070023e-04   0.000000e+00   4.070023e-04   0.000000e+00 
  2.585600e+04   3.976896e-04   0.000000e+00   3.976896e-04   0.000000e+00 
  2.598400e+04   4.249173e-04   0.000000e+00   4.249173e-04   0.000000e+00 
  2.611200e+04   4.242591e-04   0.000000e+00   4.242591e-04   0.000000e+00 
  2.624000e+04   3.997007e-04   0.000000e+00   3.997007e-04   0.000000e+00 
  2.636800e+04   4.038542e-04   0.000000e+00   4.038542e-04   0.000000e+00 
  2.649600e+04   4.202927e-04   0.000000e+00   4.202927e-04   0.000000e+00 
  2.662400e+04   4.210591e-04   0.000000e+00   4.210591e-04   0.000000e+00 
  2.675200e+04   4.191327e-04   0.000000e+00   4.191327e-04   0.000000e+00 
  2.688000e+04   4.123750e-04   0.000000e+00   4.123750e-04   0.000000e+00 
  2.700800e+04   4.144732e-04   0.000000e+00   4.144732e-04   0.000000e+00 
  2.713600e+04   4.110078e-04   0.000000e+00   4.110078e-04   0.000000e+00 
  2.726400e+04   4.186320e-04   0.000000e+00   4.186320e-04   0.000000e+00 
  2.739200e+04   4.107891e-04   0.000000e+00   4.107891e-04   0.000000e+00 
  2.752000e+04   4.060306e-04   0.000000e+00   4.060306e-04   0.000000e+00 
  2.764800e+04   4.076999e-04   0.000000e+00   4.076999e-04   0.000000e+00 
  2.777600e+04   3.924178e-04   0.000000e+00   3.924178e-04   0.000000e+00 
  2.790400e+04   3.914859e-04   0.000000e+00   3.914859e-04   0.000000e+00 
  2.803200e+04   3.970061e-04   0.000000e+00   3.970061e-04   0.000000e+00 
  2.816000e+04   3.844804e-04   0.000000e+00   3.844804e-04   0.000000e+00 
  2.828800e+04   3.711487e-04   0.000000e+00   3.711487e-04   0.000000e+00 
  2.841600e+04   3.686405e-04   0.000000e+00   3.686405e-04   0.000000e+00 
  2.854400e+04   3.671944e-04   0.000000e+00   3.671944e-04   0.000000e+00 
  2.867200e+04   3.746543e-04   0.000000e+00   3.746543e-04   0.000000e+00 
  2.880000e+04   3.957899e-04   0.000000e+00   3.957899e-04   0.000000e+00 
  2.892800e+04   3.969080e-04   0.000000e+00   3.969080e-04   0.000000e+00 
  2.905600e+04   3.716116e-04   0.000000e+00   3.716116e-04   0.000000e+00 
  2.918400e+04   3.574674e-04   0.000000e+00   3.574674e-04   0.000000e+00 
  2.931200e+04   3.596566e-04   0.000000e+00   3.596566e-04   0.000000e+00 
  2.944000e+04   3.599887e-04   0.000000e+00   3.599887e-04   0.000000e+00 
  2.956800e+04   3.545697e-04   0.000000e+00   3.545697e-04   0.000000e+00 
  2.969600e+04   3.661455e-04   0.000000e+00   3.661455e-04   0.000000e+00 
  2.982400e+04   3.872578e-04   0.000000e+00   3.872578e-04   0.000000e+00 
  2.995200e+04   3.836704e-04   0.000000e+00   3.836704e-04   0.000000e+00 
  3.008000e+04   3.695943e-04   0.000000e+00   3.695943e-04   0.000000e+00 
  3.020800e+04   3.605129e-04   0.000000e+00   3.605129e-04   0.000000e+00 
  3.033600e+04   3.570356e-04   0.000000e+00   3.570356e-04   0.000000e+00 
  3.046400e+04   3.679100e-04   0.000000e+00   3.679100e-04   0.000000e+00 
  3.059200e+04   4.087463e-04   0.000000e+00   4.087463e-04   0.000000e+00 
  3.072000e+04   4.514431e-04   0.000000e+00   4.514431e-04   0.000000e+00 
  3.084800e+04   3.850603e-04   0.000000e+00   3.850603e-04   0.000000e+00 
  3.097600e+04   3.523585e-04   0.000000e+00   3.523585e-04   0.000000e+00 
  3.110400e+04   3.583418e-04   0.000000e+00   3.583418e-04   0.000000e+00 
  3.123200e+04   3.470405e-04   0.000000e+00   3.470405e-04   0.000000e+00 
  3.136000e+04   3.396778e-04   0.000000e+00   3.396778e-04   0.000000e+00 
  3.148800e+04   3.435582e-04   0.000000e+00   3.435582e-04   0.000000e+00 
  3.161600e+04   3.393340e-04   0.000000e+00   3.393340e-04   0.000000e+00 
  3.174400e+04   3.293555e-04   0.000000e+00   3.293555e-04   0.000000e+00 
  3.187200e+04   3.387469e-04   0.000000e+00   3.387469e-04   0.000000e+00 
  3.200000e+04   5.156885e-04   0.000000e+00   5.156885e-04   0.000000e+00 
  3.212800e+04   6.790668e-04   0.000000e+00   6.790668e-04   0.000000e+00 
  3.225600e+04   4.971914e-04   0.000000e+00   4.971914e-04   0.000000e+00 
  3.238400e+04   4.547639e-04   0.000000e+00   4.547639e-04   0.000000e+00 
  3.251200e+04   3.551084e-04   0.000000e+00   3.551084e-04   0.000000e+00 
  3.264000e+04   3.313377e-04   0.000000e+00   3.313377e-04   0.000000e+00 
  3.276800e+04   3.240862e-04   0.000000e+00   3.240862e-04   0.000000e+00 
  3.289600e+04   3.112746e-04   0.000000e+00   3.112746e-04   0.000000e+00 
  3.302400e+04   3.140378e-04   0.000000e+00   3.140378e-04   0.000000e+00 
  3.315200e+04   3.184281e-04   0.000000e+00   3.184281e-04   0.000000e+00 
  3.328000e+04   3.269736e-04   0.000000e+00   3.269736e-04   0.000000e+00 
  3.340800e+04   3.521804e-04   0.000000e+00   3.521804e-04   0.000000e+00 
  3.353600e+04   3.560983e-04   0.000000e+00   3.560983e-04   0.000000e+00 
  3.366400e+04   3.198127e-04   0.000000e+00   3.198127e-04   0.000000e+00 
  3.379200e+04   3.354377e-04   0.000000e+00   3.354377e-04   0.000000e+00 
  3.392000e+04   3.962412e-04   0.000000e+00   3.962412e-04   0.000000e+00 
  3.404800e+04   3.770928e-04   0.000000e+00   3.770928e-04   0.000000e+00 
  3.417600e+04   3.025618e-04   0.000000e+00   3.025618e-04   0.000000e+00 
  3.430400e+04   2.991692e-04   0.000000e+00   2.991692e-04   0.000000e+00 
  3.443200e+04   3.037571e-04   0.000000e+00   3.037571e-04   0.000000e+00 
  3.456000e+04   2.938157e-04   0.000000e+00   2.938157e-04   0.000000e+00 
  3.468800e+04   2.791309e-04   0.000000e+00   2.791309e-04   0.000000e+00 
  3.481600e+04   2.874249e-04   0.000000e+00   2.874249e-04   0.000000e+00 
  3.494400e+04   2.803001e-04   0.000000e+00   2.803001e-04   0.000000e+00 
  3.507200e+04   2.797917e-04   0.000000e+00   2.797917e-04   0.000000e+00 
  3.520000e+04   2.801353e-04   0.000000e+00   2.801353e-04   0.000000e+00 
  3.532800e+04   2.751300e-04   0.000000e+00   2.751300e-04   0.000000e+00 
  3.545600e+04   2.781204e-04   0.000000e+00   2.781204e-04   0.000000e+00 
  3.558400e+04   2.780446e-04   0.000000e+00   2.780446e-04   0.000000e+00 
  3.571200e+04   2.886346e-04   0.000000e+00   2.886346e-04   0.000000e+00 
  3.584000e+04   3.040188e-04   0.000000e+00   3.040188e-04   0.000000e+00 
  3.596800e+04   2.793416e-04   0.000000e+00   2.793416e-04   0.000000e+00 
  3.609600e+04   2.657398e-04   0.000000e+00   2.657398e-04   0.000000e+00 
  3.622400e+04   2.781300e-04   0.000000e+00   2.781300e-04   0.000000e+00 
  3.635200e+04   2.805425e-04   0.000000e+00   2.805425e-04   0.000000e+00 
  3.648000e+04   2.663749e-04   0.000000e+00   2.663749e-04   0.000000e+00 
  3.660800e+04   2.627174e-04   0.000000e+00   2.627174e-04   0.000000e+00 
  3.673600e+04   2.736006e-04   0.000000e+00   2.736006e-04   0.000000e+00 
  3.686400e+04   2.641095e-04   0.000000e+00   2.641095e-04   0.000000e+00 
  3.699200e+04   2.746046e-04   0.000000e+00   2.746046e-04   0.000000e+00 
  3.712000e+04   3.630728e-04   0.000000e+00   3.630728e-04   0.000000e+00 
  3.724800e+04   4.497990e-04   0.000000e+00   4.497990e-04   0.000000e+00 
  3.737600e+04   4.704843e-04   0.000000e+00   4.704843e-04   0.000000e+00 
  3.750400e+04   3.656504e-04   0.000000e+00   3.656504e-04   0.000000e+00 
  3.763200e+04   2.627765e-04   0.000000e+00   2.627765e-04   0.000000e+00 
  3.776000e+04   2.500119e-04   0.000000e+00   2.500119e-04   0.000000e+00 
  3.788800e+04   2.566724e-04   0.000000e+00   2.566724e-04   0.000000e+00 
  3.801600e+04   2.521528e-04   0.000000e+00   2.521528e-04   0.000000e+00 
  3.814400e+04   2.350052e-04   0.000000e+00   2.350052e-04   0.000000e+00 
  3.827200e+04   2.250653e-04   0.000000e+00   2.250653e-04   0.000000e+00 
  3.840000e+04   2.279829e-04   0.000000e+00   2.279829e-04   0.000000e+00 
  3.852800e+04   2.329090e-04   0.000000e+00   2.329090e-04   0.000000e+00 
  3.865600e+04   2.349998e-04   0.000000e+00   2.349998e-04   0.000000e+00 
  3.878400e+04   2.662576e-04   0.000000e+00   2.662576e-04   0.000000e+00 
  3.891200e+04   2.683961e-04   0.000000e+00   2.683961e-04   0.000000e+00 
  3.904000e+04   2.410077e-04   0.000000e+00   2.410077e-04   0.000000e+00 
  3.916800e+04   2.224245e-04   0.000000e+00   2.224245e-04   0.000000e+00 
  3.929600e+04   2.151971e-04   0.000000e+00   2.151971e-04   0.000000e+00 
  3.942400e+04   2.103030e-04   0.000000e+00   2.103030e-04   0.000000e+00 
  3.955200e+04   2.168764e-04   0.000000e+00   2.168764e-04   0.000000e+00 
  3.968000e+04   2.184064e-04   0.000000e+00   2.184064e-04   0.000000e+00 
  3.980800e+04   2.084131e-04   0.000000e+00   2.084131e-04   0.000000e+00 
  3.993600e+04   2.042385e-04   0.000000e+00   2.042385e-04   0.000000e+00 
  4.006400e+04   2.121792e-04   0.000000e+00   2.121792e-04   0.000000e+00 
  4.019200e+04   2.165479e-04   0.000000e+00   2.165479e-04   0.000000e+00 
  4.032000e+04   2.060901e-04   0.000000e+00   2.060901e-04   0.000000e+00 
  4.044800e+04   1.969847e-04   0.000000e+00   1.969847e-04   0.000000e+00 
  4.057600e+04   2.036591e-04   0.000000e+00   2.036591e-04   0.000000e+00 
  4.070400e+04   2.014352e-04   0.000000e+00   2.014352e-04   0.000000e+00 
  4.083200e+04   1.987770e-04   0.000000e+00   1.987770e-04   0.000000e+00 
  4.096000e+04   1.995390e-04   0.000000e+00   1.995390e-04   0.000000e+00 
  4.108800e+04   1.979649e-04   0.000000e+00   1.979649e-04   0.000000e+00 
  4.121600e+04   1.956701e-04   0.000000e+00   1.956701e-04   0.000000e+00 
  4.134400e+04   2.003327e-04   0.000000e+00   2.003327e-04   0.000000e+00 
  4.147200e+04   1.965144e-04   0.000000e+00   1.965144e-04   0.000000e+00 
  4.160000e+04   1.901743e-04   0.000000e+00   1.901743e-04   0.000000e+00 
  4.172800e+04   1.873625e-04   0.000000e+00   1.873625e-04   0.000000e+00 
  4.185600e+04   1.924708e-04   0.000000e+00   1.924708e-04   0.000000e+00 
  4.198400e+04   1.892277e-04   0.000000e+00   1.892277e-04   0.000000e+00 
  4.211200e+04   1.924437e-04   0.000000e+00   1.924437e-04   0.000000e+00 
  4.224000e+04   2.205335e-04   0.000000e+00   2.205335e-04   0.000000e+00 
  4.236800e+04   2.310147e-04   0.000000e+00   2.310147e-04   0.000000e+00 
  4.249600e+04   2.190422e-04   0.000000e+00   2.190422e-04   0.000000e+00 
  4.262400e+04   2.078806e-04   0.000000e+00   2.078806e-04   0.000000e+00 
  4.275200e+04   1.895282e-04   0.000000e+00   1.895282e-04   0.000000e+00 
  4.288000e+04   1.808376e-04   0.000000e+00   1.808376e-04   0.000000e+00 
  4.300800e+04   1.805890e-04   0.000000e+00   1.805890e-04   0.000000e+00 
  4.313600e+04   1.749934e-04   0.000000e+00   1.749934e-04   0.000000e+00 
  4.326400e+04   1.757831e-04   0.000000e+00   1.757831e-04   0.000000e+00 
  4.339200e+04   1.803611e-04   0.000000e+00   1.803611e-04   0.000000e+00 
  4.352000e+04   1.956468e-04   0.000000e+00   1.956468e-04   0.000000e+00 
  4.364800e+04   3.023273e-04   0.000000e+00   3.023273e-04   0.000000e+00 
  4.377600e+04   3.205783e-04   0.000000e+00   3.205783e-04   0.000000e+00 
  4.390400e+04   2.020928e-04   0.000000e+00   2.020928e-04   0.000000e+00 
  4.403200e+04   1.783559e-04   0.000000e+00   1.783559e-04   0.000000e+00 
  4.416000e+04   1.814619e-04   0.000000e+00   1.814619e-04   0.000000e+00 
  4.428800e+04   1.733416e-04   0.000000e+00   1.733416e-04   0.000000e+00 
  4.441600e+04   1.694899e-04   0.000000e+00   1.694899e-04   0.000000e+00 
  4.454400e+04   1.675141e-04   0.000000e+00   1.675141e-04   0.000000e+00 
  4.467200e+04   1.688812e-04   0.000000e+00   1.688812e-04   0.000000e+00 
  4.480000e+04   1.657687e-04   0.000000e+00   1.657687e-04   0.000000e+00 
  4.492800e+04   1.675688e-04   0.000000e+00   1.675688e-04   0.000000e+00 
  4.505600e+04   1.666980e-04   0.000000e+00   1.666980e-04   0.000000e+00 
  4.518400e+04   1.589001e-04   0.000000e+00   1.589001e-04   0.000000e+00 
  4.531200e+04   1.590745e-04   0.000000e+00   1.590745e-04   0.000000e+00 
  4.544000e+04   1.677684e-04   0.000000e+00   1.677684e-04   0.000000e+00 
  4.556800e+04   1.842767e-04   0.000000e+00   1.842767e-04   0.000000e+00 
  4.569600e+04   1.750454e-04   0.000000e+00   1.750454e-04   0.000000e+00 
  4.582400e+04   1.709175e-04   0.000000e+00   1.709175e-04   0.000000e+00 
  4.595200e+04   1.773511e-04   0.000000e+00   1.773511e-04   0.000000e+00 
  4.608000e+04   1.609247e-04   0.000000e+00   1.609247e-04   0.000000e+00 
  4.620800e+04   1.545456e-04   0.000000e+00   1.545456e-04   0.000000e+00 
  4.633600e+04   1.519038e-04   0.000000e+00   1.519038e-04   0.000000e+00 
  4.646400e+04   1.572032e-04   0.000000e+00   1.572032e-04   0.000000e+00 
  4.659200e+04   1.572937e-04   0.000000e+00   1.572937e-04   0.000000e+00 
  4.672000e+04   1.498795e-04   0.000000e+00   1.498795e-04   0.000000e+00 
  4.684800e+04   1.498549e-04   0.000000e+00   1.498549e-04   0.000000e+00 
  4.697600e+04   1.593429e-04   0.000000e+00   1.593429e-04   0.000000e+00 
  4.710400e+04   1.536582e-04   0.000000e+00   1.536582e-04   0.000000e+00 
  4.723200e+04   1.460157e-04   0.000000e+00   1.460157e-04   0.000000e+00 
  4.736000e+04   1.509092e-04   0.000000e+00   1.509092e-04   0.000000e+00 
  4.748800e+04   1.605842e-04   0.000000e+00   1.605842e-04   0.000000e+00 
  4.761600e+04   1.527672e-04   0.000000e+00   1.527672e-04   0.000000e+00 
  4.774400e+04   1.458954e-04   0.000000e+00   1.458954e-04   0.000000e+00 
  4.787200e+04   1.464939e-04   0.000000e+00   1.464939e-04   0.000000e+00 
  4.800000e+04   1.470359e-04   0.000000e+00   1.470359e-04   0.000000e+00 
  4.812800e+04   1.444748e-04   0.000000e+00   1.444748e-04   0.000000e+00 
  4.825600e+04   1.413522e-04   0.000000e+00   1.413522e-04   0.000000e+00 
  4.838400e+04   1.392204e-04   0.000000e+00   1.392204e-04   0.000000e+00 
  4.851200e+04   1.372959e-04   0.000000e+00   1.372959e-04   0.000000e+00 
  4.864000e+04   1.346280e-04   0.000000e+00   1.346280e-04   0.000000e+00 
  4.876800e+04   1.387995e-04   0.000000e+00   1.387995e-04   0.000000e+00 
  4.889600e+04   1.403452e-04   0.000000e+00   1.403452e-04   0.000000e+00 
  4.902400e+04   1.378416e-04   0.000000e+00   1.378416e-04   0.000000e+00 
  4.915200e+04   1.384309e-04   0.000000e+00   1.384309e-04   0.000000e+00 
  4.928000e+04   1.453272e-04   0.000000e+00   1.453272e-04   0.000000e+00 
  4.940800e+04   1.471700e-04   0.000000e+00   1.471700e-04   0.000000e+00 
  4.953600e+04   1.394936e-04   0.000000e+00   1.394936e-04   0.000000e+00 
  4.966400e+04   1.390431e-04   0.000000e+00   1.390431e-04   0.000000e+00 
  4.979200e+04   1.466435e-04   0.000000e+00   1.466435e-04   0.000000e+00 
  4.992000e+04   1.425988e-04   0.000000e+00   1.425988e-04   0.000000e+00 
  5.004800e+04   1.319133e-04   0.000000e+00   1.319133e-04   0.000000e+00 
  5.017600e+04   1.286562e-04   0.000000e+00   1.286562e-04   0.000000e+00 
  5.030400e+04   1.288665e-04   0.000000e+00   1.288665e-04   0.000000e+00 
  5.043200e+04   1.295635e-04   0.000000e+00   1.295635e-04   0.000000e+00 
  5.056000e+04   1.311115e-04   0.000000e+00   1.311115e-04   0.000000e+00 
  5.068800e+04   1.303142e-04   0.000000e+00   1.303142e-04   0.000000e+00 
  5.081600e+04   1.290017e-04   0.000000e+00   1.290017e-04   0.000000e+00 
  5.094400e+04   1.309590e-04   0.000000e+00   1.309590e-04   0.000000e+00 
  5.107200e+04   1.293591e-04   0.000000e+00   1.293591e-04   0.000000e+00 
  5.120000e+04   1.293193e-04   0.000000e+00   1.293193e-04   0.000000e+00 
  5.132800e+04   1.272618e-04   0.000000e+00   1.272618e-04   0.000000e+00 
  5.145600e+04   1.235048e-04   0.000000e+00   1.235048e-04   0.000000e+00 
  5.158400e+04   1.351885e-04   0.000000e+00   1.351885e-04   0.000000e+00 
  5.171200e+04   1.421870e-04   0.000000e+00   1.421870e-04   0.000000e+00 
  5.184000e+04   1.216849e-04   0.000000e+00   1.216849e-04   0.000000e+00 
  5.196800e+04   1.184161e-04   0.000000e+00   1.184161e-04   0.000000e+00 
  5.209600e+04   1.201166e-04   0.000000e+00   1.201166e-04   0.000000e+00 
  5.222400e+04   1.177974e-04   0.000000e+00   1.177974e-04   0.000000e+00 
  5.235200e+04   1.171161e-04   0.000000e+00   1.171161e-04   0.000000e+00 
  5.248000e+04   1.540284e-04   0.000000e+00   1.540284e-04   0.000000e+00 
  5.260800e+04   1.968334e-04   0.000000e+00   1.968334e-04   0.000000e+00 
  5.273600e+04   1.426500e-04   0.000000e+00   1.426500e-04   0.000000e+00 
  5.286400e+04   1.361298e-04   0.000000e+00   1.361298e-04   0.000000e+00 
  5.299200e+04   1.407032e-04   0.000000e+00   1.407032e-04   0.000000e+00 
  5.312000e+04   1.197773e-04   0.000000e+00   1.197773e-04   0.000000e+00 
  5.324800e+04   1.131189e-04   0.000000e+00   1.131189e-04   0.000000e+00 
  5.337600e+04   1.140572e-04   0.000000e+00   1.140572e-04   0.000000e+00 
  5.350400e+04   1.150265e-04   0.000000e+00   1.150265e-04   0.000000e+00 
  5.363200e+04   1.130595e-04   0.000000e+00   1.130595e-04   0.000000e+00 
  5.376000e+04   1.228686e-04   0.000000e+00   1.228686e-04   0.000000e+00 
  5.388800e+04   1.717316e-04   0.000000e+00   1.717316e-04   0.000000e+00 
  5.401600e+04   1.459620e-04   0.000000e+00   1.459620e-04   0.000000e+00 
  5.414400e+04   1.140324e-04   0.000000e+00   1.140324e-04   0.000000e+00 
  5.427200e+04   1.118122e-04   0.000000e+00   1.118122e-04   0.000000e+00 
  5.440000e+04   1.146243e-04   0.000000e+00   1.146243e-04   0.000000e+00 
  5.452800e+04   1.141832e-04   0.000000e+00   1.141832e-04   0.000000e+00 
  5.465600e+04   1.084810e-04   0.000000e+00   1.084810e-04   0.000000e+00 
  5.478400e+04   1.069734e-04   0.000000e+00   1.069734e-04   0.000000e+00 
  5.491200e+04   1.089684e-04   0.000000e+00   1.089684e-04   0.000000e+00 
  5.504000e+04   1.040904e-04   0.000000e+00   1.040904e-04   0.000000e+00 
  5.516800e+04   1.051778e-04   0.000000e+00   1.051778e-04   0.000000e+00 
  5.529600e+04   1.028396e-04   0.000000e+00   1.028396e-04   0.000000e+00 
  5.542400e+04   1.003926e-04   0.000000e+00   1.003926e-04   0.000000e+00 
  5.555200e+04   1.025620e-04   0.000000e+00   1.025620e-04   0.000000e+00 
  5.568000e+04   1.020729e-04   0.000000e+00   1.020729e-04   0.000000e+00 
  5.580800e+04   1.023426e-04   0.000000e+00   1.023426e-04   0.000000e+00 
  5.593600e+04   1.062051e-04   0.000000e+00   1.062051e-04   0.000000e+00 
  5.606400e+04   1.109278e-04   0.000000e+00   1.109278e-04   0.000000e+00 
  5.619200e+04   1.257293e-04   0.000000e+00   1.257293e-04   0.000000e+00 
  5.632000e+04   1.192343e-04   0.000000e+00   1.192343e-04   0.000000e+00 
  5.644800e+04   1.010199e-04   0.000000e+00   1.010199e-04   0.000000e+00 
  5.657600e+04   9.611550e-05   0.000000e+00   9.611550e-05   0.000000e+00 
  5.670400e+04   9.713539e-05   0.000000e+00   9.713539e-05   0.000000e+00 
  5.683200e+04   1.002962e-04   0.000000e+00   1.002962e-04   0.000000e+00 
  5.696000e+04   9.769513e-05   0.000000e+00   9.769513e-05   0.000000e+00 
  5.708800e+04   9.596720e-05   0.000000e+00   9.596720e-05   0.000000e+00 
  5.721600e+04   1.060767e-04   0.000000e+00   1.060767e-04   0.000000e+00 
  5.734400e+04   1.039351e-04   0.000000e+00   1.039351e-04   0.000000e+00 
  5.747200e+04   1.028034e-04   0.000000e+00   1.028034e-04   0.000000e+00 
  5.760000e+04   1.036898e-04   0.000000e+00   1.036898e-04   0.000000e+00 
  5.772800e+04   1.000588e-04   0.000000e+00   1.000588e-04   0.000000e+00 
  5.785600e+04   9.670826e-05   0.000000e+00   9.670826e-05   0.000000e+00 
  5.798400e+04   9.591399e-05   0.000000e+00   9.591399e-05   0.000000e+00 
  5.811200e+04   9.520207e-05   0.000000e+00   9.520207e-05   0.000000e+00 
  5.824000e+04   9.135454e-05   0.000000e+00   9.135454e-05   0.000000e+00 
  5.836800e+04   9.131998e-05   0.000000e+00   9.131998e-05   0.000000e+00 
  5.849600e+04   9.222286e-05   0.000000e+00   9.222286e-05   0.000000e+00 
  5.862400e+04   9.271797e-05   0.000000e+00   9.271797e-05   0.000000e+00 
  5.875200e+04   9.044874e-05   0.000000e+00   9.044874e-05   0.000000e+00 
  5.888000e+04   9.050303e-05   0.000000e+00   9.050303e-05   0.000000e+00 
  5.900800e+04   9.780217e-05   0.000000e+00   9.780217e-05   0.000000e+00 
  5.913600e+04   1.049265e-04   0.000000e+00   1.049265e-04   0.000000e+00 
  5.926400e+04   9.859466e-05   0.000000e+00   9.859466e-05   0.000000e+00 
  5.939200e+04   9.207271e-05   0.000000e+00   9.207271e-05   0.000000e+00 
  5.952000e+04   9.860339e-05   0.000000e+00   9.860339e-05   0.000000e+00 
  5.964800e+04   9.431881e-05   0.000000e+00   9.431881e-05   0.000000e+00 
  5.977600e+04   8.829971e-05   0.000000e+00   8.829971e-05   0.000000e+00 
  5.990400e+04   8.902050e-05   0.000000e+00   8.902050e-05   0.000000e+00 
  6.003200e+04   9.110015e-05   0.000000e+00   9.110015e-05   0.000000e+00 
  6.016000e+04   9.351529e-05   0.000000e+00   9.351529e-05   0.000000e+00 
  6.028800e+04   8.788832e-05   0.000000e+00   8.788832e-05   0.000000e+00 
  6.041600e+04   8.257847e-05   0.000000e+00   8.257847e-05   0.000000e+00 
  6.054400e+04   8.189011e-05   0.000000e+00   8.189011e-05   0.000000e+00 
  6.067200e+04   8.029875e-05   0.000000e+00   8.029875e-05   0.000000e+00 
  6.080000e+04   8.378590e-05   0.000000e+00   8.378590e-05   0.000000e+00 
  6.092800e+04   8.735824e-05   0.000000e+00   8.735824e-05   0.000000e+00 
  6.105600e+04   8.537625e-05   0.000000e+00   8.537625e-05   0.000000e+00 
  6.118400e+04   8.366221e-05   0.000000e+00   8.366221e-05   0.000000e+00 
  6.131200e+04   8.085131e-05   0.000000e+00   8.085131e-05   0.000000e+00 
  6.144000e+04   8.483131e-05   0.000000e+00   8.483131e-05   0.000000e+00 
  6.156800e+04   8.073630e-05   0.000000e+00   8.073630e-05   0.000000e+00 
  6.169600e+04   7.769289e-05   0.000000e+00   7.769289e-05   0.000000e+00 
  6.182400e+04   7.895839e-05   0.000000e+00   7.895839e-05   0.000000e+00 
  6.195200e+04   7.927827e-05   0.000000e+00   7.927827e-05   0.000000e+00 
  6.208000e+04   7.687770e-05   0.000000e+00   7.687770e-05   0.000000e+00 
  6.220800e+04   7.759376e-05   0.000000e+00   7.759376e-05   0.000000e+00 
  6.233600e+04   7.904122e-05   0.000000e+00   7.904122e-05   0.000000e+00 
  6.246400e+04   7.457130e-05   0.000000e+00   7.457130e-05   0.000000e+00 
  6.259200e+04   7.333199e-05   0.000000e+00   7.333199e-05   0.000000e+00 
  6.272000e+04   7.361965e-05   0.000000e+00   7.361965e-05   0.000000e+00 
  6.284800e+04   7.205034e-05   0.000000e+00   7.205034e-05   0.000000e+00 
  6.297600e+04   7.209494e-05   0.000000e+00   7.209494e-05   0.000000e+00 
  6.310400e+04   7.361083e-05   0.000000e+00   7.361083e-05   0.000000e+00 
  6.323200e+04   8.165510e-05   0.000000e+00   8.165510e-05   0.000000e+00 
  6.336000e+04   7.747611e-05   0.000000e+00   7.747611e-05   0.000000e+00 
  6.348800e+04   6.942202e-05   0.000000e+00   6.942202e-05   0.000000e+00 
  6.361600e+04   6.940786e-05   0.000000e+00   6.940786e-05   0.000000e+00 
  6.374400e+04   7.596963e-05   0.000000e+00   7.596963e-05   0.000000e+00 
  6.387200e+04   7.930544e-05   0.000000e+00   7.930544e-05   0.000000e+00 
  6.400000e+04   9.706058e-05   0.000000e+00   9.706058e-05   0.000000e+00 
  6.412800e+04   1.780114e-04   0.000000e+00   1.780114e-04   0.000000e+00 
  6.425600e+04   2.063240e-04   0.000000e+00   2.063240e-04   0.000000e+00 
  6.438400e+04   1.202266e-04   0.000000e+00   1.202266e-04   0.000000e+00 
  6.451200e+04   8.600298e-05   0.000000e+00   8.600298e-05   0.000000e+00 
  6.464000e+04   7.783191e-05   0.000000e+00   7.783191e-05   0.000000e+00 
  6.476800e+04   6.895263e-05   0.000000e+00   6.895263e-05   0.000000e+00 
  6.489600e+04   6.552994e-05   0.000000e+00   6.552994e-05   0.000000e+00 
  6.502400e+04   6.619554e-05   0.000000e+00   6.619554e-05   0.000000e+00 
  6.515200e+04   6.611467e-05   0.000000e+00   6.611467e-05   0.000000e+00 
  6.528000e+04   6.244339e-05   0.000000e+00   6.244339e-05   0.000000e+00 
  6.540800e+04   6.232863e-05   0.000000e+00   6.232863e-05   0.000000e+00 
  6.553600e+04   6.632700e-05   0.000000e+00   6.632700e-05   0.000000e+00 
  6.566400e+04   6.452276e-05   0.000000e+00   6.452276e-05   0.000000e+00 
  6.579200e+04   5.962616e-05   0.000000e+00   5.962616e-05   0.000000e+00 
  6.592000e+04   6.019581e-05   0.000000e+00   6.019581e-05   0.000000e+00 
  6.604800e+04   6.227334e-05   0.000000e+00   6.227334e-05   0.000000e+00 
  6.617600e+04   6.153542e-05   0.000000e+00   6.153542e-05   0.000000e+00 
  6.630400e+04   5.986332e-05   0.000000e+00   5.986332e-05   0.000000e+00 
  6.643200e+04   6.106501e-05   0.000000e+00   6.106501e-05   0.000000e+00 
  6.656000e+04   6.425777e-05   0.000000e+00   6.425777e-05   0.000000e+00 
  6.668800e+04   5.823923e-05   0.000000e+00   5.823923e-05   0.000000e+00 
  6.681600e+04   5.759500e-05   0.000000e+00   5.759500e-05   0.000000e+00 
  6.694400e+04   6.428277e-05   0.000000e+00   6.428277e-05   0.000000e+00 
  6.707200e+04   6.182564e-05   0.000000e+00   6.182564e-05   0.000000e+00 
  6.720000e+04   5.738193e-05   0.000000e+00   5.738193e-05   0.000000e+00 
  6.732800e+04   5.593027e-05   0.000000e+00   5.593027e-05   0.000000e+00 
  6.745600e+04   5.709730e-05   0.000000e+00   5.709730e-05   0.000000e+00 
  6.758400e+04   5.622166e-05   0.000000e+00   5.622166e-05   0.000000e+00 
  6.771200e+04   5.613326e-05   0.000000e+00   5.613326e-05   0.000000e+00 
  6.784000e+04   5.992785e-05   0.000000e+00   5.992785e-05   0.000000e+00 
  6.796800e+04   5.865494e-05   0.000000e+00   5.865494e-05   0.000000e+00 
  6.809600e+04   5.352821e-05   0.000000e+00   5.352821e-05   0.000000e+00 
  6.822400e+04   5.195863e-05   0.000000e+00   5.195863e-05   0.000000e+00 
  6.835200e+04   5.232398e-05   0.000000e+00   5.232398e-05   0.000000e+00 
  6.848000e+04   5.162811e-05   0.000000e+00   5.162811e-05   0.000000e+00 
  6.860800e+04   5.184352e-05   0.000000e+00   5.184352e-05   0.000000e+00 
  6.873600e+04   5.231627e-05   0.000000e+00   5.231627e-05   0.000000e+00 
  6.886400e+04   5.333278e-05   0.000000e+00   5.333278e-05   0.000000e+00 
  6.899200e+04   5.565981e-05   0.000000e+00   5.565981e-05   0.000000e+00 
  6.912000e+04   5.449601e-05   0.000000e+00   5.449601e-05   0.000000e+00 
  6.924800e+04   5.594160e-05   0.000000e+00   5.594160e-05   0.000000e+00 
  6.937600e+04   5.440435e-05   0.000000e+00   5.440435e-05   0.000000e+00 
  6.950400e+04   5.308630e-05   0.000000e+00   5.308630e-05   0.000000e+00 
  6.963200e+04   5.443288e-05   0.000000e+00   5.443288e-05   0.000000e+00 
  6.976000e+04   5.810756e-05   0.000000e+00   5.810756e-05   0.000000e+00 
  6.988800e+04   5.495020e-05   0.000000e+00   5.495020e-05   0.000000e+00 
  7.001600e+04   5.286450e-05   0.000000e+00   5.286450e-05   0.000000e+00 
  7.014400e+04   5.275306e-05   0.000000e+00   5.275306e-05   0.000000e+00 
  7.027200e+04   5.194699e-05   0.000000e+00   5.194699e-05   0.000000e+00 
  7.040000e+04   5.219691e-05   0.000000e+00   5.219691e-05   0.000000e+00 
  7.052800e+04   5.257377e-05   0.000000e+00   5.257377e-05   0.000000e+00 
  7.065600e+04   5.239144e-05   0.000000e+00   5.239144e-05   0.000000e+00 
  7.078400e+04   5.170753e-05   0.000000e+00   5.170753e-05   0.000000e+00 
  7.091200e+04   5.422737e-05   0.000000e+00   5.422737e-05   0.000000e+00 
  7.104000e+04   5.871856e-05   0.000000e+00   5.871856e-05   0.000000e+00 
  7.116800e+04   6.839719e-05   0.000000e+00   6.839719e-05   0.000000e+00 
  7.129600e+04   6.353193e-05   0.000000e+00   6.353193e-05   0.000000e+00 
  7.142400e+04   5.673600e-05   0.000000e+00   5.673600e-05   0.000000e+00 
  7.155200e+04   6.352719e-05   0.000000e+00   6.352719e-05   0.000000e+00 
  7.168000e+04   8.552911e-05   0.000000e+00   8.552911e-05   0.000000e+00 
  7.180800e+04   7.526191e-05   0.000000e+00   7.526191e-05   0.000000e+00 
  7.193600e+04   5.616328e-05   0.000000e+00   5.616328e-05   0.000000e+00 
  7.206400e+04   5.413614e-05   0.000000e+00   5.413614e-05   0.000000e+00 
  7.219200e+04   5.277840e-05   0.000000e+00   5.277840e-05   0.000000e+00 
  7.232000e+04   5.195207e-05   0.000000e+00   5.195207e-05   0.000000e+00 
  7.244800e+04   5.337301e-05   0.000000e+00   5.337301e-05   0.000000e+00 
  7.257600e+04   5.202241e-05   0.000000e+00   5.202241e-05   0.000000e+00 
  7.270400e+04   5.179568e-05   0.000000e+00   5.179568e-05   0.000000e+00 
  7.283200e+04   5.071581e-05   0.000000e+00   5.071581e-05   0.000000e+00 
  7.296000e+04   5.136040e-05   0.000000e+00   5.136040e-05   0.000000e+00 
  7.308800e+04   5.196793e-05   0.000000e+00   5.196793e-05   0.000000e+00 
  7.321600e+04   5.270678e-05   0.000000e+00   5.270678e-05   0.000000e+00 
  7.334400e+04   5.421084e-05   0.000000e+00   5.421084e-05   0.000000e+00 
  7.347200e+04   7.349435e-05   0.000000e+00   7.349435e-05   0.000000e+00 
  7.360000e+04   7.196828e-05   0.000000e+00   7.196828e-05   0.000000e+00 
  7.372800e+04   5.467242e-05   0.000000e+00   5.467242e-05   0.000000e+00 
  7.385600e+04   5.508455e-05   0.000000e+00   5.508455e-05   0.000000e+00 
  7.398400e+04   6.106316e-05   0.000000e+00   6.106316e-05   0.000000e+00 
  7.411200e+04   5.699879e-05   0.000000e+00   5.699879e-05   0.000000e+00 
  7.424000e+04   5.545767e-05   0.000000e+00   5.545767e-05   0.000000e+00 
  7.436800e+04   6.979974e-05   0.000000e+00   6.979974e-05   0.000000e+00 
  7.449600e+04   7.950672e-05   0.000000e+00   7.950672e-05   0.000000e+00 
  7.462400e+04   7.061210e-05   0.000000e+00   7.061210e-05   0.000000e+00 
  7.475200e+04   8.989833e-05   0.000000e+00   8.989833e-05   0.000000e+00 
  7.488000e+04   8.945350e-05   0.000000e+00   8.945350e-05   0.000000e+00 
  7.500800e+04   6.152012e-05   0.000000e+00   6.152012e-05   0.000000e+00 
  7.513600e+04   5.420521e-05   0.000000e+00   5.420521e-05   0.000000e+00 
  7.526400e+04   5.382248e-05   0.000000e+00   5.382248e-05   0.000000e+00 
  7.539200e+04   5.260762e-05   0.000000e+00   5.260762e-05   0.000000e+00 
  7.552000e+04   5.083725e-05   0.000000e+00   5.083725e-05   0.000000e+00 
  7.564800e+04   5.303184e-05   0.000000e+00   5.303184e-05   0.000000e+00 
  7.577600e+04   5.713294e-05   0.000000e+00   5.713294e-05   0.000000e+00 
  7.590400e+04   5.787173e-05   0.000000e+00   5.787173e-05   0.000000e+00 
  7.603200e+04   5.357119e-05   0.000000e+00   5.357119e-05   0.000000e+00 
  7.616000e+04   5.363850e-05   0.000000e+00   5.363850e-05   0.000000e+00 
  7.628800e+04   5.515838e-05   0.000000e+00   5.515838e-05   0.000000e+00 
  7.641600e+04   5.377272e-05   0.000000e+00   5.377272e-05   0.000000e+00 
  7.654400e+04   5.356907e-05   0.000000e+00   5.356907e-05   0.000000e+00 
  7.667200e+04   5.565942e-05   0.000000e+00   5.565942e-05   0.000000e+00 
  7.680000e+04   5.791940e-05   0.000000e+00   5.791940e-05   0.000000e+00 
  7.692800e+04   5.324947e-05   0.000000e+00   5.324947e-05   0.000000e+00 
  7.705600e+04   5.185631e-05   0.000000e+00   5.185631e-05   0.000000e+00 
  7.718400e+04   5.247490e-05   0.000000e+00   5.247490e-05   0.000000e+00 
  7.731200e+04   5.141759e-05   0.000000e+00   5.141759e-05   0.000000e+00 
  7.744000e+04   5.057639e-05   0.000000e+00   5.057639e-05   0.000000e+00 
  7.756800e+04   5.196788e-05   0.000000e+00   5.196788e-05   0.000000e+00 
  7.769600e+04   5.335793e-05   0.000000e+00   5.335793e-05   0.000000e+00 
  7.782400e+04   5.426494e-05   0.000000e+00   5.426494e-05   0.000000e+00 
  7.795200e+04   5.346717e-05   0.000000e+00   5.346717e-05   0.000000e+00 
  7.808000e+04   5.259774e-05   0.000000e+00   5.259774e-05   0.000000e+00 
  7.820800e+04   5.350095e-05   0.000000e+00   5.350095e-05   0.000000e+00 
  7.833600e+04   5.077237e-05   0.000000e+00   5.077237e-05   0.000000e+00 
  7.846400e+04   4.955123e-05   0.000000e+00   4.955123e-05   0.000000e+00 
  7.859200e+04   4.932218e-05   0.000000e+00   4.932218e-05   0.000000e+00 
  7.872000e+04   4.984960e-05   0.000000e+00   4.984960e-05   0.000000e+00 
  7.884800e+04   4.966307e-05   0.000000e+00   4.966307e-05   0.000000e+00 
  7.897600e+04   4.843666e-05   0.000000e+00   4.843666e-05   0.000000e+00 
  7.910400e+04   4.886104e-05   0.000000e+00   4.886104e-05   0.000000e+00 
  7.923200e+04   4.861817e-05   0.000000e+00   4.861817e-05   0.000000e+00 
  7.936000e+04   4.696050e-05   0.000000e+00   4.696050e-05   0.000000e+00 
  7.948800e+04   4.786187e-05   0.000000e+00   4.786187e-05   0.000000e+00 
  7.961600e+04   4.843445e-05   0.000000e+00   4.843445e-05   0.000000e+00 
  7.974400e+04   4.836150e-05   0.000000e+00   4.836150e-05   0.000000e+00 
  7.987200e+04   4.769980e-05   0.000000e+00   4.769980e-05   0.000000e+00 
  8.000000e+04   4.693392e-05   0.000000e+00   4.693392e-05   0.000000e+00 
  8.012800e+04   4.668668e-05   0.000000e+00   4.668668e-05   0.000000e+00 
  8.025600e+04   4.598857e-05   0.000000e+00   4.598857e-05   0.000000e+00 
  8.038400e+04   5.157764e-05   0.000000e+00   5.157764e-05   0.000000e+00 
  8.051200e+04   6.539767e-05   0.000000e+00   6.539767e-05   0.000000e+00 
  8.064000e+04   5.034749e-05   0.000000e+00   5.034749e-05   0.000000e+00 
  8.076800e+04   4.481877e-05   0.000000e+00   4.481877e-05   0.000000e+00 
  8.089600e+04   4.612122e-05   0.000000e+00   4.612122e-05   0.000000e+00 
  8.102400e+04   4.655572e-05   0.000000e+00   4.655572e-05   0.000000e+00 
  8.115200e+04   4.536847e-05   0.000000e+00   4.536847e-05   0.000000e+00 
  8.128000e+04   4.601543e-05   0.000000e+00   4.601543e-05   0.000000e+00 
  8.140800e+04   5.167015e-05   0.000000e+00   5.167015e-05   0.000000e+00 
  8.153600e+04   5.088160e-05   0.000000e+00   5.088160e-05   0.000000e+00 
  8.166400e+04   4.478247e-05   0.000000e+00   4.478247e-05   0.000000e+00 
  8.179200e+04   4.403778e-05   0.000000e+00   4.403778e-05   0.000000e+00 
  8.192000e+04   4.169355e-05   0.000000e+00   4.169355e-05   0.000000e+00 
  8.204800e+04   4.108134e-05   0.000000e+00   4.108134e-05   0.000000e+00 
  8.217600e+04   4.124341e-05   0.000000e+00   4.124341e-05   0.000000e+00 
  8.230400e+04   4.198113e-05   0.000000e+00   4.198113e-05   0.000000e+00 
  8.243200e+04   4.153554e-05   0.000000e+00   4.153554e-05   0.000000e+00 
  8.256000e+04   4.230741e-05   0.000000e+00   4.230741e-05   0.000000e+00 
  8.268800e+04   4.957509e-05   0.000000e+00   4.957509e-05   0.000000e+00 
  8.281600e+04   6.870911e-05   0.000000e+00   6.870911e-05   0.000000e+00 
  8.294400e+04   5.587859e-05   0.000000e+00   5.587859e-05   0.000000e+00 
  8.307200e+04   4.278468e-05   0.000000e+00   4.278468e-05   0.000000e+00 
  8.320000e+04   4.178444e-05   0.000000e+00   4.178444e-05   0.000000e+00 
  8.332800e+04   4.168258e-05   0.000000e+00   4.168258e-05   0.000000e+00 
  8.345600e+04   4.002336e-05   0.000000e+00   4.002336e-05   0.000000e+00 
  8.358400e+04   3.924247e-05   0.000000e+00   3.924247e-05   0.000000e+00 
  8.371200e+04   4.086794e-05   0.000000e+00   4.086794e-05   0.000000e+00 
  8.384000e+04   4.078778e-05   0.000000e+00   4.078778e-05   0.000000e+00 
  8.396800e+04   3.844295e-05   0.000000e+00   3.844295e-05   0.000000e+00 
  8.409600e+04   3.867177e-05   0.000000e+00   3.867177e-05   0.000000e+00 
  8.422400e+04   3.943129e-05   0.000000e+00   3.943129e-05   0.000000e+00 
  8.435200e+04   3.940174e-05   0.000000e+00   3.940174e-05   0.000000e+00 
  8.448000e+04   3.929556e-05   0.000000e+00   3.929556e-05   0.000000e+00 
  8.460800e+04   3.855673e-05   0.000000e+00   3.855673e-05   0.000000e+00 
  8.473600e+04   3.766090e-05   0.000000e+00   3.766090e-05   0.000000e+00 
  8.486400e+04   3.816170e-05   0.000000e+00   3.816170e-05   0.000000e+00 
  8.499200e+04   3.833344e-05   0.000000e+00   3.833344e-05   0.000000e+00 
  8.512000e+04   3.859543e-05   0.000000e+00   3.859543e-05   0.000000e+00 
  8.524800e+04   3.716652e-05   0.000000e+00   3.716652e-05   0.000000e+00 
  8.537600e+04   3.679785e-05   0.000000e+00   3.679785e-05   0.000000e+00 
  8.550400e+04   3.761787e-05   0.000000e+00   3.761787e-05   0.000000e+00 
  8.563200e+04   3.724836e-05   0.000000e+00   3.724836e-05   0.000000e+00 
  8.576000e+04   3.807023e-05   0.000000e+00   3.807023e-05   0.000000e+00 
  8.588800e+04   3.954810e-05   0.000000e+00   3.954810e-05   0.000000e+00 
  8.601600e+04   5.459204e-05   0.000000e+00   5.459204e-05   0.000000e+00 
  8.614400e+04   5.384412e-05   0.000000e+00   5.384412e-05   0.000000e+00 
  8.627200e+04   3.905687e-05   0.000000e+00   3.905687e-05   0.000000e+00 
  8.640000e+04   3.669977e-05   0.000000e+00   3.669977e-05   0.000000e+00 
  8.652800e+04   3.639797e-05   0.000000e+00   3.639797e-05   0.000000e+00 
  8.665600e+04   3.551938e-05   0.000000e+00   3.551938e-05   0.000000e+00 
  8.678400e+04   3.543937e-05   0.000000e+00   3.543937e-05   0.000000e+00 
  8.691200e+04   3.572946e-05   0.000000e+00   3.572946e-05   0.000000e+00 
  8.704000e+04   3.523094e-05   0.000000e+00   3.523094e-05   0.000000e+00 
  8.716800e+04   3.505392e-05   0.000000e+00   3.505392e-05   0.000000e+00 
  8.729600e+04   3.408545e-05   0.000000e+00   3.408545e-05   0.000000e+00 
  8.742400e+04   3.489894e-05   0.000000e+00   3.489894e-05   0.000000e+00 
  8.755200e+04   3.399940e-05   0.000000e+00   3.399940e-05   0.000000e+00 
  8.768000e+04   3.278024e-05   0.000000e+00   3.278024e-05   0.000000e+00 
  8.780800e+04   3.448611e-05   0.000000e+00   3.448611e-05   0.000000e+00 
  8.793600e+04   3.523905e-05   0.000000e+00   3.523905e-05   0.000000e+00 
  8.806400e+04   3.336280e-05   0.000000e+00   3.336280e-05   0.000000e+00 
  8.819200e+04   3.280765e-05   0.000000e+00   3.280765e-05   0.000000e+00 
  8.832000e+04   3.448819e-05   0.000000e+00   3.448819e-05   0.000000e+00 
  8.844800e+04   3.522552e-05   0.000000e+00   3.522552e-05   0.000000e+00 
  8.857600e+04   3.359465e-05   0.000000e+00   3.359465e-05   0.000000e+00 
  8.870400e+04   3.306759e-05   0.000000e+00   3.306759e-05   0.000000e+00 
  8.883200e+04   3.294082e-05   0.000000e+00   3.294082e-05   0.000000e+00 
  8.896000e+04   3.276447e-05   0.000000e+00   3.276447e-05   0.000000e+00 
  8.908800e+04   3.326908e-05   0.000000e+00   3.326908e-05   0.000000e+00 
  8.921600e+04   3.326191e-05   0.000000e+00   3.326191e-05   0.000000e+00 
  8.934400e+04   3.311534e-05   0.000000e+00   3.311534e-05   0.000000e+00 
  8.947200e+04   3.464398e-05   0.000000e+00   3.464398e-05   0.000000e+00 
  8.960000e+04   4.009169e-05   0.000000e+00   4.009169e-05   0.000000e+00 
  8.972800e+04   5.398604e-05   0.000000e+00   5.398604e-05   0.000000e+00 
  8.985600e+04   5.987679e-05   0.000000e+00   5.987679e-05   0.000000e+00 
  8.998400e+04   3.565209e-05   0.000000e+00   3.565209e-05   0.000000e+00 
  9.011200e+04   3.229492e-05   0.000000e+00   3.229492e-05   0.000000e+00 
  9.024000e+04   3.566143e-05   0.000000e+00   3.566143e-05   0.000000e+00 
  9.036800e+04   3.383837e-05   0.000000e+00   3.383837e-05   0.000000e+00 
  9.049600e+04   3.030428e-05   0.000000e+00   3.030428e-05   0.000000e+00 
  9.062400e+04   3.123650e-05   0.000000e+00   3.123650e-05   0.000000e+00 
  9.075200e+04   3.243329e-05   0.000000e+00   3.243329e-05   0.000000e+00 
  9.088000e+04   3.242507e-05   0.000000e+00   3.242507e-05   0.000000e+00 
  9.100800e+04   3.231769e-05   0.000000e+00   3.231769e-05   0.000000e+00 
  9.113600e+04   3.212493e-05   0.000000e+00   3.212493e-05   0.000000e+00 
  9.126400e+04   3.178094e-05   0.000000e+00   3.178094e-05   0.000000e+00 
  9.139200e+04   3.171463e-05   0.000000e+00   3.171463e-05   0.000000e+00 
  9.152000e+04   3.185661e-05   0.000000e+00   3.185661e-05   0.000000e+00 
  9.164800e+04   3.207094e-05   0.000000e+00   3.207094e-05   0.000000e+00 
  9.177600e+04   3.528096e-05   0.000000e+00   3.528096e-05   0.000000e+00 
  9.190400e+04   3.561990e-05   0.000000e+00   3.561990e-05   0.000000e+00 
  9.203200e+04   3.185710e-05   0.000000e+00   3.185710e-05   0.000000e+00 
  9.216000e+04   3.229990e-05   0.000000e+00   3.229990e-05   0.000000e+00 
  9.228800e+04   3.011707e-05   0.000000e+00   3.011707e-05   0.000000e+00 
  9.241600e+04   2.914774e-05   0.000000e+00   2.914774e-05   0.000000e+00 
  9.254400e+04   3.006012e-05   0.000000e+00   3.006012e-05   0.000000e+00 
  9.267200e+04   2.951153e-05   0.000000e+00   2.951153e-05   0.000000e+00 
  9.280000e+04   2.903754e-05   0.000000e+00   2.903754e-05   0.000000e+00 
  9.292800e+04   2.947040e-05   0.000000e+00   2.947040e-05   0.000000e+00 
  9.305600e+04   3.084388e-05   0.000000e+00   3.084388e-05   0.000000e+00 
  9.318400e+04   3.008712e-05   0.000000e+00   3.008712e-05   0.000000e+00 
  9.331200e+04   2.939941e-05   0.000000e+00   2.939941e-05   0.000000e+00 
  9.344000e+04   3.091411e-05   0.000000e+00   3.091411e-05   0.000000e+00 
  9.356800e+04   2.895759e-05   0.000000e+00   2.895759e-05   0.000000e+00 
  9.369600e+04   2.786803e-05   0.000000e+00   2.786803e-05   0.000000e+00 
  9.382400e+04   2.843371e-05   0.000000e+00   2.843371e-05   0.000000e+00 
  9.395200e+04   2.899988e-05   0.000000e+00   2.899988e-05   0.000000e+00 
  9.408000e+04   2.897063e-05   0.000000e+00   2.897063e-05   0.000000e+00 
  9.420800e+04   2.842689e-05   0.000000e+00   2.842689e-05   0.000000e+00 
  9.433600e+04   2.857243e-05   0.000000e+00   2.857243e-05   0.000000e+00 
  9.446400e+04   2.886633e-05   0.000000e+00   2.886633e-05   0.000000e+00 
  9.459200e+04   2.736639e-05   0.000000e+00   2.736639e-05   0.000000e+00 
  9.472000e+04   2.743092e-05   0.000000e+00   2.743092e-05   0.000000e+00 
  9.484800e+04   3.038158e-05   0.000000e+00   3.038158e-05   0.000000e+00 
  9.497600e+04   2.878010e-05   0.000000e+00   2.878010e-05   0.000000e+00 
  9.510400e+04   2.778393e-05   0.000000e+00   2.778393e-05   0.000000e+00 
  9.523200e+04   2.846706e-05   0.000000e+00   2.846706e-05   0.000000e+00 
  9.536000e+04   3.296100e-05   0.000000e+00   3.296100e-05   0.000000e+00 
  9.548800e+04   3.036136e-05   0.000000e+00   3.036136e-05   0.000000e+00 
  9.561600e+04   2.734218e-05   0.000000e+00   2.734218e-05   0.000000e+00 
  9.574400e+04   2.752123e-05   0.000000e+00   2.752123e-05   0.000000e+00 
  9.587200e+04   2.852116e-05   0.000000e+00   2.852116e-05   0.000000e+00 
  9.600000e+04   2.705140e-05   0.000000e+00   2.705140e-05   0.000000e+00 
  9.612800e+04   2.710784e-05   0.000000e+00   2.710784e-05   0.000000e+00 
  9.625600e+04   2.733176e-05   0.000000e+00   2.733176e-05   0.000000e+00 
  9.638400e+04   2.811709e-05   0.000000e+00   2.811709e-05   0.000000e+00 
  9.651200e+04   3.189806e-05   0.000000e+00   3.189806e-05   0.000000e+00 
  9.664000e+04   3.140796e-05   0.000000e+00   3.140796e-05   0.000000e+00 
  9.676800e+04   3.526806e-05   0.000000e+00   3.526806e-05   0.000000e+00 
  9.689600e+04   3.175855e-05   0.000000e+00   3.175855e-05   0.000000e+00 
  9.702400e+04   2.655379e-05   0.000000e+00   2.655379e-05   0.000000e+00 
  9.715200e+04   2.898469e-05   0.000000e+00   2.898469e-05   0.000000e+00 
  9.728000e+04   3.113239e-05   0.000000e+00   3.113239e-05   0.000000e+00 
  9.740800e+04   2.676126e-05   0.000000e+00   2.676126e-05   0.000000e+00 
  9.753600e+04   2.816171e-05   0.000000e+00   2.816171e-05   0.000000e+00 
  9.766400e+04   2.990993e-05   0.000000e+00   2.990993e-05   0.000000e+00 
  9.779200e+04   2.747592e-05   0.000000e+00   2.747592e-05   0.000000e+00 
  9.792000e+04   2.631806e-05   0.000000e+00   2.631806e-05   0.000000e+00 
  9.804800e+04   2.583682e-05   0.000000e+00   2.583682e-05   0.000000e+00 
  9.817600e+04   2.517819e-05   0.000000e+00   2.517819e-05   0.000000e+00 
  9.830400e+04   2.476365e-05   0.000000e+00   2.476365e-05   0.000000e+00 
  9.843200e+04   2.445402e-05   0.000000e+00   2.445402e-05   0.000000e+00 
  9.856000e+04   2.450172e-05   0.000000e+00   2.450172e-05   0.000000e+00 
  9.868800e+04   2.458773e-05   0.000000e+00   2.458773e-05   0.000000e+00 
  9.881600e+04   2.432040e-05   0.000000e+00   2.432040e-05   0.000000e+00 
  9.894400e+04   2.439684e-05   0.000000e+00   2.439684e-05   0.000000e+00 
  9.907200e+04   2.505780e-05   0.000000e+00   2.505780e-05   0.000000e+00 
  9.920000e+04   2.465381e-05   0.000000e+00   2.465381e-05   0.000000e+00 
  9.932800e+04   2.369913e-05   0.000000e+00   2.369913e-05   0.000000e+00 
  9.945600e+04   2.366207e-05   0.000000e+00   2.366207e-05   0.000000e+00 
  9.958400e+04   2.357683e-05   0.000000e+00   2.357683e-05   0.000000e+00 
  9.971200e+04   2.498834e-05   0.000000e+00   2.498834e-05   0.000000e+00 
  9.984000e+04   2.582693e-05   0.000000e+00   2.582693e-05   0.000000e+00 
  9.996800e+04   2.907651e-05   0.000000e+00   2.907651e-05   0.000000e+00 
  1.000960e+05   3.414497e-05   0.000000e+00   3.414497e-05   0.000000e+00 
  1.002240e+05   3.181458e-05   0.000000e+00   3.181458e-05   0.000000e+00 
  1.003520e+05   2.515005e-05   0.000000e+00   2.515005e-05   0.000000e+00 
  1.004800e+05   2.395281e-05   0.000000e+00   2.395281e-05   0.000000e+00 
  1.006080e+05   2.349111e-05   0.000000e+00   2.349111e-05   0.000000e+00 
  1.007360e+05   2.305745e-05   0.000000e+00   2.305745e-05   0.000000e+00 
  1.008640e+05   2.271258e-05   0.000000e+00   2.271258e-05   0.000000e+00 
  1.009920e+05   2.260748e-05   0.000000e+00   2.260748e-05   0.000000e+00 
  1.011200e+05   2.361000e-05   0.000000e+00   2.361000e-05   0.000000e+00 
  1.012480e+05   2.486448e-05   0.000000e+00   2.486448e-05   0.000000e+00 
  1.013760e+05   2.380827e-05   0.000000e+00   2.380827e-05   0.000000e+00 
  1.015040e+05   2.725518e-05   0.000000e+00   2.725518e-05   0.000000e+00 
  1.016320e+05   3.301274e-05   0.000000e+00   3.301274e-05   0.000000e+00 
  1.017600e+05   2.712765e-05   0.000000e+00   2.712765e-05   0.000000e+00 
  1.018880e+05   2.644498e-05   0.000000e+00   2.644498e-05   0.000000e+00 
  1.020160e+05   2.378439e-05   0.000000e+00   2.378439e-05   0.000000e+00 
  1.021440e+05   2.377662e-05   0.000000e+00   2.377662e-05   0.000000e+00 
  1.022720e+05   2.298391e-05   0.000000e+00   2.298391e-05   0.000000e+00 
  1.024000e+05   2.229883e-05   0.000000e+00   2.229883e-05   0.000000e+00 
