  0.000000e+00   3.703929e-04   0.000000e+00   3.703929e-04   0.000000e+00 
  1.280000e+02   1.868968e-04   0.000000e+00   1.868968e-04   0.000000e+00 
  2.560000e+02   8.434533e-06   0.000000e+00   8.434533e-06   0.000000e+00 
  3.840000e+02   4.693567e-06   0.000000e+00   4.693567e-06   0.000000e+00 
  5.120000e+02   3.803877e-06   0.000000e+00   3.803877e-06   0.000000e+00 
  6.400000e+02   3.166425e-06   0.000000e+00   3.166425e-06   0.000000e+00 
  7.680000e+02   2.669847e-06   0.000000e+00   2.669847e-06   0.000000e+00 
  8.960000e+02   2.333618e-06   0.000000e+00   2.333618e-06   0.000000e+00 
  1.024000e+03   2.156023e-06   0.000000e+00   2.156023e-06   0.000000e+00 
  1.152000e+03   1.711509e-06   0.000000e+00   1.711509e-06   0.000000e+00 
  1.280000e+03   1.317857e-06   0.000000e+00   1.317857e-06   0.000000e+00 
  1.408000e+03   1.218483e-06   0.000000e+00   1.218483e-06   0.000000e+00 
  1.536000e+03   1.114951e-06   0.000000e+00   1.114951e-06   0.000000e+00 
  1.664000e+03   9.772692e-07   0.000000e+00   9.772692e-07   0.000000e+00 
  1.792000e+03   8.919615e-07   0.000000e+00   8.919615e-07   0.000000e+00 
  1.920000e+03   8.582721e-07   0.000000e+00   8.582721e-07   0.000000e+00 
  2.048000e+03   8.020002e-07   0.000000e+00   8.020002e-07   0.000000e+00 
  2.176000e+03   7.248244e-07   0.000000e+00   7.248244e-07   0.000000e+00 
  2.304000e+03   8.287093e-07   0.000000e+00   8.287093e-07   0.000000e+00 
  2.432000e+03   8.583424e-07   0.000000e+00   8.583424e-07   0.000000e+00 
  2.560000e+03   6.961102e-07   0.000000e+00   6.961102e-07   0.000000e+00 
  2.688000e+03   6.411902e-07   0.000000e+00   6.411902e-07   0.000000e+00 
  2.816000e+03   6.365204e-07   0.000000e+00   6.365204e-07   0.000000e+00 
  2.944000e+03   5.755684e-07   0.000000e+00   5.755684e-07   0.000000e+00 
  3.072000e+03   5.286871e-07   0.000000e+00   5.286871e-07   0.000000e+00 
  3.200000e+03   5.943744e-07   0.000000e+00   5.943744e-07   0.000000e+00 
  3.328000e+03   1.683526e-06   0.000000e+00   1.683526e-06   0.000000e+00 
  3.456000e+03   1.840640e-06   0.000000e+00   1.840640e-06   0.000000e+00 
  3.584000e+03   6.955234e-07   0.000000e+00   6.955234e-07   0.000000e+00 
  3.712000e+03   4.660547e-07   0.000000e+00   4.660547e-07   0.000000e+00 
  3.840000e+03   4.119680e-07   0.000000e+00   4.119680e-07   0.000000e+00 
  3.968000e+03   4.591082e-07   0.000000e+00   4.591082e-07   0.000000e+00 
  4.096000e+03   4.001043e-07   0.000000e+00   4.001043e-07   0.000000e+00 
  4.224000e+03   4.268190e-07   0.000000e+00   4.268190e-07   0.000000e+00 
  4.352000e+03   4.599845e-07   0.000000e+00   4.599845e-07   0.000000e+00 
  4.480000e+03   3.811965e-07   0.000000e+00   3.811965e-07   0.000000e+00 
  4.608000e+03   3.853311e-07   0.000000e+00   3.853311e-07   0.000000e+00 
  4.736000e+03   4.009034e-07   0.000000e+00   4.009034e-07   0.000000e+00 
  4.864000e+03   4.219294e-07   0.000000e+00   4.219294e-07   0.000000e+00 
  4.992000e+03   4.265871e-07   0.000000e+00   4.265871e-07   0.000000e+00 
  5.120000e+03   4.213499e-07   0.000000e+00   4.213499e-07   0.000000e+00 
  5.248000e+03   3.558531e-07   0.000000e+00   3.558531e-07   0.000000e+00 
  5.376000e+03   3.271659e-07   0.000000e+00   3.271659e-07   0.000000e+00 
  5.504000e+03   3.346467e-07   0.000000e+00   3.346467e-07   0.000000e+00 
  5.632000e+03   3.459285e-07   0.000000e+00   3.459285e-07   0.000000e+00 
  5.760000e+03   3.681561e-07   0.000000e+00   3.681561e-07   0.000000e+00 
  5.888000e+03   3.718592e-07   0.000000e+00   3.718592e-07   0.000000e+00 
  6.016000e+03   3.213561e-07   0.000000e+00   3.213561e-07   0.000000e+00 
  6.144000e+03   3.095959e-07   0.000000e+00   3.095959e-07   0.000000e+00 
  6.272000e+03   3.113219e-07   0.000000e+00   3.113219e-07   0.000000e+00 
  6.400000e+03   3.048721e-07   0.000000e+00   3.048721e-07   0.000000e+00 
  6.528000e+03   3.043761e-07   0.000000e+00   3.043761e-07   0.000000e+00 
  6.656000e+03   3.263812e-07   0.000000e+00   3.263812e-07   0.000000e+00 
  6.784000e+03   3.757835e-07   0.000000e+00   3.757835e-07   0.000000e+00 
  6.912000e+03   1.558609e-06   0.000000e+00   1.558609e-06   0.000000e+00 
  7.040000e+03   2.492167e-06   0.000000e+00   2.492167e-06   0.000000e+00 
  7.168000e+03   1.061802e-06   0.000000e+00   1.061802e-06   0.000000e+00 
  7.296000e+03   4.244470e-07   0.000000e+00   4.244470e-07   0.000000e+00 
  7.424000e+03   3.910059e-07   0.000000e+00   3.910059e-07   0.000000e+00 
  7.552000e+03   3.493615e-07   0.000000e+00   3.493615e-07   0.000000e+00 
  7.680000e+03   5.734558e-07   0.000000e+00   5.734558e-07   0.000000e+00 
  7.808000e+03   2.113344e-06   0.000000e+00   2.113344e-06   0.000000e+00 
  7.936000e+03   1.956642e-06   0.000000e+00   1.956642e-06   0.000000e+00 
  8.064000e+03   4.768256e-07   0.000000e+00   4.768256e-07   0.000000e+00 
  8.192000e+03   3.468514e-07   0.000000e+00   3.468514e-07   0.000000e+00 
  8.320000e+03   3.220873e-07   0.000000e+00   3.220873e-07   0.000000e+00 
  8.448000e+03   3.185812e-07   0.000000e+00   3.185812e-07   0.000000e+00 
  8.576000e+03   3.252267e-07   0.000000e+00   3.252267e-07   0.000000e+00 
  8.704000e+03   3.285664e-07   0.000000e+00   3.285664e-07   0.000000e+00 
  8.832000e+03   3.281258e-07   0.000000e+00   3.281258e-07   0.000000e+00 
  8.960000e+03   3.347108e-07   0.000000e+00   3.347108e-07   0.000000e+00 
  9.088000e+03   6.972926e-07   0.000000e+00   6.972926e-07   0.000000e+00 
  9.216000e+03   8.791020e-07   0.000000e+00   8.791020e-07   0.000000e+00 
  9.344000e+03   4.109131e-07   0.000000e+00   4.109131e-07   0.000000e+00 
  9.472000e+03   3.171592e-07   0.000000e+00   3.171592e-07   0.000000e+00 
  9.600000e+03   3.148424e-07   0.000000e+00   3.148424e-07   0.000000e+00 
  9.728000e+03   3.179606e-07   0.000000e+00   3.179606e-07   0.000000e+00 
  9.856000e+03   3.240592e-07   0.000000e+00   3.240592e-07   0.000000e+00 
  9.984000e+03   3.952545e-07   0.000000e+00   3.952545e-07   0.000000e+00 
  1.011200e+04   5.068545e-07   0.000000e+00   5.068545e-07   0.000000e+00 
  1.024000e+04   5.514916e-07   0.000000e+00   5.514916e-07   0.000000e+00 
  1.036800e+04   7.230215e-07   0.000000e+00   7.230215e-07   0.000000e+00 
  1.049600e+04   8.929013e-07   0.000000e+00   8.929013e-07   0.000000e+00 
  1.062400e+04   6.196846e-07   0.000000e+00   6.196846e-07   0.000000e+00 
  1.075200e+04   4.141813e-07   0.000000e+00   4.141813e-07   0.000000e+00 
  1.088000e+04   3.123123e-07   0.000000e+00   3.123123e-07   0.000000e+00 
  1.100800e+04   3.168688e-07   0.000000e+00   3.168688e-07   0.000000e+00 
  1.113600e+04   3.254810e-07   0.000000e+00   3.254810e-07   0.000000e+00 
  1.126400e+04   3.361762e-07   0.000000e+00   3.361762e-07   0.000000e+00 
  1.139200e+04   3.225789e-07   0.000000e+00   3.225789e-07   0.000000e+00 
  1.152000e+04   3.111230e-07   0.000000e+00   3.111230e-07   0.000000e+00 
  1.164800e+04   3.172695e-07   0.000000e+00   3.172695e-07   0.000000e+00 
  1.177600e+04   3.229909e-07   0.000000e+00   3.229909e-07   0.000000e+00 
  1.190400e+04   3.302171e-07   0.000000e+00   3.302171e-07   0.000000e+00 
  1.203200e+04   3.292316e-07   0.000000e+00   3.292316e-07   0.000000e+00 
  1.216000e+04   3.358381e-07   0.000000e+00   3.358381e-07   0.000000e+00 
  1.228800e+04   3.234569e-07   0.000000e+00   3.234569e-07   0.000000e+00 
  1.241600e+04   3.290342e-07   0.000000e+00   3.290342e-07   0.000000e+00 
  1.254400e+04   3.368672e-07   0.000000e+00   3.368672e-07   0.000000e+00 
  1.267200e+04   3.387306e-07   0.000000e+00   3.387306e-07   0.000000e+00 
  1.280000e+04   3.365385e-07   0.000000e+00   3.365385e-07   0.000000e+00 
  1.292800e+04   3.409887e-07   0.000000e+00   3.409887e-07   0.000000e+00 
  1.305600e+04   3.444421e-07   0.000000e+00   3.444421e-07   0.000000e+00 
  1.318400e+04   3.562150e-07   0.000000e+00   3.562150e-07   0.000000e+00 
  1.331200e+04   3.491729e-07   0.000000e+00   3.491729e-07   0.000000e+00 
  1.344000e+04   3.459466e-07   0.000000e+00   3.459466e-07   0.000000e+00 
  1.356800e+04   3.591524e-07   0.000000e+00   3.591524e-07   0.000000e+00 
  1.369600e+04   3.489927e-07   0.000000e+00   3.489927e-07   0.000000e+00 
  1.382400e+04   3.539660e-07   0.000000e+00   3.539660e-07   0.000000e+00 
  1.395200e+04   3.631824e-07   0.000000e+00   3.631824e-07   0.000000e+00 
  1.408000e+04   3.689304e-07   0.000000e+00   3.689304e-07   0.000000e+00 
  1.420800e+04   5.344731e-07   0.000000e+00   5.344731e-07   0.000000e+00 
  1.433600e+04   9.591413e-07   0.000000e+00   9.591413e-07   0.000000e+00 
  1.446400e+04   6.176129e-07   0.000000e+00   6.176129e-07   0.000000e+00 
  1.459200e+04   3.693225e-07   0.000000e+00   3.693225e-07   0.000000e+00 
  1.472000e+04   3.691878e-07   0.000000e+00   3.691878e-07   0.000000e+00 
  1.484800e+04   3.697327e-07   0.000000e+00   3.697327e-07   0.000000e+00 
  1.497600e+04   3.686192e-07   0.000000e+00   3.686192e-07   0.000000e+00 
  1.510400e+04   3.722037e-07   0.000000e+00   3.722037e-07   0.000000e+00 
  1.523200e+04   3.772653e-07   0.000000e+00   3.772653e-07   0.000000e+00 
  1.536000e+04   3.880633e-07   0.000000e+00   3.880633e-07   0.000000e+00 
  1.548800e+04   3.875759e-07   0.000000e+00   3.875759e-07   0.000000e+00 
  1.561600e+04   3.948001e-07   0.000000e+00   3.948001e-07   0.000000e+00 
  1.574400e+04   4.039989e-07   0.000000e+00   4.039989e-07   0.000000e+00 
  1.587200e+04   4.005051e-07   0.000000e+00   4.005051e-07   0.000000e+00 
  1.600000e+04   3.983148e-07   0.000000e+00   3.983148e-07   0.000000e+00 
  1.612800e+04   4.090327e-07   0.000000e+00   4.090327e-07   0.000000e+00 
  1.625600e+04   4.079759e-07   0.000000e+00   4.079759e-07   0.000000e+00 
  1.638400e+04   4.033662e-07   0.000000e+00   4.033662e-07   0.000000e+00 
  1.651200e+04   4.172145e-07   0.000000e+00   4.172145e-07   0.000000e+00 
  1.664000e+04   4.119691e-07   0.000000e+00   4.119691e-07   0.000000e+00 
  1.676800e+04   4.100546e-07   0.000000e+00   4.100546e-07   0.000000e+00 
  1.689600e+04   4.190742e-07   0.000000e+00   4.190742e-07   0.000000e+00 
  1.702400e+04   4.287562e-07   0.000000e+00   4.287562e-07   0.000000e+00 
  1.715200e+04   5.284103e-07   0.000000e+00   5.284103e-07   0.000000e+00 
  1.728000e+04   6.339557e-07   0.000000e+00   6.339557e-07   0.000000e+00 
  1.740800e+04   4.559788e-07   0.000000e+00   4.559788e-07   0.000000e+00 
  1.753600e+04   4.281272e-07   0.000000e+00   4.281272e-07   0.000000e+00 
  1.766400e+04   4.359811e-07   0.000000e+00   4.359811e-07   0.000000e+00 
  1.779200e+04   4.347179e-07   0.000000e+00   4.347179e-07   0.000000e+00 
  1.792000e+04   4.345709e-07   0.000000e+00   4.345709e-07   0.000000e+00 
  1.804800e+04   4.505864e-07   0.000000e+00   4.505864e-07   0.000000e+00 
  1.817600e+04   6.118985e-07   0.000000e+00   6.118985e-07   0.000000e+00 
  1.830400e+04   1.866062e-06   0.000000e+00   1.866062e-06   0.000000e+00 
  1.843200e+04   1.731738e-06   0.000000e+00   1.731738e-06   0.000000e+00 
  1.856000e+04   5.251201e-07   0.000000e+00   5.251201e-07   0.000000e+00 
  1.868800e+04   4.566251e-07   0.000000e+00   4.566251e-07   0.000000e+00 
  1.881600e+04   4.612260e-07   0.000000e+00   4.612260e-07   0.000000e+00 
  1.894400e+04   4.693443e-07   0.000000e+00   4.693443e-07   0.000000e+00 
  1.907200e+04   5.150018e-07   0.000000e+00   5.150018e-07   0.000000e+00 
  1.920000e+04   4.769895e-07   0.000000e+00   4.769895e-07   0.000000e+00 
  1.932800e+04   4.670682e-07   0.000000e+00   4.670682e-07   0.000000e+00 
  1.945600e+04   4.811881e-07   0.000000e+00   4.811881e-07   0.000000e+00 
  1.958400e+04   4.999348e-07   0.000000e+00   4.999348e-07   0.000000e+00 
  1.971200e+04   4.880460e-07   0.000000e+00   4.880460e-07   0.000000e+00 
  1.984000e+04   4.858006e-07   0.000000e+00   4.858006e-07   0.000000e+00 
  1.996800e+04   5.043297e-07   0.000000e+00   5.043297e-07   0.000000e+00 
  2.009600e+04   1.143897e-06   0.000000e+00   1.143897e-06   0.000000e+00 
  2.022400e+04   1.305305e-06   0.000000e+00   1.305305e-06   0.000000e+00 
  2.035200e+04   6.026374e-07   0.000000e+00   6.026374e-07   0.000000e+00 
  2.048000e+04   6.109946e-07   0.000000e+00   6.109946e-07   0.000000e+00 
  2.060800e+04   1.320359e-06   0.000000e+00   1.320359e-06   0.000000e+00 
  2.073600e+04   1.129006e-06   0.000000e+00   1.129006e-06   0.000000e+00 
  2.086400e+04   5.141927e-07   0.000000e+00   5.141927e-07   0.000000e+00 
  2.099200e+04   4.920620e-07   0.000000e+00   4.920620e-07   0.000000e+00 
  2.112000e+04   5.066004e-07   0.000000e+00   5.066004e-07   0.000000e+00 
  2.124800e+04   9.975921e-07   0.000000e+00   9.975921e-07   0.000000e+00 
  2.137600e+04   1.640235e-06   0.000000e+00   1.640235e-06   0.000000e+00 
  2.150400e+04   8.718033e-07   0.000000e+00   8.718033e-07   0.000000e+00 
  2.163200e+04   5.063229e-07   0.000000e+00   5.063229e-07   0.000000e+00 
  2.176000e+04   5.058346e-07   0.000000e+00   5.058346e-07   0.000000e+00 
  2.188800e+04   5.112429e-07   0.000000e+00   5.112429e-07   0.000000e+00 
  2.201600e+04   5.186372e-07   0.000000e+00   5.186372e-07   0.000000e+00 
  2.214400e+04   5.134965e-07   0.000000e+00   5.134965e-07   0.000000e+00 
  2.227200e+04   5.050761e-07   0.000000e+00   5.050761e-07   0.000000e+00 
  2.240000e+04   5.197593e-07   0.000000e+00   5.197593e-07   0.000000e+00 
  2.252800e+04   5.307069e-07   0.000000e+00   5.307069e-07   0.000000e+00 
  2.265600e+04   5.409365e-07   0.000000e+00   5.409365e-07   0.000000e+00 
  2.278400e+04   5.370044e-07   0.000000e+00   5.370044e-07   0.000000e+00 
  2.291200e+04   5.319233e-07   0.000000e+00   5.319233e-07   0.000000e+00 
  2.304000e+04   5.460278e-07   0.000000e+00   5.460278e-07   0.000000e+00 
  2.316800e+04   5.452006e-07   0.000000e+00   5.452006e-07   0.000000e+00 
  2.329600e+04   5.464241e-07   0.000000e+00   5.464241e-07   0.000000e+00 
  2.342400e+04   5.342021e-07   0.000000e+00   5.342021e-07   0.000000e+00 
  2.355200e+04   5.250440e-07   0.000000e+00   5.250440e-07   0.000000e+00 
  2.368000e+04   5.417305e-07   0.000000e+00   5.417305e-07   0.000000e+00 
  2.380800e+04   5.541517e-07   0.000000e+00   5.541517e-07   0.000000e+00 
  2.393600e+04   5.547263e-07   0.000000e+00   5.547263e-07   0.000000e+00 
  2.406400e+04   5.665797e-07   0.000000e+00   5.665797e-07   0.000000e+00 
  2.419200e+04   5.552699e-07   0.000000e+00   5.552699e-07   0.000000e+00 
  2.432000e+04   5.652032e-07   0.000000e+00   5.652032e-07   0.000000e+00 
  2.444800e+04   5.651584e-07   0.000000e+00   5.651584e-07   0.000000e+00 
  2.457600e+04   5.770009e-07   0.000000e+00   5.770009e-07   0.000000e+00 
  2.470400e+04   5.795131e-07   0.000000e+00   5.795131e-07   0.000000e+00 
  2.483200e+04   5.785691e-07   0.000000e+00   5.785691e-07   0.000000e+00 
  2.496000e+04   5.722191e-07   0.000000e+00   5.722191e-07   0.000000e+00 
  2.508800e+04   5.585202e-07   0.000000e+00   5.585202e-07   0.000000e+00 
  2.521600e+04   5.779372e-07   0.000000e+00   5.779372e-07   0.000000e+00 
  2.534400e+04   5.716836e-07   0.000000e+00   5.716836e-07   0.000000e+00 
  2.547200e+04   5.756120e-07   0.000000e+00   5.756120e-07   0.000000e+00 
  2.560000e+04   5.893100e-07   0.000000e+00   5.893100e-07   0.000000e+00 
  2.572800e+04   5.966969e-07   0.000000e+00   5.966969e-07   0.000000e+00 
  2.585600e+04   5.994631e-07   0.000000e+00   5.994631e-07   0.000000e+00 
  2.598400e+04   6.059122e-07   0.000000e+00   6.059122e-07   0.000000e+00 
  2.611200e+04   6.161395e-07   0.000000e+00   6.161395e-07   0.000000e+00 
  2.624000e+04   6.248520e-07   0.000000e+00   6.248520e-07   0.000000e+00 
  2.636800e+04   6.117061e-07   0.000000e+00   6.117061e-07   0.000000e+00 
  2.649600e+04   5.922066e-07   0.000000e+00   5.922066e-07   0.000000e+00 
  2.662400e+04   6.082475e-07   0.000000e+00   6.082475e-07   0.000000e+00 
  2.675200e+04   6.149097e-07   0.000000e+00   6.149097e-07   0.000000e+00 
  2.688000e+04   6.208882e-07   0.000000e+00   6.208882e-07   0.000000e+00 
  2.700800e+04   6.085091e-07   0.000000e+00   6.085091e-07   0.000000e+00 
  2.713600e+04   6.005921e-07   0.000000e+00   6.005921e-07   0.000000e+00 
  2.726400e+04   6.225358e-07   0.000000e+00   6.225358e-07   0.000000e+00 
  2.739200e+04   6.282792e-07   0.000000e+00   6.282792e-07   0.000000e+00 
  2.752000e+04   6.231218e-07   0.000000e+00   6.231218e-07   0.000000e+00 
  2.764800e+04   6.313984e-07   0.000000e+00   6.313984e-07   0.000000e+00 
  2.777600e+04   6.307985e-07   0.000000e+00   6.307985e-07   0.000000e+00 
  2.790400e+04   6.571428e-07   0.000000e+00   6.571428e-07   0.000000e+00 
  2.803200e+04   6.511823e-07   0.000000e+00   6.511823e-07   0.000000e+00 
  2.816000e+04   6.413019e-07   0.000000e+00   6.413019e-07   0.000000e+00 
  2.828800e+04   6.289068e-07   0.000000e+00   6.289068e-07   0.000000e+00 
  2.841600e+04   6.371044e-07   0.000000e+00   6.371044e-07   0.000000e+00 
  2.854400e+04   6.421948e-07   0.000000e+00   6.421948e-07   0.000000e+00 
  2.867200e+04   6.486349e-07   0.000000e+00   6.486349e-07   0.000000e+00 
  2.880000e+04   6.467681e-07   0.000000e+00   6.467681e-07   0.000000e+00 
  2.892800e+04   6.538456e-07   0.000000e+00   6.538456e-07   0.000000e+00 
  2.905600e+04   6.533875e-07   0.000000e+00   6.533875e-07   0.000000e+00 
  2.918400e+04   6.396547e-07   0.000000e+00   6.396547e-07   0.000000e+00 
  2.931200e+04   6.447017e-07   0.000000e+00   6.447017e-07   0.000000e+00 
  2.944000e+04   6.539418e-07   0.000000e+00   6.539418e-07   0.000000e+00 
  2.956800e+04   6.538409e-07   0.000000e+00   6.538409e-07   0.000000e+00 
  2.969600e+04   6.421329e-07   0.000000e+00   6.421329e-07   0.000000e+00 
  2.982400e+04   6.422584e-07   0.000000e+00   6.422584e-07   0.000000e+00 
  2.995200e+04   6.518321e-07   0.000000e+00   6.518321e-07   0.000000e+00 
  3.008000e+04   6.542216e-07   0.000000e+00   6.542216e-07   0.000000e+00 
  3.020800e+04   6.580576e-07   0.000000e+00   6.580576e-07   0.000000e+00 
  3.033600e+04   6.797413e-07   0.000000e+00   6.797413e-07   0.000000e+00 
  3.046400e+04   6.776308e-07   0.000000e+00   6.776308e-07   0.000000e+00 
  3.059200e+04   6.739679e-07   0.000000e+00   6.739679e-07   0.000000e+00 
  3.072000e+04   6.798360e-07   0.000000e+00   6.798360e-07   0.000000e+00 
  3.084800e+04   6.895016e-07   0.000000e+00   6.895016e-07   0.000000e+00 
  3.097600e+04   7.047669e-07   0.000000e+00   7.047669e-07   0.000000e+00 
  3.110400e+04   7.083660e-07   0.000000e+00   7.083660e-07   0.000000e+00 
  3.123200e+04   7.054783e-07   0.000000e+00   7.054783e-07   0.000000e+00 
  3.136000e+04   7.114148e-07   0.000000e+00   7.114148e-07   0.000000e+00 
  3.148800e+04   6.834367e-07   0.000000e+00   6.834367e-07   0.000000e+00 
  3.161600e+04   6.857654e-07   0.000000e+00   6.857654e-07   0.000000e+00 
  3.174400e+04   6.950057e-07   0.000000e+00   6.950057e-07   0.000000e+00 
  3.187200e+04   7.016623e-07   0.000000e+00   7.016623e-07   0.000000e+00 
  3.200000e+04   7.115532e-07   0.000000e+00   7.115532e-07   0.000000e+00 
  3.212800e+04   6.855985e-07   0.000000e+00   6.855985e-07   0.000000e+00 
  3.225600e+04   7.044948e-07   0.000000e+00   7.044948e-07   0.000000e+00 
  3.238400e+04   7.062202e-07   0.000000e+00   7.062202e-07   0.000000e+00 
  3.251200e+04   7.100008e-07   0.000000e+00   7.100008e-07   0.000000e+00 
  3.264000e+04   7.042682e-07   0.000000e+00   7.042682e-07   0.000000e+00 
  3.276800e+04   7.225071e-07   0.000000e+00   7.225071e-07   0.000000e+00 
  3.289600e+04   7.067268e-07   0.000000e+00   7.067268e-07   0.000000e+00 
  3.302400e+04   7.179084e-07   0.000000e+00   7.179084e-07   0.000000e+00 
  3.315200e+04   7.048172e-07   0.000000e+00   7.048172e-07   0.000000e+00 
  3.328000e+04   7.132533e-07   0.000000e+00   7.132533e-07   0.000000e+00 
  3.340800e+04   7.339491e-07   0.000000e+00   7.339491e-07   0.000000e+00 
  3.353600e+04   7.291930e-07   0.000000e+00   7.291930e-07   0.000000e+00 
  3.366400e+04   7.304029e-07   0.000000e+00   7.304029e-07   0.000000e+00 
  3.379200e+04   7.251205e-07   0.000000e+00   7.251205e-07   0.000000e+00 
  3.392000e+04   7.449584e-07   0.000000e+00   7.449584e-07   0.000000e+00 
  3.404800e+04   7.533653e-07   0.000000e+00   7.533653e-07   0.000000e+00 
  3.417600e+04   7.371302e-07   0.000000e+00   7.371302e-07   0.000000e+00 
  3.430400e+04   7.370174e-07   0.000000e+00   7.370174e-07   0.000000e+00 
  3.443200e+04   7.692879e-07   0.000000e+00   7.692879e-07   0.000000e+00 
  3.456000e+04   7.484629e-07   0.000000e+00   7.484629e-07   0.000000e+00 
  3.468800e+04   7.417236e-07   0.000000e+00   7.417236e-07   0.000000e+00 
  3.481600e+04   7.531758e-07   0.000000e+00   7.531758e-07   0.000000e+00 
  3.494400e+04   7.807755e-07   0.000000e+00   7.807755e-07   0.000000e+00 
  3.507200e+04   7.631186e-07   0.000000e+00   7.631186e-07   0.000000e+00 
  3.520000e+04   7.500475e-07   0.000000e+00   7.500475e-07   0.000000e+00 
  3.532800e+04   7.562999e-07   0.000000e+00   7.562999e-07   0.000000e+00 
  3.545600e+04   7.479414e-07   0.000000e+00   7.479414e-07   0.000000e+00 
  3.558400e+04   7.360109e-07   0.000000e+00   7.360109e-07   0.000000e+00 
  3.571200e+04   7.492117e-07   0.000000e+00   7.492117e-07   0.000000e+00 
  3.584000e+04   7.598054e-07   0.000000e+00   7.598054e-07   0.000000e+00 
  3.596800e+04   7.692292e-07   0.000000e+00   7.692292e-07   0.000000e+00 
  3.609600e+04   7.677188e-07   0.000000e+00   7.677188e-07   0.000000e+00 
  3.622400e+04   7.595348e-07   0.000000e+00   7.595348e-07   0.000000e+00 
  3.635200e+04   7.638353e-07   0.000000e+00   7.638353e-07   0.000000e+00 
  3.648000e+04   7.679346e-07   0.000000e+00   7.679346e-07   0.000000e+00 
  3.660800e+04   7.642716e-07   0.000000e+00   7.642716e-07   0.000000e+00 
  3.673600e+04   7.687880e-07   0.000000e+00   7.687880e-07   0.000000e+00 
  3.686400e+04   7.574578e-07   0.000000e+00   7.574578e-07   0.000000e+00 
  3.699200e+04   7.513933e-07   0.000000e+00   7.513933e-07   0.000000e+00 
  3.712000e+04   7.734592e-07   0.000000e+00   7.734592e-07   0.000000e+00 
  3.724800e+04   7.947291e-07   0.000000e+00   7.947291e-07   0.000000e+00 
  3.737600e+04   8.151839e-07   0.000000e+00   8.151839e-07   0.000000e+00 
  3.750400e+04   8.040533e-07   0.000000e+00   8.040533e-07   0.000000e+00 
  3.763200e+04   7.830939e-07   0.000000e+00   7.830939e-07   0.000000e+00 
  3.776000e+04   8.094932e-07   0.000000e+00   8.094932e-07   0.000000e+00 
  3.788800e+04   7.959037e-07   0.000000e+00   7.959037e-07   0.000000e+00 
  3.801600e+04   7.861564e-07   0.000000e+00   7.861564e-07   0.000000e+00 
  3.814400e+04   7.990786e-07   0.000000e+00   7.990786e-07   0.000000e+00 
  3.827200e+04   7.883459e-07   0.000000e+00   7.883459e-07   0.000000e+00 
  3.840000e+04   7.846958e-07   0.000000e+00   7.846958e-07   0.000000e+00 
  3.852800e+04   7.844075e-07   0.000000e+00   7.844075e-07   0.000000e+00 
  3.865600e+04   7.826488e-07   0.000000e+00   7.826488e-07   0.000000e+00 
  3.878400e+04   8.090632e-07   0.000000e+00   8.090632e-07   0.000000e+00 
  3.891200e+04   8.153490e-07   0.000000e+00   8.153490e-07   0.000000e+00 
  3.904000e+04   8.041916e-07   0.000000e+00   8.041916e-07   0.000000e+00 
  3.916800e+04   8.350391e-07   0.000000e+00   8.350391e-07   0.000000e+00 
  3.929600e+04   8.176813e-07   0.000000e+00   8.176813e-07   0.000000e+00 
  3.942400e+04   7.996875e-07   0.000000e+00   7.996875e-07   0.000000e+00 
  3.955200e+04   8.156448e-07   0.000000e+00   8.156448e-07   0.000000e+00 
  3.968000e+04   8.279729e-07   0.000000e+00   8.279729e-07   0.000000e+00 
  3.980800e+04   8.306592e-07   0.000000e+00   8.306592e-07   0.000000e+00 
  3.993600e+04   8.253176e-07   0.000000e+00   8.253176e-07   0.000000e+00 
  4.006400e+04   8.190100e-07   0.000000e+00   8.190100e-07   0.000000e+00 
  4.019200e+04   8.216344e-07   0.000000e+00   8.216344e-07   0.000000e+00 
  4.032000e+04   8.447954e-07   0.000000e+00   8.447954e-07   0.000000e+00 
  4.044800e+04   8.618487e-07   0.000000e+00   8.618487e-07   0.000000e+00 
  4.057600e+04   8.553311e-07   0.000000e+00   8.553311e-07   0.000000e+00 
  4.070400e+04   8.343977e-07   0.000000e+00   8.343977e-07   0.000000e+00 
  4.083200e+04   8.310070e-07   0.000000e+00   8.310070e-07   0.000000e+00 
  4.096000e+04   8.334434e-07   0.000000e+00   8.334434e-07   0.000000e+00 
  4.108800e+04   8.290413e-07   0.000000e+00   8.290413e-07   0.000000e+00 
  4.121600e+04   8.389546e-07   0.000000e+00   8.389546e-07   0.000000e+00 
  4.134400e+04   8.432830e-07   0.000000e+00   8.432830e-07   0.000000e+00 
  4.147200e+04   8.585939e-07   0.000000e+00   8.585939e-07   0.000000e+00 
  4.160000e+04   8.470913e-07   0.000000e+00   8.470913e-07   0.000000e+00 
  4.172800e+04   8.437178e-07   0.000000e+00   8.437178e-07   0.000000e+00 
  4.185600e+04   8.515828e-07   0.000000e+00   8.515828e-07   0.000000e+00 
  4.198400e+04   8.336083e-07   0.000000e+00   8.336083e-07   0.000000e+00 
  4.211200e+04   8.379193e-07   0.000000e+00   8.379193e-07   0.000000e+00 
  4.224000e+04   8.475263e-07   0.000000e+00   8.475263e-07   0.000000e+00 
  4.236800e+04   8.541837e-07   0.000000e+00   8.541837e-07   0.000000e+00 
  4.249600e+04   8.628725e-07   0.000000e+00   8.628725e-07   0.000000e+00 
  4.262400e+04   8.480528e-07   0.000000e+00   8.480528e-07   0.000000e+00 
  4.275200e+04   8.601243e-07   0.000000e+00   8.601243e-07   0.000000e+00 
  4.288000e+04   8.546569e-07   0.000000e+00   8.546569e-07   0.000000e+00 
  4.300800e+04   8.614552e-07   0.000000e+00   8.614552e-07   0.000000e+00 
  4.313600e+04   8.858078e-07   0.000000e+00   8.858078e-07   0.000000e+00 
  4.326400e+04   8.844295e-07   0.000000e+00   8.844295e-07   0.000000e+00 
  4.339200e+04   8.772861e-07   0.000000e+00   8.772861e-07   0.000000e+00 
  4.352000e+04   8.719852e-07   0.000000e+00   8.719852e-07   0.000000e+00 
  4.364800e+04   9.082377e-07   0.000000e+00   9.082377e-07   0.000000e+00 
  4.377600e+04   8.950937e-07   0.000000e+00   8.950937e-07   0.000000e+00 
  4.390400e+04   8.878084e-07   0.000000e+00   8.878084e-07   0.000000e+00 
  4.403200e+04   8.865304e-07   0.000000e+00   8.865304e-07   0.000000e+00 
  4.416000e+04   8.989048e-07   0.000000e+00   8.989048e-07   0.000000e+00 
  4.428800e+04   9.060142e-07   0.000000e+00   9.060142e-07   0.000000e+00 
  4.441600e+04   8.961344e-07   0.000000e+00   8.961344e-07   0.000000e+00 
  4.454400e+04   9.096390e-07   0.000000e+00   9.096390e-07   0.000000e+00 
  4.467200e+04   9.199471e-07   0.000000e+00   9.199471e-07   0.000000e+00 
  4.480000e+04   9.324948e-07   0.000000e+00   9.324948e-07   0.000000e+00 
  4.492800e+04   9.475032e-07   0.000000e+00   9.475032e-07   0.000000e+00 
  4.505600e+04   9.324473e-07   0.000000e+00   9.324473e-07   0.000000e+00 
  4.518400e+04   9.021387e-07   0.000000e+00   9.021387e-07   0.000000e+00 
  4.531200e+04   9.025208e-07   0.000000e+00   9.025208e-07   0.000000e+00 
  4.544000e+04   9.104032e-07   0.000000e+00   9.104032e-07   0.000000e+00 
  4.556800e+04   9.141913e-07   0.000000e+00   9.141913e-07   0.000000e+00 
  4.569600e+04   9.205497e-07   0.000000e+00   9.205497e-07   0.000000e+00 
  4.582400e+04   9.050435e-07   0.000000e+00   9.050435e-07   0.000000e+00 
  4.595200e+04   9.083718e-07   0.000000e+00   9.083718e-07   0.000000e+00 
  4.608000e+04   9.151417e-07   0.000000e+00   9.151417e-07   0.000000e+00 
  4.620800e+04   9.311465e-07   0.000000e+00   9.311465e-07   0.000000e+00 
  4.633600e+04   9.147431e-07   0.000000e+00   9.147431e-07   0.000000e+00 
  4.646400e+04   9.146666e-07   0.000000e+00   9.146666e-07   0.000000e+00 
  4.659200e+04   9.194776e-07   0.000000e+00   9.194776e-07   0.000000e+00 
  4.672000e+04   9.163248e-07   0.000000e+00   9.163248e-07   0.000000e+00 
  4.684800e+04   9.170623e-07   0.000000e+00   9.170623e-07   0.000000e+00 
  4.697600e+04   9.006483e-07   0.000000e+00   9.006483e-07   0.000000e+00 
  4.710400e+04   9.170718e-07   0.000000e+00   9.170718e-07   0.000000e+00 
  4.723200e+04   9.377816e-07   0.000000e+00   9.377816e-07   0.000000e+00 
  4.736000e+04   9.261714e-07   0.000000e+00   9.261714e-07   0.000000e+00 
  4.748800e+04   9.173629e-07   0.000000e+00   9.173629e-07   0.000000e+00 
  4.761600e+04   9.452787e-07   0.000000e+00   9.452787e-07   0.000000e+00 
  4.774400e+04   9.209659e-07   0.000000e+00   9.209659e-07   0.000000e+00 
  4.787200e+04   9.129061e-07   0.000000e+00   9.129061e-07   0.000000e+00 
  4.800000e+04   9.380984e-07   0.000000e+00   9.380984e-07   0.000000e+00 
  4.812800e+04   9.395536e-07   0.000000e+00   9.395536e-07   0.000000e+00 
  4.825600e+04   9.246083e-07   0.000000e+00   9.246083e-07   0.000000e+00 
  4.838400e+04   9.219156e-07   0.000000e+00   9.219156e-07   0.000000e+00 
  4.851200e+04   9.396387e-07   0.000000e+00   9.396387e-07   0.000000e+00 
  4.864000e+04   9.437636e-07   0.000000e+00   9.437636e-07   0.000000e+00 
  4.876800e+04   9.654511e-07   0.000000e+00   9.654511e-07   0.000000e+00 
  4.889600e+04   9.615446e-07   0.000000e+00   9.615446e-07   0.000000e+00 
  4.902400e+04   9.442331e-07   0.000000e+00   9.442331e-07   0.000000e+00 
  4.915200e+04   9.241431e-07   0.000000e+00   9.241431e-07   0.000000e+00 
  4.928000e+04   9.499100e-07   0.000000e+00   9.499100e-07   0.000000e+00 
  4.940800e+04   9.694863e-07   0.000000e+00   9.694863e-07   0.000000e+00 
  4.953600e+04   9.483455e-07   0.000000e+00   9.483455e-07   0.000000e+00 
  4.966400e+04   9.499057e-07   0.000000e+00   9.499057e-07   0.000000e+00 
  4.979200e+04   9.442767e-07   0.000000e+00   9.442767e-07   0.000000e+00 
  4.992000e+04   9.687657e-07   0.000000e+00   9.687657e-07   0.000000e+00 
  5.004800e+04   9.486832e-07   0.000000e+00   9.486832e-07   0.000000e+00 
  5.017600e+04   9.463488e-07   0.000000e+00   9.463488e-07   0.000000e+00 
  5.030400e+04   9.621310e-07   0.000000e+00   9.621310e-07   0.000000e+00 
  5.043200e+04   9.566921e-07   0.000000e+00   9.566921e-07   0.000000e+00 
  5.056000e+04   9.722573e-07   0.000000e+00   9.722573e-07   0.000000e+00 
  5.068800e+04   9.654673e-07   0.000000e+00   9.654673e-07   0.000000e+00 
  5.081600e+04   9.842851e-07   0.000000e+00   9.842851e-07   0.000000e+00 
  5.094400e+04   9.636901e-07   0.000000e+00   9.636901e-07   0.000000e+00 
  5.107200e+04   9.557081e-07   0.000000e+00   9.557081e-07   0.000000e+00 
  5.120000e+04   9.645945e-07   0.000000e+00   9.645945e-07   0.000000e+00 
  5.132800e+04   9.627551e-07   0.000000e+00   9.627551e-07   0.000000e+00 
  5.145600e+04   9.781214e-07   0.000000e+00   9.781214e-07   0.000000e+00 
  5.158400e+04   9.757083e-07   0.000000e+00   9.757083e-07   0.000000e+00 
  5.171200e+04   9.862403e-07   0.000000e+00   9.862403e-07   0.000000e+00 
  5.184000e+04   9.912296e-07   0.000000e+00   9.912296e-07   0.000000e+00 
  5.196800e+04   9.854256e-07   0.000000e+00   9.854256e-07   0.000000e+00 
  5.209600e+04   9.861790e-07   0.000000e+00   9.861790e-07   0.000000e+00 
  5.222400e+04   9.793353e-07   0.000000e+00   9.793353e-07   0.000000e+00 
  5.235200e+04   9.722693e-07   0.000000e+00   9.722693e-07   0.000000e+00 
  5.248000e+04   9.638794e-07   0.000000e+00   9.638794e-07   0.000000e+00 
  5.260800e+04   1.000780e-06   0.000000e+00   1.000780e-06   0.000000e+00 
  5.273600e+04   9.992589e-07   0.000000e+00   9.992589e-07   0.000000e+00 
  5.286400e+04   9.785276e-07   0.000000e+00   9.785276e-07   0.000000e+00 
  5.299200e+04   9.722592e-07   0.000000e+00   9.722592e-07   0.000000e+00 
  5.312000e+04   9.695478e-07   0.000000e+00   9.695478e-07   0.000000e+00 
  5.324800e+04   9.921088e-07   0.000000e+00   9.921088e-07   0.000000e+00 
  5.337600e+04   1.009521e-06   0.000000e+00   1.009521e-06   0.000000e+00 
  5.350400e+04   1.011930e-06   0.000000e+00   1.011930e-06   0.000000e+00 
  5.363200e+04   9.967666e-07   0.000000e+00   9.967666e-07   0.000000e+00 
  5.376000e+04   1.014949e-06   0.000000e+00   1.014949e-06   0.000000e+00 
  5.388800e+04   1.029768e-06   0.000000e+00   1.029768e-06   0.000000e+00 
  5.401600e+04   1.020786e-06   0.000000e+00   1.020786e-06   0.000000e+00 
  5.414400e+04   9.964147e-07   0.000000e+00   9.964147e-07   0.000000e+00 
  5.427200e+04   1.009525e-06   0.000000e+00   1.009525e-06   0.000000e+00 
  5.440000e+04   1.002273e-06   0.000000e+00   1.002273e-06   0.000000e+00 
  5.452800e+04   1.000894e-06   0.000000e+00   1.000894e-06   0.000000e+00 
  5.465600e+04   1.014479e-06   0.000000e+00   1.014479e-06   0.000000e+00 
  5.478400e+04   1.030706e-06   0.000000e+00   1.030706e-06   0.000000e+00 
  5.491200e+04   1.020689e-06   0.000000e+00   1.020689e-06   0.000000e+00 
  5.504000e+04   1.010157e-06   0.000000e+00   1.010157e-06   0.000000e+00 
  5.516800e+04   1.033924e-06   0.000000e+00   1.033924e-06   0.000000e+00 
  5.529600e+04   1.044187e-06   0.000000e+00   1.044187e-06   0.000000e+00 
  5.542400e+04   1.032602e-06   0.000000e+00   1.032602e-06   0.000000e+00 
  5.555200e+04   1.047690e-06   0.000000e+00   1.047690e-06   0.000000e+00 
  5.568000e+04   1.029582e-06   0.000000e+00   1.029582e-06   0.000000e+00 
  5.580800e+04   1.040936e-06   0.000000e+00   1.040936e-06   0.000000e+00 
  5.593600e+04   1.025836e-06   0.000000e+00   1.025836e-06   0.000000e+00 
  5.606400e+04   1.036540e-06   0.000000e+00   1.036540e-06   0.000000e+00 
  5.619200e+04   1.040472e-06   0.000000e+00   1.040472e-06   0.000000e+00 
  5.632000e+04   1.041316e-06   0.000000e+00   1.041316e-06   0.000000e+00 
  5.644800e+04   1.015899e-06   0.000000e+00   1.015899e-06   0.000000e+00 
  5.657600e+04   1.030054e-06   0.000000e+00   1.030054e-06   0.000000e+00 
  5.670400e+04   1.044964e-06   0.000000e+00   1.044964e-06   0.000000e+00 
  5.683200e+04   1.040176e-06   0.000000e+00   1.040176e-06   0.000000e+00 
  5.696000e+04   1.021595e-06   0.000000e+00   1.021595e-06   0.000000e+00 
  5.708800e+04   1.042235e-06   0.000000e+00   1.042235e-06   0.000000e+00 
  5.721600e+04   1.043516e-06   0.000000e+00   1.043516e-06   0.000000e+00 
  5.734400e+04   1.035628e-06   0.000000e+00   1.035628e-06   0.000000e+00 
  5.747200e+04   1.036252e-06   0.000000e+00   1.036252e-06   0.000000e+00 
  5.760000e+04   1.030251e-06   0.000000e+00   1.030251e-06   0.000000e+00 
  5.772800e+04   1.044784e-06   0.000000e+00   1.044784e-06   0.000000e+00 
  5.785600e+04   1.027524e-06   0.000000e+00   1.027524e-06   0.000000e+00 
  5.798400e+04   1.031296e-06   0.000000e+00   1.031296e-06   0.000000e+00 
  5.811200e+04   1.055556e-06   0.000000e+00   1.055556e-06   0.000000e+00 
  5.824000e+04   1.070791e-06   0.000000e+00   1.070791e-06   0.000000e+00 
  5.836800e+04   1.045291e-06   0.000000e+00   1.045291e-06   0.000000e+00 
  5.849600e+04   1.044221e-06   0.000000e+00   1.044221e-06   0.000000e+00 
  5.862400e+04   1.075820e-06   0.000000e+00   1.075820e-06   0.000000e+00 
  5.875200e+04   1.110222e-06   0.000000e+00   1.110222e-06   0.000000e+00 
  5.888000e+04   1.066981e-06   0.000000e+00   1.066981e-06   0.000000e+00 
  5.900800e+04   1.090687e-06   0.000000e+00   1.090687e-06   0.000000e+00 
  5.913600e+04   1.099152e-06   0.000000e+00   1.099152e-06   0.000000e+00 
  5.926400e+04   1.074041e-06   0.000000e+00   1.074041e-06   0.000000e+00 
  5.939200e+04   1.060866e-06   0.000000e+00   1.060866e-06   0.000000e+00 
  5.952000e+04   1.066274e-06   0.000000e+00   1.066274e-06   0.000000e+00 
  5.964800e+04   1.076884e-06   0.000000e+00   1.076884e-06   0.000000e+00 
  5.977600e+04   1.097443e-06   0.000000e+00   1.097443e-06   0.000000e+00 
  5.990400e+04   1.077982e-06   0.000000e+00   1.077982e-06   0.000000e+00 
  6.003200e+04   1.073429e-06   0.000000e+00   1.073429e-06   0.000000e+00 
  6.016000e+04   1.099995e-06   0.000000e+00   1.099995e-06   0.000000e+00 
  6.028800e+04   1.090376e-06   0.000000e+00   1.090376e-06   0.000000e+00 
  6.041600e+04   1.070820e-06   0.000000e+00   1.070820e-06   0.000000e+00 
  6.054400e+04   1.105925e-06   0.000000e+00   1.105925e-06   0.000000e+00 
  6.067200e+04   1.085297e-06   0.000000e+00   1.085297e-06   0.000000e+00 
  6.080000e+04   1.072049e-06   0.000000e+00   1.072049e-06   0.000000e+00 
  6.092800e+04   1.097483e-06   0.000000e+00   1.097483e-06   0.000000e+00 
  6.105600e+04   1.079126e-06   0.000000e+00   1.079126e-06   0.000000e+00 
  6.118400e+04   1.056148e-06   0.000000e+00   1.056148e-06   0.000000e+00 
  6.131200e+04   1.052272e-06   0.000000e+00   1.052272e-06   0.000000e+00 
  6.144000e+04   1.060669e-06   0.000000e+00   1.060669e-06   0.000000e+00 
  6.156800e+04   1.081621e-06   0.000000e+00   1.081621e-06   0.000000e+00 
  6.169600e+04   1.092155e-06   0.000000e+00   1.092155e-06   0.000000e+00 
  6.182400e+04   1.094607e-06   0.000000e+00   1.094607e-06   0.000000e+00 
  6.195200e+04   1.108096e-06   0.000000e+00   1.108096e-06   0.000000e+00 
  6.208000e+04   1.106839e-06   0.000000e+00   1.106839e-06   0.000000e+00 
  6.220800e+04   1.096854e-06   0.000000e+00   1.096854e-06   0.000000e+00 
  6.233600e+04   1.085698e-06   0.000000e+00   1.085698e-06   0.000000e+00 
  6.246400e+04   1.071416e-06   0.000000e+00   1.071416e-06   0.000000e+00 
  6.259200e+04   1.181774e-06   0.000000e+00   1.181774e-06   0.000000e+00 
  6.272000e+04   1.145129e-06   0.000000e+00   1.145129e-06   0.000000e+00 
  6.284800e+04   1.108216e-06   0.000000e+00   1.108216e-06   0.000000e+00 
  6.297600e+04   1.110684e-06   0.000000e+00   1.110684e-06   0.000000e+00 
  6.310400e+04   1.115309e-06   0.000000e+00   1.115309e-06   0.000000e+00 
  6.323200e+04   1.147555e-06   0.000000e+00   1.147555e-06   0.000000e+00 
  6.336000e+04   1.118440e-06   0.000000e+00   1.118440e-06   0.000000e+00 
  6.348800e+04   1.105057e-06   0.000000e+00   1.105057e-06   0.000000e+00 
  6.361600e+04   1.094207e-06   0.000000e+00   1.094207e-06   0.000000e+00 
  6.374400e+04   1.100997e-06   0.000000e+00   1.100997e-06   0.000000e+00 
  6.387200e+04   1.117018e-06   0.000000e+00   1.117018e-06   0.000000e+00 
  6.400000e+04   1.141631e-06   0.000000e+00   1.141631e-06   0.000000e+00 
  6.412800e+04   1.102408e-06   0.000000e+00   1.102408e-06   0.000000e+00 
  6.425600e+04   1.103470e-06   0.000000e+00   1.103470e-06   0.000000e+00 
  6.438400e+04   1.132433e-06   0.000000e+00   1.132433e-06   0.000000e+00 
  6.451200e+04   1.127415e-06   0.000000e+00   1.127415e-06   0.000000e+00 
  6.464000e+04   1.120658e-06   0.000000e+00   1.120658e-06   0.000000e+00 
  6.476800e+04   1.122421e-06   0.000000e+00   1.122421e-06   0.000000e+00 
  6.489600e+04   1.131297e-06   0.000000e+00   1.131297e-06   0.000000e+00 
  6.502400e+04   1.145070e-06   0.000000e+00   1.145070e-06   0.000000e+00 
  6.515200e+04   1.132645e-06   0.000000e+00   1.132645e-06   0.000000e+00 
  6.528000e+04   1.131904e-06   0.000000e+00   1.131904e-06   0.000000e+00 
  6.540800e+04   1.140832e-06   0.000000e+00   1.140832e-06   0.000000e+00 
  6.553600e+04   1.129004e-06   0.000000e+00   1.129004e-06   0.000000e+00 
  6.566400e+04   1.123128e-06   0.000000e+00   1.123128e-06   0.000000e+00 
  6.579200e+04   1.135836e-06   0.000000e+00   1.135836e-06   0.000000e+00 
  6.592000e+04   1.135852e-06   0.000000e+00   1.135852e-06   0.000000e+00 
  6.604800e+04   1.131874e-06   0.000000e+00   1.131874e-06   0.000000e+00 
  6.617600e+04   1.134157e-06   0.000000e+00   1.134157e-06   0.000000e+00 
  6.630400e+04   1.150939e-06   0.000000e+00   1.150939e-06   0.000000e+00 
  6.643200e+04   1.172293e-06   0.000000e+00   1.172293e-06   0.000000e+00 
  6.656000e+04   1.165107e-06   0.000000e+00   1.165107e-06   0.000000e+00 
  6.668800e+04   1.115926e-06   0.000000e+00   1.115926e-06   0.000000e+00 
  6.681600e+04   1.113727e-06   0.000000e+00   1.113727e-06   0.000000e+00 
  6.694400e+04   1.123375e-06   0.000000e+00   1.123375e-06   0.000000e+00 
  6.707200e+04   1.118039e-06   0.000000e+00   1.118039e-06   0.000000e+00 
  6.720000e+04   1.114961e-06   0.000000e+00   1.114961e-06   0.000000e+00 
  6.732800e+04   1.108964e-06   0.000000e+00   1.108964e-06   0.000000e+00 
  6.745600e+04   1.136734e-06   0.000000e+00   1.136734e-06   0.000000e+00 
  6.758400e+04   1.138624e-06   0.000000e+00   1.138624e-06   0.000000e+00 
  6.771200e+04   1.129306e-06   0.000000e+00   1.129306e-06   0.000000e+00 
  6.784000e+04   1.145602e-06   0.000000e+00   1.145602e-06   0.000000e+00 
  6.796800e+04   1.139157e-06   0.000000e+00   1.139157e-06   0.000000e+00 
  6.809600e+04   1.132975e-06   0.000000e+00   1.132975e-06   0.000000e+00 
  6.822400e+04   1.147211e-06   0.000000e+00   1.147211e-06   0.000000e+00 
  6.835200e+04   1.169786e-06   0.000000e+00   1.169786e-06   0.000000e+00 
  6.848000e+04   1.154672e-06   0.000000e+00   1.154672e-06   0.000000e+00 
  6.860800e+04   1.141047e-06   0.000000e+00   1.141047e-06   0.000000e+00 
  6.873600e+04   1.158936e-06   0.000000e+00   1.158936e-06   0.000000e+00 
  6.886400e+04   1.130497e-06   0.000000e+00   1.130497e-06   0.000000e+00 
  6.899200e+04   1.133425e-06   0.000000e+00   1.133425e-06   0.000000e+00 
  6.912000e+04   1.164208e-06   0.000000e+00   1.164208e-06   0.000000e+00 
  6.924800e+04   1.146574e-06   0.000000e+00   1.146574e-06   0.000000e+00 
  6.937600e+04   1.153294e-06   0.000000e+00   1.153294e-06   0.000000e+00 
  6.950400e+04   1.181330e-06   0.000000e+00   1.181330e-06   0.000000e+00 
  6.963200e+04   1.147988e-06   0.000000e+00   1.147988e-06   0.000000e+00 
  6.976000e+04   1.141857e-06   0.000000e+00   1.141857e-06   0.000000e+00 
  6.988800e+04   1.149396e-06   0.000000e+00   1.149396e-06   0.000000e+00 
  7.001600e+04   1.146338e-06   0.000000e+00   1.146338e-06   0.000000e+00 
  7.014400e+04   1.160186e-06   0.000000e+00   1.160186e-06   0.000000e+00 
  7.027200e+04   1.155512e-06   0.000000e+00   1.155512e-06   0.000000e+00 
  7.040000e+04   1.153086e-06   0.000000e+00   1.153086e-06   0.000000e+00 
  7.052800e+04   1.151172e-06   0.000000e+00   1.151172e-06   0.000000e+00 
  7.065600e+04   1.174453e-06   0.000000e+00   1.174453e-06   0.000000e+00 
  7.078400e+04   1.164621e-06   0.000000e+00   1.164621e-06   0.000000e+00 
  7.091200e+04   1.147340e-06   0.000000e+00   1.147340e-06   0.000000e+00 
  7.104000e+04   1.179906e-06   0.000000e+00   1.179906e-06   0.000000e+00 
  7.116800e+04   1.264546e-06   0.000000e+00   1.264546e-06   0.000000e+00 
  7.129600e+04   1.200786e-06   0.000000e+00   1.200786e-06   0.000000e+00 
  7.142400e+04   1.164465e-06   0.000000e+00   1.164465e-06   0.000000e+00 
  7.155200e+04   1.136414e-06   0.000000e+00   1.136414e-06   0.000000e+00 
  7.168000e+04   1.142458e-06   0.000000e+00   1.142458e-06   0.000000e+00 
  7.180800e+04   1.182087e-06   0.000000e+00   1.182087e-06   0.000000e+00 
  7.193600e+04   1.169663e-06   0.000000e+00   1.169663e-06   0.000000e+00 
  7.206400e+04   1.142642e-06   0.000000e+00   1.142642e-06   0.000000e+00 
  7.219200e+04   1.129964e-06   0.000000e+00   1.129964e-06   0.000000e+00 
  7.232000e+04   1.148789e-06   0.000000e+00   1.148789e-06   0.000000e+00 
  7.244800e+04   1.164133e-06   0.000000e+00   1.164133e-06   0.000000e+00 
  7.257600e+04   1.169211e-06   0.000000e+00   1.169211e-06   0.000000e+00 
  7.270400e+04   1.188752e-06   0.000000e+00   1.188752e-06   0.000000e+00 
  7.283200e+04   1.180416e-06   0.000000e+00   1.180416e-06   0.000000e+00 
  7.296000e+04   1.187998e-06   0.000000e+00   1.187998e-06   0.000000e+00 
  7.308800e+04   1.172296e-06   0.000000e+00   1.172296e-06   0.000000e+00 
  7.321600e+04   1.174452e-06   0.000000e+00   1.174452e-06   0.000000e+00 
  7.334400e+04   1.180850e-06   0.000000e+00   1.180850e-06   0.000000e+00 
  7.347200e+04   1.396991e-06   0.000000e+00   1.396991e-06   0.000000e+00 
  7.360000e+04   1.423349e-06   0.000000e+00   1.423349e-06   0.000000e+00 
  7.372800e+04   1.186623e-06   0.000000e+00   1.186623e-06   0.000000e+00 
  7.385600e+04   1.177314e-06   0.000000e+00   1.177314e-06   0.000000e+00 
  7.398400e+04   1.194442e-06   0.000000e+00   1.194442e-06   0.000000e+00 
  7.411200e+04   1.190887e-06   0.000000e+00   1.190887e-06   0.000000e+00 
  7.424000e+04   1.203225e-06   0.000000e+00   1.203225e-06   0.000000e+00 
  7.436800e+04   1.199031e-06   0.000000e+00   1.199031e-06   0.000000e+00 
  7.449600e+04   1.199252e-06   0.000000e+00   1.199252e-06   0.000000e+00 
  7.462400e+04   1.198301e-06   0.000000e+00   1.198301e-06   0.000000e+00 
  7.475200e+04   1.177867e-06   0.000000e+00   1.177867e-06   0.000000e+00 
  7.488000e+04   1.140500e-06   0.000000e+00   1.140500e-06   0.000000e+00 
  7.500800e+04   1.168506e-06   0.000000e+00   1.168506e-06   0.000000e+00 
  7.513600e+04   1.215610e-06   0.000000e+00   1.215610e-06   0.000000e+00 
  7.526400e+04   1.230917e-06   0.000000e+00   1.230917e-06   0.000000e+00 
  7.539200e+04   1.215684e-06   0.000000e+00   1.215684e-06   0.000000e+00 
  7.552000e+04   1.209928e-06   0.000000e+00   1.209928e-06   0.000000e+00 
  7.564800e+04   1.215065e-06   0.000000e+00   1.215065e-06   0.000000e+00 
  7.577600e+04   1.198066e-06   0.000000e+00   1.198066e-06   0.000000e+00 
  7.590400e+04   1.184693e-06   0.000000e+00   1.184693e-06   0.000000e+00 
  7.603200e+04   1.180929e-06   0.000000e+00   1.180929e-06   0.000000e+00 
  7.616000e+04   1.222187e-06   0.000000e+00   1.222187e-06   0.000000e+00 
  7.628800e+04   1.236540e-06   0.000000e+00   1.236540e-06   0.000000e+00 
  7.641600e+04   1.205237e-06   0.000000e+00   1.205237e-06   0.000000e+00 
  7.654400e+04   1.210380e-06   0.000000e+00   1.210380e-06   0.000000e+00 
  7.667200e+04   1.210969e-06   0.000000e+00   1.210969e-06   0.000000e+00 
  7.680000e+04   1.212190e-06   0.000000e+00   1.212190e-06   0.000000e+00 
  7.692800e+04   1.222827e-06   0.000000e+00   1.222827e-06   0.000000e+00 
  7.705600e+04   1.229381e-06   0.000000e+00   1.229381e-06   0.000000e+00 
  7.718400e+04   1.216585e-06   0.000000e+00   1.216585e-06   0.000000e+00 
  7.731200e+04   1.206741e-06   0.000000e+00   1.206741e-06   0.000000e+00 
  7.744000e+04   1.223080e-06   0.000000e+00   1.223080e-06   0.000000e+00 
  7.756800e+04   1.218104e-06   0.000000e+00   1.218104e-06   0.000000e+00 
  7.769600e+04   1.222122e-06   0.000000e+00   1.222122e-06   0.000000e+00 
  7.782400e+04   1.213759e-06   0.000000e+00   1.213759e-06   0.000000e+00 
  7.795200e+04   1.244559e-06   0.000000e+00   1.244559e-06   0.000000e+00 
  7.808000e+04   1.248510e-06   0.000000e+00   1.248510e-06   0.000000e+00 
  7.820800e+04   1.199744e-06   0.000000e+00   1.199744e-06   0.000000e+00 
  7.833600e+04   1.242826e-06   0.000000e+00   1.242826e-06   0.000000e+00 
  7.846400e+04   1.228667e-06   0.000000e+00   1.228667e-06   0.000000e+00 
  7.859200e+04   1.202818e-06   0.000000e+00   1.202818e-06   0.000000e+00 
  7.872000e+04   1.244040e-06   0.000000e+00   1.244040e-06   0.000000e+00 
  7.884800e+04   1.257183e-06   0.000000e+00   1.257183e-06   0.000000e+00 
  7.897600e+04   1.259137e-06   0.000000e+00   1.259137e-06   0.000000e+00 
  7.910400e+04   1.251084e-06   0.000000e+00   1.251084e-06   0.000000e+00 
  7.923200e+04   1.262180e-06   0.000000e+00   1.262180e-06   0.000000e+00 
  7.936000e+04   1.225395e-06   0.000000e+00   1.225395e-06   0.000000e+00 
  7.948800e+04   1.228175e-06   0.000000e+00   1.228175e-06   0.000000e+00 
  7.961600e+04   1.243603e-06   0.000000e+00   1.243603e-06   0.000000e+00 
  7.974400e+04   1.222799e-06   0.000000e+00   1.222799e-06   0.000000e+00 
  7.987200e+04   1.239284e-06   0.000000e+00   1.239284e-06   0.000000e+00 
  8.000000e+04   1.248122e-06   0.000000e+00   1.248122e-06   0.000000e+00 
  8.012800e+04   1.236159e-06   0.000000e+00   1.236159e-06   0.000000e+00 
  8.025600e+04   1.217066e-06   0.000000e+00   1.217066e-06   0.000000e+00 
  8.038400e+04   1.213006e-06   0.000000e+00   1.213006e-06   0.000000e+00 
  8.051200e+04   1.218478e-06   0.000000e+00   1.218478e-06   0.000000e+00 
  8.064000e+04   1.226517e-06   0.000000e+00   1.226517e-06   0.000000e+00 
  8.076800e+04   1.238614e-06   0.000000e+00   1.238614e-06   0.000000e+00 
  8.089600e+04   1.252104e-06   0.000000e+00   1.252104e-06   0.000000e+00 
  8.102400e+04   1.223424e-06   0.000000e+00   1.223424e-06   0.000000e+00 
  8.115200e+04   1.227462e-06   0.000000e+00   1.227462e-06   0.000000e+00 
  8.128000e+04   1.231041e-06   0.000000e+00   1.231041e-06   0.000000e+00 
  8.140800e+04   1.257660e-06   0.000000e+00   1.257660e-06   0.000000e+00 
  8.153600e+04   1.226294e-06   0.000000e+00   1.226294e-06   0.000000e+00 
  8.166400e+04   1.232669e-06   0.000000e+00   1.232669e-06   0.000000e+00 
  8.179200e+04   1.226684e-06   0.000000e+00   1.226684e-06   0.000000e+00 
  8.192000e+04   1.236806e-06   0.000000e+00   1.236806e-06   0.000000e+00 
  8.204800e+04   1.242505e-06   0.000000e+00   1.242505e-06   0.000000e+00 
  8.217600e+04   1.250520e-06   0.000000e+00   1.250520e-06   0.000000e+00 
  8.230400e+04   1.268965e-06   0.000000e+00   1.268965e-06   0.000000e+00 
  8.243200e+04   1.247255e-06   0.000000e+00   1.247255e-06   0.000000e+00 
  8.256000e+04   1.245320e-06   0.000000e+00   1.245320e-06   0.000000e+00 
  8.268800e+04   1.240387e-06   0.000000e+00   1.240387e-06   0.000000e+00 
  8.281600e+04   1.220693e-06   0.000000e+00   1.220693e-06   0.000000e+00 
  8.294400e+04   1.243198e-06   0.000000e+00   1.243198e-06   0.000000e+00 
  8.307200e+04   1.264635e-06   0.000000e+00   1.264635e-06   0.000000e+00 
  8.320000e+04   1.290284e-06   0.000000e+00   1.290284e-06   0.000000e+00 
  8.332800e+04   1.249349e-06   0.000000e+00   1.249349e-06   0.000000e+00 
  8.345600e+04   1.223290e-06   0.000000e+00   1.223290e-06   0.000000e+00 
  8.358400e+04   1.229503e-06   0.000000e+00   1.229503e-06   0.000000e+00 
  8.371200e+04   1.242663e-06   0.000000e+00   1.242663e-06   0.000000e+00 
  8.384000e+04   1.252061e-06   0.000000e+00   1.252061e-06   0.000000e+00 
  8.396800e+04   1.264556e-06   0.000000e+00   1.264556e-06   0.000000e+00 
  8.409600e+04   1.262649e-06   0.000000e+00   1.262649e-06   0.000000e+00 
  8.422400e+04   1.251047e-06   0.000000e+00   1.251047e-06   0.000000e+00 
  8.435200e+04   1.233925e-06   0.000000e+00   1.233925e-06   0.000000e+00 
  8.448000e+04   1.233289e-06   0.000000e+00   1.233289e-06   0.000000e+00 
  8.460800e+04   1.250849e-06   0.000000e+00   1.250849e-06   0.000000e+00 
  8.473600e+04   1.291641e-06   0.000000e+00   1.291641e-06   0.000000e+00 
  8.486400e+04   1.266993e-06   0.000000e+00   1.266993e-06   0.000000e+00 
  8.499200e+04   1.267784e-06   0.000000e+00   1.267784e-06   0.000000e+00 
  8.512000e+04   1.275990e-06   0.000000e+00   1.275990e-06   0.000000e+00 
  8.524800e+04   1.248580e-06   0.000000e+00   1.248580e-06   0.000000e+00 
  8.537600e+04   1.228833e-06   0.000000e+00   1.228833e-06   0.000000e+00 
  8.550400e+04   1.262824e-06   0.000000e+00   1.262824e-06   0.000000e+00 
  8.563200e+04   1.265974e-06   0.000000e+00   1.265974e-06   0.000000e+00 
  8.576000e+04   1.276252e-06   0.000000e+00   1.276252e-06   0.000000e+00 
  8.588800e+04   1.289427e-06   0.000000e+00   1.289427e-06   0.000000e+00 
  8.601600e+04   1.284184e-06   0.000000e+00   1.284184e-06   0.000000e+00 
  8.614400e+04   1.256883e-06   0.000000e+00   1.256883e-06   0.000000e+00 
  8.627200e+04   1.257787e-06   0.000000e+00   1.257787e-06   0.000000e+00 
  8.640000e+04   1.298372e-06   0.000000e+00   1.298372e-06   0.000000e+00 
  8.652800e+04   1.272917e-06   0.000000e+00   1.272917e-06   0.000000e+00 
  8.665600e+04   1.282711e-06   0.000000e+00   1.282711e-06   0.000000e+00 
  8.678400e+04   1.298865e-06   0.000000e+00   1.298865e-06   0.000000e+00 
  8.691200e+04   1.268372e-06   0.000000e+00   1.268372e-06   0.000000e+00 
  8.704000e+04   1.252135e-06   0.000000e+00   1.252135e-06   0.000000e+00 
  8.716800e+04   1.282478e-06   0.000000e+00   1.282478e-06   0.000000e+00 
  8.729600e+04   1.261831e-06   0.000000e+00   1.261831e-06   0.000000e+00 
  8.742400e+04   1.263435e-06   0.000000e+00   1.263435e-06   0.000000e+00 
  8.755200e+04   1.261506e-06   0.000000e+00   1.261506e-06   0.000000e+00 
  8.768000e+04   1.274270e-06   0.000000e+00   1.274270e-06   0.000000e+00 
  8.780800e+04   1.306785e-06   0.000000e+00   1.306785e-06   0.000000e+00 
  8.793600e+04   1.304731e-06   0.000000e+00   1.304731e-06   0.000000e+00 
  8.806400e+04   1.309161e-06   0.000000e+00   1.309161e-06   0.000000e+00 
  8.819200e+04   1.298072e-06   0.000000e+00   1.298072e-06   0.000000e+00 
  8.832000e+04   1.289170e-06   0.000000e+00   1.289170e-06   0.000000e+00 
  8.844800e+04   1.274235e-06   0.000000e+00   1.274235e-06   0.000000e+00 
  8.857600e+04   1.287020e-06   0.000000e+00   1.287020e-06   0.000000e+00 
  8.870400e+04   1.291597e-06   0.000000e+00   1.291597e-06   0.000000e+00 
  8.883200e+04   1.285841e-06   0.000000e+00   1.285841e-06   0.000000e+00 
  8.896000e+04   1.306423e-06   0.000000e+00   1.306423e-06   0.000000e+00 
  8.908800e+04   1.336773e-06   0.000000e+00   1.336773e-06   0.000000e+00 
  8.921600e+04   1.369355e-06   0.000000e+00   1.369355e-06   0.000000e+00 
  8.934400e+04   1.376112e-06   0.000000e+00   1.376112e-06   0.000000e+00 
  8.947200e+04   1.394869e-06   0.000000e+00   1.394869e-06   0.000000e+00 
  8.960000e+04   1.363680e-06   0.000000e+00   1.363680e-06   0.000000e+00 
  8.972800e+04   1.325848e-06   0.000000e+00   1.325848e-06   0.000000e+00 
  8.985600e+04   1.361557e-06   0.000000e+00   1.361557e-06   0.000000e+00 
  8.998400e+04   1.328875e-06   0.000000e+00   1.328875e-06   0.000000e+00 
  9.011200e+04   1.299779e-06   0.000000e+00   1.299779e-06   0.000000e+00 
  9.024000e+04   1.318836e-06   0.000000e+00   1.318836e-06   0.000000e+00 
  9.036800e+04   1.342495e-06   0.000000e+00   1.342495e-06   0.000000e+00 
  9.049600e+04   1.326710e-06   0.000000e+00   1.326710e-06   0.000000e+00 
  9.062400e+04   1.283766e-06   0.000000e+00   1.283766e-06   0.000000e+00 
  9.075200e+04   1.314412e-06   0.000000e+00   1.314412e-06   0.000000e+00 
  9.088000e+04   1.328989e-06   0.000000e+00   1.328989e-06   0.000000e+00 
  9.100800e+04   1.385521e-06   0.000000e+00   1.385521e-06   0.000000e+00 
  9.113600e+04   1.342578e-06   0.000000e+00   1.342578e-06   0.000000e+00 
  9.126400e+04   1.285809e-06   0.000000e+00   1.285809e-06   0.000000e+00 
  9.139200e+04   1.272119e-06   0.000000e+00   1.272119e-06   0.000000e+00 
  9.152000e+04   1.295753e-06   0.000000e+00   1.295753e-06   0.000000e+00 
  9.164800e+04   1.306296e-06   0.000000e+00   1.306296e-06   0.000000e+00 
  9.177600e+04   1.282130e-06   0.000000e+00   1.282130e-06   0.000000e+00 
  9.190400e+04   1.283256e-06   0.000000e+00   1.283256e-06   0.000000e+00 
  9.203200e+04   1.267905e-06   0.000000e+00   1.267905e-06   0.000000e+00 
  9.216000e+04   1.271895e-06   0.000000e+00   1.271895e-06   0.000000e+00 
  9.228800e+04   1.321765e-06   0.000000e+00   1.321765e-06   0.000000e+00 
  9.241600e+04   1.328722e-06   0.000000e+00   1.328722e-06   0.000000e+00 
  9.254400e+04   1.291563e-06   0.000000e+00   1.291563e-06   0.000000e+00 
  9.267200e+04   1.287711e-06   0.000000e+00   1.287711e-06   0.000000e+00 
  9.280000e+04   1.297592e-06   0.000000e+00   1.297592e-06   0.000000e+00 
  9.292800e+04   1.256592e-06   0.000000e+00   1.256592e-06   0.000000e+00 
  9.305600e+04   1.272900e-06   0.000000e+00   1.272900e-06   0.000000e+00 
  9.318400e+04   1.303090e-06   0.000000e+00   1.303090e-06   0.000000e+00 
  9.331200e+04   1.276184e-06   0.000000e+00   1.276184e-06   0.000000e+00 
  9.344000e+04   1.250688e-06   0.000000e+00   1.250688e-06   0.000000e+00 
  9.356800e+04   1.259692e-06   0.000000e+00   1.259692e-06   0.000000e+00 
  9.369600e+04   1.296434e-06   0.000000e+00   1.296434e-06   0.000000e+00 
  9.382400e+04   1.286230e-06   0.000000e+00   1.286230e-06   0.000000e+00 
  9.395200e+04   1.264330e-06   0.000000e+00   1.264330e-06   0.000000e+00 
  9.408000e+04   1.263970e-06   0.000000e+00   1.263970e-06   0.000000e+00 
  9.420800e+04   1.288061e-06   0.000000e+00   1.288061e-06   0.000000e+00 
  9.433600e+04   1.300751e-06   0.000000e+00   1.300751e-06   0.000000e+00 
  9.446400e+04   1.358952e-06   0.000000e+00   1.358952e-06   0.000000e+00 
  9.459200e+04   1.370526e-06   0.000000e+00   1.370526e-06   0.000000e+00 
  9.472000e+04   1.362078e-06   0.000000e+00   1.362078e-06   0.000000e+00 
  9.484800e+04   1.343722e-06   0.000000e+00   1.343722e-06   0.000000e+00 
  9.497600e+04   1.307913e-06   0.000000e+00   1.307913e-06   0.000000e+00 
  9.510400e+04   1.315271e-06   0.000000e+00   1.315271e-06   0.000000e+00 
  9.523200e+04   1.326887e-06   0.000000e+00   1.326887e-06   0.000000e+00 
  9.536000e+04   1.319724e-06   0.000000e+00   1.319724e-06   0.000000e+00 
  9.548800e+04   1.321280e-06   0.000000e+00   1.321280e-06   0.000000e+00 
  9.561600e+04   1.352136e-06   0.000000e+00   1.352136e-06   0.000000e+00 
  9.574400e+04   1.289933e-06   0.000000e+00   1.289933e-06   0.000000e+00 
  9.587200e+04   1.291490e-06   0.000000e+00   1.291490e-06   0.000000e+00 
  9.600000e+04   1.261417e-06   0.000000e+00   1.261417e-06   0.000000e+00 
  9.612800e+04   1.269918e-06   0.000000e+00   1.269918e-06   0.000000e+00 
  9.625600e+04   1.347948e-06   0.000000e+00   1.347948e-06   0.000000e+00 
  9.638400e+04   1.334652e-06   0.000000e+00   1.334652e-06   0.000000e+00 
  9.651200e+04   1.333863e-06   0.000000e+00   1.333863e-06   0.000000e+00 
  9.664000e+04   1.290151e-06   0.000000e+00   1.290151e-06   0.000000e+00 
  9.676800e+04   1.315620e-06   0.000000e+00   1.315620e-06   0.000000e+00 
  9.689600e+04   1.350193e-06   0.000000e+00   1.350193e-06   0.000000e+00 
  9.702400e+04   1.341378e-06   0.000000e+00   1.341378e-06   0.000000e+00 
  9.715200e+04   1.344935e-06   0.000000e+00   1.344935e-06   0.000000e+00 
  9.728000e+04   1.351641e-06   0.000000e+00   1.351641e-06   0.000000e+00 
  9.740800e+04   1.336601e-06   0.000000e+00   1.336601e-06   0.000000e+00 
  9.753600e+04   1.353067e-06   0.000000e+00   1.353067e-06   0.000000e+00 
  9.766400e+04   1.364234e-06   0.000000e+00   1.364234e-06   0.000000e+00 
  9.779200e+04   1.323955e-06   0.000000e+00   1.323955e-06   0.000000e+00 
  9.792000e+04   1.340108e-06   0.000000e+00   1.340108e-06   0.000000e+00 
  9.804800e+04   1.297528e-06   0.000000e+00   1.297528e-06   0.000000e+00 
  9.817600e+04   1.296220e-06   0.000000e+00   1.296220e-06   0.000000e+00 
  9.830400e+04   1.312438e-06   0.000000e+00   1.312438e-06   0.000000e+00 
  9.843200e+04   1.304025e-06   0.000000e+00   1.304025e-06   0.000000e+00 
  9.856000e+04   1.329158e-06   0.000000e+00   1.329158e-06   0.000000e+00 
  9.868800e+04   1.314161e-06   0.000000e+00   1.314161e-06   0.000000e+00 
  9.881600e+04   1.298443e-06   0.000000e+00   1.298443e-06   0.000000e+00 
  9.894400e+04   1.326579e-06   0.000000e+00   1.326579e-06   0.000000e+00 
  9.907200e+04   1.315125e-06   0.000000e+00   1.315125e-06   0.000000e+00 
  9.920000e+04   1.334877e-06   0.000000e+00   1.334877e-06   0.000000e+00 
  9.932800e+04   1.356990e-06   0.000000e+00   1.356990e-06   0.000000e+00 
  9.945600e+04   1.418262e-06   0.000000e+00   1.418262e-06   0.000000e+00 
  9.958400e+04   2.436225e-06   0.000000e+00   2.436225e-06   0.000000e+00 
  9.971200e+04   3.388025e-06   0.000000e+00   3.388025e-06   0.000000e+00 
  9.984000e+04   3.391189e-06   0.000000e+00   3.391189e-06   0.000000e+00 
  9.996800e+04   1.981320e-06   0.000000e+00   1.981320e-06   0.000000e+00 
  1.000960e+05   1.340349e-06   0.000000e+00   1.340349e-06   0.000000e+00 
  1.002240e+05   1.358216e-06   0.000000e+00   1.358216e-06   0.000000e+00 
  1.003520e+05   1.347482e-06   0.000000e+00   1.347482e-06   0.000000e+00 
  1.004800e+05   1.356808e-06   0.000000e+00   1.356808e-06   0.000000e+00 
  1.006080e+05   1.346227e-06   0.000000e+00   1.346227e-06   0.000000e+00 
  1.007360e+05   1.343063e-06   0.000000e+00   1.343063e-06   0.000000e+00 
  1.008640e+05   1.315373e-06   0.000000e+00   1.315373e-06   0.000000e+00 
  1.009920e+05   1.344478e-06   0.000000e+00   1.344478e-06   0.000000e+00 
  1.011200e+05   1.360352e-06   0.000000e+00   1.360352e-06   0.000000e+00 
  1.012480e+05   1.334742e-06   0.000000e+00   1.334742e-06   0.000000e+00 
  1.013760e+05   1.320138e-06   0.000000e+00   1.320138e-06   0.000000e+00 
  1.015040e+05   1.336105e-06   0.000000e+00   1.336105e-06   0.000000e+00 
  1.016320e+05   1.335673e-06   0.000000e+00   1.335673e-06   0.000000e+00 
  1.017600e+05   1.335215e-06   0.000000e+00   1.335215e-06   0.000000e+00 
  1.018880e+05   1.341262e-06   0.000000e+00   1.341262e-06   0.000000e+00 
  1.020160e+05   1.347967e-06   0.000000e+00   1.347967e-06   0.000000e+00 
  1.021440e+05   1.333698e-06   0.000000e+00   1.333698e-06   0.000000e+00 
  1.022720e+05   1.341746e-06   0.000000e+00   1.341746e-06   0.000000e+00 
  1.024000e+05   1.324214e-06   0.000000e+00   1.324214e-06   0.000000e+00 
