  0.000000e+00   1.718476e-03   2.189674e-06   1.718477e-03   7.300599e-02 
  5.000000e-01   1.374380e-03   6.005623e-04   1.499865e-03   2.360386e+01 
  1.000000e+00   8.694052e-04   5.674112e-04   1.038182e-03   3.313019e+01 
  1.500000e+00   7.189536e-04   4.907106e-04   8.704546e-04   3.431488e+01 
  2.000000e+00   7.242041e-04   5.945766e-04   9.370128e-04   3.938623e+01 
  2.500000e+00   5.327896e-04   5.271636e-04   7.495107e-04   4.469588e+01 
  3.000000e+00   4.320507e-04   5.330582e-04   6.861624e-04   5.097478e+01 
  3.500000e+00   4.981604e-04   5.471263e-04   7.399399e-04   4.768203e+01 
  4.000000e+00   5.032066e-04   4.750417e-04   6.920126e-04   4.335084e+01 
  4.500000e+00   4.724972e-04   3.489886e-04   5.874067e-04   3.644975e+01 
  5.000000e+00   4.602647e-04   3.377486e-04   5.708920e-04   3.627174e+01 
  5.500000e+00   3.916295e-04   3.654648e-04   5.356661e-04   4.302068e+01 
  6.000000e+00   3.165833e-04   3.008662e-04   4.367441e-04   4.354185e+01 
  6.500000e+00   2.985338e-04   2.875488e-04   4.144958e-04   4.392623e+01 
  7.000000e+00   2.848529e-04   2.964948e-04   4.111573e-04   4.614724e+01 
  7.500000e+00   2.256640e-04   2.771245e-04   3.573825e-04   5.084389e+01 
  8.000000e+00   2.172571e-04   2.872551e-04   3.601613e-04   5.289902e+01 
  8.500000e+00   1.987023e-04   2.833189e-04   3.460523e-04   5.495655e+01 
  9.000000e+00   1.588161e-04   2.405588e-04   2.882553e-04   5.656735e+01 
  9.500000e+00   1.379161e-04   2.146940e-04   2.551752e-04   5.728393e+01 
  1.000000e+01   1.661398e-04   1.723461e-04   2.393859e-04   4.605043e+01 
  1.050000e+01   1.486191e-04   1.445630e-04   2.073309e-04   4.420738e+01 
  1.100000e+01   1.005887e-04   1.561355e-04   1.857320e-04   5.720875e+01 
  1.150000e+01   1.428753e-04   1.731583e-04   2.244931e-04   5.047349e+01 
  1.200000e+01   1.744390e-04   1.772940e-04   2.487210e-04   4.546506e+01 
  1.250000e+01   1.567847e-04   1.399664e-04   2.101714e-04   4.175625e+01 
  1.300000e+01   1.371545e-04   1.253019e-04   1.857739e-04   4.241428e+01 
  1.350000e+01   1.103937e-04   1.378293e-04   1.765890e-04   5.130718e+01 
  1.400000e+01   1.184959e-04   1.145790e-04   1.648321e-04   4.403721e+01 
  1.450000e+01   1.073374e-04   1.008118e-04   1.472560e-04   4.320431e+01 
  1.500000e+01   9.782267e-05   1.028374e-04   1.419324e-04   4.643158e+01 
  1.550000e+01   1.208535e-04   1.171908e-04   1.683427e-04   4.411848e+01 
  1.600000e+01   1.268479e-04   1.164426e-04   1.721896e-04   4.255101e+01 
  1.650000e+01   1.291193e-04   1.000074e-04   1.633196e-04   3.775902e+01 
  1.700000e+01   1.323139e-04   9.017908e-05   1.601226e-04   3.427654e+01 
  1.750000e+01   1.296914e-04   7.469140e-05   1.496618e-04   2.993834e+01 
  1.800000e+01   1.165764e-04   7.613796e-05   1.392374e-04   3.314920e+01 
  1.850000e+01   8.484665e-05   7.861327e-05   1.156676e-04   4.281614e+01 
  1.900000e+01   6.010092e-05   6.915516e-05   9.162181e-05   4.900696e+01 
  1.950000e+01   6.118893e-05   6.797082e-05   9.145554e-05   4.800571e+01 
  2.000000e+01   6.884407e-05   6.955963e-05   9.786750e-05   4.529622e+01 
  2.050000e+01   8.648185e-05   6.419603e-05   1.077044e-04   3.658673e+01 
  2.100000e+01   7.556097e-05   7.004308e-05   1.030315e-04   4.282972e+01 
  2.150000e+01   6.096902e-05   7.458243e-05   9.633151e-05   5.073497e+01 
  2.200000e+01   6.410661e-05   6.697683e-05   9.271220e-05   4.625435e+01 
  2.250000e+01   6.245713e-05   5.191183e-05   8.121411e-05   3.973198e+01 
  2.300000e+01   5.797114e-05   5.232534e-05   7.809349e-05   4.206973e+01 
  2.350000e+01   4.655838e-05   6.351410e-05   7.875102e-05   5.375709e+01 
  2.400000e+01   4.800768e-05   6.658999e-05   8.209119e-05   5.421049e+01 
  2.450000e+01   4.630491e-05   6.089424e-05   7.650002e-05   5.275008e+01 
  2.500000e+01   3.322228e-05   5.780322e-05   6.667032e-05   6.011195e+01 
  2.550000e+01   3.519893e-05   4.502042e-05   5.714720e-05   5.198015e+01 
  2.600000e+01   3.875234e-05   4.233351e-05   5.739225e-05   4.752883e+01 
  2.650000e+01   3.886605e-05   4.732733e-05   6.124088e-05   5.060655e+01 
  2.700000e+01   3.999454e-05   4.571307e-05   6.073918e-05   4.881719e+01 
  2.750000e+01   4.834080e-05   4.460306e-05   6.577436e-05   4.269709e+01 
  2.800000e+01   5.793061e-05   3.977074e-05   7.026854e-05   3.447052e+01 
  2.850000e+01   5.901197e-05   3.555428e-05   6.889499e-05   3.106865e+01 
  2.900000e+01   5.138231e-05   3.476020e-05   6.203559e-05   3.407840e+01 
  2.950000e+01   4.135526e-05   2.548949e-05   4.857954e-05   3.164778e+01 
  3.000000e+01   3.616366e-05   2.601386e-05   4.454808e-05   3.572886e+01 
  3.050000e+01   3.872242e-05   2.944573e-05   4.864645e-05   3.725048e+01 
  3.100000e+01   3.753664e-05   2.993311e-05   4.801032e-05   3.857016e+01 
  3.150000e+01   3.847229e-05   2.718375e-05   4.710704e-05   3.524426e+01 
  3.200000e+01   3.766251e-05   2.460036e-05   4.498491e-05   3.315173e+01 
  3.250000e+01   3.207333e-05   2.953124e-05   4.359809e-05   4.263705e+01 
  3.300000e+01   2.976479e-05   2.838270e-05   4.112810e-05   4.363840e+01 
  3.350000e+01   2.506175e-05   2.174520e-05   3.318049e-05   4.094702e+01 
  3.400000e+01   2.383241e-05   1.926178e-05   3.064311e-05   3.894576e+01 
  3.450000e+01   3.171439e-05   2.404782e-05   3.980075e-05   3.717166e+01 
  3.500000e+01   3.760162e-05   2.984540e-05   4.800656e-05   3.843996e+01 
  3.550000e+01   3.680231e-05   2.932044e-05   4.705420e-05   3.854437e+01 
  3.600000e+01   3.240497e-05   2.527598e-05   4.109693e-05   3.795435e+01 
  3.650000e+01   2.549611e-05   2.720693e-05   3.728631e-05   4.685925e+01 
  3.700000e+01   2.876948e-05   2.841893e-05   4.043907e-05   4.464879e+01 
  3.750000e+01   2.936983e-05   2.928129e-05   4.147265e-05   4.491351e+01 
  3.800000e+01   2.661894e-05   2.789884e-05   3.856052e-05   4.634488e+01 
  3.850000e+01   2.507425e-05   2.540074e-05   3.569196e-05   4.537059e+01 
  3.900000e+01   2.534254e-05   2.368392e-05   3.468677e-05   4.306237e+01 
  3.950000e+01   2.352879e-05   2.088425e-05   3.146039e-05   4.159239e+01 
  4.000000e+01   2.328322e-05   2.448810e-05   3.379017e-05   4.644479e+01 
  4.050000e+01   2.284943e-05   2.638356e-05   3.490256e-05   4.910586e+01 
  4.100000e+01   2.511456e-05   2.753847e-05   3.727074e-05   4.763578e+01 
  4.150000e+01   2.297148e-05   2.866557e-05   3.673423e-05   5.129266e+01 
  4.200000e+01   1.656354e-05   2.712790e-05   3.178480e-05   5.859292e+01 
  4.250000e+01   2.009990e-05   2.553718e-05   3.249851e-05   5.179429e+01 
  4.300000e+01   2.412112e-05   2.496323e-05   3.471299e-05   4.598289e+01 
  4.350000e+01   2.463277e-05   2.142558e-05   3.264703e-05   4.101675e+01 
  4.400000e+01   2.091591e-05   1.413697e-05   2.524538e-05   3.405458e+01 
  4.450000e+01   2.256999e-05   1.439682e-05   2.677075e-05   3.253275e+01 
  4.500000e+01   2.970690e-05   1.958153e-05   3.558000e-05   3.339117e+01 
  4.550000e+01   2.430054e-05   1.798454e-05   3.023177e-05   3.650470e+01 
  4.600000e+01   1.708757e-05   2.120229e-05   2.723090e-05   5.113361e+01 
  4.650000e+01   1.564917e-05   2.256676e-05   2.746189e-05   5.526019e+01 
  4.700000e+01   1.637782e-05   1.964570e-05   2.557707e-05   5.018341e+01 
  4.750000e+01   1.739678e-05   2.002539e-05   2.652667e-05   4.901796e+01 
  4.800000e+01   1.765118e-05   1.776826e-05   2.504546e-05   4.518939e+01 
  4.850000e+01   1.942652e-05   1.427993e-05   2.411029e-05   3.631863e+01 
  4.900000e+01   2.100458e-05   1.240799e-05   2.439571e-05   3.057152e+01 
  4.950000e+01   2.017848e-05   1.273232e-05   2.385966e-05   3.225131e+01 
  5.000000e+01   1.925872e-05   1.641008e-05   2.530196e-05   4.043383e+01 
  5.050000e+01   1.868145e-05   1.738584e-05   2.551987e-05   4.294270e+01 
  5.100000e+01   1.698564e-05   1.585347e-05   2.323455e-05   4.302545e+01 
  5.150000e+01   1.551614e-05   1.541369e-05   2.187082e-05   4.481022e+01 
  5.200000e+01   1.431524e-05   1.913274e-05   2.389535e-05   5.319592e+01 
  5.250000e+01   1.213530e-05   1.793974e-05   2.165871e-05   5.592368e+01 
  5.300000e+01   1.165202e-05   1.592600e-05   1.973340e-05   5.380949e+01 
  5.350000e+01   1.316809e-05   1.202233e-05   1.783073e-05   4.239575e+01 
  5.400000e+01   1.577852e-05   1.158880e-05   1.957707e-05   3.629604e+01 
  5.450000e+01   2.145309e-05   1.851280e-05   2.833653e-05   4.079234e+01 
  5.500000e+01   2.363869e-05   1.973280e-05   3.079238e-05   3.985401e+01 
  5.550000e+01   1.883121e-05   1.383251e-05   2.336563e-05   3.629924e+01 
  5.600000e+01   1.562319e-05   1.137966e-05   1.932823e-05   3.606893e+01 
  5.650000e+01   1.666156e-05   1.425914e-05   2.193013e-05   4.055727e+01 
  5.700000e+01   1.708043e-05   1.427639e-05   2.226110e-05   3.989000e+01 
  5.750000e+01   1.493001e-05   1.357623e-05   2.017967e-05   4.228102e+01 
  5.800000e+01   1.315189e-05   1.170503e-05   1.760624e-05   4.166871e+01 
  5.850000e+01   1.376487e-05   1.071634e-05   1.744453e-05   3.790176e+01 
  5.900000e+01   1.547397e-05   1.228761e-05   1.975929e-05   3.845248e+01 
  5.950000e+01   1.893610e-05   1.681604e-05   2.532499e-05   4.160641e+01 
  6.000000e+01   2.015787e-05   1.884795e-05   2.759683e-05   4.307658e+01 
  6.050000e+01   1.490775e-05   1.341651e-05   2.005601e-05   4.198621e+01 
  6.100000e+01   1.203001e-05   1.413850e-05   1.856390e-05   4.960659e+01 
  6.150000e+01   1.041247e-05   1.692211e-05   1.986900e-05   5.839527e+01 
  6.200000e+01   9.930059e-06   1.529430e-05   1.823518e-05   5.700574e+01 
  6.250000e+01   1.237151e-05   1.205432e-05   1.727313e-05   4.425600e+01 
  6.300000e+01   1.049845e-05   1.008368e-05   1.455672e-05   4.384554e+01 
  6.350000e+01   8.636068e-06   1.240274e-05   1.511323e-05   5.515038e+01 
  6.400000e+01   1.269686e-05   1.364214e-05   1.863648e-05   4.705540e+01 
  6.450000e+01   1.606072e-05   1.212074e-05   2.012111e-05   3.704121e+01 
  6.500000e+01   1.628825e-05   1.147469e-05   1.992424e-05   3.516378e+01 
  6.550000e+01   1.292232e-05   1.199955e-05   1.763450e-05   4.287949e+01 
  6.600000e+01   1.337003e-05   1.156417e-05   1.767732e-05   4.085758e+01 
  6.650000e+01   1.405797e-05   1.051839e-05   1.755742e-05   3.680441e+01 
  6.700000e+01   1.336838e-05   7.693447e-06   1.542409e-05   2.992025e+01 
  6.750000e+01   1.313198e-05   1.001366e-05   1.651430e-05   3.732696e+01 
  6.800000e+01   1.395914e-05   1.235505e-05   1.864148e-05   4.151162e+01 
  6.850000e+01   1.266800e-05   1.121551e-05   1.691940e-05   4.151981e+01 
  6.900000e+01   8.873057e-06   1.216204e-05   1.505478e-05   5.388664e+01 
  6.950000e+01   1.218269e-05   1.311381e-05   1.789944e-05   4.710801e+01 
  7.000000e+01   1.679604e-05   1.454270e-05   2.221705e-05   4.088736e+01 
  7.050000e+01   1.772693e-05   1.405059e-05   2.261998e-05   3.840079e+01 
  7.100000e+01   1.685922e-05   1.310809e-05   2.135545e-05   3.786516e+01 
  7.150000e+01   1.483811e-05   1.483166e-05   2.097970e-05   4.498756e+01 
  7.200000e+01   9.842217e-06   1.607378e-05   1.884770e-05   5.852024e+01 
  7.250000e+01   8.015274e-06   1.466878e-05   1.671579e-05   6.134703e+01 
  7.300000e+01   7.918234e-06   1.112797e-05   1.365760e-05   5.456580e+01 
  7.350000e+01   8.190904e-06   8.034382e-06   1.147354e-05   4.444729e+01 
  7.400000e+01   9.269299e-06   8.205106e-06   1.237916e-05   4.151498e+01 
  7.450000e+01   9.051238e-06   1.129574e-05   1.447476e-05   5.129491e+01 
  7.500000e+01   1.232655e-05   1.264500e-05   1.765899e-05   4.573064e+01 
  7.550000e+01   1.151209e-05   1.072175e-05   1.573163e-05   4.296419e+01 
  7.600000e+01   8.471843e-06   7.351387e-06   1.121673e-05   4.094960e+01 
  7.650000e+01   8.132213e-06   8.434677e-06   1.171651e-05   4.604594e+01 
  7.700000e+01   9.780365e-06   1.037744e-05   1.425997e-05   4.669661e+01 
  7.750000e+01   1.095509e-05   1.265798e-05   1.674032e-05   4.912481e+01 
  7.800000e+01   9.835926e-06   1.320272e-05   1.646381e-05   5.331416e+01 
  7.850000e+01   8.681291e-06   1.149056e-05   1.440131e-05   5.292839e+01 
  7.900000e+01   1.093314e-05   9.883091e-06   1.473801e-05   4.211224e+01 
  7.950000e+01   1.327762e-05   9.783332e-06   1.649269e-05   3.638386e+01 
  8.000000e+01   1.443056e-05   1.054951e-05   1.787549e-05   3.616880e+01 
  8.050000e+01   1.168735e-05   7.684076e-06   1.398711e-05   3.332370e+01 
  8.100000e+01   8.868405e-06   8.758750e-06   1.246452e-05   4.464357e+01 
  8.150000e+01   1.164661e-05   1.103699e-05   1.604552e-05   4.346057e+01 
  8.200000e+01   1.261440e-05   1.202057e-05   1.742461e-05   4.361914e+01 
  8.250000e+01   1.128877e-05   1.102384e-05   1.577851e-05   4.431974e+01 
  8.300000e+01   8.402741e-06   1.068015e-05   1.358939e-05   5.180566e+01 
  8.350000e+01   7.872879e-06   1.077001e-05   1.334074e-05   5.383318e+01 
  8.400000e+01   8.388363e-06   1.022126e-05   1.322266e-05   5.062502e+01 
  8.450000e+01   8.505716e-06   9.806066e-06   1.298099e-05   4.906185e+01 
  8.500000e+01   9.215425e-06   9.566507e-06   1.328315e-05   4.607088e+01 
  8.550000e+01   9.233696e-06   9.986450e-06   1.360111e-05   4.724283e+01 
  8.600000e+01   9.481748e-06   1.107914e-05   1.458255e-05   4.944242e+01 
  8.650000e+01   7.389075e-06   1.038615e-05   1.274639e-05   5.457061e+01 
  8.700000e+01   5.796532e-06   8.869190e-06   1.059539e-05   5.683305e+01 
  8.750000e+01   7.467395e-06   9.464152e-06   1.205538e-05   5.172589e+01 
  8.800000e+01   9.059566e-06   1.035586e-05   1.375935e-05   4.881976e+01 
  8.850000e+01   9.339316e-06   9.427206e-06   1.327008e-05   4.526833e+01 
  8.900000e+01   7.845792e-06   9.695491e-06   1.247233e-05   5.101950e+01 
  8.950000e+01   7.760827e-06   9.859829e-06   1.254778e-05   5.179316e+01 
  9.000000e+01   9.134318e-06   1.018876e-05   1.368381e-05   4.812347e+01 
  9.050000e+01   7.541060e-06   9.110741e-06   1.182680e-05   5.038507e+01 
  9.100000e+01   6.747428e-06   1.020310e-05   1.223238e-05   5.652288e+01 
  9.150000e+01   9.077396e-06   1.191367e-05   1.497781e-05   5.269511e+01 
  9.200000e+01   9.222051e-06   1.036140e-05   1.387101e-05   4.832967e+01 
  9.250000e+01   8.322838e-06   7.249304e-06   1.103730e-05   4.105630e+01 
  9.300000e+01   7.755756e-06   5.679081e-06   9.612685e-06   3.621311e+01 
  9.350000e+01   8.419082e-06   6.657423e-06   1.073323e-05   3.833532e+01 
  9.400000e+01   9.973138e-06   6.616414e-06   1.196831e-05   3.356123e+01 
  9.450000e+01   1.054696e-05   6.388730e-06   1.233103e-05   3.120502e+01 
  9.500000e+01   1.023038e-05   6.258482e-06   1.199288e-05   3.145640e+01 
  9.550000e+01   8.270353e-06   6.206345e-06   1.034009e-05   3.688577e+01 
  9.600000e+01   9.528120e-06   7.472893e-06   1.210906e-05   3.810704e+01 
  9.650000e+01   1.028929e-05   7.570016e-06   1.277398e-05   3.634258e+01 
  9.700000e+01   8.555458e-06   9.300445e-06   1.263701e-05   4.738911e+01 
  9.750000e+01   8.235414e-06   1.118709e-05   1.389147e-05   5.364124e+01 
  9.800000e+01   9.755255e-06   9.607279e-06   1.369178e-05   4.456213e+01 
  9.850000e+01   1.069359e-05   7.889580e-06   1.328903e-05   3.641939e+01 
  9.900000e+01   1.778457e-05   1.619588e-05   2.405405e-05   4.232320e+01 
  9.950000e+01   4.733048e-05   4.764611e-05   6.715896e-05   4.519040e+01 
  1.000000e+02   6.664680e-05   6.767535e-05   9.498288e-05   4.543872e+01 
  1.005000e+02   4.529091e-05   4.496714e-05   6.382249e-05   4.479447e+01 
  1.010000e+02   1.598802e-05   1.416791e-05   2.136227e-05   4.154600e+01 
  1.015000e+02   8.310267e-06   8.852398e-06   1.214189e-05   4.680925e+01 
  1.020000e+02   7.996131e-06   9.876211e-06   1.270739e-05   5.100514e+01 
  1.025000e+02   7.132025e-06   9.673384e-06   1.201832e-05   5.359927e+01 
  1.030000e+02   6.366172e-06   9.207265e-06   1.119383e-05   5.533888e+01 
  1.035000e+02   7.702723e-06   1.099964e-05   1.342848e-05   5.499757e+01 
  1.040000e+02   9.249775e-06   1.210393e-05   1.523363e-05   5.261307e+01 
  1.045000e+02   9.581804e-06   1.176852e-05   1.517594e-05   5.084788e+01 
  1.050000e+02   9.197142e-06   1.124127e-05   1.452424e-05   5.071138e+01 
  1.055000e+02   8.714230e-06   1.024300e-05   1.344831e-05   4.961054e+01 
  1.060000e+02   8.934423e-06   8.820556e-06   1.255492e-05   4.463255e+01 
  1.065000e+02   8.577182e-06   8.910524e-06   1.236792e-05   4.609201e+01 
  1.070000e+02   9.237599e-06   9.629205e-06   1.334372e-05   4.618908e+01 
  1.075000e+02   8.646784e-06   9.607346e-06   1.292548e-05   4.801221e+01 
  1.080000e+02   8.421969e-06   9.274872e-06   1.252808e-05   4.775924e+01 
  1.085000e+02   9.817962e-06   9.267722e-06   1.350122e-05   4.334862e+01 
  1.090000e+02   8.426170e-06   7.631646e-06   1.136848e-05   4.216737e+01 
  1.095000e+02   7.349533e-06   7.071863e-06   1.019936e-05   4.389696e+01 
  1.100000e+02   9.748984e-06   7.267985e-06   1.216003e-05   3.670498e+01 
  1.105000e+02   9.735719e-06   5.862199e-06   1.136440e-05   3.105354e+01 
  1.110000e+02   9.253482e-06   5.519117e-06   1.077439e-05   3.081340e+01 
  1.115000e+02   8.176344e-06   5.473590e-06   9.839349e-06   3.380002e+01 
  1.120000e+02   8.854835e-06   6.009789e-06   1.070167e-05   3.416479e+01 
  1.125000e+02   1.151585e-05   5.996454e-06   1.298354e-05   2.750658e+01 
  1.130000e+02   1.169914e-05   6.433393e-06   1.335134e-05   2.880653e+01 
  1.135000e+02   1.130317e-05   9.362492e-06   1.467712e-05   3.963519e+01 
  1.140000e+02   1.063676e-05   1.043674e-05   1.490189e-05   4.445619e+01 
  1.145000e+02   9.822630e-06   1.034583e-05   1.426605e-05   4.648600e+01 
  1.150000e+02   9.215132e-06   1.016468e-05   1.372003e-05   4.780505e+01 
  1.155000e+02   8.504095e-06   8.266724e-06   1.185995e-05   4.418910e+01 
  1.160000e+02   8.279447e-06   7.223050e-06   1.098734e-05   4.110168e+01 
  1.165000e+02   8.233594e-06   8.920186e-06   1.213927e-05   4.729208e+01 
  1.170000e+02   6.366368e-06   8.915907e-06   1.095555e-05   5.447141e+01 
  1.175000e+02   7.013885e-06   8.427004e-06   1.096399e-05   5.022903e+01 
  1.180000e+02   8.251324e-06   8.544327e-06   1.187813e-05   4.599943e+01 
  1.185000e+02   7.400864e-06   8.936500e-06   1.160318e-05   5.036975e+01 
  1.190000e+02   7.774803e-06   1.073150e-05   1.325189e-05   5.407725e+01 
  1.195000e+02   1.513980e-05   1.608286e-05   2.208782e-05   4.673005e+01 
  1.200000e+02   2.010198e-05   1.991927e-05   2.829960e-05   4.473843e+01 
  1.205000e+02   1.331640e-05   1.477413e-05   1.988973e-05   4.797063e+01 
  1.210000e+02   7.078516e-06   1.038422e-05   1.256732e-05   5.571928e+01 
  1.215000e+02   8.435272e-06   9.540065e-06   1.273447e-05   4.851706e+01 
  1.220000e+02   8.421839e-06   8.701384e-06   1.210956e-05   4.593530e+01 
  1.225000e+02   6.567308e-06   7.672759e-06   1.009954e-05   4.943895e+01 
  1.230000e+02   5.118750e-06   6.688842e-06   8.422719e-06   5.257436e+01 
  1.235000e+02   5.286811e-06   6.955544e-06   8.736702e-06   5.276204e+01 
  1.240000e+02   6.384550e-06   6.809302e-06   9.334296e-06   4.684389e+01 
  1.245000e+02   8.038361e-06   8.156717e-06   1.145196e-05   4.541872e+01 
  1.250000e+02   9.025497e-06   9.481790e-06   1.309060e-05   4.641232e+01 
  1.255000e+02   9.605949e-06   9.193244e-06   1.329624e-05   4.374237e+01 
  1.260000e+02   8.999930e-06   8.213883e-06   1.218469e-05   4.238548e+01 
  1.265000e+02   7.575151e-06   8.508222e-06   1.139178e-05   4.832027e+01 
  1.270000e+02   8.353559e-06   8.926802e-06   1.222578e-05   4.689998e+01 
  1.275000e+02   8.861394e-06   8.216625e-06   1.208459e-05   4.283786e+01 
  1.280000e+02   8.626970e-06   6.189391e-06   1.061759e-05   3.565742e+01 
  1.285000e+02   9.564536e-06   5.461910e-06   1.101421e-05   2.972890e+01 
  1.290000e+02   9.692424e-06   5.883133e-06   1.133818e-05   3.125702e+01 
  1.295000e+02   1.009895e-05   7.101291e-06   1.234573e-05   3.511378e+01 
  1.300000e+02   1.029563e-05   7.635971e-06   1.281827e-05   3.656326e+01 
  1.305000e+02   7.987393e-06   6.649352e-06   1.039290e-05   3.977673e+01 
  1.310000e+02   6.522427e-06   6.104109e-06   8.933208e-06   4.310248e+01 
  1.315000e+02   6.576156e-06   6.331730e-06   9.128890e-06   4.391516e+01 
  1.320000e+02   6.751126e-06   6.046246e-06   9.062825e-06   4.184733e+01 
  1.325000e+02   6.817478e-06   6.387508e-06   9.342284e-06   4.313504e+01 
  1.330000e+02   7.402386e-06   7.266287e-06   1.037277e-05   4.446841e+01 
  1.335000e+02   6.484884e-06   8.485756e-06   1.067997e-05   5.261264e+01 
  1.340000e+02   6.100734e-06   8.394656e-06   1.037734e-05   5.399259e+01 
  1.345000e+02   7.754110e-06   6.826882e-06   1.033114e-05   4.136137e+01 
  1.350000e+02   8.366339e-06   7.026406e-06   1.092548e-05   4.002496e+01 
  1.355000e+02   6.937605e-06   7.386524e-06   1.013366e-05   4.679506e+01 
  1.360000e+02   7.132414e-06   8.519057e-06   1.111061e-05   5.006290e+01 
  1.365000e+02   7.990009e-06   1.018962e-05   1.294869e-05   5.189885e+01 
  1.370000e+02   8.975695e-06   9.980819e-06   1.342311e-05   4.803513e+01 
  1.375000e+02   9.749043e-06   9.282879e-06   1.346164e-05   4.359689e+01 
  1.380000e+02   1.018433e-05   8.432250e-06   1.322208e-05   3.962349e+01 
  1.385000e+02   9.309587e-06   7.270319e-06   1.181211e-05   3.798804e+01 
  1.390000e+02   7.402020e-06   5.157453e-06   9.021597e-06   3.486735e+01 
  1.395000e+02   9.135993e-06   5.820490e-06   1.083256e-05   3.250098e+01 
  1.400000e+02   1.009293e-05   8.508619e-06   1.320090e-05   4.013182e+01 
  1.405000e+02   8.770699e-06   9.081620e-06   1.262541e-05   4.599778e+01 
  1.410000e+02   8.200659e-06   9.260711e-06   1.236978e-05   4.847407e+01 
  1.415000e+02   8.806902e-06   8.933626e-06   1.254477e-05   4.540927e+01 
  1.420000e+02   8.249495e-06   7.871167e-06   1.140217e-05   4.365560e+01 
  1.425000e+02   7.108336e-06   7.756924e-06   1.052133e-05   4.749829e+01 
  1.430000e+02   6.763165e-06   7.540608e-06   1.012922e-05   4.811110e+01 
  1.435000e+02   6.490322e-06   7.431436e-06   9.866636e-06   4.886732e+01 
  1.440000e+02   7.932558e-06   6.846897e-06   1.047881e-05   4.079874e+01 
  1.445000e+02   9.832378e-06   7.833300e-06   1.257125e-05   3.854377e+01 
  1.450000e+02   1.021096e-05   7.711641e-06   1.279582e-05   3.706125e+01 
  1.455000e+02   8.984783e-06   5.159168e-06   1.036066e-05   2.986495e+01 
  1.460000e+02   7.398670e-06   5.905941e-06   9.466808e-06   3.859839e+01 
  1.465000e+02   7.828576e-06   7.331116e-06   1.072529e-05   4.312053e+01 
  1.470000e+02   7.424840e-06   8.140748e-06   1.101817e-05   4.763334e+01 
  1.475000e+02   8.049959e-06   8.213292e-06   1.150043e-05   4.557540e+01 
  1.480000e+02   8.427416e-06   9.280543e-06   1.253594e-05   4.775824e+01 
  1.485000e+02   8.607914e-06   9.863274e-06   1.309123e-05   4.888802e+01 
  1.490000e+02   8.894320e-06   7.815373e-06   1.184014e-05   4.130553e+01 
  1.495000e+02   7.384736e-06   5.823806e-06   9.404842e-06   3.826028e+01 
  1.500000e+02   8.426171e-06   6.970920e-06   1.093591e-05   3.960075e+01 
  1.505000e+02   8.692477e-06   7.735285e-06   1.163588e-05   4.166533e+01 
  1.510000e+02   7.277654e-06   8.573428e-06   1.124580e-05   4.967335e+01 
  1.515000e+02   6.446569e-06   8.768990e-06   1.088363e-05   5.367834e+01 
  1.520000e+02   5.696277e-06   8.865882e-06   1.053809e-05   5.727949e+01 
  1.525000e+02   6.448478e-06   7.701231e-06   1.004449e-05   5.005952e+01 
  1.530000e+02   8.387669e-06   7.465821e-06   1.122905e-05   4.167211e+01 
  1.535000e+02   8.256033e-06   8.047816e-06   1.152950e-05   4.426831e+01 
  1.540000e+02   7.150697e-06   7.359433e-06   1.026127e-05   4.582417e+01 
  1.545000e+02   7.543485e-06   7.936525e-06   1.094955e-05   4.645444e+01 
  1.550000e+02   7.533482e-06   8.628910e-06   1.145476e-05   4.887737e+01 
  1.555000e+02   7.936425e-06   7.876518e-06   1.118152e-05   4.478293e+01 
  1.560000e+02   8.454251e-06   7.839948e-06   1.152992e-05   4.284093e+01 
  1.565000e+02   9.215040e-06   8.611602e-06   1.261256e-05   4.306126e+01 
  1.570000e+02   9.677237e-06   8.195749e-06   1.268145e-05   4.026159e+01 
  1.575000e+02   9.210234e-06   8.298730e-06   1.239747e-05   4.201991e+01 
  1.580000e+02   9.842413e-06   7.684745e-06   1.248713e-05   3.798195e+01 
  1.585000e+02   1.087972e-05   7.665854e-06   1.330915e-05   3.516854e+01 
  1.590000e+02   8.561887e-06   8.678985e-06   1.219142e-05   4.538914e+01 
  1.595000e+02   7.042599e-06   8.676396e-06   1.117488e-05   5.093389e+01 
  1.600000e+02   6.864859e-06   7.905038e-06   1.046976e-05   4.902844e+01 
  1.605000e+02   6.843839e-06   7.989463e-06   1.051996e-05   4.941637e+01 
  1.610000e+02   7.547811e-06   8.181104e-06   1.113103e-05   4.730565e+01 
  1.615000e+02   8.013427e-06   7.009153e-06   1.064628e-05   4.117541e+01 
  1.620000e+02   7.781356e-06   6.939940e-06   1.042652e-05   4.172874e+01 
  1.625000e+02   7.656448e-06   8.635003e-06   1.154056e-05   4.843737e+01 
  1.630000e+02   9.775352e-06   1.006509e-05   1.403080e-05   4.583664e+01 
  1.635000e+02   1.033001e-05   1.043658e-05   1.468439e-05   4.529402e+01 
  1.640000e+02   9.054048e-06   8.696756e-06   1.255426e-05   4.384689e+01 
  1.645000e+02   8.854329e-06   7.679790e-06   1.172085e-05   4.093668e+01 
  1.650000e+02   9.914798e-06   6.916813e-06   1.208907e-05   3.490060e+01 
  1.655000e+02   8.888824e-06   6.766111e-06   1.117101e-05   3.727814e+01 
  1.660000e+02   8.612158e-06   7.379310e-06   1.134123e-05   4.059155e+01 
  1.665000e+02   8.563597e-06   7.669466e-06   1.149591e-05   4.184728e+01 
  1.670000e+02   6.889295e-06   8.762147e-06   1.114619e-05   5.182357e+01 
  1.675000e+02   5.783117e-06   9.182374e-06   1.085175e-05   5.779702e+01 
  1.680000e+02   6.989713e-06   7.465313e-06   1.022678e-05   4.688446e+01 
  1.685000e+02   8.148199e-06   5.457224e-06   9.806857e-06   3.381204e+01 
  1.690000e+02   8.013983e-06   4.508375e-06   9.195072e-06   2.936052e+01 
  1.695000e+02   7.976420e-06   6.347010e-06   1.019352e-05   3.851003e+01 
  1.700000e+02   7.499508e-06   8.596907e-06   1.140830e-05   4.890019e+01 
  1.705000e+02   6.713119e-06   1.015019e-05   1.216932e-05   5.652021e+01 
  1.710000e+02   8.959330e-06   1.023213e-05   1.360023e-05   4.879438e+01 
  1.715000e+02   9.379773e-06   9.106955e-06   1.307351e-05   4.415451e+01 
  1.720000e+02   8.243058e-06   7.694480e-06   1.127621e-05   4.302863e+01 
  1.725000e+02   8.969170e-06   8.133560e-06   1.210788e-05   4.220285e+01 
  1.730000e+02   8.902201e-06   8.978563e-06   1.264372e-05   4.524468e+01 
  1.735000e+02   7.292975e-06   8.439826e-06   1.115429e-05   4.916923e+01 
  1.740000e+02   7.024813e-06   8.072029e-06   1.070073e-05   4.896805e+01 
  1.745000e+02   7.507682e-06   8.063184e-06   1.101727e-05   4.704320e+01 
  1.750000e+02   8.526312e-06   7.431939e-06   1.131069e-05   4.107695e+01 
  1.755000e+02   7.842734e-06   7.971621e-06   1.118281e-05   4.546695e+01 
  1.760000e+02   6.839774e-06   8.521398e-06   1.092688e-05   5.124743e+01 
  1.765000e+02   7.789464e-06   8.320938e-06   1.139797e-05   4.688947e+01 
  1.770000e+02   9.242261e-06   9.491304e-06   1.324780e-05   4.576164e+01 
  1.775000e+02   8.382368e-06   8.149460e-06   1.169093e-05   4.419284e+01 
  1.780000e+02   6.987217e-06   7.975517e-06   1.060330e-05   4.877894e+01 
  1.785000e+02   7.870512e-06   9.160548e-06   1.207728e-05   4.933166e+01 
  1.790000e+02   9.533454e-06   8.966461e-06   1.308756e-05   4.324452e+01 
  1.795000e+02   1.079484e-05   7.616987e-06   1.321163e-05   3.520731e+01 
  1.800000e+02   9.699771e-06   8.683790e-06   1.301898e-05   4.183672e+01 
  1.805000e+02   7.588034e-06   8.719074e-06   1.155857e-05   4.896761e+01 
  1.810000e+02   7.188600e-06   6.522589e-06   9.706706e-06   4.221908e+01 
  1.815000e+02   6.953455e-06   6.484457e-06   9.507824e-06   4.300112e+01 
  1.820000e+02   8.622143e-06   8.950040e-06   1.242757e-05   4.606901e+01 
  1.825000e+02   9.722762e-06   9.968397e-06   1.392484e-05   4.571469e+01 
  1.830000e+02   9.088860e-06   8.926085e-06   1.273901e-05   4.448231e+01 
  1.835000e+02   7.772407e-06   8.923935e-06   1.183414e-05   4.894537e+01 
  1.840000e+02   6.789357e-06   9.347234e-06   1.155275e-05   5.400724e+01 
  1.845000e+02   9.400012e-06   8.817695e-06   1.288844e-05   4.316920e+01 
  1.850000e+02   9.428034e-06   9.479146e-06   1.336944e-05   4.515488e+01 
  1.855000e+02   7.644902e-06   1.060207e-05   1.307090e-05   5.420551e+01 
  1.860000e+02   8.559475e-06   9.108644e-06   1.249928e-05   4.678032e+01 
  1.865000e+02   8.158963e-06   7.715163e-06   1.122909e-05   4.339857e+01 
  1.870000e+02   9.127558e-06   8.714473e-06   1.261960e-05   4.367370e+01 
  1.875000e+02   1.080718e-05   9.176383e-06   1.417749e-05   4.033461e+01 
  1.880000e+02   8.072352e-06   7.628802e-06   1.110682e-05   4.338185e+01 
  1.885000e+02   6.824692e-06   7.732219e-06   1.031327e-05   4.856739e+01 
  1.890000e+02   8.034635e-06   9.465760e-06   1.241596e-05   4.967506e+01 
  1.895000e+02   8.162316e-06   8.803389e-06   1.200513e-05   4.716397e+01 
  1.900000e+02   8.447964e-06   7.037524e-06   1.099522e-05   3.979577e+01 
  1.905000e+02   9.505742e-06   5.731828e-06   1.110013e-05   3.108938e+01 
  1.910000e+02   1.028041e-05   6.249920e-06   1.203114e-05   3.129729e+01 
  1.915000e+02   1.223235e-05   9.718588e-06   1.562310e-05   3.846710e+01 
  1.920000e+02   1.276290e-05   1.077054e-05   1.670018e-05   4.016083e+01 
  1.925000e+02   9.246719e-06   7.368395e-06   1.182350e-05   3.855014e+01 
  1.930000e+02   7.795464e-06   7.325006e-06   1.069696e-05   4.321787e+01 
  1.935000e+02   8.752443e-06   7.127810e-06   1.128765e-05   3.915866e+01 
  1.940000e+02   9.855517e-06   7.623162e-06   1.245969e-05   3.772165e+01 
  1.945000e+02   1.319132e-05   9.740930e-06   1.639807e-05   3.644345e+01 
  1.950000e+02   1.436837e-05   9.934633e-06   1.746846e-05   3.466090e+01 
  1.955000e+02   1.254908e-05   1.084370e-05   1.658509e-05   4.083040e+01 
  1.960000e+02   1.016642e-05   1.069196e-05   1.475378e-05   4.644329e+01 
  1.965000e+02   8.786974e-06   7.897223e-06   1.181427e-05   4.194736e+01 
  1.970000e+02   7.715686e-06   5.673414e-06   9.577027e-06   3.632738e+01 
  1.975000e+02   7.636483e-06   5.710601e-06   9.535556e-06   3.678932e+01 
  1.980000e+02   7.544762e-06   7.348731e-06   1.053220e-05   4.424591e+01 
  1.985000e+02   7.439189e-06   8.540125e-06   1.132587e-05   4.894131e+01 
  1.990000e+02   8.992773e-06   9.253586e-06   1.290344e-05   4.581892e+01 
  1.995000e+02   1.713519e-05   1.721047e-05   2.428611e-05   4.512558e+01 
  2.000000e+02   2.322808e-05   2.348994e-05   3.303515e-05   4.532114e+01 
  2.005000e+02   1.594825e-05   1.702844e-05   2.333055e-05   4.687613e+01 
  2.010000e+02   7.746436e-06   8.479781e-06   1.148538e-05   4.758772e+01 
  2.015000e+02   6.809109e-06   6.639159e-06   9.510120e-06   4.427597e+01 
  2.020000e+02   6.091278e-06   9.407402e-06   1.120727e-05   5.707700e+01 
  2.025000e+02   6.371302e-06   1.125086e-05   1.292963e-05   6.047734e+01 
  2.030000e+02   6.715927e-06   1.231430e-05   1.402661e-05   6.139299e+01 
  2.035000e+02   8.788697e-06   1.226609e-05   1.508967e-05   5.437827e+01 
  2.040000e+02   9.452836e-06   1.040712e-05   1.405931e-05   4.775097e+01 
  2.045000e+02   8.636182e-06   8.396366e-06   1.204502e-05   4.419333e+01 
  2.050000e+02   8.638722e-06   6.944610e-06   1.108400e-05   3.879556e+01 
  2.055000e+02   9.391438e-06   7.844148e-06   1.223641e-05   3.987014e+01 
  2.060000e+02   9.263988e-06   9.499954e-06   1.326916e-05   4.572049e+01 
  2.065000e+02   7.361889e-06   9.878488e-06   1.231998e-05   5.330488e+01 
  2.070000e+02   6.363111e-06   8.769454e-06   1.083478e-05   5.403538e+01 
  2.075000e+02   6.517141e-06   7.973676e-06   1.029819e-05   5.073977e+01 
  2.080000e+02   7.879255e-06   8.556766e-06   1.163189e-05   4.736046e+01 
  2.085000e+02   8.975440e-06   8.976287e-06   1.269379e-05   4.500270e+01 
  2.090000e+02   8.104799e-06   8.439000e-06   1.170062e-05   4.615727e+01 
  2.095000e+02   7.343315e-06   9.334623e-06   1.187685e-05   5.180875e+01 
  2.100000e+02   5.864043e-06   9.952362e-06   1.155147e-05   5.949292e+01 
  2.105000e+02   6.353656e-06   8.117161e-06   1.030812e-05   5.194816e+01 
  2.110000e+02   7.107230e-06   7.567513e-06   1.038171e-05   4.679653e+01 
  2.115000e+02   8.229051e-06   8.592112e-06   1.189713e-05   4.623645e+01 
  2.120000e+02   8.836376e-06   1.005176e-05   1.338355e-05   4.868169e+01 
  2.125000e+02   8.965481e-06   9.353551e-06   1.295642e-05   4.621357e+01 
  2.130000e+02   8.416718e-06   7.864991e-06   1.151952e-05   4.305920e+01 
  2.135000e+02   7.657838e-06   9.280506e-06   1.203205e-05   5.047215e+01 
  2.140000e+02   7.118671e-06   8.867261e-06   1.137118e-05   5.124237e+01 
  2.145000e+02   8.303658e-06   7.769105e-06   1.137144e-05   4.309514e+01 
  2.150000e+02   8.978321e-06   7.399146e-06   1.163433e-05   3.949236e+01 
  2.155000e+02   9.538930e-06   8.122953e-06   1.252891e-05   4.041632e+01 
  2.160000e+02   1.073875e-05   8.466573e-06   1.367492e-05   3.825272e+01 
  2.165000e+02   1.107054e-05   9.148974e-06   1.436178e-05   3.957117e+01 
  2.170000e+02   8.969459e-06   9.730245e-06   1.323363e-05   4.732975e+01 
  2.175000e+02   8.100805e-06   9.622570e-06   1.257843e-05   4.990750e+01 
  2.180000e+02   9.386552e-06   7.437151e-06   1.197575e-05   3.839048e+01 
  2.185000e+02   9.882579e-06   7.117511e-06   1.217885e-05   3.576173e+01 
  2.190000e+02   1.006412e-05   8.774436e-06   1.335205e-05   4.108365e+01 
  2.195000e+02   9.357218e-06   8.888339e-06   1.290582e-05   4.352792e+01 
  2.200000e+02   8.364155e-06   8.735677e-06   1.209426e-05   4.624464e+01 
  2.205000e+02   8.765293e-06   9.733457e-06   1.309849e-05   4.799593e+01 
  2.210000e+02   9.150879e-06   1.010828e-05   1.363510e-05   4.784591e+01 
  2.215000e+02   7.620399e-06   7.366554e-06   1.059890e-05   4.402963e+01 
  2.220000e+02   6.542961e-06   6.048179e-06   8.910152e-06   4.274966e+01 
  2.225000e+02   6.401158e-06   6.695174e-06   9.262838e-06   4.628609e+01 
  2.230000e+02   7.388251e-06   6.152844e-06   9.614767e-06   3.978711e+01 
  2.235000e+02   9.536903e-06   5.112498e-06   1.082082e-05   2.819466e+01 
  2.240000e+02   9.201290e-06   6.317687e-06   1.116140e-05   3.447384e+01 
  2.245000e+02   8.213188e-06   5.774441e-06   1.003995e-05   3.510987e+01 
  2.250000e+02   6.934375e-06   6.748194e-06   9.675933e-06   4.422041e+01 
  2.255000e+02   7.204587e-06   7.983417e-06   1.075365e-05   4.793552e+01 
  2.260000e+02   8.456500e-06   1.010639e-05   1.317769e-05   5.007917e+01 
  2.265000e+02   9.193544e-06   1.063894e-05   1.406088e-05   4.916836e+01 
  2.270000e+02   8.785173e-06   8.013892e-06   1.189125e-05   4.237127e+01 
  2.275000e+02   5.897765e-06   7.540599e-06   9.573101e-06   5.196980e+01 
  2.280000e+02   6.234317e-06   7.764361e-06   9.957510e-06   5.123762e+01 
  2.285000e+02   8.993347e-06   5.771334e-06   1.068591e-05   3.268966e+01 
  2.290000e+02   8.956050e-06   6.050584e-06   1.080835e-05   3.404242e+01 
  2.295000e+02   8.343748e-06   8.167752e-06   1.167606e-05   4.438931e+01 
  2.300000e+02   9.350182e-06   9.477774e-06   1.331368e-05   4.538827e+01 
  2.305000e+02   1.052536e-05   1.161113e-05   1.567168e-05   4.780804e+01 
  2.310000e+02   9.263421e-06   1.334645e-05   1.624619e-05   5.523649e+01 
  2.315000e+02   5.378972e-06   1.144946e-05   1.265004e-05   6.483579e+01 
  2.320000e+02   5.750991e-06   7.535532e-06   9.479354e-06   5.264973e+01 
  2.325000e+02   6.605395e-06   4.820291e-06   8.177190e-06   3.612011e+01 
  2.330000e+02   7.403492e-06   4.376673e-06   8.600405e-06   3.059002e+01 
  2.335000e+02   7.961545e-06   6.637689e-06   1.036557e-05   3.981860e+01 
  2.340000e+02   8.022935e-06   5.767727e-06   9.881000e-06   3.571254e+01 
  2.345000e+02   6.131200e-06   7.712208e-06   9.852399e-06   5.151532e+01 
  2.350000e+02   6.758974e-06   1.047896e-05   1.246966e-05   5.717781e+01 
  2.355000e+02   7.124294e-06   8.294384e-06   1.093400e-05   4.933973e+01 
  2.360000e+02   8.841828e-06   7.639668e-06   1.168514e-05   4.082823e+01 
  2.365000e+02   1.026313e-05   1.074708e-05   1.486040e-05   4.631951e+01 
  2.370000e+02   9.264339e-06   9.908188e-06   1.356467e-05   4.692337e+01 
  2.375000e+02   9.372357e-06   7.510359e-06   1.201027e-05   3.870627e+01 
  2.380000e+02   8.593212e-06   9.173664e-06   1.256978e-05   4.687121e+01 
  2.385000e+02   9.452792e-06   9.959806e-06   1.373146e-05   4.649609e+01 
  2.390000e+02   9.623785e-06   1.083575e-05   1.449244e-05   4.839007e+01 
  2.395000e+02   9.190026e-06   1.230742e-05   1.535999e-05   5.325108e+01 
  2.400000e+02   1.038942e-05   1.308748e-05   1.670994e-05   5.155590e+01 
  2.405000e+02   1.038652e-05   1.252018e-05   1.626760e-05   5.032150e+01 
  2.410000e+02   9.137320e-06   1.101584e-05   1.431221e-05   5.032526e+01 
  2.415000e+02   8.194046e-06   9.079263e-06   1.223010e-05   4.793370e+01 
  2.420000e+02   8.194011e-06   8.985552e-06   1.216067e-05   4.763801e+01 
  2.425000e+02   9.230132e-06   8.611070e-06   1.262323e-05   4.301272e+01 
  2.430000e+02   9.889224e-06   5.976273e-06   1.155476e-05   3.114548e+01 
  2.435000e+02   9.156962e-06   5.645595e-06   1.075745e-05   3.165532e+01 
  2.440000e+02   7.665728e-06   6.948046e-06   1.034595e-05   4.218846e+01 
  2.445000e+02   6.867533e-06   7.625706e-06   1.026228e-05   4.799453e+01 
  2.450000e+02   7.692680e-06   7.306944e-06   1.060984e-05   4.352689e+01 
  2.455000e+02   7.222712e-06   8.184763e-06   1.091595e-05   4.857294e+01 
  2.460000e+02   7.346284e-06   9.157086e-06   1.173968e-05   5.126162e+01 
  2.465000e+02   1.025428e-05   8.188765e-06   1.312273e-05   3.860983e+01 
  2.470000e+02   1.002024e-05   7.255036e-06   1.237096e-05   3.590598e+01 
  2.475000e+02   8.303396e-06   7.226640e-06   1.100776e-05   4.103381e+01 
  2.480000e+02   9.227219e-06   7.550680e-06   1.192285e-05   3.929363e+01 
  2.485000e+02   9.932448e-06   8.140336e-06   1.284206e-05   3.933701e+01 
  2.490000e+02   1.090776e-05   8.842265e-06   1.404154e-05   3.902959e+01 
  2.495000e+02   1.216078e-05   8.389632e-06   1.477398e-05   3.460151e+01 
  2.500000e+02   1.313184e-05   7.051875e-06   1.490550e-05   2.823607e+01 
  2.505000e+02   1.249679e-05   7.788499e-06   1.472517e-05   3.193280e+01 
  2.510000e+02   1.065316e-05   7.235557e-06   1.287801e-05   3.418410e+01 
  2.515000e+02   9.433604e-06   6.843796e-06   1.165463e-05   3.595975e+01 
  2.520000e+02   1.163359e-05   6.714471e-06   1.343222e-05   2.999192e+01 
  2.525000e+02   1.269789e-05   7.994870e-06   1.500514e-05   3.219542e+01 
  2.530000e+02   9.824936e-06   8.622800e-06   1.307219e-05   4.127163e+01 
  2.535000e+02   7.636169e-06   9.164901e-06   1.192923e-05   5.019903e+01 
  2.540000e+02   9.030265e-06   9.168535e-06   1.286887e-05   4.543531e+01 
  2.545000e+02   1.040185e-05   8.429848e-06   1.338883e-05   3.902193e+01 
  2.550000e+02   1.023266e-05   8.528269e-06   1.332061e-05   3.980905e+01 
  2.555000e+02   9.102046e-06   9.208846e-06   1.294798e-05   4.533418e+01 
  2.560000e+02   8.988124e-06   9.186845e-06   1.285241e-05   4.562643e+01 
  2.565000e+02   8.933805e-06   9.491579e-06   1.303468e-05   4.673393e+01 
  2.570000e+02   8.651480e-06   8.768964e-06   1.231839e-05   4.538639e+01 
  2.575000e+02   9.650237e-06   8.221959e-06   1.267784e-05   4.043084e+01 
  2.580000e+02   1.082860e-05   9.359257e-06   1.431273e-05   4.083716e+01 
  2.585000e+02   1.010726e-05   9.965070e-06   1.419364e-05   4.459413e+01 
  2.590000e+02   9.406903e-06   1.030523e-05   1.395305e-05   4.760931e+01 
  2.595000e+02   9.296728e-06   1.031302e-05   1.388480e-05   4.796675e+01 
  2.600000e+02   8.469502e-06   1.074873e-05   1.368458e-05   5.176353e+01 
  2.605000e+02   8.175796e-06   1.238416e-05   1.483951e-05   5.656793e+01 
  2.610000e+02   8.588170e-06   1.260747e-05   1.525467e-05   5.573743e+01 
  2.615000e+02   8.461972e-06   1.149810e-05   1.427625e-05   5.364896e+01 
  2.620000e+02   6.652562e-06   9.640379e-06   1.171296e-05   5.539150e+01 
  2.625000e+02   7.296838e-06   7.982404e-06   1.081493e-05   4.756908e+01 
  2.630000e+02   9.013335e-06   7.873515e-06   1.196798e-05   4.113853e+01 
  2.635000e+02   8.280703e-06   1.061815e-05   1.346533e-05   5.205064e+01 
  2.640000e+02   8.373227e-06   1.184687e-05   1.450721e-05   5.474778e+01 
  2.645000e+02   6.643292e-06   1.038839e-05   1.233094e-05   5.740142e+01 
  2.650000e+02   6.998624e-06   7.949800e-06   1.059151e-05   4.864085e+01 
  2.655000e+02   9.098891e-06   9.055861e-06   1.283738e-05   4.486419e+01 
  2.660000e+02   8.399012e-06   8.919073e-06   1.225126e-05   4.672007e+01 
  2.665000e+02   8.357799e-06   7.652723e-06   1.133212e-05   4.247842e+01 
  2.670000e+02   8.773286e-06   8.969970e-06   1.254715e-05   4.563509e+01 
  2.675000e+02   8.914642e-06   1.199686e-05   1.494642e-05   5.338465e+01 
  2.680000e+02   9.729600e-06   1.371989e-05   1.681965e-05   5.465725e+01 
  2.685000e+02   1.022024e-05   1.119861e-05   1.516121e-05   4.761534e+01 
  2.690000e+02   1.095699e-05   8.728781e-06   1.400882e-05   3.854225e+01 
  2.695000e+02   1.287966e-05   8.492530e-06   1.542753e-05   3.339988e+01 
  2.700000e+02   1.303640e-05   7.805458e-06   1.519450e-05   3.091078e+01 
  2.705000e+02   1.076076e-05   7.053491e-06   1.286646e-05   3.324414e+01 
  2.710000e+02   7.366651e-06   6.453223e-06   9.793448e-06   4.121852e+01 
  2.715000e+02   7.369837e-06   7.965860e-06   1.085216e-05   4.722569e+01 
  2.720000e+02   8.316109e-06   9.483557e-06   1.261331e-05   4.875255e+01 
  2.725000e+02   8.810242e-06   9.756434e-06   1.314566e-05   4.791737e+01 
  2.730000e+02   9.490239e-06   8.128142e-06   1.249525e-05   4.057919e+01 
  2.735000e+02   9.510071e-06   6.293495e-06   1.140393e-05   3.349545e+01 
  2.740000e+02   9.027422e-06   7.560745e-06   1.177537e-05   3.994721e+01 
  2.745000e+02   8.682956e-06   9.231828e-06   1.267361e-05   4.675487e+01 
  2.750000e+02   8.261452e-06   9.739682e-06   1.277157e-05   4.969452e+01 
  2.755000e+02   8.351077e-06   1.046356e-05   1.338756e-05   5.140627e+01 
  2.760000e+02   9.900747e-06   1.158212e-05   1.523713e-05   4.947516e+01 
  2.765000e+02   9.937617e-06   1.194224e-05   1.553620e-05   5.023480e+01 
  2.770000e+02   9.231369e-06   1.118918e-05   1.450572e-05   5.047648e+01 
  2.775000e+02   9.313108e-06   9.803733e-06   1.352210e-05   4.647015e+01 
  2.780000e+02   1.004601e-05   8.468151e-06   1.313895e-05   4.012877e+01 
  2.785000e+02   8.945294e-06   1.019614e-05   1.356391e-05   4.873883e+01 
  2.790000e+02   6.905746e-06   1.253761e-05   1.431366e-05   6.115392e+01 
  2.795000e+02   8.620131e-06   1.234004e-05   1.505268e-05   5.506379e+01 
  2.800000e+02   1.050739e-05   1.166821e-05   1.570199e-05   4.799651e+01 
  2.805000e+02   1.151969e-05   1.140973e-05   1.621373e-05   4.472523e+01 
  2.810000e+02   1.042924e-05   1.016335e-05   1.456237e-05   4.426025e+01 
  2.815000e+02   9.411645e-06   1.053731e-05   1.412848e-05   4.822961e+01 
  2.820000e+02   9.978161e-06   1.062360e-05   1.457479e-05   4.679445e+01 
  2.825000e+02   1.027802e-05   1.029238e-05   1.454547e-05   4.503998e+01 
  2.830000e+02   1.153924e-05   1.029478e-05   1.546404e-05   4.173787e+01 
  2.835000e+02   1.061522e-05   1.050459e-05   1.493417e-05   4.469989e+01 
  2.840000e+02   7.983315e-06   1.018838e-05   1.294359e-05   5.191879e+01 
  2.845000e+02   7.919730e-06   9.611733e-06   1.245422e-05   5.051268e+01 
  2.850000e+02   8.750684e-06   1.046551e-05   1.364190e-05   5.009948e+01 
  2.855000e+02   1.076876e-05   1.121547e-05   1.554840e-05   4.616407e+01 
  2.860000e+02   1.054652e-05   1.237893e-05   1.626244e-05   4.956988e+01 
  2.865000e+02   1.039431e-05   1.345262e-05   1.700043e-05   5.230813e+01 
  2.870000e+02   9.240783e-06   1.208722e-05   1.521490e-05   5.260178e+01 
  2.875000e+02   6.766355e-06   9.929338e-06   1.201563e-05   5.572750e+01 
  2.880000e+02   8.378351e-06   1.020736e-05   1.320557e-05   5.062035e+01 
  2.885000e+02   9.337847e-06   1.061252e-05   1.413581e-05   4.865578e+01 
  2.890000e+02   9.704720e-06   9.001709e-06   1.323678e-05   4.284777e+01 
  2.895000e+02   1.018817e-05   7.336394e-06   1.255474e-05   3.575726e+01 
  2.900000e+02   8.996030e-06   8.300171e-06   1.224016e-05   4.269612e+01 
  2.905000e+02   8.625331e-06   8.772179e-06   1.230234e-05   4.548360e+01 
  2.910000e+02   1.138257e-05   6.548032e-06   1.313163e-05   2.991045e+01 
  2.915000e+02   1.189383e-05   5.924634e-06   1.328775e-05   2.647912e+01 
  2.920000e+02   1.020644e-05   8.690505e-06   1.340508e-05   4.041350e+01 
  2.925000e+02   8.410243e-06   1.132128e-05   1.410332e-05   5.339244e+01 
  2.930000e+02   1.143999e-05   1.116068e-05   1.598231e-05   4.429193e+01 
  2.935000e+02   1.333908e-05   9.807317e-06   1.655641e-05   3.632451e+01 
  2.940000e+02   1.317875e-05   8.368928e-06   1.561148e-05   3.241685e+01 
  2.945000e+02   1.156301e-05   6.528358e-06   1.327865e-05   2.944864e+01 
  2.950000e+02   1.018534e-05   8.117248e-06   1.302424e-05   3.855323e+01 
  2.955000e+02   9.311372e-06   1.025914e-05   1.385466e-05   4.777256e+01 
  2.960000e+02   9.935151e-06   1.066829e-05   1.457805e-05   4.703791e+01 
  2.965000e+02   9.877101e-06   1.059738e-05   1.448660e-05   4.701480e+01 
  2.970000e+02   9.137550e-06   9.812706e-06   1.340836e-05   4.704045e+01 
  2.975000e+02   1.017533e-05   9.223352e-06   1.373345e-05   4.219049e+01 
  2.980000e+02   1.115696e-05   1.043089e-05   1.527354e-05   4.307369e+01 
  2.985000e+02   1.041651e-05   9.813471e-06   1.431111e-05   4.329256e+01 
  2.990000e+02   8.624734e-06   7.394857e-06   1.136089e-05   4.060982e+01 
  2.995000e+02   9.882052e-06   9.880676e-06   1.397436e-05   4.499601e+01 
  3.000000e+02   1.134338e-05   1.303164e-05   1.727703e-05   4.896210e+01 
  3.005000e+02   9.983662e-06   1.269564e-05   1.615094e-05   5.181901e+01 
  3.010000e+02   9.575157e-06   1.230061e-05   1.558809e-05   5.210175e+01 
  3.015000e+02   9.957633e-06   1.202647e-05   1.561379e-05   5.037604e+01 
  3.020000e+02   1.005438e-05   1.184055e-05   1.553348e-05   4.966383e+01 
  3.025000e+02   9.741482e-06   1.025337e-05   1.414313e-05   4.646651e+01 
  3.030000e+02   9.973950e-06   9.859672e-06   1.402472e-05   4.466987e+01 
  3.035000e+02   1.194913e-05   1.032642e-05   1.579293e-05   4.083353e+01 
  3.040000e+02   1.362784e-05   9.944806e-06   1.687060e-05   3.611980e+01 
  3.045000e+02   1.265698e-05   1.051088e-05   1.645229e-05   3.970765e+01 
  3.050000e+02   1.024675e-05   1.146894e-05   1.537962e-05   4.822129e+01 
  3.055000e+02   7.656575e-06   1.369316e-05   1.568839e-05   6.078811e+01 
  3.060000e+02   8.410272e-06   1.546389e-05   1.760297e-05   6.145977e+01 
  3.065000e+02   9.495016e-06   1.467628e-05   1.747995e-05   5.709861e+01 
  3.070000e+02   1.077904e-05   1.142021e-05   1.570379e-05   4.665437e+01 
  3.075000e+02   9.393634e-06   9.954085e-06   1.368664e-05   4.665924e+01 
  3.080000e+02   7.963931e-06   1.065615e-05   1.330330e-05   5.322720e+01 
  3.085000e+02   9.804152e-06   8.827763e-06   1.319283e-05   4.200021e+01 
  3.090000e+02   1.031105e-05   7.687690e-06   1.286151e-05   3.670738e+01 
  3.095000e+02   9.757446e-06   9.273769e-06   1.346145e-05   4.354414e+01 
  3.100000e+02   1.121699e-05   8.279500e-06   1.394170e-05   3.643182e+01 
  3.105000e+02   1.373721e-05   8.898690e-06   1.636758e-05   3.293436e+01 
  3.110000e+02   1.538551e-05   1.208761e-05   1.956589e-05   3.815491e+01 
  3.115000e+02   1.614387e-05   1.306593e-05   2.076880e-05   3.898473e+01 
  3.120000e+02   1.564997e-05   1.316711e-05   2.045225e-05   4.007559e+01 
  3.125000e+02   1.338690e-05   1.272783e-05   1.847178e-05   4.355431e+01 
  3.130000e+02   1.075007e-05   1.103323e-05   1.540442e-05   4.574474e+01 
  3.135000e+02   9.909678e-06   1.140358e-05   1.510773e-05   4.900946e+01 
  3.140000e+02   7.445810e-06   1.365797e-05   1.555571e-05   6.140244e+01 
  3.145000e+02   7.956242e-06   1.288075e-05   1.513987e-05   5.829701e+01 
  3.150000e+02   1.120676e-05   1.355819e-05   1.759023e-05   5.042396e+01 
  3.155000e+02   1.020707e-05   1.303569e-05   1.655637e-05   5.193872e+01 
  3.160000e+02   9.254665e-06   8.476150e-06   1.254966e-05   4.248590e+01 
  3.165000e+02   8.493085e-06   7.068801e-06   1.104991e-05   3.977063e+01 
  3.170000e+02   9.165134e-06   9.919271e-06   1.350524e-05   4.726292e+01 
  3.175000e+02   1.032553e-05   1.085058e-05   1.497837e-05   4.642034e+01 
  3.180000e+02   9.079222e-06   1.090436e-05   1.418934e-05   5.021846e+01 
  3.185000e+02   8.674052e-06   1.098440e-05   1.399629e-05   5.170289e+01 
  3.190000e+02   9.652995e-06   1.182930e-05   1.526802e-05   5.078471e+01 
  3.195000e+02   1.045371e-05   1.001546e-05   1.447721e-05   4.377347e+01 
  3.200000e+02   1.063007e-05   8.846225e-06   1.382946e-05   3.976685e+01 
  3.205000e+02   9.847465e-06   1.027009e-05   1.422840e-05   4.620348e+01 
  3.210000e+02   9.102730e-06   9.004720e-06   1.280409e-05   4.468988e+01 
  3.215000e+02   1.080951e-05   8.680502e-06   1.386350e-05   3.876596e+01 
  3.220000e+02   1.219330e-05   1.007377e-05   1.581636e-05   3.956258e+01 
  3.225000e+02   1.169908e-05   1.053879e-05   1.574594e-05   4.201322e+01 
  3.230000e+02   1.025067e-05   1.075865e-05   1.486017e-05   4.638509e+01 
  3.235000e+02   8.860526e-06   1.138668e-05   1.442794e-05   5.211180e+01 
  3.240000e+02   7.937226e-06   1.030409e-05   1.300669e-05   5.239299e+01 
  3.245000e+02   9.188720e-06   9.968810e-06   1.355765e-05   4.733178e+01 
  3.250000e+02   1.028983e-05   9.553165e-06   1.404078e-05   4.287388e+01 
  3.255000e+02   8.503041e-06   8.332800e-06   1.190535e-05   4.442065e+01 
  3.260000e+02   7.875607e-06   9.366752e-06   1.223770e-05   4.994273e+01 
  3.265000e+02   1.003906e-05   9.480603e-06   1.380814e-05   4.336120e+01 
  3.270000e+02   1.109182e-05   9.981286e-06   1.492162e-05   4.198335e+01 
  3.275000e+02   9.696454e-06   1.032769e-05   1.416624e-05   4.680558e+01 
  3.280000e+02   8.821863e-06   1.092905e-05   1.404526e-05   5.108974e+01 
  3.285000e+02   9.905606e-06   1.180312e-05   1.540891e-05   4.999540e+01 
  3.290000e+02   1.039192e-05   1.110166e-05   1.520654e-05   4.689127e+01 
  3.295000e+02   9.970466e-06   9.924610e-06   1.406798e-05   4.486794e+01 
  3.300000e+02   8.737545e-06   9.796195e-06   1.312670e-05   4.826919e+01 
  3.305000e+02   8.928839e-06   1.075621e-05   1.397928e-05   5.030360e+01 
  3.310000e+02   8.485163e-06   1.065022e-05   1.361709e-05   5.145522e+01 
  3.315000e+02   8.157349e-06   1.007052e-05   1.295985e-05   5.099174e+01 
  3.320000e+02   7.868485e-06   9.717645e-06   1.250383e-05   5.100252e+01 
  3.325000e+02   7.958917e-06   1.010617e-05   1.286386e-05   5.177848e+01 
  3.330000e+02   1.007678e-05   1.168775e-05   1.543195e-05   4.923319e+01 
  3.335000e+02   1.144878e-05   1.325313e-05   1.751343e-05   4.917775e+01 
  3.340000e+02   1.001941e-05   1.312571e-05   1.651281e-05   5.264396e+01 
  3.345000e+02   7.513590e-06   1.242937e-05   1.452389e-05   5.884692e+01 
  3.350000e+02   7.204022e-06   1.182911e-05   1.385012e-05   5.865826e+01 
  3.355000e+02   7.890892e-06   1.015482e-05   1.286027e-05   5.215070e+01 
  3.360000e+02   9.370206e-06   8.862496e-06   1.289746e-05   4.340495e+01 
  3.365000e+02   1.054961e-05   9.938214e-06   1.449353e-05   4.329068e+01 
  3.370000e+02   1.071733e-05   1.073763e-05   1.517096e-05   4.505419e+01 
  3.375000e+02   1.004524e-05   9.197038e-06   1.361956e-05   4.247602e+01 
  3.380000e+02   1.107128e-05   9.710809e-06   1.472661e-05   4.125455e+01 
  3.385000e+02   1.161778e-05   1.118768e-05   1.612876e-05   4.391957e+01 
  3.390000e+02   1.087981e-05   1.021351e-05   1.492267e-05   4.319075e+01 
  3.395000e+02   1.018281e-05   9.300528e-06   1.379092e-05   4.240720e+01 
  3.400000e+02   1.132849e-05   1.024696e-05   1.527530e-05   4.213028e+01 
  3.405000e+02   1.219318e-05   1.010971e-05   1.583918e-05   3.966309e+01 
  3.410000e+02   1.155338e-05   1.080135e-05   1.581612e-05   4.307323e+01 
  3.415000e+02   1.137513e-05   1.073656e-05   1.564184e-05   4.334581e+01 
  3.420000e+02   1.049277e-05   1.250220e-05   1.632186e-05   4.999413e+01 
  3.425000e+02   1.149494e-05   1.220487e-05   1.676582e-05   4.671578e+01 
  3.430000e+02   1.107350e-05   7.923035e-06   1.361605e-05   3.558353e+01 
  3.435000e+02   9.733334e-06   8.803273e-06   1.312385e-05   4.212763e+01 
  3.440000e+02   8.493633e-06   1.171506e-05   1.447012e-05   5.405720e+01 
  3.445000e+02   6.342295e-06   1.089377e-05   1.260551e-05   5.979226e+01 
  3.450000e+02   7.850107e-06   9.819044e-06   1.257131e-05   5.135844e+01 
  3.455000e+02   1.136122e-05   1.091217e-05   1.575287e-05   4.384504e+01 
  3.460000e+02   1.303194e-05   9.261481e-06   1.598769e-05   3.540048e+01 
  3.465000e+02   1.281820e-05   6.799449e-06   1.450995e-05   2.794384e+01 
  3.470000e+02   1.114733e-05   9.417159e-06   1.459267e-05   4.019080e+01 
  3.475000e+02   1.052881e-05   1.182531e-05   1.583332e-05   4.831934e+01 
  3.480000e+02   1.182196e-05   1.010655e-05   1.555317e-05   4.052702e+01 
  3.485000e+02   1.158479e-05   9.055098e-06   1.470382e-05   3.801249e+01 
  3.490000e+02   1.012099e-05   1.108467e-05   1.501015e-05   4.760197e+01 
  3.495000e+02   8.785897e-06   1.287083e-05   1.558365e-05   5.568173e+01 
  3.500000e+02   9.175138e-06   1.474598e-05   1.736742e-05   5.810959e+01 
  3.505000e+02   1.006456e-05   1.335205e-05   1.672043e-05   5.299158e+01 
  3.510000e+02   1.112526e-05   9.618546e-06   1.470672e-05   4.084566e+01 
  3.515000e+02   1.253509e-05   1.031512e-05   1.623361e-05   3.945094e+01 
  3.520000e+02   1.226793e-05   1.159313e-05   1.687906e-05   4.338009e+01 
  3.525000e+02   1.123083e-05   9.582858e-06   1.476356e-05   4.047291e+01 
  3.530000e+02   9.850277e-06   7.597290e-06   1.243973e-05   3.764217e+01 
  3.535000e+02   9.808038e-06   9.237649e-06   1.347337e-05   4.328459e+01 
  3.540000e+02   8.661797e-06   1.038254e-05   1.352124e-05   5.016291e+01 
  3.545000e+02   1.076438e-05   1.114421e-05   1.549404e-05   4.599324e+01 
  3.550000e+02   1.273818e-05   1.011525e-05   1.626590e-05   3.845272e+01 
  3.555000e+02   1.380663e-05   9.606964e-06   1.682013e-05   3.483107e+01 
  3.560000e+02   1.256753e-05   1.060120e-05   1.644167e-05   4.014892e+01 
  3.565000e+02   1.144637e-05   1.029570e-05   1.539548e-05   4.197053e+01 
  3.570000e+02   9.409460e-06   1.092818e-05   1.442092e-05   4.927065e+01 
  3.575000e+02   7.284900e-06   1.125568e-05   1.340747e-05   5.708826e+01 
  3.580000e+02   8.593504e-06   1.117451e-05   1.409674e-05   5.243873e+01 
  3.585000e+02   9.918012e-06   1.328847e-05   1.658163e-05   5.326373e+01 
  3.590000e+02   1.049185e-05   1.413739e-05   1.760525e-05   5.341960e+01 
  3.595000e+02   1.048444e-05   1.310536e-05   1.678315e-05   5.133978e+01 
  3.600000e+02   1.085600e-05   1.177272e-05   1.601405e-05   4.731985e+01 
  3.605000e+02   1.137098e-05   1.147028e-05   1.615137e-05   4.524908e+01 
  3.610000e+02   1.266753e-05   1.251311e-05   1.780573e-05   4.464863e+01 
  3.615000e+02   1.440735e-05   1.312723e-05   1.949092e-05   4.233815e+01 
  3.620000e+02   1.370689e-05   1.294697e-05   1.885478e-05   4.336690e+01 
  3.625000e+02   1.105991e-05   1.127176e-05   1.579158e-05   4.554352e+01 
  3.630000e+02   1.134557e-05   1.175237e-05   1.633524e-05   4.600897e+01 
  3.635000e+02   1.159545e-05   1.277602e-05   1.725344e-05   4.777327e+01 
  3.640000e+02   1.142128e-05   1.270460e-05   1.708369e-05   4.804484e+01 
  3.645000e+02   1.572127e-05   1.245453e-05   2.005676e-05   3.838658e+01 
  3.650000e+02   1.549326e-05   1.124203e-05   1.914222e-05   3.596493e+01 
  3.655000e+02   1.271364e-05   1.096871e-05   1.679134e-05   4.078603e+01 
  3.660000e+02   1.115113e-05   1.119909e-05   1.580403e-05   4.512294e+01 
  3.665000e+02   1.123065e-05   9.587791e-06   1.476663e-05   4.048793e+01 
  3.670000e+02   1.083710e-05   1.248866e-05   1.653510e-05   4.905000e+01 
  3.675000e+02   8.920034e-06   1.275360e-05   1.556346e-05   5.503056e+01 
  3.680000e+02   9.954750e-06   1.093564e-05   1.478801e-05   4.768830e+01 
  3.685000e+02   1.171140e-05   1.113610e-05   1.616074e-05   4.355758e+01 
  3.690000e+02   1.228478e-05   1.060377e-05   1.622824e-05   4.079955e+01 
  3.695000e+02   1.094901e-05   1.156429e-05   1.592525e-05   4.656549e+01 
  3.700000e+02   9.278268e-06   1.102019e-05   1.440593e-05   4.990484e+01 
  3.705000e+02   1.129053e-05   1.055362e-05   1.545493e-05   4.306786e+01 
  3.710000e+02   1.337699e-05   9.283250e-06   1.628259e-05   3.475954e+01 
  3.715000e+02   1.285986e-05   7.153739e-06   1.471571e-05   2.908650e+01 
  3.720000e+02   1.164271e-05   6.074076e-06   1.313191e-05   2.755134e+01 
  3.725000e+02   1.110110e-05   8.391827e-06   1.391608e-05   3.708728e+01 
  3.730000e+02   1.072496e-05   1.033949e-05   1.489731e-05   4.395163e+01 
  3.735000e+02   1.046294e-05   9.163251e-06   1.390821e-05   4.121128e+01 
  3.740000e+02   1.035197e-05   6.624183e-06   1.228996e-05   3.261502e+01 
  3.745000e+02   1.118060e-05   7.462271e-06   1.344215e-05   3.372034e+01 
  3.750000e+02   1.207713e-05   1.112421e-05   1.641966e-05   4.264807e+01 
  3.755000e+02   1.185621e-05   1.105873e-05   1.621312e-05   4.300680e+01 
  3.760000e+02   1.195937e-05   9.433461e-06   1.523209e-05   3.826611e+01 
  3.765000e+02   1.254950e-05   8.235415e-06   1.501040e-05   3.327427e+01 
  3.770000e+02   1.327471e-05   1.093339e-05   1.719759e-05   3.947574e+01 
  3.775000e+02   1.242046e-05   1.278280e-05   1.782323e-05   4.582366e+01 
  3.780000e+02   1.030856e-05   1.346107e-05   1.695485e-05   5.255490e+01 
  3.785000e+02   1.001360e-05   1.140366e-05   1.517616e-05   4.871350e+01 
  3.790000e+02   1.203783e-05   9.650977e-06   1.542889e-05   3.871987e+01 
  3.795000e+02   1.427256e-05   1.171947e-05   1.846759e-05   3.939006e+01 
  3.800000e+02   1.483695e-05   1.430417e-05   2.060933e-05   4.395259e+01 
  3.805000e+02   1.290962e-05   1.369242e-05   1.881863e-05   4.668552e+01 
  3.810000e+02   1.226241e-05   1.156520e-05   1.685587e-05   4.332398e+01 
  3.815000e+02   1.145638e-05   9.961360e-06   1.518148e-05   4.100707e+01 
  3.820000e+02   1.252043e-05   9.731941e-06   1.585786e-05   3.785739e+01 
  3.825000e+02   1.349685e-05   1.062030e-05   1.717427e-05   3.819823e+01 
  3.830000e+02   1.108882e-05   1.057007e-05   1.531954e-05   4.362798e+01 
  3.835000e+02   1.351344e-05   1.101408e-05   1.743339e-05   3.918163e+01 
  3.840000e+02   1.523287e-05   1.251233e-05   1.971291e-05   3.939981e+01 
  3.845000e+02   1.290093e-05   1.230401e-05   1.782758e-05   4.364333e+01 
  3.850000e+02   1.232941e-05   1.119221e-05   1.665173e-05   4.223206e+01 
  3.855000e+02   1.199254e-05   1.180115e-05   1.682522e-05   4.453912e+01 
  3.860000e+02   1.147189e-05   1.236216e-05   1.686497e-05   4.713917e+01 
  3.865000e+02   1.226857e-05   1.182937e-05   1.704264e-05   4.395588e+01 
  3.870000e+02   1.275306e-05   1.253793e-05   1.788408e-05   4.451264e+01 
  3.875000e+02   1.267506e-05   1.369240e-05   1.865848e-05   4.720955e+01 
  3.880000e+02   1.273069e-05   1.248822e-05   1.783328e-05   4.444914e+01 
  3.885000e+02   1.150288e-05   1.108768e-05   1.597664e-05   4.394705e+01 
  3.890000e+02   1.021419e-05   1.226711e-05   1.596283e-05   5.021759e+01 
  3.895000e+02   1.234919e-05   1.185564e-05   1.711896e-05   4.383186e+01 
  3.900000e+02   1.311984e-05   1.272816e-05   1.827940e-05   4.413184e+01 
  3.905000e+02   1.212636e-05   1.323414e-05   1.794969e-05   4.750116e+01 
  3.910000e+02   1.066865e-05   1.309879e-05   1.689374e-05   5.083800e+01 
  3.915000e+02   1.085597e-05   1.260160e-05   1.663287e-05   4.925590e+01 
  3.920000e+02   1.023882e-05   1.203208e-05   1.579888e-05   4.960354e+01 
  3.925000e+02   1.061409e-05   9.504707e-06   1.424775e-05   4.184381e+01 
  3.930000e+02   9.701898e-06   7.946519e-06   1.254089e-05   3.931982e+01 
  3.935000e+02   1.002085e-05   7.492795e-06   1.251237e-05   3.678622e+01 
  3.940000e+02   1.098841e-05   8.763616e-06   1.405511e-05   3.857352e+01 
  3.945000e+02   1.129977e-05   9.378052e-06   1.468444e-05   3.969040e+01 
  3.950000e+02   1.244145e-05   8.133245e-06   1.486403e-05   3.317351e+01 
  3.955000e+02   1.200697e-05   9.703358e-06   1.543769e-05   3.894320e+01 
  3.960000e+02   1.097110e-05   1.204522e-05   1.629271e-05   4.767193e+01 
  3.965000e+02   1.089786e-05   1.155615e-05   1.588420e-05   4.667929e+01 
  3.970000e+02   1.067445e-05   1.320300e-05   1.697831e-05   5.104492e+01 
  3.975000e+02   8.733667e-06   1.547368e-05   1.776828e-05   6.055871e+01 
  3.980000e+02   8.866941e-06   1.550252e-05   1.785920e-05   6.023184e+01 
  3.985000e+02   7.692884e-06   1.474591e-05   1.663196e-05   6.244912e+01 
  3.990000e+02   7.685103e-06   1.315885e-05   1.523864e-05   5.971399e+01 
  3.995000e+02   1.149282e-05   1.324604e-05   1.753689e-05   4.905371e+01 
  4.000000e+02   1.452126e-05   1.473343e-05   2.068673e-05   4.541552e+01 
