  0.000000e+00   1.465204e-03   0.000000e+00   1.465204e-03   0.000000e+00 
  1.280000e+02   7.344823e-04   0.000000e+00   7.344823e-04   0.000000e+00 
  2.560000e+02   2.920155e-05   0.000000e+00   2.920155e-05   0.000000e+00 
  3.840000e+02   1.287181e-05   0.000000e+00   1.287181e-05   0.000000e+00 
  5.120000e+02   1.294660e-05   0.000000e+00   1.294660e-05   0.000000e+00 
  6.400000e+02   1.275971e-05   0.000000e+00   1.275971e-05   0.000000e+00 
  7.680000e+02   1.229497e-05   0.000000e+00   1.229497e-05   0.000000e+00 
  8.960000e+02   1.277751e-05   0.000000e+00   1.277751e-05   0.000000e+00 
  1.024000e+03   1.326065e-05   0.000000e+00   1.326065e-05   0.000000e+00 
  1.152000e+03   1.122949e-05   0.000000e+00   1.122949e-05   0.000000e+00 
  1.280000e+03   1.008419e-05   0.000000e+00   1.008419e-05   0.000000e+00 
  1.408000e+03   9.917126e-06   0.000000e+00   9.917126e-06   0.000000e+00 
  1.536000e+03   9.461050e-06   0.000000e+00   9.461050e-06   0.000000e+00 
  1.664000e+03   8.733213e-06   0.000000e+00   8.733213e-06   0.000000e+00 
  1.792000e+03   8.319735e-06   0.000000e+00   8.319735e-06   0.000000e+00 
  1.920000e+03   8.210351e-06   0.000000e+00   8.210351e-06   0.000000e+00 
  2.048000e+03   8.619318e-06   0.000000e+00   8.619318e-06   0.000000e+00 
  2.176000e+03   1.131975e-05   0.000000e+00   1.131975e-05   0.000000e+00 
  2.304000e+03   8.751408e-06   0.000000e+00   8.751408e-06   0.000000e+00 
  2.432000e+03   7.268250e-06   0.000000e+00   7.268250e-06   0.000000e+00 
  2.560000e+03   6.840773e-06   0.000000e+00   6.840773e-06   0.000000e+00 
  2.688000e+03   7.296084e-06   0.000000e+00   7.296084e-06   0.000000e+00 
  2.816000e+03   8.427362e-06   0.000000e+00   8.427362e-06   0.000000e+00 
  2.944000e+03   6.498208e-06   0.000000e+00   6.498208e-06   0.000000e+00 
  3.072000e+03   5.229586e-06   0.000000e+00   5.229586e-06   0.000000e+00 
  3.200000e+03   5.058310e-06   0.000000e+00   5.058310e-06   0.000000e+00 
  3.328000e+03   4.935034e-06   0.000000e+00   4.935034e-06   0.000000e+00 
  3.456000e+03   4.851473e-06   0.000000e+00   4.851473e-06   0.000000e+00 
  3.584000e+03   4.649380e-06   0.000000e+00   4.649380e-06   0.000000e+00 
  3.712000e+03   4.237324e-06   0.000000e+00   4.237324e-06   0.000000e+00 
  3.840000e+03   4.256292e-06   0.000000e+00   4.256292e-06   0.000000e+00 
  3.968000e+03   4.432231e-06   0.000000e+00   4.432231e-06   0.000000e+00 
  4.096000e+03   4.227110e-06   0.000000e+00   4.227110e-06   0.000000e+00 
  4.224000e+03   4.170145e-06   0.000000e+00   4.170145e-06   0.000000e+00 
  4.352000e+03   4.230281e-06   0.000000e+00   4.230281e-06   0.000000e+00 
  4.480000e+03   3.953655e-06   0.000000e+00   3.953655e-06   0.000000e+00 
  4.608000e+03   3.782042e-06   0.000000e+00   3.782042e-06   0.000000e+00 
  4.736000e+03   3.835715e-06   0.000000e+00   3.835715e-06   0.000000e+00 
  4.864000e+03   3.773268e-06   0.000000e+00   3.773268e-06   0.000000e+00 
  4.992000e+03   9.259191e-06   0.000000e+00   9.259191e-06   0.000000e+00 
  5.120000e+03   1.325400e-05   0.000000e+00   1.325400e-05   0.000000e+00 
  5.248000e+03   5.864814e-06   0.000000e+00   5.864814e-06   0.000000e+00 
  5.376000e+03   3.649923e-06   0.000000e+00   3.649923e-06   0.000000e+00 
  5.504000e+03   3.513120e-06   0.000000e+00   3.513120e-06   0.000000e+00 
  5.632000e+03   3.388025e-06   0.000000e+00   3.388025e-06   0.000000e+00 
  5.760000e+03   3.362537e-06   0.000000e+00   3.362537e-06   0.000000e+00 
  5.888000e+03   3.248183e-06   0.000000e+00   3.248183e-06   0.000000e+00 
  6.016000e+03   3.124772e-06   0.000000e+00   3.124772e-06   0.000000e+00 
  6.144000e+03   3.115018e-06   0.000000e+00   3.115018e-06   0.000000e+00 
  6.272000e+03   2.981106e-06   0.000000e+00   2.981106e-06   0.000000e+00 
  6.400000e+03   3.056238e-06   0.000000e+00   3.056238e-06   0.000000e+00 
  6.528000e+03   3.084244e-06   0.000000e+00   3.084244e-06   0.000000e+00 
  6.656000e+03   3.077151e-06   0.000000e+00   3.077151e-06   0.000000e+00 
  6.784000e+03   3.062936e-06   0.000000e+00   3.062936e-06   0.000000e+00 
  6.912000e+03   3.050210e-06   0.000000e+00   3.050210e-06   0.000000e+00 
  7.040000e+03   3.153835e-06   0.000000e+00   3.153835e-06   0.000000e+00 
  7.168000e+03   3.151135e-06   0.000000e+00   3.151135e-06   0.000000e+00 
  7.296000e+03   3.106584e-06   0.000000e+00   3.106584e-06   0.000000e+00 
  7.424000e+03   3.066268e-06   0.000000e+00   3.066268e-06   0.000000e+00 
  7.552000e+03   3.085381e-06   0.000000e+00   3.085381e-06   0.000000e+00 
  7.680000e+03   7.936583e-06   0.000000e+00   7.936583e-06   0.000000e+00 
  7.808000e+03   1.111334e-05   0.000000e+00   1.111334e-05   0.000000e+00 
  7.936000e+03   4.773855e-06   0.000000e+00   4.773855e-06   0.000000e+00 
  8.064000e+03   3.114789e-06   0.000000e+00   3.114789e-06   0.000000e+00 
  8.192000e+03   3.004536e-06   0.000000e+00   3.004536e-06   0.000000e+00 
  8.320000e+03   2.981871e-06   0.000000e+00   2.981871e-06   0.000000e+00 
  8.448000e+03   2.970249e-06   0.000000e+00   2.970249e-06   0.000000e+00 
  8.576000e+03   2.922544e-06   0.000000e+00   2.922544e-06   0.000000e+00 
  8.704000e+03   2.947990e-06   0.000000e+00   2.947990e-06   0.000000e+00 
  8.832000e+03   2.925550e-06   0.000000e+00   2.925550e-06   0.000000e+00 
  8.960000e+03   2.931225e-06   0.000000e+00   2.931225e-06   0.000000e+00 
  9.088000e+03   3.938457e-06   0.000000e+00   3.938457e-06   0.000000e+00 
  9.216000e+03   4.905052e-06   0.000000e+00   4.905052e-06   0.000000e+00 
  9.344000e+03   3.196818e-06   0.000000e+00   3.196818e-06   0.000000e+00 
  9.472000e+03   2.874399e-06   0.000000e+00   2.874399e-06   0.000000e+00 
  9.600000e+03   2.836125e-06   0.000000e+00   2.836125e-06   0.000000e+00 
  9.728000e+03   2.890294e-06   0.000000e+00   2.890294e-06   0.000000e+00 
  9.856000e+03   3.028500e-06   0.000000e+00   3.028500e-06   0.000000e+00 
  9.984000e+03   3.375952e-06   0.000000e+00   3.375952e-06   0.000000e+00 
  1.011200e+04   3.840379e-06   0.000000e+00   3.840379e-06   0.000000e+00 
  1.024000e+04   4.049278e-06   0.000000e+00   4.049278e-06   0.000000e+00 
  1.036800e+04   3.117658e-06   0.000000e+00   3.117658e-06   0.000000e+00 
  1.049600e+04   4.072294e-06   0.000000e+00   4.072294e-06   0.000000e+00 
  1.062400e+04   4.624366e-06   0.000000e+00   4.624366e-06   0.000000e+00 
  1.075200e+04   3.115952e-06   0.000000e+00   3.115952e-06   0.000000e+00 
  1.088000e+04   2.873977e-06   0.000000e+00   2.873977e-06   0.000000e+00 
  1.100800e+04   2.811733e-06   0.000000e+00   2.811733e-06   0.000000e+00 
  1.113600e+04   2.820653e-06   0.000000e+00   2.820653e-06   0.000000e+00 
  1.126400e+04   2.844317e-06   0.000000e+00   2.844317e-06   0.000000e+00 
  1.139200e+04   2.773181e-06   0.000000e+00   2.773181e-06   0.000000e+00 
  1.152000e+04   2.775761e-06   0.000000e+00   2.775761e-06   0.000000e+00 
  1.164800e+04   2.889537e-06   0.000000e+00   2.889537e-06   0.000000e+00 
  1.177600e+04   3.002793e-06   0.000000e+00   3.002793e-06   0.000000e+00 
  1.190400e+04   3.086290e-06   0.000000e+00   3.086290e-06   0.000000e+00 
  1.203200e+04   2.980033e-06   0.000000e+00   2.980033e-06   0.000000e+00 
  1.216000e+04   2.954385e-06   0.000000e+00   2.954385e-06   0.000000e+00 
  1.228800e+04   2.966854e-06   0.000000e+00   2.966854e-06   0.000000e+00 
  1.241600e+04   2.887418e-06   0.000000e+00   2.887418e-06   0.000000e+00 
  1.254400e+04   2.931580e-06   0.000000e+00   2.931580e-06   0.000000e+00 
  1.267200e+04   2.916146e-06   0.000000e+00   2.916146e-06   0.000000e+00 
  1.280000e+04   2.877911e-06   0.000000e+00   2.877911e-06   0.000000e+00 
  1.292800e+04   2.850035e-06   0.000000e+00   2.850035e-06   0.000000e+00 
  1.305600e+04   2.874761e-06   0.000000e+00   2.874761e-06   0.000000e+00 
  1.318400e+04   2.866451e-06   0.000000e+00   2.866451e-06   0.000000e+00 
  1.331200e+04   2.858479e-06   0.000000e+00   2.858479e-06   0.000000e+00 
  1.344000e+04   3.053005e-06   0.000000e+00   3.053005e-06   0.000000e+00 
  1.356800e+04   3.269955e-06   0.000000e+00   3.269955e-06   0.000000e+00 
  1.369600e+04   2.985068e-06   0.000000e+00   2.985068e-06   0.000000e+00 
  1.382400e+04   2.927035e-06   0.000000e+00   2.927035e-06   0.000000e+00 
  1.395200e+04   2.909319e-06   0.000000e+00   2.909319e-06   0.000000e+00 
  1.408000e+04   2.904531e-06   0.000000e+00   2.904531e-06   0.000000e+00 
  1.420800e+04   3.242282e-06   0.000000e+00   3.242282e-06   0.000000e+00 
  1.433600e+04   3.286018e-06   0.000000e+00   3.286018e-06   0.000000e+00 
  1.446400e+04   3.009677e-06   0.000000e+00   3.009677e-06   0.000000e+00 
  1.459200e+04   3.007788e-06   0.000000e+00   3.007788e-06   0.000000e+00 
  1.472000e+04   2.971738e-06   0.000000e+00   2.971738e-06   0.000000e+00 
  1.484800e+04   2.895850e-06   0.000000e+00   2.895850e-06   0.000000e+00 
  1.497600e+04   2.952364e-06   0.000000e+00   2.952364e-06   0.000000e+00 
  1.510400e+04   2.986458e-06   0.000000e+00   2.986458e-06   0.000000e+00 
  1.523200e+04   3.063162e-06   0.000000e+00   3.063162e-06   0.000000e+00 
  1.536000e+04   3.026498e-06   0.000000e+00   3.026498e-06   0.000000e+00 
  1.548800e+04   3.059783e-06   0.000000e+00   3.059783e-06   0.000000e+00 
  1.561600e+04   3.064413e-06   0.000000e+00   3.064413e-06   0.000000e+00 
  1.574400e+04   3.321997e-06   0.000000e+00   3.321997e-06   0.000000e+00 
  1.587200e+04   4.697792e-06   0.000000e+00   4.697792e-06   0.000000e+00 
  1.600000e+04   3.775207e-06   0.000000e+00   3.775207e-06   0.000000e+00 
  1.612800e+04   3.088328e-06   0.000000e+00   3.088328e-06   0.000000e+00 
  1.625600e+04   3.054255e-06   0.000000e+00   3.054255e-06   0.000000e+00 
  1.638400e+04   3.082362e-06   0.000000e+00   3.082362e-06   0.000000e+00 
  1.651200e+04   3.146378e-06   0.000000e+00   3.146378e-06   0.000000e+00 
  1.664000e+04   3.196886e-06   0.000000e+00   3.196886e-06   0.000000e+00 
  1.676800e+04   3.125723e-06   0.000000e+00   3.125723e-06   0.000000e+00 
  1.689600e+04   3.142556e-06   0.000000e+00   3.142556e-06   0.000000e+00 
  1.702400e+04   3.177367e-06   0.000000e+00   3.177367e-06   0.000000e+00 
  1.715200e+04   3.209691e-06   0.000000e+00   3.209691e-06   0.000000e+00 
  1.728000e+04   3.194843e-06   0.000000e+00   3.194843e-06   0.000000e+00 
  1.740800e+04   3.276536e-06   0.000000e+00   3.276536e-06   0.000000e+00 
  1.753600e+04   3.294901e-06   0.000000e+00   3.294901e-06   0.000000e+00 
  1.766400e+04   3.247817e-06   0.000000e+00   3.247817e-06   0.000000e+00 
  1.779200e+04   3.203749e-06   0.000000e+00   3.203749e-06   0.000000e+00 
  1.792000e+04   3.224154e-06   0.000000e+00   3.224154e-06   0.000000e+00 
  1.804800e+04   3.353174e-06   0.000000e+00   3.353174e-06   0.000000e+00 
  1.817600e+04   4.032525e-06   0.000000e+00   4.032525e-06   0.000000e+00 
  1.830400e+04   8.737102e-06   0.000000e+00   8.737102e-06   0.000000e+00 
  1.843200e+04   9.368458e-06   0.000000e+00   9.368458e-06   0.000000e+00 
  1.856000e+04   3.968192e-06   0.000000e+00   3.968192e-06   0.000000e+00 
  1.868800e+04   3.370513e-06   0.000000e+00   3.370513e-06   0.000000e+00 
  1.881600e+04   3.382730e-06   0.000000e+00   3.382730e-06   0.000000e+00 
  1.894400e+04   3.391564e-06   0.000000e+00   3.391564e-06   0.000000e+00 
  1.907200e+04   3.305008e-06   0.000000e+00   3.305008e-06   0.000000e+00 
  1.920000e+04   3.300509e-06   0.000000e+00   3.300509e-06   0.000000e+00 
  1.932800e+04   3.335110e-06   0.000000e+00   3.335110e-06   0.000000e+00 
  1.945600e+04   3.370134e-06   0.000000e+00   3.370134e-06   0.000000e+00 
  1.958400e+04   3.449673e-06   0.000000e+00   3.449673e-06   0.000000e+00 
  1.971200e+04   3.449776e-06   0.000000e+00   3.449776e-06   0.000000e+00 
  1.984000e+04   5.671821e-06   0.000000e+00   5.671821e-06   0.000000e+00 
  1.996800e+04   7.344356e-06   0.000000e+00   7.344356e-06   0.000000e+00 
  2.009600e+04   4.265132e-06   0.000000e+00   4.265132e-06   0.000000e+00 
  2.022400e+04   3.862535e-06   0.000000e+00   3.862535e-06   0.000000e+00 
  2.035200e+04   6.874918e-06   0.000000e+00   6.874918e-06   0.000000e+00 
  2.048000e+04   6.596573e-06   0.000000e+00   6.596573e-06   0.000000e+00 
  2.060800e+04   3.600798e-06   0.000000e+00   3.600798e-06   0.000000e+00 
  2.073600e+04   3.573095e-06   0.000000e+00   3.573095e-06   0.000000e+00 
  2.086400e+04   5.732260e-06   0.000000e+00   5.732260e-06   0.000000e+00 
  2.099200e+04   9.019318e-06   0.000000e+00   9.019318e-06   0.000000e+00 
  2.112000e+04   5.234410e-06   0.000000e+00   5.234410e-06   0.000000e+00 
  2.124800e+04   3.493099e-06   0.000000e+00   3.493099e-06   0.000000e+00 
  2.137600e+04   3.443442e-06   0.000000e+00   3.443442e-06   0.000000e+00 
  2.150400e+04   3.471551e-06   0.000000e+00   3.471551e-06   0.000000e+00 
  2.163200e+04   3.543355e-06   0.000000e+00   3.543355e-06   0.000000e+00 
  2.176000e+04   3.615159e-06   0.000000e+00   3.615159e-06   0.000000e+00 
  2.188800e+04   3.647513e-06   0.000000e+00   3.647513e-06   0.000000e+00 
  2.201600e+04   3.610035e-06   0.000000e+00   3.610035e-06   0.000000e+00 
  2.214400e+04   3.608738e-06   0.000000e+00   3.608738e-06   0.000000e+00 
  2.227200e+04   3.605568e-06   0.000000e+00   3.605568e-06   0.000000e+00 
  2.240000e+04   3.702964e-06   0.000000e+00   3.702964e-06   0.000000e+00 
  2.252800e+04   3.657068e-06   0.000000e+00   3.657068e-06   0.000000e+00 
  2.265600e+04   3.664332e-06   0.000000e+00   3.664332e-06   0.000000e+00 
  2.278400e+04   3.659659e-06   0.000000e+00   3.659659e-06   0.000000e+00 
  2.291200e+04   3.682973e-06   0.000000e+00   3.682973e-06   0.000000e+00 
  2.304000e+04   3.696256e-06   0.000000e+00   3.696256e-06   0.000000e+00 
  2.316800e+04   3.671246e-06   0.000000e+00   3.671246e-06   0.000000e+00 
  2.329600e+04   3.684950e-06   0.000000e+00   3.684950e-06   0.000000e+00 
  2.342400e+04   3.686004e-06   0.000000e+00   3.686004e-06   0.000000e+00 
  2.355200e+04   3.825646e-06   0.000000e+00   3.825646e-06   0.000000e+00 
  2.368000e+04   3.839833e-06   0.000000e+00   3.839833e-06   0.000000e+00 
  2.380800e+04   3.797918e-06   0.000000e+00   3.797918e-06   0.000000e+00 
  2.393600e+04   3.853082e-06   0.000000e+00   3.853082e-06   0.000000e+00 
  2.406400e+04   3.909278e-06   0.000000e+00   3.909278e-06   0.000000e+00 
  2.419200e+04   3.835966e-06   0.000000e+00   3.835966e-06   0.000000e+00 
  2.432000e+04   3.812037e-06   0.000000e+00   3.812037e-06   0.000000e+00 
  2.444800e+04   3.853203e-06   0.000000e+00   3.853203e-06   0.000000e+00 
  2.457600e+04   3.927542e-06   0.000000e+00   3.927542e-06   0.000000e+00 
  2.470400e+04   3.975263e-06   0.000000e+00   3.975263e-06   0.000000e+00 
  2.483200e+04   3.825540e-06   0.000000e+00   3.825540e-06   0.000000e+00 
  2.496000e+04   3.775876e-06   0.000000e+00   3.775876e-06   0.000000e+00 
  2.508800e+04   3.841702e-06   0.000000e+00   3.841702e-06   0.000000e+00 
  2.521600e+04   3.843172e-06   0.000000e+00   3.843172e-06   0.000000e+00 
  2.534400e+04   3.917864e-06   0.000000e+00   3.917864e-06   0.000000e+00 
  2.547200e+04   3.938334e-06   0.000000e+00   3.938334e-06   0.000000e+00 
  2.560000e+04   3.999703e-06   0.000000e+00   3.999703e-06   0.000000e+00 
  2.572800e+04   3.979500e-06   0.000000e+00   3.979500e-06   0.000000e+00 
  2.585600e+04   4.044533e-06   0.000000e+00   4.044533e-06   0.000000e+00 
  2.598400e+04   4.075973e-06   0.000000e+00   4.075973e-06   0.000000e+00 
  2.611200e+04   4.138004e-06   0.000000e+00   4.138004e-06   0.000000e+00 
  2.624000e+04   4.074294e-06   0.000000e+00   4.074294e-06   0.000000e+00 
  2.636800e+04   4.194856e-06   0.000000e+00   4.194856e-06   0.000000e+00 
  2.649600e+04   4.285775e-06   0.000000e+00   4.285775e-06   0.000000e+00 
  2.662400e+04   4.304789e-06   0.000000e+00   4.304789e-06   0.000000e+00 
  2.675200e+04   4.198628e-06   0.000000e+00   4.198628e-06   0.000000e+00 
  2.688000e+04   4.082683e-06   0.000000e+00   4.082683e-06   0.000000e+00 
  2.700800e+04   4.478919e-06   0.000000e+00   4.478919e-06   0.000000e+00 
  2.713600e+04   4.551893e-06   0.000000e+00   4.551893e-06   0.000000e+00 
  2.726400e+04   4.244040e-06   0.000000e+00   4.244040e-06   0.000000e+00 
  2.739200e+04   4.379216e-06   0.000000e+00   4.379216e-06   0.000000e+00 
  2.752000e+04   4.343861e-06   0.000000e+00   4.343861e-06   0.000000e+00 
  2.764800e+04   4.245178e-06   0.000000e+00   4.245178e-06   0.000000e+00 
  2.777600e+04   4.311970e-06   0.000000e+00   4.311970e-06   0.000000e+00 
  2.790400e+04   4.326675e-06   0.000000e+00   4.326675e-06   0.000000e+00 
  2.803200e+04   4.263555e-06   0.000000e+00   4.263555e-06   0.000000e+00 
  2.816000e+04   4.363190e-06   0.000000e+00   4.363190e-06   0.000000e+00 
  2.828800e+04   4.433751e-06   0.000000e+00   4.433751e-06   0.000000e+00 
  2.841600e+04   4.813294e-06   0.000000e+00   4.813294e-06   0.000000e+00 
  2.854400e+04   6.925361e-06   0.000000e+00   6.925361e-06   0.000000e+00 
  2.867200e+04   6.456173e-06   0.000000e+00   6.456173e-06   0.000000e+00 
  2.880000e+04   5.082890e-06   0.000000e+00   5.082890e-06   0.000000e+00 
  2.892800e+04   4.411454e-06   0.000000e+00   4.411454e-06   0.000000e+00 
  2.905600e+04   4.188714e-06   0.000000e+00   4.188714e-06   0.000000e+00 
  2.918400e+04   4.358230e-06   0.000000e+00   4.358230e-06   0.000000e+00 
  2.931200e+04   4.565568e-06   0.000000e+00   4.565568e-06   0.000000e+00 
  2.944000e+04   4.452111e-06   0.000000e+00   4.452111e-06   0.000000e+00 
  2.956800e+04   4.410719e-06   0.000000e+00   4.410719e-06   0.000000e+00 
  2.969600e+04   4.437401e-06   0.000000e+00   4.437401e-06   0.000000e+00 
  2.982400e+04   4.602786e-06   0.000000e+00   4.602786e-06   0.000000e+00 
  2.995200e+04   4.566355e-06   0.000000e+00   4.566355e-06   0.000000e+00 
  3.008000e+04   4.482472e-06   0.000000e+00   4.482472e-06   0.000000e+00 
  3.020800e+04   4.421049e-06   0.000000e+00   4.421049e-06   0.000000e+00 
  3.033600e+04   4.370049e-06   0.000000e+00   4.370049e-06   0.000000e+00 
  3.046400e+04   4.332519e-06   0.000000e+00   4.332519e-06   0.000000e+00 
  3.059200e+04   4.380320e-06   0.000000e+00   4.380320e-06   0.000000e+00 
  3.072000e+04   4.410101e-06   0.000000e+00   4.410101e-06   0.000000e+00 
  3.084800e+04   4.462038e-06   0.000000e+00   4.462038e-06   0.000000e+00 
  3.097600e+04   4.420004e-06   0.000000e+00   4.420004e-06   0.000000e+00 
  3.110400e+04   4.444301e-06   0.000000e+00   4.444301e-06   0.000000e+00 
  3.123200e+04   5.050137e-06   0.000000e+00   5.050137e-06   0.000000e+00 
  3.136000e+04   7.120666e-06   0.000000e+00   7.120666e-06   0.000000e+00 
  3.148800e+04   5.489244e-06   0.000000e+00   5.489244e-06   0.000000e+00 
  3.161600e+04   4.573564e-06   0.000000e+00   4.573564e-06   0.000000e+00 
  3.174400e+04   4.505007e-06   0.000000e+00   4.505007e-06   0.000000e+00 
  3.187200e+04   4.535557e-06   0.000000e+00   4.535557e-06   0.000000e+00 
  3.200000e+04   4.586272e-06   0.000000e+00   4.586272e-06   0.000000e+00 
  3.212800e+04   4.502922e-06   0.000000e+00   4.502922e-06   0.000000e+00 
  3.225600e+04   4.456382e-06   0.000000e+00   4.456382e-06   0.000000e+00 
  3.238400e+04   4.423562e-06   0.000000e+00   4.423562e-06   0.000000e+00 
  3.251200e+04   4.494692e-06   0.000000e+00   4.494692e-06   0.000000e+00 
  3.264000e+04   4.596100e-06   0.000000e+00   4.596100e-06   0.000000e+00 
  3.276800e+04   4.633335e-06   0.000000e+00   4.633335e-06   0.000000e+00 
  3.289600e+04   4.627348e-06   0.000000e+00   4.627348e-06   0.000000e+00 
  3.302400e+04   4.553549e-06   0.000000e+00   4.553549e-06   0.000000e+00 
  3.315200e+04   4.532219e-06   0.000000e+00   4.532219e-06   0.000000e+00 
  3.328000e+04   4.457751e-06   0.000000e+00   4.457751e-06   0.000000e+00 
  3.340800e+04   4.501039e-06   0.000000e+00   4.501039e-06   0.000000e+00 
  3.353600e+04   4.468654e-06   0.000000e+00   4.468654e-06   0.000000e+00 
  3.366400e+04   4.538766e-06   0.000000e+00   4.538766e-06   0.000000e+00 
  3.379200e+04   4.641591e-06   0.000000e+00   4.641591e-06   0.000000e+00 
  3.392000e+04   4.514596e-06   0.000000e+00   4.514596e-06   0.000000e+00 
  3.404800e+04   4.525294e-06   0.000000e+00   4.525294e-06   0.000000e+00 
  3.417600e+04   4.579584e-06   0.000000e+00   4.579584e-06   0.000000e+00 
  3.430400e+04   4.673205e-06   0.000000e+00   4.673205e-06   0.000000e+00 
  3.443200e+04   4.658922e-06   0.000000e+00   4.658922e-06   0.000000e+00 
  3.456000e+04   4.666901e-06   0.000000e+00   4.666901e-06   0.000000e+00 
  3.468800e+04   4.662106e-06   0.000000e+00   4.662106e-06   0.000000e+00 
  3.481600e+04   4.691714e-06   0.000000e+00   4.691714e-06   0.000000e+00 
  3.494400e+04   4.703869e-06   0.000000e+00   4.703869e-06   0.000000e+00 
  3.507200e+04   4.710928e-06   0.000000e+00   4.710928e-06   0.000000e+00 
  3.520000e+04   4.713616e-06   0.000000e+00   4.713616e-06   0.000000e+00 
  3.532800e+04   4.768833e-06   0.000000e+00   4.768833e-06   0.000000e+00 
  3.545600e+04   4.831718e-06   0.000000e+00   4.831718e-06   0.000000e+00 
  3.558400e+04   4.825399e-06   0.000000e+00   4.825399e-06   0.000000e+00 
  3.571200e+04   4.705063e-06   0.000000e+00   4.705063e-06   0.000000e+00 
  3.584000e+04   4.831731e-06   0.000000e+00   4.831731e-06   0.000000e+00 
  3.596800e+04   4.811460e-06   0.000000e+00   4.811460e-06   0.000000e+00 
  3.609600e+04   4.915074e-06   0.000000e+00   4.915074e-06   0.000000e+00 
  3.622400e+04   4.827077e-06   0.000000e+00   4.827077e-06   0.000000e+00 
  3.635200e+04   4.817342e-06   0.000000e+00   4.817342e-06   0.000000e+00 
  3.648000e+04   4.910167e-06   0.000000e+00   4.910167e-06   0.000000e+00 
  3.660800e+04   4.965220e-06   0.000000e+00   4.965220e-06   0.000000e+00 
  3.673600e+04   5.042384e-06   0.000000e+00   5.042384e-06   0.000000e+00 
  3.686400e+04   4.917594e-06   0.000000e+00   4.917594e-06   0.000000e+00 
  3.699200e+04   4.940779e-06   0.000000e+00   4.940779e-06   0.000000e+00 
  3.712000e+04   4.939830e-06   0.000000e+00   4.939830e-06   0.000000e+00 
  3.724800e+04   4.853594e-06   0.000000e+00   4.853594e-06   0.000000e+00 
  3.737600e+04   4.935731e-06   0.000000e+00   4.935731e-06   0.000000e+00 
  3.750400e+04   5.058152e-06   0.000000e+00   5.058152e-06   0.000000e+00 
  3.763200e+04   4.993667e-06   0.000000e+00   4.993667e-06   0.000000e+00 
  3.776000e+04   4.910676e-06   0.000000e+00   4.910676e-06   0.000000e+00 
  3.788800e+04   4.971423e-06   0.000000e+00   4.971423e-06   0.000000e+00 
  3.801600e+04   4.963821e-06   0.000000e+00   4.963821e-06   0.000000e+00 
  3.814400e+04   4.938657e-06   0.000000e+00   4.938657e-06   0.000000e+00 
  3.827200e+04   5.004061e-06   0.000000e+00   5.004061e-06   0.000000e+00 
  3.840000e+04   5.058964e-06   0.000000e+00   5.058964e-06   0.000000e+00 
  3.852800e+04   4.992572e-06   0.000000e+00   4.992572e-06   0.000000e+00 
  3.865600e+04   4.959545e-06   0.000000e+00   4.959545e-06   0.000000e+00 
  3.878400e+04   4.955980e-06   0.000000e+00   4.955980e-06   0.000000e+00 
  3.891200e+04   4.954898e-06   0.000000e+00   4.954898e-06   0.000000e+00 
  3.904000e+04   5.070277e-06   0.000000e+00   5.070277e-06   0.000000e+00 
  3.916800e+04   5.153416e-06   0.000000e+00   5.153416e-06   0.000000e+00 
  3.929600e+04   5.130365e-06   0.000000e+00   5.130365e-06   0.000000e+00 
  3.942400e+04   5.261080e-06   0.000000e+00   5.261080e-06   0.000000e+00 
  3.955200e+04   5.171224e-06   0.000000e+00   5.171224e-06   0.000000e+00 
  3.968000e+04   5.135503e-06   0.000000e+00   5.135503e-06   0.000000e+00 
  3.980800e+04   5.158917e-06   0.000000e+00   5.158917e-06   0.000000e+00 
  3.993600e+04   5.112493e-06   0.000000e+00   5.112493e-06   0.000000e+00 
  4.006400e+04   5.057639e-06   0.000000e+00   5.057639e-06   0.000000e+00 
  4.019200e+04   5.105375e-06   0.000000e+00   5.105375e-06   0.000000e+00 
  4.032000e+04   5.127785e-06   0.000000e+00   5.127785e-06   0.000000e+00 
  4.044800e+04   5.197330e-06   0.000000e+00   5.197330e-06   0.000000e+00 
  4.057600e+04   5.213630e-06   0.000000e+00   5.213630e-06   0.000000e+00 
  4.070400e+04   5.224599e-06   0.000000e+00   5.224599e-06   0.000000e+00 
  4.083200e+04   5.253404e-06   0.000000e+00   5.253404e-06   0.000000e+00 
  4.096000e+04   5.287747e-06   0.000000e+00   5.287747e-06   0.000000e+00 
  4.108800e+04   5.329819e-06   0.000000e+00   5.329819e-06   0.000000e+00 
  4.121600e+04   5.264010e-06   0.000000e+00   5.264010e-06   0.000000e+00 
  4.134400e+04   5.227495e-06   0.000000e+00   5.227495e-06   0.000000e+00 
  4.147200e+04   5.248505e-06   0.000000e+00   5.248505e-06   0.000000e+00 
  4.160000e+04   5.225477e-06   0.000000e+00   5.225477e-06   0.000000e+00 
  4.172800e+04   5.187637e-06   0.000000e+00   5.187637e-06   0.000000e+00 
  4.185600e+04   5.338763e-06   0.000000e+00   5.338763e-06   0.000000e+00 
  4.198400e+04   5.316046e-06   0.000000e+00   5.316046e-06   0.000000e+00 
  4.211200e+04   5.228229e-06   0.000000e+00   5.228229e-06   0.000000e+00 
  4.224000e+04   5.278091e-06   0.000000e+00   5.278091e-06   0.000000e+00 
  4.236800e+04   5.344152e-06   0.000000e+00   5.344152e-06   0.000000e+00 
  4.249600e+04   5.319095e-06   0.000000e+00   5.319095e-06   0.000000e+00 
  4.262400e+04   5.302247e-06   0.000000e+00   5.302247e-06   0.000000e+00 
  4.275200e+04   5.386110e-06   0.000000e+00   5.386110e-06   0.000000e+00 
  4.288000e+04   5.337087e-06   0.000000e+00   5.337087e-06   0.000000e+00 
  4.300800e+04   5.296872e-06   0.000000e+00   5.296872e-06   0.000000e+00 
  4.313600e+04   5.302333e-06   0.000000e+00   5.302333e-06   0.000000e+00 
  4.326400e+04   5.376812e-06   0.000000e+00   5.376812e-06   0.000000e+00 
  4.339200e+04   5.246516e-06   0.000000e+00   5.246516e-06   0.000000e+00 
  4.352000e+04   5.414364e-06   0.000000e+00   5.414364e-06   0.000000e+00 
  4.364800e+04   5.416039e-06   0.000000e+00   5.416039e-06   0.000000e+00 
  4.377600e+04   5.376583e-06   0.000000e+00   5.376583e-06   0.000000e+00 
  4.390400e+04   5.397667e-06   0.000000e+00   5.397667e-06   0.000000e+00 
  4.403200e+04   5.535058e-06   0.000000e+00   5.535058e-06   0.000000e+00 
  4.416000e+04   5.579228e-06   0.000000e+00   5.579228e-06   0.000000e+00 
  4.428800e+04   5.369562e-06   0.000000e+00   5.369562e-06   0.000000e+00 
  4.441600e+04   5.442976e-06   0.000000e+00   5.442976e-06   0.000000e+00 
  4.454400e+04   5.493909e-06   0.000000e+00   5.493909e-06   0.000000e+00 
  4.467200e+04   5.534122e-06   0.000000e+00   5.534122e-06   0.000000e+00 
  4.480000e+04   5.528015e-06   0.000000e+00   5.528015e-06   0.000000e+00 
  4.492800e+04   5.583949e-06   0.000000e+00   5.583949e-06   0.000000e+00 
  4.505600e+04   5.656492e-06   0.000000e+00   5.656492e-06   0.000000e+00 
  4.518400e+04   5.673125e-06   0.000000e+00   5.673125e-06   0.000000e+00 
  4.531200e+04   5.667086e-06   0.000000e+00   5.667086e-06   0.000000e+00 
  4.544000e+04   5.521289e-06   0.000000e+00   5.521289e-06   0.000000e+00 
  4.556800e+04   5.497918e-06   0.000000e+00   5.497918e-06   0.000000e+00 
  4.569600e+04   5.666255e-06   0.000000e+00   5.666255e-06   0.000000e+00 
  4.582400e+04   5.718183e-06   0.000000e+00   5.718183e-06   0.000000e+00 
  4.595200e+04   5.632110e-06   0.000000e+00   5.632110e-06   0.000000e+00 
  4.608000e+04   5.435168e-06   0.000000e+00   5.435168e-06   0.000000e+00 
  4.620800e+04   5.478020e-06   0.000000e+00   5.478020e-06   0.000000e+00 
  4.633600e+04   5.650935e-06   0.000000e+00   5.650935e-06   0.000000e+00 
  4.646400e+04   5.659849e-06   0.000000e+00   5.659849e-06   0.000000e+00 
  4.659200e+04   5.611518e-06   0.000000e+00   5.611518e-06   0.000000e+00 
  4.672000e+04   5.553829e-06   0.000000e+00   5.553829e-06   0.000000e+00 
  4.684800e+04   5.612005e-06   0.000000e+00   5.612005e-06   0.000000e+00 
  4.697600e+04   5.679408e-06   0.000000e+00   5.679408e-06   0.000000e+00 
  4.710400e+04   5.685875e-06   0.000000e+00   5.685875e-06   0.000000e+00 
  4.723200e+04   5.641190e-06   0.000000e+00   5.641190e-06   0.000000e+00 
  4.736000e+04   5.658377e-06   0.000000e+00   5.658377e-06   0.000000e+00 
  4.748800e+04   5.672712e-06   0.000000e+00   5.672712e-06   0.000000e+00 
  4.761600e+04   5.622063e-06   0.000000e+00   5.622063e-06   0.000000e+00 
  4.774400e+04   5.530201e-06   0.000000e+00   5.530201e-06   0.000000e+00 
  4.787200e+04   5.585845e-06   0.000000e+00   5.585845e-06   0.000000e+00 
  4.800000e+04   5.696879e-06   0.000000e+00   5.696879e-06   0.000000e+00 
  4.812800e+04   5.807015e-06   0.000000e+00   5.807015e-06   0.000000e+00 
  4.825600e+04   5.701621e-06   0.000000e+00   5.701621e-06   0.000000e+00 
  4.838400e+04   5.662048e-06   0.000000e+00   5.662048e-06   0.000000e+00 
  4.851200e+04   5.741946e-06   0.000000e+00   5.741946e-06   0.000000e+00 
  4.864000e+04   5.870373e-06   0.000000e+00   5.870373e-06   0.000000e+00 
  4.876800e+04   5.834896e-06   0.000000e+00   5.834896e-06   0.000000e+00 
  4.889600e+04   5.736297e-06   0.000000e+00   5.736297e-06   0.000000e+00 
  4.902400e+04   5.802236e-06   0.000000e+00   5.802236e-06   0.000000e+00 
  4.915200e+04   5.730002e-06   0.000000e+00   5.730002e-06   0.000000e+00 
  4.928000e+04   5.804261e-06   0.000000e+00   5.804261e-06   0.000000e+00 
  4.940800e+04   5.870756e-06   0.000000e+00   5.870756e-06   0.000000e+00 
  4.953600e+04   5.811423e-06   0.000000e+00   5.811423e-06   0.000000e+00 
  4.966400e+04   5.944914e-06   0.000000e+00   5.944914e-06   0.000000e+00 
  4.979200e+04   5.933142e-06   0.000000e+00   5.933142e-06   0.000000e+00 
  4.992000e+04   5.884037e-06   0.000000e+00   5.884037e-06   0.000000e+00 
  5.004800e+04   5.758949e-06   0.000000e+00   5.758949e-06   0.000000e+00 
  5.017600e+04   5.846725e-06   0.000000e+00   5.846725e-06   0.000000e+00 
  5.030400e+04   5.903239e-06   0.000000e+00   5.903239e-06   0.000000e+00 
  5.043200e+04   5.960424e-06   0.000000e+00   5.960424e-06   0.000000e+00 
  5.056000e+04   5.888720e-06   0.000000e+00   5.888720e-06   0.000000e+00 
  5.068800e+04   5.959772e-06   0.000000e+00   5.959772e-06   0.000000e+00 
  5.081600e+04   5.957351e-06   0.000000e+00   5.957351e-06   0.000000e+00 
  5.094400e+04   5.995860e-06   0.000000e+00   5.995860e-06   0.000000e+00 
  5.107200e+04   5.878031e-06   0.000000e+00   5.878031e-06   0.000000e+00 
  5.120000e+04   5.858531e-06   0.000000e+00   5.858531e-06   0.000000e+00 
  5.132800e+04   5.823987e-06   0.000000e+00   5.823987e-06   0.000000e+00 
  5.145600e+04   5.843413e-06   0.000000e+00   5.843413e-06   0.000000e+00 
  5.158400e+04   6.000787e-06   0.000000e+00   6.000787e-06   0.000000e+00 
  5.171200e+04   6.023821e-06   0.000000e+00   6.023821e-06   0.000000e+00 
  5.184000e+04   5.935095e-06   0.000000e+00   5.935095e-06   0.000000e+00 
  5.196800e+04   5.897281e-06   0.000000e+00   5.897281e-06   0.000000e+00 
  5.209600e+04   5.833608e-06   0.000000e+00   5.833608e-06   0.000000e+00 
  5.222400e+04   5.853535e-06   0.000000e+00   5.853535e-06   0.000000e+00 
  5.235200e+04   6.004555e-06   0.000000e+00   6.004555e-06   0.000000e+00 
  5.248000e+04   5.946750e-06   0.000000e+00   5.946750e-06   0.000000e+00 
  5.260800e+04   5.975386e-06   0.000000e+00   5.975386e-06   0.000000e+00 
  5.273600e+04   5.933749e-06   0.000000e+00   5.933749e-06   0.000000e+00 
  5.286400e+04   6.039558e-06   0.000000e+00   6.039558e-06   0.000000e+00 
  5.299200e+04   5.943464e-06   0.000000e+00   5.943464e-06   0.000000e+00 
  5.312000e+04   6.004851e-06   0.000000e+00   6.004851e-06   0.000000e+00 
  5.324800e+04   6.067271e-06   0.000000e+00   6.067271e-06   0.000000e+00 
  5.337600e+04   6.008414e-06   0.000000e+00   6.008414e-06   0.000000e+00 
  5.350400e+04   5.991006e-06   0.000000e+00   5.991006e-06   0.000000e+00 
  5.363200e+04   6.096434e-06   0.000000e+00   6.096434e-06   0.000000e+00 
  5.376000e+04   6.142490e-06   0.000000e+00   6.142490e-06   0.000000e+00 
  5.388800e+04   6.147192e-06   0.000000e+00   6.147192e-06   0.000000e+00 
  5.401600e+04   6.111223e-06   0.000000e+00   6.111223e-06   0.000000e+00 
  5.414400e+04   6.016481e-06   0.000000e+00   6.016481e-06   0.000000e+00 
  5.427200e+04   6.003922e-06   0.000000e+00   6.003922e-06   0.000000e+00 
  5.440000e+04   6.128661e-06   0.000000e+00   6.128661e-06   0.000000e+00 
  5.452800e+04   6.098053e-06   0.000000e+00   6.098053e-06   0.000000e+00 
  5.465600e+04   6.101160e-06   0.000000e+00   6.101160e-06   0.000000e+00 
  5.478400e+04   6.128266e-06   0.000000e+00   6.128266e-06   0.000000e+00 
  5.491200e+04   6.091776e-06   0.000000e+00   6.091776e-06   0.000000e+00 
  5.504000e+04   6.215911e-06   0.000000e+00   6.215911e-06   0.000000e+00 
  5.516800e+04   6.137486e-06   0.000000e+00   6.137486e-06   0.000000e+00 
  5.529600e+04   6.148116e-06   0.000000e+00   6.148116e-06   0.000000e+00 
  5.542400e+04   6.262339e-06   0.000000e+00   6.262339e-06   0.000000e+00 
  5.555200e+04   6.138822e-06   0.000000e+00   6.138822e-06   0.000000e+00 
  5.568000e+04   6.116607e-06   0.000000e+00   6.116607e-06   0.000000e+00 
  5.580800e+04   6.150502e-06   0.000000e+00   6.150502e-06   0.000000e+00 
  5.593600e+04   6.181013e-06   0.000000e+00   6.181013e-06   0.000000e+00 
  5.606400e+04   6.204893e-06   0.000000e+00   6.204893e-06   0.000000e+00 
  5.619200e+04   6.102627e-06   0.000000e+00   6.102627e-06   0.000000e+00 
  5.632000e+04   6.160847e-06   0.000000e+00   6.160847e-06   0.000000e+00 
  5.644800e+04   6.267558e-06   0.000000e+00   6.267558e-06   0.000000e+00 
  5.657600e+04   6.253375e-06   0.000000e+00   6.253375e-06   0.000000e+00 
  5.670400e+04   6.297079e-06   0.000000e+00   6.297079e-06   0.000000e+00 
  5.683200e+04   6.345572e-06   0.000000e+00   6.345572e-06   0.000000e+00 
  5.696000e+04   6.366271e-06   0.000000e+00   6.366271e-06   0.000000e+00 
  5.708800e+04   6.314721e-06   0.000000e+00   6.314721e-06   0.000000e+00 
  5.721600e+04   6.206062e-06   0.000000e+00   6.206062e-06   0.000000e+00 
  5.734400e+04   6.231804e-06   0.000000e+00   6.231804e-06   0.000000e+00 
  5.747200e+04   6.276377e-06   0.000000e+00   6.276377e-06   0.000000e+00 
  5.760000e+04   6.255426e-06   0.000000e+00   6.255426e-06   0.000000e+00 
  5.772800e+04   6.249043e-06   0.000000e+00   6.249043e-06   0.000000e+00 
  5.785600e+04   6.195277e-06   0.000000e+00   6.195277e-06   0.000000e+00 
  5.798400e+04   6.097915e-06   0.000000e+00   6.097915e-06   0.000000e+00 
  5.811200e+04   6.227607e-06   0.000000e+00   6.227607e-06   0.000000e+00 
  5.824000e+04   6.290443e-06   0.000000e+00   6.290443e-06   0.000000e+00 
  5.836800e+04   6.322728e-06   0.000000e+00   6.322728e-06   0.000000e+00 
  5.849600e+04   6.335064e-06   0.000000e+00   6.335064e-06   0.000000e+00 
  5.862400e+04   6.402715e-06   0.000000e+00   6.402715e-06   0.000000e+00 
  5.875200e+04   6.458725e-06   0.000000e+00   6.458725e-06   0.000000e+00 
  5.888000e+04   6.469014e-06   0.000000e+00   6.469014e-06   0.000000e+00 
  5.900800e+04   6.295850e-06   0.000000e+00   6.295850e-06   0.000000e+00 
  5.913600e+04   6.425008e-06   0.000000e+00   6.425008e-06   0.000000e+00 
  5.926400e+04   6.370492e-06   0.000000e+00   6.370492e-06   0.000000e+00 
  5.939200e+04   6.281515e-06   0.000000e+00   6.281515e-06   0.000000e+00 
  5.952000e+04   6.335643e-06   0.000000e+00   6.335643e-06   0.000000e+00 
  5.964800e+04   6.307125e-06   0.000000e+00   6.307125e-06   0.000000e+00 
  5.977600e+04   6.290268e-06   0.000000e+00   6.290268e-06   0.000000e+00 
  5.990400e+04   6.421638e-06   0.000000e+00   6.421638e-06   0.000000e+00 
  6.003200e+04   6.419944e-06   0.000000e+00   6.419944e-06   0.000000e+00 
  6.016000e+04   6.469186e-06   0.000000e+00   6.469186e-06   0.000000e+00 
  6.028800e+04   6.454085e-06   0.000000e+00   6.454085e-06   0.000000e+00 
  6.041600e+04   6.479803e-06   0.000000e+00   6.479803e-06   0.000000e+00 
  6.054400e+04   6.540997e-06   0.000000e+00   6.540997e-06   0.000000e+00 
  6.067200e+04   6.387310e-06   0.000000e+00   6.387310e-06   0.000000e+00 
  6.080000e+04   6.410509e-06   0.000000e+00   6.410509e-06   0.000000e+00 
  6.092800e+04   6.571121e-06   0.000000e+00   6.571121e-06   0.000000e+00 
  6.105600e+04   6.543057e-06   0.000000e+00   6.543057e-06   0.000000e+00 
  6.118400e+04   6.467527e-06   0.000000e+00   6.467527e-06   0.000000e+00 
  6.131200e+04   6.479629e-06   0.000000e+00   6.479629e-06   0.000000e+00 
  6.144000e+04   6.501260e-06   0.000000e+00   6.501260e-06   0.000000e+00 
  6.156800e+04   6.425872e-06   0.000000e+00   6.425872e-06   0.000000e+00 
  6.169600e+04   6.454746e-06   0.000000e+00   6.454746e-06   0.000000e+00 
  6.182400e+04   6.574217e-06   0.000000e+00   6.574217e-06   0.000000e+00 
  6.195200e+04   6.470513e-06   0.000000e+00   6.470513e-06   0.000000e+00 
  6.208000e+04   6.424228e-06   0.000000e+00   6.424228e-06   0.000000e+00 
  6.220800e+04   6.507946e-06   0.000000e+00   6.507946e-06   0.000000e+00 
  6.233600e+04   6.447955e-06   0.000000e+00   6.447955e-06   0.000000e+00 
  6.246400e+04   6.436202e-06   0.000000e+00   6.436202e-06   0.000000e+00 
  6.259200e+04   6.642133e-06   0.000000e+00   6.642133e-06   0.000000e+00 
  6.272000e+04   7.253538e-06   0.000000e+00   7.253538e-06   0.000000e+00 
  6.284800e+04   6.897439e-06   0.000000e+00   6.897439e-06   0.000000e+00 
  6.297600e+04   6.601580e-06   0.000000e+00   6.601580e-06   0.000000e+00 
  6.310400e+04   6.537133e-06   0.000000e+00   6.537133e-06   0.000000e+00 
  6.323200e+04   6.512465e-06   0.000000e+00   6.512465e-06   0.000000e+00 
  6.336000e+04   6.679319e-06   0.000000e+00   6.679319e-06   0.000000e+00 
  6.348800e+04   6.637455e-06   0.000000e+00   6.637455e-06   0.000000e+00 
  6.361600e+04   6.566635e-06   0.000000e+00   6.566635e-06   0.000000e+00 
  6.374400e+04   6.611268e-06   0.000000e+00   6.611268e-06   0.000000e+00 
  6.387200e+04   6.578729e-06   0.000000e+00   6.578729e-06   0.000000e+00 
  6.400000e+04   6.527980e-06   0.000000e+00   6.527980e-06   0.000000e+00 
  6.412800e+04   6.450419e-06   0.000000e+00   6.450419e-06   0.000000e+00 
  6.425600e+04   6.722070e-06   0.000000e+00   6.722070e-06   0.000000e+00 
  6.438400e+04   6.823836e-06   0.000000e+00   6.823836e-06   0.000000e+00 
  6.451200e+04   6.722428e-06   0.000000e+00   6.722428e-06   0.000000e+00 
  6.464000e+04   6.505592e-06   0.000000e+00   6.505592e-06   0.000000e+00 
  6.476800e+04   6.704592e-06   0.000000e+00   6.704592e-06   0.000000e+00 
  6.489600e+04   6.697694e-06   0.000000e+00   6.697694e-06   0.000000e+00 
  6.502400e+04   6.600211e-06   0.000000e+00   6.600211e-06   0.000000e+00 
  6.515200e+04   6.689966e-06   0.000000e+00   6.689966e-06   0.000000e+00 
  6.528000e+04   6.827503e-06   0.000000e+00   6.827503e-06   0.000000e+00 
  6.540800e+04   6.719453e-06   0.000000e+00   6.719453e-06   0.000000e+00 
  6.553600e+04   6.738777e-06   0.000000e+00   6.738777e-06   0.000000e+00 
  6.566400e+04   6.652253e-06   0.000000e+00   6.652253e-06   0.000000e+00 
  6.579200e+04   6.719603e-06   0.000000e+00   6.719603e-06   0.000000e+00 
  6.592000e+04   6.767312e-06   0.000000e+00   6.767312e-06   0.000000e+00 
  6.604800e+04   6.628640e-06   0.000000e+00   6.628640e-06   0.000000e+00 
  6.617600e+04   6.687860e-06   0.000000e+00   6.687860e-06   0.000000e+00 
  6.630400e+04   6.673648e-06   0.000000e+00   6.673648e-06   0.000000e+00 
  6.643200e+04   7.253552e-06   0.000000e+00   7.253552e-06   0.000000e+00 
  6.656000e+04   7.535181e-06   0.000000e+00   7.535181e-06   0.000000e+00 
  6.668800e+04   6.802536e-06   0.000000e+00   6.802536e-06   0.000000e+00 
  6.681600e+04   6.757409e-06   0.000000e+00   6.757409e-06   0.000000e+00 
  6.694400e+04   6.859124e-06   0.000000e+00   6.859124e-06   0.000000e+00 
  6.707200e+04   6.854409e-06   0.000000e+00   6.854409e-06   0.000000e+00 
  6.720000e+04   6.732929e-06   0.000000e+00   6.732929e-06   0.000000e+00 
  6.732800e+04   6.615714e-06   0.000000e+00   6.615714e-06   0.000000e+00 
  6.745600e+04   6.758374e-06   0.000000e+00   6.758374e-06   0.000000e+00 
  6.758400e+04   6.883324e-06   0.000000e+00   6.883324e-06   0.000000e+00 
  6.771200e+04   6.898236e-06   0.000000e+00   6.898236e-06   0.000000e+00 
  6.784000e+04   6.851093e-06   0.000000e+00   6.851093e-06   0.000000e+00 
  6.796800e+04   6.786028e-06   0.000000e+00   6.786028e-06   0.000000e+00 
  6.809600e+04   6.725102e-06   0.000000e+00   6.725102e-06   0.000000e+00 
  6.822400e+04   6.753471e-06   0.000000e+00   6.753471e-06   0.000000e+00 
  6.835200e+04   6.781825e-06   0.000000e+00   6.781825e-06   0.000000e+00 
  6.848000e+04   6.830852e-06   0.000000e+00   6.830852e-06   0.000000e+00 
  6.860800e+04   6.772001e-06   0.000000e+00   6.772001e-06   0.000000e+00 
  6.873600e+04   6.657796e-06   0.000000e+00   6.657796e-06   0.000000e+00 
  6.886400e+04   6.669810e-06   0.000000e+00   6.669810e-06   0.000000e+00 
  6.899200e+04   6.703793e-06   0.000000e+00   6.703793e-06   0.000000e+00 
  6.912000e+04   6.862200e-06   0.000000e+00   6.862200e-06   0.000000e+00 
  6.924800e+04   6.873159e-06   0.000000e+00   6.873159e-06   0.000000e+00 
  6.937600e+04   7.094967e-06   0.000000e+00   7.094967e-06   0.000000e+00 
  6.950400e+04   7.070746e-06   0.000000e+00   7.070746e-06   0.000000e+00 
  6.963200e+04   6.955936e-06   0.000000e+00   6.955936e-06   0.000000e+00 
  6.976000e+04   6.779455e-06   0.000000e+00   6.779455e-06   0.000000e+00 
  6.988800e+04   6.910606e-06   0.000000e+00   6.910606e-06   0.000000e+00 
  7.001600e+04   6.983248e-06   0.000000e+00   6.983248e-06   0.000000e+00 
  7.014400e+04   6.919122e-06   0.000000e+00   6.919122e-06   0.000000e+00 
  7.027200e+04   6.859488e-06   0.000000e+00   6.859488e-06   0.000000e+00 
  7.040000e+04   6.766175e-06   0.000000e+00   6.766175e-06   0.000000e+00 
  7.052800e+04   6.762056e-06   0.000000e+00   6.762056e-06   0.000000e+00 
  7.065600e+04   6.786093e-06   0.000000e+00   6.786093e-06   0.000000e+00 
  7.078400e+04   6.830513e-06   0.000000e+00   6.830513e-06   0.000000e+00 
  7.091200e+04   6.953786e-06   0.000000e+00   6.953786e-06   0.000000e+00 
  7.104000e+04   6.863248e-06   0.000000e+00   6.863248e-06   0.000000e+00 
  7.116800e+04   7.247329e-06   0.000000e+00   7.247329e-06   0.000000e+00 
  7.129600e+04   7.189392e-06   0.000000e+00   7.189392e-06   0.000000e+00 
  7.142400e+04   7.014233e-06   0.000000e+00   7.014233e-06   0.000000e+00 
  7.155200e+04   6.953542e-06   0.000000e+00   6.953542e-06   0.000000e+00 
  7.168000e+04   6.981008e-06   0.000000e+00   6.981008e-06   0.000000e+00 
  7.180800e+04   7.044267e-06   0.000000e+00   7.044267e-06   0.000000e+00 
  7.193600e+04   7.169849e-06   0.000000e+00   7.169849e-06   0.000000e+00 
  7.206400e+04   7.238585e-06   0.000000e+00   7.238585e-06   0.000000e+00 
  7.219200e+04   7.235498e-06   0.000000e+00   7.235498e-06   0.000000e+00 
  7.232000e+04   6.893232e-06   0.000000e+00   6.893232e-06   0.000000e+00 
  7.244800e+04   6.978335e-06   0.000000e+00   6.978335e-06   0.000000e+00 
  7.257600e+04   7.108482e-06   0.000000e+00   7.108482e-06   0.000000e+00 
  7.270400e+04   7.084643e-06   0.000000e+00   7.084643e-06   0.000000e+00 
  7.283200e+04   7.097070e-06   0.000000e+00   7.097070e-06   0.000000e+00 
  7.296000e+04   7.134390e-06   0.000000e+00   7.134390e-06   0.000000e+00 
  7.308800e+04   7.178350e-06   0.000000e+00   7.178350e-06   0.000000e+00 
  7.321600e+04   7.135309e-06   0.000000e+00   7.135309e-06   0.000000e+00 
  7.334400e+04   7.023589e-06   0.000000e+00   7.023589e-06   0.000000e+00 
  7.347200e+04   7.380393e-06   0.000000e+00   7.380393e-06   0.000000e+00 
  7.360000e+04   7.507128e-06   0.000000e+00   7.507128e-06   0.000000e+00 
  7.372800e+04   7.101410e-06   0.000000e+00   7.101410e-06   0.000000e+00 
  7.385600e+04   6.856198e-06   0.000000e+00   6.856198e-06   0.000000e+00 
  7.398400e+04   6.915247e-06   0.000000e+00   6.915247e-06   0.000000e+00 
  7.411200e+04   6.921489e-06   0.000000e+00   6.921489e-06   0.000000e+00 
  7.424000e+04   7.034272e-06   0.000000e+00   7.034272e-06   0.000000e+00 
  7.436800e+04   6.951858e-06   0.000000e+00   6.951858e-06   0.000000e+00 
  7.449600e+04   6.901606e-06   0.000000e+00   6.901606e-06   0.000000e+00 
  7.462400e+04   7.054440e-06   0.000000e+00   7.054440e-06   0.000000e+00 
  7.475200e+04   7.188570e-06   0.000000e+00   7.188570e-06   0.000000e+00 
  7.488000e+04   7.067317e-06   0.000000e+00   7.067317e-06   0.000000e+00 
  7.500800e+04   7.059215e-06   0.000000e+00   7.059215e-06   0.000000e+00 
  7.513600e+04   7.219420e-06   0.000000e+00   7.219420e-06   0.000000e+00 
  7.526400e+04   7.272244e-06   0.000000e+00   7.272244e-06   0.000000e+00 
  7.539200e+04   7.206524e-06   0.000000e+00   7.206524e-06   0.000000e+00 
  7.552000e+04   7.144371e-06   0.000000e+00   7.144371e-06   0.000000e+00 
  7.564800e+04   7.129692e-06   0.000000e+00   7.129692e-06   0.000000e+00 
  7.577600e+04   7.180114e-06   0.000000e+00   7.180114e-06   0.000000e+00 
  7.590400e+04   7.046403e-06   0.000000e+00   7.046403e-06   0.000000e+00 
  7.603200e+04   6.893195e-06   0.000000e+00   6.893195e-06   0.000000e+00 
  7.616000e+04   7.024352e-06   0.000000e+00   7.024352e-06   0.000000e+00 
  7.628800e+04   7.124368e-06   0.000000e+00   7.124368e-06   0.000000e+00 
  7.641600e+04   7.217778e-06   0.000000e+00   7.217778e-06   0.000000e+00 
  7.654400e+04   7.150970e-06   0.000000e+00   7.150970e-06   0.000000e+00 
  7.667200e+04   7.076577e-06   0.000000e+00   7.076577e-06   0.000000e+00 
  7.680000e+04   7.112936e-06   0.000000e+00   7.112936e-06   0.000000e+00 
  7.692800e+04   7.268742e-06   0.000000e+00   7.268742e-06   0.000000e+00 
  7.705600e+04   7.153208e-06   0.000000e+00   7.153208e-06   0.000000e+00 
  7.718400e+04   7.126316e-06   0.000000e+00   7.126316e-06   0.000000e+00 
  7.731200e+04   7.195007e-06   0.000000e+00   7.195007e-06   0.000000e+00 
  7.744000e+04   7.268533e-06   0.000000e+00   7.268533e-06   0.000000e+00 
  7.756800e+04   7.158952e-06   0.000000e+00   7.158952e-06   0.000000e+00 
  7.769600e+04   6.983460e-06   0.000000e+00   6.983460e-06   0.000000e+00 
  7.782400e+04   7.042615e-06   0.000000e+00   7.042615e-06   0.000000e+00 
  7.795200e+04   7.243447e-06   0.000000e+00   7.243447e-06   0.000000e+00 
  7.808000e+04   7.212872e-06   0.000000e+00   7.212872e-06   0.000000e+00 
  7.820800e+04   7.192102e-06   0.000000e+00   7.192102e-06   0.000000e+00 
  7.833600e+04   7.185330e-06   0.000000e+00   7.185330e-06   0.000000e+00 
  7.846400e+04   7.156588e-06   0.000000e+00   7.156588e-06   0.000000e+00 
  7.859200e+04   7.207394e-06   0.000000e+00   7.207394e-06   0.000000e+00 
  7.872000e+04   7.168996e-06   0.000000e+00   7.168996e-06   0.000000e+00 
  7.884800e+04   7.229142e-06   0.000000e+00   7.229142e-06   0.000000e+00 
  7.897600e+04   7.275489e-06   0.000000e+00   7.275489e-06   0.000000e+00 
  7.910400e+04   7.348113e-06   0.000000e+00   7.348113e-06   0.000000e+00 
  7.923200e+04   7.251573e-06   0.000000e+00   7.251573e-06   0.000000e+00 
  7.936000e+04   7.360338e-06   0.000000e+00   7.360338e-06   0.000000e+00 
  7.948800e+04   7.352150e-06   0.000000e+00   7.352150e-06   0.000000e+00 
  7.961600e+04   7.320838e-06   0.000000e+00   7.320838e-06   0.000000e+00 
  7.974400e+04   7.213945e-06   0.000000e+00   7.213945e-06   0.000000e+00 
  7.987200e+04   7.314188e-06   0.000000e+00   7.314188e-06   0.000000e+00 
  8.000000e+04   7.283438e-06   0.000000e+00   7.283438e-06   0.000000e+00 
  8.012800e+04   7.291700e-06   0.000000e+00   7.291700e-06   0.000000e+00 
  8.025600e+04   7.394870e-06   0.000000e+00   7.394870e-06   0.000000e+00 
  8.038400e+04   7.380635e-06   0.000000e+00   7.380635e-06   0.000000e+00 
  8.051200e+04   7.287566e-06   0.000000e+00   7.287566e-06   0.000000e+00 
  8.064000e+04   7.193816e-06   0.000000e+00   7.193816e-06   0.000000e+00 
  8.076800e+04   7.296432e-06   0.000000e+00   7.296432e-06   0.000000e+00 
  8.089600e+04   7.253471e-06   0.000000e+00   7.253471e-06   0.000000e+00 
  8.102400e+04   7.283676e-06   0.000000e+00   7.283676e-06   0.000000e+00 
  8.115200e+04   7.238510e-06   0.000000e+00   7.238510e-06   0.000000e+00 
  8.128000e+04   7.249671e-06   0.000000e+00   7.249671e-06   0.000000e+00 
  8.140800e+04   7.194886e-06   0.000000e+00   7.194886e-06   0.000000e+00 
  8.153600e+04   7.272795e-06   0.000000e+00   7.272795e-06   0.000000e+00 
  8.166400e+04   7.504702e-06   0.000000e+00   7.504702e-06   0.000000e+00 
  8.179200e+04   7.392993e-06   0.000000e+00   7.392993e-06   0.000000e+00 
  8.192000e+04   7.269372e-06   0.000000e+00   7.269372e-06   0.000000e+00 
  8.204800e+04   7.350210e-06   0.000000e+00   7.350210e-06   0.000000e+00 
  8.217600e+04   7.385484e-06   0.000000e+00   7.385484e-06   0.000000e+00 
  8.230400e+04   7.320215e-06   0.000000e+00   7.320215e-06   0.000000e+00 
  8.243200e+04   7.476232e-06   0.000000e+00   7.476232e-06   0.000000e+00 
  8.256000e+04   7.389656e-06   0.000000e+00   7.389656e-06   0.000000e+00 
  8.268800e+04   7.389795e-06   0.000000e+00   7.389795e-06   0.000000e+00 
  8.281600e+04   7.272714e-06   0.000000e+00   7.272714e-06   0.000000e+00 
  8.294400e+04   7.312304e-06   0.000000e+00   7.312304e-06   0.000000e+00 
  8.307200e+04   7.380422e-06   0.000000e+00   7.380422e-06   0.000000e+00 
  8.320000e+04   7.364110e-06   0.000000e+00   7.364110e-06   0.000000e+00 
  8.332800e+04   7.441855e-06   0.000000e+00   7.441855e-06   0.000000e+00 
  8.345600e+04   7.422290e-06   0.000000e+00   7.422290e-06   0.000000e+00 
  8.358400e+04   7.407394e-06   0.000000e+00   7.407394e-06   0.000000e+00 
  8.371200e+04   7.423857e-06   0.000000e+00   7.423857e-06   0.000000e+00 
  8.384000e+04   7.347328e-06   0.000000e+00   7.347328e-06   0.000000e+00 
  8.396800e+04   7.366107e-06   0.000000e+00   7.366107e-06   0.000000e+00 
  8.409600e+04   7.406580e-06   0.000000e+00   7.406580e-06   0.000000e+00 
  8.422400e+04   7.405661e-06   0.000000e+00   7.405661e-06   0.000000e+00 
  8.435200e+04   7.610926e-06   0.000000e+00   7.610926e-06   0.000000e+00 
  8.448000e+04   7.525412e-06   0.000000e+00   7.525412e-06   0.000000e+00 
  8.460800e+04   7.403138e-06   0.000000e+00   7.403138e-06   0.000000e+00 
  8.473600e+04   7.222061e-06   0.000000e+00   7.222061e-06   0.000000e+00 
  8.486400e+04   7.261773e-06   0.000000e+00   7.261773e-06   0.000000e+00 
  8.499200e+04   7.463983e-06   0.000000e+00   7.463983e-06   0.000000e+00 
  8.512000e+04   7.532426e-06   0.000000e+00   7.532426e-06   0.000000e+00 
  8.524800e+04   7.531844e-06   0.000000e+00   7.531844e-06   0.000000e+00 
  8.537600e+04   7.586307e-06   0.000000e+00   7.586307e-06   0.000000e+00 
  8.550400e+04   7.380196e-06   0.000000e+00   7.380196e-06   0.000000e+00 
  8.563200e+04   7.295117e-06   0.000000e+00   7.295117e-06   0.000000e+00 
  8.576000e+04   7.280404e-06   0.000000e+00   7.280404e-06   0.000000e+00 
  8.588800e+04   7.304143e-06   0.000000e+00   7.304143e-06   0.000000e+00 
  8.601600e+04   7.492580e-06   0.000000e+00   7.492580e-06   0.000000e+00 
  8.614400e+04   7.463457e-06   0.000000e+00   7.463457e-06   0.000000e+00 
  8.627200e+04   7.435715e-06   0.000000e+00   7.435715e-06   0.000000e+00 
  8.640000e+04   7.486227e-06   0.000000e+00   7.486227e-06   0.000000e+00 
  8.652800e+04   7.514403e-06   0.000000e+00   7.514403e-06   0.000000e+00 
  8.665600e+04   7.464024e-06   0.000000e+00   7.464024e-06   0.000000e+00 
  8.678400e+04   7.386167e-06   0.000000e+00   7.386167e-06   0.000000e+00 
  8.691200e+04   7.356455e-06   0.000000e+00   7.356455e-06   0.000000e+00 
  8.704000e+04   7.392024e-06   0.000000e+00   7.392024e-06   0.000000e+00 
  8.716800e+04   7.539994e-06   0.000000e+00   7.539994e-06   0.000000e+00 
  8.729600e+04   7.615119e-06   0.000000e+00   7.615119e-06   0.000000e+00 
  8.742400e+04   7.494692e-06   0.000000e+00   7.494692e-06   0.000000e+00 
  8.755200e+04   7.582604e-06   0.000000e+00   7.582604e-06   0.000000e+00 
  8.768000e+04   7.559668e-06   0.000000e+00   7.559668e-06   0.000000e+00 
  8.780800e+04   7.762890e-06   0.000000e+00   7.762890e-06   0.000000e+00 
  8.793600e+04   7.674670e-06   0.000000e+00   7.674670e-06   0.000000e+00 
  8.806400e+04   7.494052e-06   0.000000e+00   7.494052e-06   0.000000e+00 
  8.819200e+04   7.502709e-06   0.000000e+00   7.502709e-06   0.000000e+00 
  8.832000e+04   7.654417e-06   0.000000e+00   7.654417e-06   0.000000e+00 
  8.844800e+04   7.571889e-06   0.000000e+00   7.571889e-06   0.000000e+00 
  8.857600e+04   7.499056e-06   0.000000e+00   7.499056e-06   0.000000e+00 
  8.870400e+04   7.693080e-06   0.000000e+00   7.693080e-06   0.000000e+00 
  8.883200e+04   7.638800e-06   0.000000e+00   7.638800e-06   0.000000e+00 
  8.896000e+04   7.616460e-06   0.000000e+00   7.616460e-06   0.000000e+00 
  8.908800e+04   7.841828e-06   0.000000e+00   7.841828e-06   0.000000e+00 
  8.921600e+04   8.101261e-06   0.000000e+00   8.101261e-06   0.000000e+00 
  8.934400e+04   8.200926e-06   0.000000e+00   8.200926e-06   0.000000e+00 
  8.947200e+04   8.337583e-06   0.000000e+00   8.337583e-06   0.000000e+00 
  8.960000e+04   8.132988e-06   0.000000e+00   8.132988e-06   0.000000e+00 
  8.972800e+04   8.144812e-06   0.000000e+00   8.144812e-06   0.000000e+00 
  8.985600e+04   8.067075e-06   0.000000e+00   8.067075e-06   0.000000e+00 
  8.998400e+04   7.961121e-06   0.000000e+00   7.961121e-06   0.000000e+00 
  9.011200e+04   8.026320e-06   0.000000e+00   8.026320e-06   0.000000e+00 
  9.024000e+04   8.146803e-06   0.000000e+00   8.146803e-06   0.000000e+00 
  9.036800e+04   8.300346e-06   0.000000e+00   8.300346e-06   0.000000e+00 
  9.049600e+04   8.351488e-06   0.000000e+00   8.351488e-06   0.000000e+00 
  9.062400e+04   8.174979e-06   0.000000e+00   8.174979e-06   0.000000e+00 
  9.075200e+04   7.967184e-06   0.000000e+00   7.967184e-06   0.000000e+00 
  9.088000e+04   8.030470e-06   0.000000e+00   8.030470e-06   0.000000e+00 
  9.100800e+04   7.925362e-06   0.000000e+00   7.925362e-06   0.000000e+00 
  9.113600e+04   7.840707e-06   0.000000e+00   7.840707e-06   0.000000e+00 
  9.126400e+04   7.926558e-06   0.000000e+00   7.926558e-06   0.000000e+00 
  9.139200e+04   7.774021e-06   0.000000e+00   7.774021e-06   0.000000e+00 
  9.152000e+04   7.519274e-06   0.000000e+00   7.519274e-06   0.000000e+00 
  9.164800e+04   7.619640e-06   0.000000e+00   7.619640e-06   0.000000e+00 
  9.177600e+04   7.846986e-06   0.000000e+00   7.846986e-06   0.000000e+00 
  9.190400e+04   7.809544e-06   0.000000e+00   7.809544e-06   0.000000e+00 
  9.203200e+04   7.742238e-06   0.000000e+00   7.742238e-06   0.000000e+00 
  9.216000e+04   7.670666e-06   0.000000e+00   7.670666e-06   0.000000e+00 
  9.228800e+04   7.669440e-06   0.000000e+00   7.669440e-06   0.000000e+00 
  9.241600e+04   7.637978e-06   0.000000e+00   7.637978e-06   0.000000e+00 
  9.254400e+04   7.606467e-06   0.000000e+00   7.606467e-06   0.000000e+00 
  9.267200e+04   7.749441e-06   0.000000e+00   7.749441e-06   0.000000e+00 
  9.280000e+04   7.830380e-06   0.000000e+00   7.830380e-06   0.000000e+00 
  9.292800e+04   7.753214e-06   0.000000e+00   7.753214e-06   0.000000e+00 
  9.305600e+04   7.699873e-06   0.000000e+00   7.699873e-06   0.000000e+00 
  9.318400e+04   7.628303e-06   0.000000e+00   7.628303e-06   0.000000e+00 
  9.331200e+04   7.817528e-06   0.000000e+00   7.817528e-06   0.000000e+00 
  9.344000e+04   7.700419e-06   0.000000e+00   7.700419e-06   0.000000e+00 
  9.356800e+04   7.762839e-06   0.000000e+00   7.762839e-06   0.000000e+00 
  9.369600e+04   7.708476e-06   0.000000e+00   7.708476e-06   0.000000e+00 
  9.382400e+04   7.772624e-06   0.000000e+00   7.772624e-06   0.000000e+00 
  9.395200e+04   7.848497e-06   0.000000e+00   7.848497e-06   0.000000e+00 
  9.408000e+04   7.761828e-06   0.000000e+00   7.761828e-06   0.000000e+00 
  9.420800e+04   7.644175e-06   0.000000e+00   7.644175e-06   0.000000e+00 
  9.433600e+04   7.621959e-06   0.000000e+00   7.621959e-06   0.000000e+00 
  9.446400e+04   7.694165e-06   0.000000e+00   7.694165e-06   0.000000e+00 
  9.459200e+04   7.778301e-06   0.000000e+00   7.778301e-06   0.000000e+00 
  9.472000e+04   7.905261e-06   0.000000e+00   7.905261e-06   0.000000e+00 
  9.484800e+04   7.879241e-06   0.000000e+00   7.879241e-06   0.000000e+00 
  9.497600e+04   7.791667e-06   0.000000e+00   7.791667e-06   0.000000e+00 
  9.510400e+04   7.858748e-06   0.000000e+00   7.858748e-06   0.000000e+00 
  9.523200e+04   7.881656e-06   0.000000e+00   7.881656e-06   0.000000e+00 
  9.536000e+04   7.870077e-06   0.000000e+00   7.870077e-06   0.000000e+00 
  9.548800e+04   7.827583e-06   0.000000e+00   7.827583e-06   0.000000e+00 
  9.561600e+04   7.879171e-06   0.000000e+00   7.879171e-06   0.000000e+00 
  9.574400e+04   7.835378e-06   0.000000e+00   7.835378e-06   0.000000e+00 
  9.587200e+04   7.775311e-06   0.000000e+00   7.775311e-06   0.000000e+00 
  9.600000e+04   7.931362e-06   0.000000e+00   7.931362e-06   0.000000e+00 
  9.612800e+04   7.898468e-06   0.000000e+00   7.898468e-06   0.000000e+00 
  9.625600e+04   7.912053e-06   0.000000e+00   7.912053e-06   0.000000e+00 
  9.638400e+04   7.881321e-06   0.000000e+00   7.881321e-06   0.000000e+00 
  9.651200e+04   7.810474e-06   0.000000e+00   7.810474e-06   0.000000e+00 
  9.664000e+04   7.749380e-06   0.000000e+00   7.749380e-06   0.000000e+00 
  9.676800e+04   7.805048e-06   0.000000e+00   7.805048e-06   0.000000e+00 
  9.689600e+04   7.818300e-06   0.000000e+00   7.818300e-06   0.000000e+00 
  9.702400e+04   7.704674e-06   0.000000e+00   7.704674e-06   0.000000e+00 
  9.715200e+04   7.844986e-06   0.000000e+00   7.844986e-06   0.000000e+00 
  9.728000e+04   7.824497e-06   0.000000e+00   7.824497e-06   0.000000e+00 
  9.740800e+04   7.717405e-06   0.000000e+00   7.717405e-06   0.000000e+00 
  9.753600e+04   7.693413e-06   0.000000e+00   7.693413e-06   0.000000e+00 
  9.766400e+04   7.822411e-06   0.000000e+00   7.822411e-06   0.000000e+00 
  9.779200e+04   7.800660e-06   0.000000e+00   7.800660e-06   0.000000e+00 
  9.792000e+04   7.748389e-06   0.000000e+00   7.748389e-06   0.000000e+00 
  9.804800e+04   7.810347e-06   0.000000e+00   7.810347e-06   0.000000e+00 
  9.817600e+04   7.901401e-06   0.000000e+00   7.901401e-06   0.000000e+00 
  9.830400e+04   7.962431e-06   0.000000e+00   7.962431e-06   0.000000e+00 
  9.843200e+04   7.861660e-06   0.000000e+00   7.861660e-06   0.000000e+00 
  9.856000e+04   7.919677e-06   0.000000e+00   7.919677e-06   0.000000e+00 
  9.868800e+04   8.079550e-06   0.000000e+00   8.079550e-06   0.000000e+00 
  9.881600e+04   7.952645e-06   0.000000e+00   7.952645e-06   0.000000e+00 
  9.894400e+04   7.824550e-06   0.000000e+00   7.824550e-06   0.000000e+00 
  9.907200e+04   7.846914e-06   0.000000e+00   7.846914e-06   0.000000e+00 
  9.920000e+04   7.845533e-06   0.000000e+00   7.845533e-06   0.000000e+00 
  9.932800e+04   7.832687e-06   0.000000e+00   7.832687e-06   0.000000e+00 
  9.945600e+04   7.843884e-06   0.000000e+00   7.843884e-06   0.000000e+00 
  9.958400e+04   9.613310e-06   0.000000e+00   9.613310e-06   0.000000e+00 
  9.971200e+04   1.438249e-05   0.000000e+00   1.438249e-05   0.000000e+00 
  9.984000e+04   1.847634e-05   0.000000e+00   1.847634e-05   0.000000e+00 
  9.996800e+04   1.117216e-05   0.000000e+00   1.117216e-05   0.000000e+00 
  1.000960e+05   7.864558e-06   0.000000e+00   7.864558e-06   0.000000e+00 
  1.002240e+05   8.050131e-06   0.000000e+00   8.050131e-06   0.000000e+00 
  1.003520e+05   7.878670e-06   0.000000e+00   7.878670e-06   0.000000e+00 
  1.004800e+05   7.788381e-06   0.000000e+00   7.788381e-06   0.000000e+00 
  1.006080e+05   7.946641e-06   0.000000e+00   7.946641e-06   0.000000e+00 
  1.007360e+05   7.762204e-06   0.000000e+00   7.762204e-06   0.000000e+00 
  1.008640e+05   7.655892e-06   0.000000e+00   7.655892e-06   0.000000e+00 
  1.009920e+05   7.813020e-06   0.000000e+00   7.813020e-06   0.000000e+00 
  1.011200e+05   7.946448e-06   0.000000e+00   7.946448e-06   0.000000e+00 
  1.012480e+05   7.838048e-06   0.000000e+00   7.838048e-06   0.000000e+00 
  1.013760e+05   7.849732e-06   0.000000e+00   7.849732e-06   0.000000e+00 
  1.015040e+05   7.960387e-06   0.000000e+00   7.960387e-06   0.000000e+00 
  1.016320e+05   7.866216e-06   0.000000e+00   7.866216e-06   0.000000e+00 
  1.017600e+05   7.870534e-06   0.000000e+00   7.870534e-06   0.000000e+00 
  1.018880e+05   7.897595e-06   0.000000e+00   7.897595e-06   0.000000e+00 
  1.020160e+05   8.000829e-06   0.000000e+00   8.000829e-06   0.000000e+00 
  1.021440e+05   7.931671e-06   0.000000e+00   7.931671e-06   0.000000e+00 
  1.022720e+05   7.893726e-06   0.000000e+00   7.893726e-06   0.000000e+00 
  1.024000e+05   7.950254e-06   0.000000e+00   7.950254e-06   0.000000e+00 
