  0.000000e+00   1.280541e-02   1.631660e-05   1.280542e-02   7.300600e-02 
  2.500000e-01   1.227495e-02   7.585953e-03   1.442987e-02   3.171618e+01 
  5.000000e-01   1.120890e-02   1.057518e-02   1.541019e-02   4.333366e+01 
  7.500000e-01   1.016349e-02   1.015558e-02   1.436775e-02   4.497767e+01 
  1.000000e+00   9.331739e-03   8.279750e-03   1.247540e-02   4.158160e+01 
  1.250000e+00   7.782690e-03   7.955727e-03   1.112941e-02   4.562992e+01 
  1.500000e+00   8.811548e-03   8.280319e-03   1.209161e-02   4.321977e+01 
  1.750000e+00   9.430835e-03   8.032025e-03   1.238766e-02   4.042027e+01 
  2.000000e+00   7.581412e-03   6.989679e-03   1.031181e-02   4.267449e+01 
  2.250000e+00   7.147384e-03   5.943697e-03   9.295840e-03   3.974659e+01 
  2.500000e+00   6.786698e-03   5.882654e-03   8.981363e-03   4.091848e+01 
  2.750000e+00   6.076630e-03   5.902844e-03   8.471659e-03   4.416887e+01 
  3.000000e+00   5.448306e-03   5.091446e-03   7.457001e-03   4.306079e+01 
  3.250000e+00   4.917659e-03   5.419620e-03   7.318173e-03   4.778000e+01 
  3.500000e+00   4.615066e-03   5.832471e-03   7.437510e-03   5.164645e+01 
  3.750000e+00   3.972101e-03   4.568971e-03   6.054179e-03   4.899746e+01 
  4.000000e+00   3.547130e-03   2.962575e-03   4.621577e-03   3.986875e+01 
  4.250000e+00   3.619024e-03   3.312622e-03   4.906199e-03   4.246898e+01 
  4.500000e+00   4.087960e-03   4.633610e-03   6.179139e-03   4.857994e+01 
  4.750000e+00   5.032933e-03   4.758578e-03   6.926361e-03   4.339501e+01 
  5.000000e+00   4.316362e-03   3.600807e-03   5.621102e-03   3.983562e+01 
  5.250000e+00   3.480317e-03   3.212923e-03   4.736611e-03   4.271225e+01 
  5.500000e+00   4.057299e-03   3.279277e-03   5.216832e-03   3.894657e+01 
  5.750000e+00   4.054416e-03   2.973372e-03   5.027846e-03   3.625507e+01 
  6.000000e+00   4.105946e-03   3.281095e-03   5.255890e-03   3.862864e+01 
  6.250000e+00   3.693581e-03   3.491504e-03   5.082631e-03   4.338901e+01 
  6.500000e+00   3.406314e-03   3.234711e-03   4.697481e-03   4.351981e+01 
  6.750000e+00   3.807661e-03   2.937283e-03   4.808940e-03   3.764709e+01 
  7.000000e+00   4.053408e-03   2.809515e-03   4.931886e-03   3.472676e+01 
  7.250000e+00   3.774908e-03   2.540382e-03   4.550107e-03   3.393918e+01 
  7.500000e+00   3.090414e-03   2.731420e-03   4.124478e-03   4.147141e+01 
  7.750000e+00   2.762009e-03   2.851584e-03   3.969915e-03   4.591417e+01 
  8.000000e+00   2.943180e-03   2.436525e-03   3.820859e-03   3.961982e+01 
  8.250000e+00   2.972507e-03   2.727264e-03   4.034076e-03   4.253626e+01 
  8.500000e+00   2.842681e-03   2.557783e-03   3.824015e-03   4.198019e+01 
  8.750000e+00   2.850640e-03   2.411349e-03   3.733732e-03   4.022779e+01 
  9.000000e+00   2.445258e-03   2.444425e-03   3.457528e-03   4.499025e+01 
  9.250000e+00   2.294465e-03   2.221710e-03   3.193832e-03   4.407706e+01 
  9.500000e+00   2.473953e-03   2.630276e-03   3.610927e-03   4.675419e+01 
  9.750000e+00   2.358017e-03   2.520252e-03   3.451364e-03   4.690475e+01 
  1.000000e+01   2.290916e-03   2.066525e-03   3.085259e-03   4.205210e+01 
  1.025000e+01   2.142671e-03   2.402748e-03   3.219354e-03   4.827474e+01 
  1.050000e+01   2.050904e-03   2.219868e-03   3.022254e-03   4.726559e+01 
  1.075000e+01   2.043905e-03   1.707519e-03   2.663300e-03   3.987605e+01 
  1.100000e+01   1.957421e-03   1.765730e-03   2.636153e-03   4.205265e+01 
  1.125000e+01   1.818806e-03   1.824947e-03   2.576526e-03   4.509657e+01 
  1.150000e+01   1.629021e-03   1.811455e-03   2.436202e-03   4.803531e+01 
  1.175000e+01   1.672128e-03   1.804303e-03   2.459984e-03   4.717735e+01 
  1.200000e+01   1.875484e-03   1.534729e-03   2.423393e-03   3.929383e+01 
  1.225000e+01   1.816326e-03   1.322392e-03   2.246722e-03   3.605680e+01 
  1.250000e+01   1.700471e-03   1.385161e-03   2.193233e-03   3.916539e+01 
  1.275000e+01   1.799092e-03   1.470418e-03   2.323545e-03   3.925952e+01 
  1.300000e+01   1.861830e-03   1.596158e-03   2.452372e-03   4.060669e+01 
  1.325000e+01   1.736586e-03   1.166865e-03   2.092201e-03   3.389835e+01 
  1.350000e+01   1.480983e-03   9.701311e-04   1.770442e-03   3.322715e+01 
  1.375000e+01   1.374155e-03   1.113162e-03   1.768455e-03   3.900988e+01 
  1.400000e+01   1.497163e-03   1.198272e-03   1.917642e-03   3.867243e+01 
  1.425000e+01   1.436066e-03   1.114283e-03   1.817666e-03   3.780885e+01 
  1.450000e+01   1.332345e-03   1.057855e-03   1.701235e-03   3.844886e+01 
  1.475000e+01   1.119024e-03   1.250091e-03   1.677779e-03   4.816656e+01 
  1.500000e+01   8.976358e-04   1.244024e-03   1.534062e-03   5.418736e+01 
  1.525000e+01   9.434094e-04   1.035110e-03   1.400527e-03   4.765366e+01 
  1.550000e+01   9.529954e-04   1.060140e-03   1.425516e-03   4.804655e+01 
  1.575000e+01   1.061376e-03   1.289043e-03   1.669776e-03   5.053256e+01 
  1.600000e+01   1.156490e-03   1.266581e-03   1.715138e-03   4.760140e+01 
  1.625000e+01   1.078939e-03   1.134695e-03   1.565772e-03   4.644282e+01 
  1.650000e+01   1.142372e-03   1.103404e-03   1.588243e-03   4.400592e+01 
  1.675000e+01   1.286324e-03   1.020967e-03   1.642256e-03   3.843936e+01 
  1.700000e+01   1.356010e-03   9.548719e-04   1.658476e-03   3.515235e+01 
  1.725000e+01   1.347076e-03   8.253397e-04   1.579810e-03   3.149537e+01 
  1.750000e+01   1.194159e-03   7.978504e-04   1.436169e-03   3.374797e+01 
  1.775000e+01   9.991297e-04   1.019290e-03   1.427309e-03   4.557225e+01 
  1.800000e+01   9.964219e-04   1.184787e-03   1.548088e-03   4.993570e+01 
  1.825000e+01   1.137541e-03   1.090632e-03   1.575905e-03   4.379395e+01 
  1.850000e+01   1.132890e-03   9.229983e-04   1.461289e-03   3.917071e+01 
  1.875000e+01   9.567891e-04   8.276110e-04   1.265063e-03   4.085941e+01 
  1.900000e+01   8.164654e-04   9.669502e-04   1.265547e-03   4.982320e+01 
  1.925000e+01   9.175019e-04   1.069386e-03   1.409041e-03   4.937138e+01 
  1.950000e+01   1.112870e-03   1.004360e-03   1.499072e-03   4.206612e+01 
  1.975000e+01   9.552031e-04   1.053879e-03   1.422348e-03   4.781181e+01 
  2.000000e+01   6.965615e-04   1.006605e-03   1.224112e-03   5.531710e+01 
  2.025000e+01   6.973301e-04   8.009849e-04   1.062001e-03   4.895747e+01 
  2.050000e+01   6.890176e-04   7.044683e-04   9.854039e-04   4.563526e+01 
  2.075000e+01   6.261612e-04   7.814523e-04   1.001372e-03   5.129554e+01 
  2.100000e+01   7.294285e-04   8.075141e-04   1.088184e-03   4.790846e+01 
  2.125000e+01   9.893380e-04   7.368415e-04   1.233582e-03   3.667809e+01 
  2.150000e+01   1.034843e-03   6.519170e-04   1.223068e-03   3.220958e+01 
  2.175000e+01   8.908528e-04   6.065034e-04   1.077713e-03   3.424751e+01 
  2.200000e+01   7.161512e-04   6.541264e-04   9.699247e-04   4.240831e+01 
  2.225000e+01   7.672799e-04   6.114855e-04   9.811387e-04   3.855317e+01 
  2.250000e+01   9.053679e-04   5.933979e-04   1.082503e-03   3.324171e+01 
  2.275000e+01   8.681038e-04   6.504919e-04   1.084778e-03   3.684513e+01 
  2.300000e+01   7.721247e-04   6.483662e-04   1.008244e-03   4.002075e+01 
  2.325000e+01   7.863922e-04   6.932771e-04   1.048354e-03   4.139914e+01 
  2.350000e+01   8.993541e-04   6.297689e-04   1.097928e-03   3.500147e+01 
  2.375000e+01   8.531947e-04   6.614581e-04   1.079568e-03   3.778542e+01 
  2.400000e+01   5.678893e-04   6.227607e-04   8.428103e-04   4.763862e+01 
  2.425000e+01   5.464723e-04   5.811754e-04   7.977448e-04   4.676271e+01 
  2.450000e+01   6.203815e-04   6.139102e-04   8.727880e-04   4.469960e+01 
  2.475000e+01   6.436255e-04   5.035400e-04   8.171942e-04   3.803783e+01 
  2.500000e+01   5.940669e-04   4.896310e-04   7.698402e-04   3.949541e+01 
  2.525000e+01   5.947329e-04   5.801729e-04   8.308476e-04   4.429000e+01 
  2.550000e+01   5.467651e-04   5.813095e-04   7.980432e-04   4.675399e+01 
  2.575000e+01   4.352213e-04   5.123392e-04   6.722418e-04   4.965281e+01 
  2.600000e+01   4.513989e-04   5.438073e-04   7.067441e-04   5.030490e+01 
  2.625000e+01   4.534196e-04   6.014243e-04   7.531936e-04   5.298700e+01 
  2.650000e+01   3.795513e-04   5.174635e-04   6.417379e-04   5.374054e+01 
  2.675000e+01   3.706329e-04   4.290432e-04   5.669628e-04   4.917760e+01 
  2.700000e+01   4.979161e-04   4.626517e-04   6.796816e-04   4.289750e+01 
  2.725000e+01   4.926225e-04   5.380354e-04   7.294922e-04   4.752293e+01 
  2.750000e+01   4.366378e-04   4.903442e-04   6.565744e-04   4.831583e+01 
  2.775000e+01   4.061968e-04   5.331648e-04   6.702690e-04   5.269768e+01 
  2.800000e+01   4.133440e-04   5.667123e-04   7.014386e-04   5.389404e+01 
  2.825000e+01   3.856796e-04   5.336626e-04   6.584410e-04   5.414425e+01 
  2.850000e+01   3.513398e-04   5.214365e-04   6.287572e-04   5.602822e+01 
  2.875000e+01   3.379292e-04   3.596023e-04   4.934673e-04   4.677967e+01 
  2.900000e+01   3.710050e-04   2.862770e-04   4.686142e-04   3.765470e+01 
  2.925000e+01   3.091237e-04   3.394924e-04   4.591433e-04   4.768067e+01 
  2.950000e+01   3.185646e-04   3.635649e-04   4.833869e-04   4.877435e+01 
  2.975000e+01   4.365344e-04   3.626751e-04   5.675346e-04   3.971998e+01 
  3.000000e+01   4.416212e-04   3.153016e-04   5.426272e-04   3.552546e+01 
  3.025000e+01   4.189443e-04   3.142068e-04   5.236795e-04   3.686977e+01 
  3.050000e+01   3.935830e-04   3.344911e-04   5.165190e-04   4.035994e+01 
  3.075000e+01   3.610644e-04   2.618069e-04   4.459937e-04   3.594577e+01 
  3.100000e+01   3.178558e-04   2.603070e-04   4.108431e-04   3.931565e+01 
  3.125000e+01   2.110107e-04   3.196881e-04   3.830483e-04   5.657312e+01 
  3.150000e+01   2.495538e-04   3.585047e-04   4.368097e-04   5.515836e+01 
  3.175000e+01   3.385195e-04   3.212153e-04   4.666634e-04   4.349754e+01 
  3.200000e+01   3.809932e-04   2.810291e-04   4.734270e-04   3.641332e+01 
  3.225000e+01   3.972566e-04   3.278310e-04   5.150592e-04   3.953072e+01 
  3.250000e+01   3.959643e-04   3.464893e-04   5.261583e-04   4.118761e+01 
  3.275000e+01   3.831757e-04   2.982256e-04   4.855534e-04   3.789362e+01 
  3.300000e+01   3.707107e-04   2.255922e-04   4.339565e-04   3.132217e+01 
  3.325000e+01   3.694061e-04   2.666028e-04   4.555633e-04   3.581822e+01 
  3.350000e+01   3.354073e-04   3.398785e-04   4.775097e-04   4.537936e+01 
  3.375000e+01   2.882144e-04   3.592109e-04   4.605432e-04   5.125804e+01 
  3.400000e+01   3.311835e-04   3.458850e-04   4.788726e-04   4.624390e+01 
  3.425000e+01   3.300785e-04   2.992295e-04   4.455223e-04   4.219357e+01 
  3.450000e+01   2.997411e-04   3.294320e-04   4.453876e-04   4.770180e+01 
  3.475000e+01   3.053585e-04   3.749240e-04   4.835409e-04   5.083875e+01 
  3.500000e+01   3.356219e-04   3.977858e-04   5.204571e-04   4.984483e+01 
  3.525000e+01   3.667646e-04   3.252539e-04   4.902105e-04   4.156723e+01 
  3.550000e+01   3.349658e-04   2.709886e-04   4.308560e-04   3.897298e+01 
  3.575000e+01   3.243389e-04   2.732647e-04   4.241100e-04   4.011509e+01 
  3.600000e+01   3.126949e-04   2.560510e-04   4.041537e-04   3.931242e+01 
  3.625000e+01   2.564253e-04   2.177016e-04   3.363747e-04   4.033081e+01 
  3.650000e+01   2.202791e-04   2.507949e-04   3.337978e-04   4.870639e+01 
  3.675000e+01   2.621122e-04   2.759057e-04   3.805611e-04   4.646861e+01 
  3.700000e+01   3.104045e-04   2.913344e-04   4.257073e-04   4.318480e+01 
  3.725000e+01   2.775971e-04   2.921876e-04   4.030307e-04   4.646686e+01 
  3.750000e+01   2.765144e-04   2.494498e-04   3.724049e-04   4.205431e+01 
  3.775000e+01   2.908517e-04   2.143961e-04   3.613315e-04   3.639511e+01 
  3.800000e+01   3.055650e-04   1.981036e-04   3.641635e-04   3.295610e+01 
  3.825000e+01   3.301986e-04   2.238965e-04   3.989496e-04   3.413987e+01 
  3.850000e+01   2.727273e-04   1.811421e-04   3.274029e-04   3.359162e+01 
  3.875000e+01   1.824448e-04   1.724245e-04   2.510305e-04   4.338259e+01 
  3.900000e+01   1.829102e-04   1.927698e-04   2.657374e-04   4.650337e+01 
  3.925000e+01   2.373360e-04   2.203150e-04   3.238319e-04   4.287003e+01 
  3.950000e+01   2.575096e-04   2.357256e-04   3.491099e-04   4.247115e+01 
  3.975000e+01   2.447866e-04   2.387245e-04   3.419209e-04   4.428167e+01 
  4.000000e+01   2.113879e-04   2.207595e-04   3.056463e-04   4.624232e+01 
  4.025000e+01   1.882765e-04   1.779716e-04   2.590790e-04   4.338833e+01 
  4.050000e+01   2.233824e-04   1.482578e-04   2.681046e-04   3.357203e+01 
  4.075000e+01   1.951728e-04   1.627961e-04   2.541555e-04   3.983191e+01 
  4.100000e+01   1.752797e-04   1.686319e-04   2.432277e-04   4.389262e+01 
  4.125000e+01   1.548728e-04   1.572949e-04   2.207426e-04   4.544455e+01 
  4.150000e+01   1.283230e-04   1.779298e-04   2.193759e-04   5.420086e+01 
  4.175000e+01   1.768222e-04   1.902103e-04   2.597038e-04   4.708902e+01 
  4.200000e+01   1.764646e-04   1.783983e-04   2.509297e-04   4.531221e+01 
  4.225000e+01   1.366059e-04   1.601982e-04   2.105342e-04   4.954477e+01 
  4.250000e+01   9.372126e-05   1.433765e-04   1.712907e-04   5.682846e+01 
  4.275000e+01   1.216208e-04   1.654271e-04   2.053235e-04   5.367696e+01 
  4.300000e+01   1.901363e-04   1.821259e-04   2.632901e-04   4.376729e+01 
  4.325000e+01   2.059757e-04   1.708722e-04   2.676253e-04   3.967824e+01 
  4.350000e+01   1.937995e-04   1.539567e-04   2.475093e-04   3.846406e+01 
  4.375000e+01   1.884448e-04   1.511480e-04   2.415723e-04   3.873244e+01 
  4.400000e+01   1.929549e-04   1.894065e-04   2.703820e-04   4.446829e+01 
  4.425000e+01   1.758007e-04   2.073901e-04   2.718760e-04   4.971268e+01 
  4.450000e+01   1.416281e-04   1.912948e-04   2.380172e-04   5.348502e+01 
  4.475000e+01   1.513385e-04   1.645244e-04   2.235433e-04   4.739046e+01 
  4.500000e+01   2.047113e-04   1.741157e-04   2.687433e-04   4.038257e+01 
  4.525000e+01   1.846422e-04   2.039281e-04   2.750990e-04   4.784143e+01 
  4.550000e+01   1.581713e-04   2.131438e-04   2.654213e-04   5.342136e+01 
  4.575000e+01   1.732633e-04   1.768229e-04   2.475611e-04   4.558255e+01 
  4.600000e+01   1.648246e-04   1.506002e-04   2.232657e-04   4.241794e+01 
  4.625000e+01   1.541090e-04   1.482201e-04   2.138195e-04   4.388411e+01 
  4.650000e+01   1.642894e-04   1.206933e-04   2.038575e-04   3.630244e+01 
  4.675000e+01   1.819475e-04   1.109666e-04   2.131161e-04   3.137829e+01 
  4.700000e+01   1.841502e-04   1.621656e-04   2.453752e-04   4.136767e+01 
  4.725000e+01   1.575338e-04   1.730223e-04   2.339948e-04   4.768268e+01 
  4.750000e+01   1.367866e-04   1.513728e-04   2.040203e-04   4.789775e+01 
  4.775000e+01   1.347407e-04   1.404154e-04   1.946061e-04   4.618147e+01 
  4.800000e+01   1.371421e-04   1.589965e-04   2.099711e-04   4.922066e+01 
  4.825000e+01   1.271962e-04   1.704653e-04   2.126906e-04   5.327078e+01 
  4.850000e+01   1.251509e-04   1.551879e-04   1.993640e-04   5.111564e+01 
  4.875000e+01   1.165751e-04   1.468150e-04   1.874683e-04   5.154947e+01 
  4.900000e+01   1.268906e-04   1.563274e-04   2.013441e-04   5.093383e+01 
  4.925000e+01   1.318751e-04   1.449499e-04   1.959630e-04   4.770415e+01 
  4.950000e+01   1.272690e-04   1.448042e-04   1.927839e-04   4.868762e+01 
  4.975000e+01   1.301012e-04   1.556893e-04   2.028928e-04   5.011631e+01 
  5.000000e+01   1.300650e-04   1.457352e-04   1.953347e-04   4.825188e+01 
  5.025000e+01   1.136792e-04   1.139157e-04   1.609340e-04   4.505954e+01 
  5.050000e+01   1.288195e-04   1.229199e-04   1.780555e-04   4.365749e+01 
  5.075000e+01   1.475524e-04   1.263010e-04   1.942258e-04   4.056265e+01 
  5.100000e+01   1.431154e-04   1.096574e-04   1.802963e-04   3.745993e+01 
  5.125000e+01   1.551599e-04   1.013647e-04   1.853358e-04   3.315625e+01 
  5.150000e+01   1.572977e-04   1.137579e-04   1.941222e-04   3.587450e+01 
  5.175000e+01   1.435060e-04   1.264246e-04   1.912515e-04   4.137912e+01 
  5.200000e+01   1.391983e-04   1.162850e-04   1.813791e-04   3.987508e+01 
  5.225000e+01   1.304821e-04   1.106682e-04   1.710936e-04   4.030288e+01 
  5.250000e+01   1.071725e-04   1.081284e-04   1.522422e-04   4.525439e+01 
  5.275000e+01   8.224136e-05   1.088279e-04   1.364080e-04   5.292161e+01 
  5.300000e+01   8.432454e-05   1.197160e-04   1.464328e-04   5.484022e+01 
  5.325000e+01   1.023009e-04   1.186413e-04   1.566564e-04   4.922977e+01 
  5.350000e+01   1.040342e-04   1.052036e-04   1.479557e-04   4.532022e+01 
  5.375000e+01   9.842736e-05   9.181716e-05   1.346044e-04   4.301001e+01 
  5.400000e+01   1.121402e-04   9.591559e-05   1.475643e-04   4.054097e+01 
  5.425000e+01   1.098856e-04   1.073962e-04   1.536515e-04   4.434358e+01 
  5.450000e+01   8.436882e-05   1.227520e-04   1.489502e-04   5.549883e+01 
  5.475000e+01   6.410345e-05   9.706333e-05   1.163209e-04   5.655806e+01 
  5.500000e+01   9.303885e-05   8.354541e-05   1.250442e-04   4.192265e+01 
  5.525000e+01   1.019912e-04   1.017828e-04   1.440901e-04   4.494139e+01 
  5.550000e+01   1.044692e-04   1.048929e-04   1.480417e-04   4.511596e+01 
  5.575000e+01   8.198778e-05   9.891786e-05   1.284786e-04   5.034646e+01 
  5.600000e+01   8.059284e-05   9.171676e-05   1.220949e-04   4.869376e+01 
  5.625000e+01   9.154333e-05   8.055842e-05   1.219420e-04   4.134788e+01 
  5.650000e+01   9.154034e-05   9.876694e-05   1.346646e-04   4.717466e+01 
  5.675000e+01   9.108613e-05   1.113636e-04   1.438698e-04   5.071969e+01 
  5.700000e+01   9.449600e-05   9.941475e-05   1.371597e-04   4.645305e+01 
  5.725000e+01   9.191470e-05   8.533704e-05   1.254222e-04   4.287478e+01 
  5.750000e+01   8.997141e-05   1.031903e-04   1.369054e-04   4.891489e+01 
  5.775000e+01   8.688162e-05   1.066373e-04   1.375497e-04   5.082893e+01 
  5.800000e+01   9.077554e-05   8.331898e-05   1.232163e-04   4.254749e+01 
  5.825000e+01   1.067980e-04   6.831896e-05   1.267805e-04   3.260716e+01 
  5.850000e+01   9.747654e-05   7.419583e-05   1.225018e-04   3.727716e+01 
  5.875000e+01   6.650907e-05   9.172787e-05   1.133025e-04   5.405528e+01 
  5.900000e+01   8.664592e-05   8.823675e-05   1.236658e-04   4.552118e+01 
  5.925000e+01   9.273304e-05   8.236030e-05   1.240268e-04   4.160969e+01 
  5.950000e+01   8.027775e-05   8.649578e-05   1.180086e-04   4.713524e+01 
  5.975000e+01   8.144126e-05   1.199444e-04   1.449805e-04   5.582383e+01 
  6.000000e+01   9.476455e-05   1.363911e-04   1.660809e-04   5.520842e+01 
  6.025000e+01   8.143023e-05   1.065412e-04   1.340966e-04   5.260904e+01 
  6.050000e+01   7.002982e-05   9.594060e-05   1.187804e-04   5.387321e+01 
  6.075000e+01   7.142435e-05   7.897666e-05   1.064836e-04   4.787466e+01 
  6.100000e+01   7.706272e-05   5.794246e-05   9.641572e-05   3.693903e+01 
  6.125000e+01   6.275968e-05   6.443349e-05   8.994695e-05   4.575394e+01 
  6.150000e+01   6.722322e-05   7.438567e-05   1.002606e-04   4.789550e+01 
  6.175000e+01   6.058550e-05   7.689577e-05   9.789567e-05   5.176573e+01 
  6.200000e+01   5.984078e-05   8.378176e-05   1.029578e-04   5.446383e+01 
  6.225000e+01   7.185326e-05   9.184239e-05   1.166101e-04   5.196201e+01 
  6.250000e+01   7.348393e-05   7.785534e-05   1.070577e-04   4.665452e+01 
  6.275000e+01   6.330210e-05   8.299817e-05   1.043832e-04   5.266749e+01 
  6.300000e+01   5.603106e-05   8.785639e-05   1.042028e-04   5.747200e+01 
  6.325000e+01   6.628088e-05   7.407391e-05   9.939868e-05   4.817801e+01 
  6.350000e+01   8.096029e-05   5.750799e-05   9.930629e-05   3.538707e+01 
  6.375000e+01   7.091754e-05   6.886254e-05   9.885013e-05   4.415771e+01 
  6.400000e+01   5.536626e-05   7.738129e-05   9.514876e-05   5.441630e+01 
  6.425000e+01   6.565431e-05   8.069578e-05   1.040303e-04   5.086810e+01 
  6.450000e+01   7.405767e-05   7.999774e-05   1.090146e-04   4.720812e+01 
  6.475000e+01   9.017374e-05   6.678786e-05   1.122137e-04   3.652577e+01 
  6.500000e+01   9.107314e-05   6.172687e-05   1.100206e-04   3.412834e+01 
  6.525000e+01   7.214674e-05   5.474702e-05   9.056704e-05   3.719227e+01 
  6.550000e+01   6.533614e-05   4.755772e-05   8.081181e-05   3.605061e+01 
  6.575000e+01   6.811348e-05   5.607346e-05   8.822517e-05   3.946243e+01 
  6.600000e+01   7.708278e-05   5.980755e-05   9.756382e-05   3.780743e+01 
  6.625000e+01   7.406410e-05   5.634645e-05   9.306134e-05   3.726313e+01 
  6.650000e+01   6.476072e-05   6.234078e-05   8.989062e-05   4.390925e+01 
  6.675000e+01   6.785701e-05   6.064979e-05   9.101083e-05   4.178996e+01 
  6.700000e+01   6.751310e-05   5.866014e-05   8.943730e-05   4.098641e+01 
  6.725000e+01   5.661417e-05   6.390945e-05   8.537905e-05   4.846388e+01 
  6.750000e+01   5.182909e-05   7.909055e-05   9.455987e-05   5.676264e+01 
  6.775000e+01   5.732065e-05   8.024467e-05   9.861473e-05   5.446089e+01 
  6.800000e+01   6.827801e-05   6.809651e-05   9.643143e-05   4.492374e+01 
  6.825000e+01   6.031228e-05   6.905731e-05   9.168688e-05   4.886715e+01 
  6.850000e+01   4.234479e-05   6.692569e-05   7.919678e-05   5.767791e+01 
  6.875000e+01   5.128802e-05   6.355794e-05   8.167051e-05   5.109823e+01 
  6.900000e+01   5.510834e-05   6.727965e-05   8.696827e-05   5.067931e+01 
  6.925000e+01   4.706655e-05   6.517937e-05   8.039658e-05   5.416665e+01 
  6.950000e+01   4.159083e-05   4.743858e-05   6.308896e-05   4.875798e+01 
  6.975000e+01   4.171655e-05   5.842227e-05   7.178741e-05   5.447118e+01 
  7.000000e+01   5.254965e-05   8.331898e-05   9.850644e-05   5.776019e+01 
  7.025000e+01   4.924406e-05   8.078852e-05   9.461375e-05   5.863591e+01 
  7.050000e+01   4.434639e-05   6.239196e-05   7.654646e-05   5.459589e+01 
  7.075000e+01   4.964290e-05   5.288577e-05   7.253497e-05   4.681160e+01 
  7.100000e+01   5.125235e-05   5.873015e-05   7.794892e-05   4.888960e+01 
  7.125000e+01   5.157017e-05   6.095945e-05   7.984696e-05   4.976961e+01 
  7.150000e+01   5.307203e-05   5.102225e-05   7.362004e-05   4.387190e+01 
  7.175000e+01   4.607638e-05   4.669492e-05   6.560068e-05   4.538200e+01 
  7.200000e+01   5.169436e-05   5.412357e-05   7.484429e-05   4.631508e+01 
  7.225000e+01   6.750743e-05   5.924361e-05   8.981681e-05   4.126974e+01 
  7.250000e+01   6.001331e-05   5.936766e-05   8.441633e-05   4.469012e+01 
  7.275000e+01   4.155932e-05   5.949580e-05   7.257360e-05   5.506473e+01 
  7.300000e+01   4.050784e-05   6.952127e-05   8.046174e-05   5.977200e+01 
  7.325000e+01   5.152708e-05   8.035647e-05   9.545785e-05   5.733073e+01 
  7.350000e+01   4.564950e-05   6.688108e-05   8.097503e-05   5.568462e+01 
  7.375000e+01   4.204766e-05   4.338243e-05   6.041557e-05   4.589512e+01 
  7.400000e+01   4.332769e-05   3.878876e-05   5.815374e-05   4.183624e+01 
  7.425000e+01   4.464895e-05   3.797386e-05   5.861351e-05   4.038111e+01 
  7.450000e+01   4.280321e-05   4.312904e-05   6.076372e-05   4.521725e+01 
  7.475000e+01   5.230495e-05   5.447806e-05   7.552263e-05   4.616585e+01 
  7.500000e+01   7.418153e-05   6.196914e-05   9.665958e-05   3.987442e+01 
  7.525000e+01   6.395899e-05   5.395793e-05   8.367921e-05   4.015209e+01 
  7.550000e+01   4.580621e-05   4.912345e-05   6.716637e-05   4.700134e+01 
  7.575000e+01   4.661301e-05   4.666534e-05   6.595776e-05   4.503214e+01 
  7.600000e+01   5.050133e-05   4.463079e-05   6.739652e-05   4.146879e+01 
  7.625000e+01   4.682835e-05   4.889658e-05   6.770354e-05   4.623774e+01 
  7.650000e+01   4.812572e-05   5.102880e-05   7.014288e-05   4.667705e+01 
  7.675000e+01   5.279380e-05   3.910757e-05   6.570074e-05   3.652959e+01 
  7.700000e+01   4.298773e-05   3.528353e-05   5.561360e-05   3.937851e+01 
  7.725000e+01   3.972563e-05   4.900171e-05   6.308164e-05   5.096835e+01 
  7.750000e+01   4.985611e-05   5.731767e-05   7.596675e-05   4.898257e+01 
  7.775000e+01   5.235499e-05   5.432004e-05   7.544344e-05   4.605532e+01 
  7.800000e+01   4.655794e-05   5.843561e-05   7.471521e-05   5.145429e+01 
  7.825000e+01   4.488256e-05   5.407735e-05   7.027663e-05   5.030836e+01 
  7.850000e+01   5.536297e-05   4.131595e-05   6.908014e-05   3.673303e+01 
  7.875000e+01   6.233056e-05   3.460807e-05   7.129388e-05   2.904053e+01 
  7.900000e+01   5.689212e-05   3.492448e-05   6.675652e-05   3.154460e+01 
  7.925000e+01   4.703331e-05   4.221433e-05   6.319954e-05   4.190928e+01 
  7.950000e+01   3.754869e-05   5.009315e-05   6.260374e-05   5.314560e+01 
  7.975000e+01   3.887288e-05   5.339198e-05   6.604395e-05   5.394291e+01 
  8.000000e+01   5.752824e-05   5.600876e-05   8.028997e-05   4.423325e+01 
  8.025000e+01   5.170467e-05   4.311204e-05   6.732028e-05   3.982179e+01 
  8.050000e+01   3.835958e-05   3.587197e-05   5.251910e-05   4.308065e+01 
  8.075000e+01   3.572908e-05   3.815034e-05   5.226869e-05   4.687709e+01 
  8.100000e+01   3.011269e-05   4.197455e-05   5.165885e-05   5.434421e+01 
  8.125000e+01   3.445096e-05   3.836745e-05   5.156481e-05   4.807864e+01 
  8.150000e+01   3.738464e-05   3.739354e-05   5.287616e-05   4.500682e+01 
  8.175000e+01   3.727009e-05   4.690710e-05   5.991106e-05   5.153106e+01 
  8.200000e+01   4.621276e-05   4.391286e-05   6.374918e-05   4.353820e+01 
  8.225000e+01   3.885726e-05   4.226665e-05   5.741390e-05   4.740654e+01 
  8.250000e+01   3.946149e-05   4.493337e-05   5.980148e-05   4.870967e+01 
  8.275000e+01   4.591636e-05   3.884753e-05   6.014518e-05   4.023289e+01 
  8.300000e+01   4.068119e-05   3.427399e-05   5.319460e-05   4.011421e+01 
  8.325000e+01   2.861438e-05   3.890793e-05   4.829710e-05   5.366781e+01 
  8.350000e+01   3.486912e-05   4.317937e-05   5.550057e-05   5.107769e+01 
  8.375000e+01   3.688960e-05   3.776402e-05   5.279171e-05   4.567107e+01 
  8.400000e+01   3.428151e-05   3.420199e-05   4.842518e-05   4.493346e+01 
  8.425000e+01   3.954660e-05   3.257602e-05   5.123603e-05   3.947956e+01 
  8.450000e+01   4.561300e-05   3.852129e-05   5.970289e-05   4.018190e+01 
  8.475000e+01   5.662742e-05   5.494001e-05   7.889911e-05   4.413348e+01 
  8.500000e+01   6.151527e-05   6.438980e-05   8.905153e-05   4.630789e+01 
  8.525000e+01   5.648290e-05   5.020016e-05   7.556702e-05   4.162965e+01 
  8.550000e+01   4.914392e-05   3.567956e-05   6.073019e-05   3.598047e+01 
  8.575000e+01   3.765291e-05   4.475367e-05   5.848617e-05   4.992486e+01 
  8.600000e+01   3.948851e-05   5.046829e-05   6.408112e-05   5.195888e+01 
  8.625000e+01   4.287063e-05   4.188855e-05   5.993781e-05   4.433616e+01 
  8.650000e+01   3.897115e-05   2.914017e-05   4.866107e-05   3.678682e+01 
  8.675000e+01   3.052251e-05   3.333234e-05   4.519589e-05   4.751958e+01 
  8.700000e+01   2.838306e-05   3.649294e-05   4.623130e-05   5.212534e+01 
  8.725000e+01   3.467640e-05   3.712429e-05   5.080025e-05   4.695262e+01 
  8.750000e+01   4.557190e-05   4.253203e-05   6.233596e-05   4.302389e+01 
  8.775000e+01   4.264793e-05   4.307218e-05   6.061402e-05   4.528357e+01 
  8.800000e+01   3.335328e-05   3.859332e-05   5.100868e-05   4.916563e+01 
  8.825000e+01   4.065410e-05   2.838272e-05   4.958159e-05   3.492088e+01 
  8.850000e+01   3.654377e-05   3.137665e-05   4.816577e-05   4.064954e+01 
  8.875000e+01   2.705207e-05   4.251271e-05   5.038994e-05   5.753022e+01 
  8.900000e+01   3.220226e-05   4.150437e-05   5.253187e-05   5.219296e+01 
  8.925000e+01   2.472607e-05   3.557691e-05   4.332545e-05   5.520058e+01 
  8.950000e+01   3.221820e-05   3.433839e-05   4.708649e-05   4.682456e+01 
  8.975000e+01   5.026603e-05   4.086185e-05   6.477936e-05   3.910807e+01 
  9.000000e+01   5.998555e-05   4.727300e-05   7.637410e-05   3.824069e+01 
  9.025000e+01   5.299229e-05   4.822832e-05   7.165301e-05   4.230535e+01 
  9.050000e+01   4.483983e-05   3.729951e-05   5.832550e-05   3.975500e+01 
  9.075000e+01   3.104753e-05   3.498984e-05   4.677861e-05   4.841639e+01 
  9.100000e+01   2.331780e-05   4.050062e-05   4.673350e-05   6.006927e+01 
  9.125000e+01   2.867357e-05   3.736141e-05   4.709616e-05   5.249503e+01 
  9.150000e+01   4.501655e-05   3.990374e-05   6.015645e-05   4.155454e+01 
  9.175000e+01   5.707053e-05   4.703658e-05   7.395597e-05   3.949477e+01 
  9.200000e+01   3.980432e-05   3.826846e-05   5.521647e-05   4.387301e+01 
  9.225000e+01   2.775804e-05   2.142405e-05   3.506421e-05   3.766146e+01 
  9.250000e+01   3.129005e-05   2.652092e-05   4.101739e-05   4.028404e+01 
  9.275000e+01   2.764448e-05   3.311351e-05   4.313609e-05   5.014352e+01 
  9.300000e+01   2.609579e-05   3.237204e-05   4.158052e-05   5.112697e+01 
  9.325000e+01   3.450285e-05   2.692656e-05   4.376627e-05   3.796902e+01 
  9.350000e+01   3.547172e-05   2.973654e-05   4.628720e-05   3.997367e+01 
  9.375000e+01   2.985680e-05   3.829722e-05   4.856033e-05   5.205976e+01 
  9.400000e+01   2.985872e-05   3.956262e-05   4.956555e-05   5.295739e+01 
  9.425000e+01   3.742722e-05   4.517293e-05   5.866336e-05   5.035716e+01 
  9.450000e+01   4.010974e-05   4.396970e-05   5.951577e-05   4.762851e+01 
  9.475000e+01   3.983445e-05   4.369158e-05   5.912476e-05   4.764397e+01 
  9.500000e+01   4.263990e-05   5.260540e-05   6.771624e-05   5.097311e+01 
  9.525000e+01   3.439638e-05   4.341469e-05   5.538904e-05   5.161109e+01 
  9.550000e+01   2.976211e-05   4.289000e-05   5.220474e-05   5.524255e+01 
  9.575000e+01   4.253073e-05   5.624719e-05   7.051673e-05   5.290563e+01 
  9.600000e+01   3.934323e-05   4.404121e-05   5.905522e-05   4.822470e+01 
  9.625000e+01   2.603964e-05   2.983033e-05   3.959686e-05   4.888148e+01 
  9.650000e+01   2.294375e-05   3.564180e-05   4.238813e-05   5.722933e+01 
  9.675000e+01   2.695947e-05   3.378930e-05   4.322649e-05   5.141467e+01 
  9.700000e+01   3.407129e-05   2.799031e-05   4.409434e-05   3.940385e+01 
  9.725000e+01   3.003118e-05   2.733299e-05   4.060744e-05   4.230700e+01 
  9.750000e+01   2.343806e-05   3.109590e-05   3.893966e-05   5.299340e+01 
  9.775000e+01   2.654155e-05   3.459504e-05   4.360356e-05   5.250433e+01 
  9.800000e+01   3.288863e-05   3.643031e-05   4.907983e-05   4.792484e+01 
  9.825000e+01   3.534658e-05   3.902664e-05   5.265415e-05   4.783274e+01 
  9.850000e+01   3.544498e-05   3.861442e-05   5.241584e-05   4.745052e+01 
  9.875000e+01   3.122647e-05   3.826850e-05   4.939201e-05   5.078611e+01 
  9.900000e+01   2.685516e-05   3.689129e-05   4.563077e-05   5.394711e+01 
  9.925000e+01   2.827565e-05   3.088651e-05   4.187468e-05   4.752686e+01 
  9.950000e+01   9.775614e-05   9.219559e-05   1.343737e-04   4.332323e+01 
  9.975000e+01   3.049659e-04   3.007827e-04   4.283391e-04   4.460432e+01 
  1.000000e+02   4.293988e-04   4.301718e-04   6.078084e-04   4.505152e+01 
  1.002500e+02   2.817711e-04   2.876797e-04   4.026842e-04   4.559447e+01 
  1.005000e+02   8.048205e-05   8.941582e-05   1.203019e-04   4.801002e+01 
  1.007500e+02   2.678119e-05   2.302577e-05   3.531880e-05   4.068808e+01 
  1.010000e+02   2.245340e-05   1.866872e-05   2.920062e-05   3.974159e+01 
  1.012500e+02   2.057542e-05   2.332633e-05   3.110411e-05   4.858549e+01 
  1.015000e+02   2.259723e-05   2.808197e-05   3.604486e-05   5.117677e+01 
  1.017500e+02   2.438191e-05   2.764853e-05   3.686351e-05   4.859248e+01 
  1.020000e+02   2.516869e-05   2.596659e-05   3.616250e-05   4.589395e+01 
  1.022500e+02   3.445928e-05   3.471255e-05   4.891220e-05   4.520978e+01 
  1.025000e+02   3.917580e-05   4.209804e-05   5.750643e-05   4.705921e+01 
  1.027500e+02   3.282992e-05   4.017710e-05   5.188452e-05   5.074669e+01 
  1.030000e+02   2.906386e-05   3.433086e-05   4.498129e-05   4.974937e+01 
  1.032500e+02   2.603596e-05   3.003268e-05   3.974711e-05   4.907730e+01 
  1.035000e+02   2.020219e-05   2.728776e-05   3.395218e-05   5.348601e+01 
  1.037500e+02   3.584969e-05   2.508273e-05   4.375321e-05   3.497909e+01 
  1.040000e+02   6.387849e-05   5.330176e-05   8.319580e-05   3.984244e+01 
  1.042500e+02   6.586038e-05   5.656882e-05   8.681948e-05   4.065995e+01 
  1.045000e+02   5.065918e-05   3.563803e-05   6.193885e-05   3.512585e+01 
  1.047500e+02   4.745099e-05   3.186015e-05   5.715475e-05   3.387871e+01 
  1.050000e+02   4.636485e-05   3.426393e-05   5.765168e-05   3.646464e+01 
  1.052500e+02   3.435157e-05   2.709739e-05   4.375270e-05   3.826727e+01 
  1.055000e+02   2.451447e-05   2.721138e-05   3.662538e-05   4.798461e+01 
  1.057500e+02   2.173303e-05   2.928057e-05   3.646472e-05   5.341595e+01 
  1.060000e+02   2.519708e-05   2.855373e-05   3.808160e-05   4.857339e+01 
  1.062500e+02   2.586860e-05   2.917150e-05   3.898923e-05   4.843414e+01 
  1.065000e+02   2.953639e-05   3.516599e-05   4.592435e-05   4.997264e+01 
  1.067500e+02   3.251548e-05   4.143287e-05   5.266820e-05   5.187606e+01 
  1.070000e+02   2.914772e-05   3.657368e-05   4.676776e-05   5.144659e+01 
  1.072500e+02   3.021452e-05   2.743441e-05   4.081133e-05   4.223906e+01 
  1.075000e+02   3.095498e-05   2.534565e-05   4.000765e-05   3.931030e+01 
  1.077500e+02   2.462422e-05   2.907680e-05   3.810265e-05   4.973979e+01 
  1.080000e+02   3.768289e-05   4.396067e-05   5.790113e-05   4.939697e+01 
  1.082500e+02   4.962136e-05   5.197621e-05   7.185963e-05   4.632777e+01 
  1.085000e+02   3.626120e-05   3.547325e-05   5.072698e-05   4.437067e+01 
  1.087500e+02   2.167409e-05   1.966057e-05   2.926268e-05   4.221118e+01 
  1.090000e+02   1.851151e-05   2.284532e-05   2.940382e-05   5.098223e+01 
  1.092500e+02   2.353626e-05   2.494479e-05   3.429575e-05   4.666417e+01 
  1.095000e+02   2.080517e-05   3.035234e-05   3.679837e-05   5.557111e+01 
  1.097500e+02   1.786534e-05   3.657501e-05   4.070506e-05   6.396645e+01 
  1.100000e+02   2.455549e-05   4.082563e-05   4.764141e-05   5.897425e+01 
  1.102500e+02   2.639421e-05   3.133388e-05   4.096909e-05   4.989076e+01 
  1.105000e+02   2.524639e-05   2.535220e-05   3.577868e-05   4.511982e+01 
  1.107500e+02   2.877505e-05   2.960386e-05   4.128428e-05   4.581337e+01 
  1.110000e+02   3.035574e-05   2.754154e-05   4.098789e-05   4.221723e+01 
  1.112500e+02   2.957902e-05   2.655144e-05   3.974792e-05   4.191255e+01 
  1.115000e+02   3.057374e-05   2.919766e-05   4.227596e-05   4.368114e+01 
  1.117500e+02   3.124752e-05   2.983458e-05   4.320313e-05   4.367488e+01 
  1.120000e+02   3.467198e-05   3.577902e-05   4.982253e-05   4.590025e+01 
  1.122500e+02   4.767177e-05   4.871904e-05   6.816261e-05   4.562249e+01 
  1.125000e+02   4.940703e-05   4.830483e-05   6.909711e-05   4.435373e+01 
  1.127500e+02   4.001204e-05   3.862579e-05   5.561399e-05   4.399008e+01 
  1.130000e+02   3.206515e-05   2.642352e-05   4.154969e-05   3.949048e+01 
  1.132500e+02   2.904329e-05   2.351413e-05   3.736879e-05   3.899444e+01 
  1.135000e+02   3.011341e-05   2.744776e-05   4.074552e-05   4.234854e+01 
  1.137500e+02   2.761282e-05   2.643754e-05   3.822841e-05   4.375435e+01 
  1.140000e+02   2.531778e-05   2.208268e-05   3.359516e-05   4.109560e+01 
  1.142500e+02   2.305412e-05   1.894230e-05   2.983795e-05   3.940805e+01 
  1.145000e+02   2.261914e-05   2.554035e-05   3.411650e-05   4.847113e+01 
  1.147500e+02   2.885840e-05   3.291732e-05   4.377621e-05   4.875916e+01 
  1.150000e+02   3.543339e-05   3.915051e-05   5.280424e-05   4.785315e+01 
  1.152500e+02   3.586323e-05   3.742312e-05   5.183301e-05   4.621935e+01 
  1.155000e+02   3.498964e-05   3.466376e-05   4.925293e-05   4.473194e+01 
  1.157500e+02   3.529633e-05   3.771747e-05   5.165693e-05   4.689923e+01 
  1.160000e+02   3.649305e-05   3.472204e-05   5.037224e-05   4.357543e+01 
  1.162500e+02   3.853983e-05   3.484640e-05   5.195758e-05   4.211880e+01 
  1.165000e+02   3.803482e-05   3.449563e-05   5.134780e-05   4.220641e+01 
  1.167500e+02   3.127696e-05   3.231708e-05   4.497379e-05   4.593703e+01 
  1.170000e+02   2.211645e-05   2.767166e-05   3.542397e-05   5.136656e+01 
  1.172500e+02   2.504661e-05   2.752505e-05   3.721507e-05   4.769915e+01 
  1.175000e+02   2.711836e-05   3.046010e-05   4.078263e-05   4.832160e+01 
  1.177500e+02   2.759060e-05   3.282687e-05   4.288174e-05   4.995334e+01 
  1.180000e+02   3.137256e-05   3.675024e-05   4.831995e-05   4.951361e+01 
  1.182500e+02   3.069789e-05   3.685179e-05   4.796264e-05   5.020538e+01 
  1.185000e+02   2.735428e-05   3.529478e-05   4.465398e-05   5.222347e+01 
  1.187500e+02   2.724107e-05   3.395928e-05   4.353514e-05   5.126451e+01 
  1.190000e+02   3.475202e-05   3.527563e-05   4.951841e-05   4.542840e+01 
  1.192500e+02   3.363290e-05   3.083586e-05   4.562919e-05   4.251572e+01 
  1.195000e+02   3.828861e-05   4.612894e-05   5.994911e-05   5.030616e+01 
  1.197500e+02   7.957996e-05   1.288009e-04   1.514023e-04   5.829005e+01 
  1.200000e+02   1.122892e-04   1.933219e-04   2.235670e-04   5.985024e+01 
  1.202500e+02   7.903505e-05   1.456667e-04   1.657267e-04   6.151687e+01 
  1.205000e+02   3.297680e-05   6.871643e-05   7.621953e-05   6.436379e+01 
  1.207500e+02   3.157549e-05   4.394189e-05   5.411008e-05   5.429996e+01 
  1.210000e+02   2.547542e-05   3.471993e-05   4.306357e-05   5.373098e+01 
  1.212500e+02   2.196073e-05   2.964683e-05   3.689456e-05   5.347100e+01 
  1.215000e+02   2.486414e-05   2.822783e-05   3.761696e-05   4.862518e+01 
  1.217500e+02   2.631468e-05   2.578931e-05   3.684495e-05   4.442229e+01 
  1.220000e+02   2.983899e-05   2.583516e-05   3.946924e-05   4.088663e+01 
  1.222500e+02   3.586871e-05   2.603533e-05   4.432158e-05   3.597405e+01 
  1.225000e+02   3.557575e-05   3.105674e-05   4.722452e-05   4.112014e+01 
  1.227500e+02   3.097287e-05   3.393408e-05   4.594389e-05   4.761216e+01 
  1.230000e+02   3.493499e-05   3.491718e-05   4.939294e-05   4.498539e+01 
  1.232500e+02   3.281954e-05   3.230297e-05   4.605002e-05   4.454552e+01 
  1.235000e+02   2.481848e-05   3.044248e-05   3.927724e-05   5.081108e+01 
  1.237500e+02   2.770576e-05   2.882337e-05   3.997994e-05   4.613262e+01 
  1.240000e+02   2.696786e-05   3.079744e-05   4.093590e-05   4.879290e+01 
  1.242500e+02   3.099324e-05   3.192338e-05   4.449363e-05   4.584698e+01 
  1.245000e+02   3.395752e-05   3.451587e-05   4.841961e-05   4.546719e+01 
  1.247500e+02   3.338647e-05   3.720280e-05   4.998705e-05   4.809461e+01 
  1.250000e+02   3.443926e-05   3.055466e-05   4.603965e-05   4.157958e+01 
  1.252500e+02   3.004255e-05   2.601084e-05   3.973812e-05   4.088601e+01 
  1.255000e+02   2.392441e-05   2.855941e-05   3.725610e-05   5.004686e+01 
  1.257500e+02   2.737763e-05   2.450571e-05   3.674322e-05   4.183171e+01 
  1.260000e+02   2.832462e-05   2.053614e-05   3.498596e-05   3.594315e+01 
  1.262500e+02   2.816038e-05   2.502324e-05   3.767187e-05   4.162421e+01 
  1.265000e+02   2.782548e-05   3.163790e-05   4.213329e-05   4.866842e+01 
  1.267500e+02   2.646120e-05   3.116671e-05   4.088470e-05   4.966803e+01 
  1.270000e+02   3.117727e-05   2.615098e-05   4.069271e-05   3.998936e+01 
  1.272500e+02   3.403887e-05   2.324294e-05   4.121745e-05   3.432664e+01 
  1.275000e+02   2.908708e-05   2.901985e-05   4.108783e-05   4.493371e+01 
  1.277500e+02   2.623226e-05   3.254511e-05   4.180091e-05   5.113023e+01 
  1.280000e+02   2.794464e-05   2.744319e-05   3.916672e-05   4.448129e+01 
  1.282500e+02   3.208024e-05   2.480198e-05   4.054972e-05   3.770844e+01 
  1.285000e+02   2.779980e-05   2.484168e-05   3.728186e-05   4.178372e+01 
  1.287500e+02   2.374228e-05   2.461638e-05   3.420032e-05   4.603553e+01 
  1.290000e+02   2.490294e-05   2.575781e-05   3.582766e-05   4.596674e+01 
  1.292500e+02   3.057534e-05   3.215075e-05   4.436803e-05   4.643872e+01 
  1.295000e+02   3.266938e-05   3.015751e-05   4.446082e-05   4.271049e+01 
  1.297500e+02   3.135555e-05   2.498261e-05   4.009116e-05   3.854617e+01 
  1.300000e+02   2.452786e-05   2.932607e-05   3.823132e-05   5.009142e+01 
  1.302500e+02   2.527166e-05   3.132407e-05   4.024741e-05   5.110407e+01 
  1.305000e+02   2.960639e-05   3.191426e-05   4.353227e-05   4.714838e+01 
  1.307500e+02   3.385523e-05   2.649989e-05   4.299326e-05   3.805175e+01 
  1.310000e+02   3.471218e-05   3.048782e-05   4.620003e-05   4.129295e+01 
  1.312500e+02   3.518270e-05   3.600560e-05   5.034110e-05   4.566228e+01 
  1.315000e+02   3.695898e-05   4.042873e-05   5.477634e-05   4.756719e+01 
  1.317500e+02   3.287154e-05   3.828110e-05   5.045771e-05   4.934769e+01 
  1.320000e+02   2.859293e-05   3.442555e-05   4.475125e-05   5.028790e+01 
  1.322500e+02   3.198258e-05   3.807460e-05   4.972485e-05   4.996981e+01 
  1.325000e+02   3.609018e-05   3.454407e-05   4.995793e-05   4.374606e+01 
  1.327500e+02   3.064548e-05   2.772662e-05   4.132688e-05   4.213735e+01 
  1.330000e+02   2.730799e-05   2.966104e-05   4.031754e-05   4.736519e+01 
  1.332500e+02   3.196312e-05   3.496546e-05   4.737324e-05   4.756850e+01 
  1.335000e+02   4.216223e-05   3.554104e-05   5.514363e-05   4.012952e+01 
  1.337500e+02   4.157236e-05   2.848124e-05   5.039287e-05   3.441506e+01 
  1.340000e+02   3.623867e-05   2.652624e-05   4.490972e-05   3.620365e+01 
  1.342500e+02   2.989650e-05   3.564576e-05   4.652334e-05   5.001307e+01 
  1.345000e+02   2.696253e-05   3.811050e-05   4.668392e-05   5.472124e+01 
  1.347500e+02   3.403748e-05   3.199220e-05   4.671243e-05   4.322582e+01 
  1.350000e+02   3.751605e-05   3.208380e-05   4.936420e-05   4.053712e+01 
  1.352500e+02   3.599362e-05   3.292917e-05   4.878392e-05   4.245418e+01 
  1.355000e+02   2.979102e-05   2.850851e-05   4.123397e-05   4.373977e+01 
  1.357500e+02   3.075815e-05   2.337278e-05   3.863096e-05   3.723080e+01 
  1.360000e+02   4.280619e-05   3.760153e-05   5.697583e-05   4.129650e+01 
  1.362500e+02   4.740367e-05   6.532457e-05   8.071188e-05   5.403297e+01 
  1.365000e+02   4.473373e-05   6.971107e-05   8.282958e-05   5.731163e+01 
  1.367500e+02   3.384520e-05   4.929130e-05   5.979239e-05   5.552509e+01 
  1.370000e+02   3.722220e-05   4.692826e-05   5.989787e-05   5.157952e+01 
  1.372500e+02   4.344076e-05   4.358660e-05   6.153772e-05   4.509602e+01 
  1.375000e+02   4.091602e-05   3.773097e-05   5.565740e-05   4.268090e+01 
  1.377500e+02   3.982917e-05   4.269270e-05   5.838689e-05   4.698738e+01 
  1.380000e+02   4.201852e-05   4.690905e-05   6.297631e-05   4.814778e+01 
  1.382500e+02   4.055860e-05   4.586632e-05   6.122679e-05   4.851436e+01 
  1.385000e+02   3.310386e-05   4.309199e-05   5.433954e-05   5.246803e+01 
  1.387500e+02   2.553166e-05   4.359239e-05   5.051893e-05   5.964289e+01 
  1.390000e+02   3.107497e-05   3.762293e-05   4.879691e-05   5.044471e+01 
  1.392500e+02   3.876004e-05   3.149993e-05   4.994583e-05   3.910045e+01 
  1.395000e+02   4.220793e-05   4.192493e-05   5.949126e-05   4.480727e+01 
  1.397500e+02   4.794565e-05   5.345640e-05   7.180788e-05   4.811071e+01 
  1.400000e+02   4.874305e-05   5.340594e-05   7.230546e-05   4.761361e+01 
  1.402500e+02   4.355264e-05   4.776027e-05   6.463649e-05   4.763828e+01 
  1.405000e+02   4.081525e-05   4.515985e-05   6.087115e-05   4.789288e+01 
  1.407500e+02   3.592874e-05   4.568605e-05   5.812134e-05   5.181754e+01 
  1.410000e+02   3.287027e-05   5.426875e-05   6.344724e-05   5.879695e+01 
  1.412500e+02   3.653271e-05   5.489297e-05   6.593843e-05   5.635519e+01 
  1.415000e+02   3.834429e-05   4.563495e-05   5.960565e-05   4.996170e+01 
  1.417500e+02   3.879163e-05   4.392513e-05   5.860211e-05   4.855129e+01 
  1.420000e+02   4.051672e-05   4.351983e-05   5.946074e-05   4.704663e+01 
  1.422500e+02   3.935496e-05   4.348430e-05   5.864893e-05   4.785369e+01 
  1.425000e+02   4.421755e-05   4.935909e-05   6.626848e-05   4.814493e+01 
  1.427500e+02   4.722648e-05   4.802418e-05   6.735475e-05   4.547982e+01 
  1.430000e+02   3.979255e-05   4.515823e-05   6.018897e-05   4.861412e+01 
  1.432500e+02   3.524550e-05   4.608890e-05   5.802096e-05   5.259381e+01 
  1.435000e+02   4.279693e-05   4.063290e-05   5.901364e-05   4.351418e+01 
  1.437500e+02   4.228922e-05   3.629322e-05   5.572769e-05   4.063666e+01 
  1.440000e+02   3.460236e-05   3.780052e-05   5.124649e-05   4.752921e+01 
  1.442500e+02   3.408000e-05   4.427156e-05   5.586965e-05   5.241113e+01 
  1.445000e+02   3.625079e-05   5.226574e-05   6.360681e-05   5.525536e+01 
  1.447500e+02   3.508557e-05   5.162190e-05   6.241649e-05   5.579744e+01 
  1.450000e+02   3.304126e-05   4.066009e-05   5.239244e-05   5.090194e+01 
  1.452500e+02   3.766633e-05   3.843656e-05   5.381562e-05   4.557986e+01 
  1.455000e+02   3.833536e-05   4.995731e-05   6.297089e-05   5.249872e+01 
  1.457500e+02   3.697434e-05   5.397138e-05   6.542180e-05   5.558600e+01 
  1.460000e+02   3.970097e-05   5.585960e-05   6.853074e-05   5.459753e+01 
  1.462500e+02   3.926949e-05   4.986967e-05   6.347501e-05   5.178160e+01 
  1.465000e+02   4.353291e-05   4.141994e-05   6.008931e-05   4.357522e+01 
  1.467500e+02   3.707566e-05   4.291553e-05   5.671285e-05   4.917554e+01 
  1.470000e+02   3.536181e-05   4.679000e-05   5.864948e-05   5.291962e+01 
  1.472500e+02   4.523040e-05   4.021419e-05   6.052248e-05   4.164019e+01 
  1.475000e+02   4.240422e-05   3.575531e-05   5.546675e-05   4.013764e+01 
  1.477500e+02   4.439789e-05   3.372510e-05   5.575442e-05   3.722068e+01 
  1.480000e+02   5.231357e-05   3.303269e-05   6.186977e-05   3.226980e+01 
  1.482500e+02   5.138660e-05   4.443274e-05   6.793270e-05   4.084917e+01 
  1.485000e+02   3.862158e-05   5.043732e-05   6.352598e-05   5.255748e+01 
  1.487500e+02   3.257558e-05   4.695874e-05   5.715148e-05   5.525071e+01 
  1.490000e+02   3.775025e-05   4.968746e-05   6.240132e-05   5.277409e+01 
  1.492500e+02   5.302543e-05   4.543410e-05   6.982803e-05   4.059116e+01 
  1.495000e+02   5.518366e-05   4.408525e-05   7.063105e-05   3.862074e+01 
  1.497500e+02   4.109455e-05   4.943322e-05   6.428378e-05   5.026276e+01 
  1.500000e+02   3.557065e-05   5.008247e-05   6.142903e-05   5.461604e+01 
  1.502500e+02   4.480809e-05   5.326789e-05   6.960770e-05   4.993000e+01 
  1.505000e+02   4.478968e-05   5.335533e-05   6.966280e-05   4.998787e+01 
  1.507500e+02   4.843529e-05   4.936325e-05   6.915712e-05   4.554363e+01 
  1.510000e+02   5.691184e-05   4.858213e-05   7.482768e-05   4.048534e+01 
  1.512500e+02   5.457850e-05   4.771399e-05   7.249440e-05   4.116083e+01 
  1.515000e+02   4.743839e-05   5.198145e-05   7.037380e-05   4.761635e+01 
  1.517500e+02   4.447109e-05   4.810101e-05   6.550866e-05   4.724551e+01 
  1.520000e+02   4.216400e-05   4.017604e-05   5.824016e-05   4.361695e+01 
  1.522500e+02   3.558393e-05   4.435693e-05   5.686609e-05   5.126278e+01 
  1.525000e+02   3.558522e-05   4.649863e-05   5.855280e-05   5.257331e+01 
  1.527500e+02   4.400433e-05   4.802960e-05   6.514003e-05   4.750433e+01 
  1.530000e+02   4.725049e-05   4.783780e-05   6.723886e-05   4.535388e+01 
  1.532500e+02   5.058769e-05   5.267049e-05   7.302941e-05   4.615554e+01 
  1.535000e+02   5.287981e-05   5.265046e-05   7.462135e-05   4.487548e+01 
  1.537500e+02   4.725638e-05   4.971735e-05   6.859286e-05   4.645372e+01 
  1.540000e+02   4.176410e-05   4.944874e-05   6.472571e-05   4.981577e+01 
  1.542500e+02   5.361057e-05   5.286207e-05   7.528938e-05   4.459721e+01 
  1.545000e+02   5.787604e-05   6.064975e-05   8.383334e-05   4.634057e+01 
  1.547500e+02   6.123279e-05   6.601419e-05   9.004070e-05   4.715192e+01 
  1.550000e+02   6.304029e-05   7.399933e-05   9.721100e-05   4.957220e+01 
  1.552500e+02   6.413263e-05   7.074777e-05   9.548949e-05   4.780779e+01 
  1.555000e+02   5.964314e-05   5.891895e-05   8.383763e-05   4.465003e+01 
  1.557500e+02   5.722071e-05   5.445757e-05   7.899263e-05   4.358268e+01 
  1.560000e+02   6.277629e-05   5.738820e-05   8.505450e-05   4.243262e+01 
  1.562500e+02   5.828856e-05   6.492993e-05   8.725510e-05   4.808521e+01 
  1.565000e+02   5.855276e-05   6.208615e-05   8.534118e-05   4.667766e+01 
  1.567500e+02   6.128685e-05   5.540645e-05   8.261933e-05   4.211519e+01 
  1.570000e+02   6.578251e-05   5.929556e-05   8.856242e-05   4.203112e+01 
  1.572500e+02   6.065851e-05   6.439450e-05   8.846528e-05   4.671122e+01 
  1.575000e+02   7.679703e-05   7.011785e-05   1.039918e-04   4.239696e+01 
  1.577500e+02   8.238196e-05   6.937528e-05   1.077020e-04   4.010131e+01 
  1.580000e+02   5.692299e-05   6.747498e-05   8.827853e-05   4.984847e+01 
  1.582500e+02   4.685593e-05   7.976797e-05   9.251166e-05   5.956990e+01 
  1.585000e+02   5.658696e-05   9.290149e-05   1.087785e-04   5.865410e+01 
  1.587500e+02   6.438773e-05   7.560760e-05   9.930906e-05   4.958215e+01 
  1.590000e+02   7.380766e-05   4.218813e-05   8.501417e-05   2.975209e+01 
  1.592500e+02   7.230507e-05   5.351479e-05   8.995474e-05   3.650607e+01 
  1.595000e+02   5.669582e-05   6.413894e-05   8.560502e-05   4.852482e+01 
  1.597500e+02   5.333295e-05   6.177570e-05   8.161275e-05   4.919489e+01 
  1.600000e+02   6.112899e-05   5.874413e-05   8.477987e-05   4.386025e+01 
  1.602500e+02   5.966124e-05   6.066374e-05   8.508556e-05   4.547735e+01 
  1.605000e+02   5.175867e-05   7.438019e-05   9.061662e-05   5.516724e+01 
  1.607500e+02   5.731999e-05   7.393148e-05   9.354916e-05   5.221313e+01 
  1.610000e+02   5.907926e-05   7.971475e-05   9.922097e-05   5.345662e+01 
  1.612500e+02   4.867431e-05   8.351335e-05   9.666265e-05   5.976497e+01 
  1.615000e+02   5.087822e-05   7.454225e-05   9.025043e-05   5.568482e+01 
  1.617500e+02   6.457065e-05   5.863946e-05   8.722359e-05   4.224398e+01 
  1.620000e+02   6.586274e-05   5.434669e-05   8.539006e-05   3.952777e+01 
  1.622500e+02   6.161236e-05   5.898126e-05   8.529286e-05   4.375012e+01 
  1.625000e+02   7.169174e-05   6.288474e-05   9.536350e-05   4.125577e+01 
  1.627500e+02   7.220104e-05   7.709608e-05   1.056257e-04   4.687790e+01 
  1.630000e+02   6.295479e-05   7.801920e-05   1.002512e-04   5.109945e+01 
  1.632500e+02   6.086527e-05   6.912967e-05   9.210587e-05   4.863766e+01 
  1.635000e+02   6.004495e-05   6.607810e-05   8.928444e-05   4.773868e+01 
  1.637500e+02   5.622226e-05   5.727433e-05   8.025765e-05   4.553109e+01 
  1.640000e+02   5.837268e-05   5.466292e-05   7.997127e-05   4.312026e+01 
  1.642500e+02   7.082576e-05   5.237061e-05   8.808501e-05   3.648029e+01 
  1.645000e+02   6.689048e-05   5.050707e-05   8.381706e-05   3.705540e+01 
  1.647500e+02   4.953507e-05   4.611205e-05   6.767602e-05   4.295037e+01 
  1.650000e+02   4.382066e-05   4.526756e-05   6.300319e-05   4.593047e+01 
  1.652500e+02   5.084930e-05   5.346431e-05   7.378404e-05   4.643602e+01 
  1.655000e+02   4.841398e-05   6.068994e-05   7.763493e-05   5.141970e+01 
  1.657500e+02   4.850666e-05   6.219286e-05   7.887236e-05   5.204793e+01 
  1.660000e+02   4.887077e-05   6.636829e-05   8.242028e-05   5.363365e+01 
  1.662500e+02   5.529104e-05   6.535526e-05   8.560613e-05   4.976853e+01 
  1.665000e+02   5.675896e-05   5.243354e-05   7.727131e-05   4.273154e+01 
  1.667500e+02   5.156428e-05   6.271579e-05   8.119203e-05   5.057330e+01 
  1.670000e+02   5.436902e-05   7.009603e-05   8.870989e-05   5.220155e+01 
  1.672500e+02   5.415269e-05   7.473896e-05   9.229533e-05   5.407450e+01 
  1.675000e+02   5.209487e-05   7.859348e-05   9.429110e-05   5.646200e+01 
  1.677500e+02   4.816209e-05   6.790615e-05   8.325162e-05   5.465402e+01 
  1.680000e+02   5.152541e-05   6.238720e-05   8.091372e-05   5.044679e+01 
  1.682500e+02   5.271551e-05   6.225326e-05   8.157447e-05   4.974237e+01 
  1.685000e+02   4.433554e-05   4.243524e-05   6.137092e-05   4.374541e+01 
  1.687500e+02   4.954472e-05   3.656023e-05   6.157377e-05   3.642450e+01 
  1.690000e+02   5.685352e-05   3.969016e-05   6.933708e-05   3.491937e+01 
  1.692500e+02   5.238708e-05   5.388695e-05   7.515457e-05   4.580857e+01 
  1.695000e+02   4.205806e-05   6.303043e-05   7.577411e-05   5.628616e+01 
  1.697500e+02   4.641309e-05   5.252780e-05   7.009525e-05   4.853647e+01 
  1.700000e+02   5.914435e-05   3.697013e-05   6.974844e-05   3.200880e+01 
  1.702500e+02   5.699247e-05   3.845404e-05   6.875212e-05   3.400838e+01 
  1.705000e+02   5.833218e-05   3.717393e-05   6.917040e-05   3.250854e+01 
  1.707500e+02   5.627173e-05   4.206984e-05   7.025937e-05   3.678250e+01 
  1.710000e+02   4.523674e-05   4.771194e-05   6.574794e-05   4.652541e+01 
  1.712500e+02   4.561490e-05   5.290376e-05   6.985361e-05   4.923129e+01 
  1.715000e+02   5.795736e-05   5.487338e-05   7.981317e-05   4.343433e+01 
  1.717500e+02   6.770440e-05   5.183006e-05   8.526571e-05   3.743531e+01 
  1.720000e+02   5.938608e-05   5.397388e-05   8.024890e-05   4.226657e+01 
  1.722500e+02   5.402475e-05   5.803799e-05   7.929112e-05   4.705102e+01 
  1.725000e+02   5.558027e-05   6.976185e-05   8.919575e-05   5.145516e+01 
  1.727500e+02   5.484488e-05   6.590493e-05   8.574043e-05   5.023338e+01 
  1.730000e+02   6.662933e-05   5.000033e-05   8.330367e-05   3.688548e+01 
  1.732500e+02   7.389202e-05   5.760443e-05   9.369259e-05   3.793912e+01 
  1.735000e+02   6.972166e-05   6.071918e-05   9.245501e-05   4.105194e+01 
  1.737500e+02   6.654205e-05   5.333061e-05   8.527601e-05   3.871068e+01 
  1.740000e+02   6.588103e-05   5.690275e-05   8.705305e-05   4.081782e+01 
  1.742500e+02   6.386955e-05   5.731287e-05   8.581424e-05   4.190298e+01 
  1.745000e+02   6.120573e-05   6.296636e-05   8.781175e-05   4.581233e+01 
  1.747500e+02   7.445699e-05   6.856120e-05   1.012150e-04   4.263937e+01 
  1.750000e+02   9.332454e-05   6.729844e-05   1.150589e-04   3.579622e+01 
  1.752500e+02   8.335704e-05   7.177886e-05   1.100027e-04   4.073178e+01 
  1.755000e+02   6.430272e-05   8.436307e-05   1.060753e-04   5.268484e+01 
  1.757500e+02   6.889873e-05   7.748205e-05   1.036846e-04   4.835580e+01 
  1.760000e+02   6.989713e-05   7.251893e-05   1.007204e-04   4.605466e+01 
  1.762500e+02   7.616558e-05   8.535010e-05   1.143933e-04   4.825459e+01 
  1.765000e+02   8.283777e-05   9.030856e-05   1.225469e-04   4.747062e+01 
  1.767500e+02   7.341601e-05   8.167082e-05   1.098182e-04   4.804681e+01 
  1.770000e+02   7.408219e-05   8.477962e-05   1.125866e-04   4.885236e+01 
  1.772500e+02   8.490450e-05   9.213035e-05   1.252868e-04   4.733728e+01 
  1.775000e+02   1.038824e-04   1.120710e-04   1.528118e-04   4.717152e+01 
  1.777500e+02   1.589265e-04   1.739254e-04   2.356006e-04   4.758010e+01 
  1.780000e+02   1.966977e-04   2.111431e-04   2.885678e-04   4.702852e+01 
  1.782500e+02   1.718628e-04   1.881183e-04   2.548045e-04   4.758551e+01 
  1.785000e+02   1.319133e-04   1.435905e-04   1.949855e-04   4.742702e+01 
  1.787500e+02   9.978312e-05   1.230001e-04   1.583847e-04   5.094951e+01 
  1.790000e+02   8.432101e-05   9.087087e-05   1.239659e-04   4.714111e+01 
  1.792500e+02   7.291856e-05   7.069225e-05   1.015604e-04   4.411185e+01 
  1.795000e+02   6.814599e-05   6.964913e-05   9.744166e-05   4.562498e+01 
  1.797500e+02   6.509305e-05   6.133722e-05   8.943913e-05   4.329843e+01 
  1.800000e+02   7.147180e-05   5.956439e-05   9.303836e-05   3.980772e+01 
  1.802500e+02   7.477292e-05   6.022337e-05   9.600961e-05   3.884855e+01 
  1.805000e+02   7.576564e-05   5.480031e-05   9.350672e-05   3.587773e+01 
  1.807500e+02   7.572424e-05   3.842729e-05   8.491653e-05   2.690613e+01 
  1.810000e+02   6.884490e-05   3.495725e-05   7.721159e-05   2.692001e+01 
  1.812500e+02   6.160440e-05   4.980925e-05   7.922161e-05   3.895671e+01 
  1.815000e+02   5.412854e-05   6.339589e-05   8.336029e-05   4.950871e+01 
  1.817500e+02   5.381679e-05   6.443131e-05   8.395022e-05   5.012939e+01 
  1.820000e+02   6.018334e-05   6.011800e-05   8.506591e-05   4.496888e+01 
  1.822500e+02   6.568791e-05   6.354623e-05   9.139488e-05   4.405058e+01 
  1.825000e+02   6.645199e-05   7.264281e-05   9.845225e-05   4.754843e+01 
  1.827500e+02   5.978275e-05   6.358272e-05   8.727393e-05   4.676429e+01 
  1.830000e+02   5.216243e-05   4.495976e-05   6.886435e-05   4.075865e+01 
  1.832500e+02   4.850176e-05   4.482531e-05   6.604339e-05   4.274410e+01 
  1.835000e+02   5.597960e-05   4.764406e-05   7.350968e-05   4.040100e+01 
  1.837500e+02   5.949573e-05   4.718634e-05   7.593611e-05   3.841809e+01 
  1.840000e+02   7.465614e-05   5.155998e-05   9.073022e-05   3.463023e+01 
  1.842500e+02   7.867877e-05   6.146660e-05   9.984233e-05   3.799819e+01 
  1.845000e+02   6.967795e-05   7.102155e-05   9.949411e-05   4.554712e+01 
  1.847500e+02   6.476173e-05   8.292851e-05   1.052199e-04   5.201249e+01 
  1.850000e+02   5.899892e-05   7.496930e-05   9.540057e-05   5.179816e+01 
  1.852500e+02   5.377427e-05   5.751052e-05   7.873457e-05   4.692291e+01 
  1.855000e+02   4.651169e-05   5.208293e-05   6.982814e-05   4.823415e+01 
  1.857500e+02   3.621590e-05   5.583083e-05   6.654827e-05   5.702965e+01 
  1.860000e+02   3.323764e-05   5.330006e-05   6.281430e-05   5.805255e+01 
  1.862500e+02   4.377434e-05   4.989108e-05   6.637254e-05   4.873634e+01 
  1.865000e+02   5.129332e-05   4.273534e-05   6.676312e-05   3.979958e+01 
  1.867500e+02   4.983786e-05   4.050322e-05   6.422089e-05   3.910075e+01 
  1.870000e+02   5.412988e-05   3.755761e-05   6.588336e-05   3.475455e+01 
  1.872500e+02   6.450001e-05   3.485197e-05   7.331379e-05   2.838415e+01 
  1.875000e+02   6.046551e-05   5.479227e-05   8.159823e-05   4.218205e+01 
  1.877500e+02   6.187653e-05   7.396951e-05   9.643751e-05   5.008704e+01 
  1.880000e+02   7.440154e-05   7.811816e-05   1.078797e-04   4.639591e+01 
  1.882500e+02   7.012068e-05   7.119730e-05   9.992980e-05   4.543649e+01 
  1.885000e+02   7.272495e-05   5.195846e-05   8.937897e-05   3.554397e+01 
  1.887500e+02   8.157809e-05   4.464660e-05   9.299626e-05   2.869130e+01 
  1.890000e+02   6.606770e-05   5.720711e-05   8.739333e-05   4.088883e+01 
  1.892500e+02   5.717975e-05   5.947051e-05   8.250010e-05   4.612502e+01 
  1.895000e+02   6.289752e-05   5.039846e-05   8.059840e-05   3.870446e+01 
  1.897500e+02   6.175006e-05   5.299492e-05   8.137280e-05   4.063673e+01 
  1.900000e+02   5.688773e-05   6.954368e-05   8.984730e-05   5.071634e+01 
  1.902500e+02   6.209916e-05   8.835857e-05   1.079979e-04   5.490012e+01 
  1.905000e+02   6.801082e-05   8.631365e-05   1.098887e-04   5.176366e+01 
  1.907500e+02   7.989364e-05   7.926700e-05   1.125444e-04   4.477441e+01 
  1.910000e+02   8.113420e-05   7.460631e-05   1.102219e-04   4.259984e+01 
  1.912500e+02   6.597983e-05   6.639364e-05   9.360264e-05   4.517911e+01 
  1.915000e+02   6.881931e-05   7.127246e-05   9.907503e-05   4.600320e+01 
  1.917500e+02   6.864496e-05   7.631520e-05   1.026457e-04   4.802885e+01 
  1.920000e+02   6.937078e-05   8.334910e-05   1.084407e-04   5.022966e+01 
  1.922500e+02   7.167033e-05   9.042991e-05   1.153872e-04   5.160137e+01 
  1.925000e+02   7.667361e-05   7.662152e-05   1.083960e-04   4.498053e+01 
  1.927500e+02   7.750592e-05   5.832038e-05   9.699709e-05   3.696012e+01 
  1.930000e+02   7.777907e-05   5.726122e-05   9.658380e-05   3.636063e+01 
  1.932500e+02   8.237496e-05   5.131967e-05   9.705329e-05   3.192294e+01 
  1.935000e+02   6.279886e-05   4.752297e-05   7.875360e-05   3.711657e+01 
  1.937500e+02   6.766340e-05   5.062457e-05   8.450552e-05   3.680319e+01 
  1.940000e+02   8.707993e-05   4.933304e-05   1.000833e-04   2.953268e+01 
  1.942500e+02   8.360692e-05   6.620838e-05   1.066474e-04   3.837572e+01 
  1.945000e+02   6.801481e-05   7.925361e-05   1.044373e-04   4.936407e+01 
  1.947500e+02   6.957557e-05   8.458166e-05   1.095208e-04   5.055981e+01 
  1.950000e+02   8.163211e-05   7.933552e-05   1.138329e-04   4.418259e+01 
  1.952500e+02   7.205976e-05   6.790763e-05   9.901542e-05   4.330082e+01 
  1.955000e+02   6.852741e-05   6.250740e-05   9.275333e-05   4.236956e+01 
  1.957500e+02   6.418355e-05   6.515798e-05   9.146087e-05   4.543164e+01 
  1.960000e+02   6.187371e-05   7.773133e-05   9.935047e-05   5.148040e+01 
  1.962500e+02   6.578126e-05   9.200827e-05   1.131048e-04   5.443715e+01 
  1.965000e+02   6.464254e-05   9.226754e-05   1.126586e-04   5.498495e+01 
  1.967500e+02   6.220376e-05   8.255727e-05   1.033683e-04   5.300336e+01 
  1.970000e+02   5.862894e-05   6.703068e-05   8.905315e-05   4.882517e+01 
  1.972500e+02   6.927584e-05   6.046271e-05   9.195043e-05   4.111387e+01 
  1.975000e+02   7.337732e-05   6.727711e-05   9.955119e-05   4.251662e+01 
  1.977500e+02   7.343255e-05   7.245470e-05   1.031602e-04   4.461596e+01 
  1.980000e+02   6.736619e-05   7.098049e-05   9.785925e-05   4.649651e+01 
  1.982500e+02   4.884260e-05   7.161765e-05   8.668729e-05   5.570635e+01 
  1.985000e+02   4.826904e-05   7.491666e-05   8.912018e-05   5.720619e+01 
  1.987500e+02   6.159340e-05   7.221281e-05   9.491279e-05   4.953772e+01 
  1.990000e+02   6.765357e-05   7.125533e-05   9.825644e-05   4.648528e+01 
  1.992500e+02   7.229569e-05   7.764714e-05   1.060931e-04   4.704401e+01 
  1.995000e+02   8.434054e-05   8.559495e-05   1.201658e-04   4.542293e+01 
  1.997500e+02   1.322216e-04   1.262116e-04   1.827893e-04   4.366780e+01 
  2.000000e+02   1.523552e-04   1.588420e-04   2.200975e-04   4.619414e+01 
