  1.000000e+01   3.897686e-01  -7.220974e-03  -8.182373e+00  -1.061358e+00 
  1.097762e+01   3.864437e-01  -2.472931e-02  -8.240528e+00  -3.661480e+00 
  1.205081e+01   3.814884e-01  -4.604542e-03  -8.369741e+00  -6.915231e-01 
  1.322892e+01   3.777938e-01  -1.726151e-02  -8.445846e+00  -2.616042e+00 
  1.452220e+01   3.932530e-01  -2.191867e-02  -8.093087e+00  -3.190182e+00 
  1.594191e+01   3.846185e-01  -2.843935e-02  -8.275716e+00  -4.228852e+00 
  1.750042e+01   3.844586e-01  -3.944416e-02  -8.257534e+00  -5.857859e+00 
  1.921129e+01   3.988954e-01  -4.872787e-02  -7.918491e+00  -6.964575e+00 
  2.108942e+01   3.852221e-01  -4.472034e-02  -8.227638e+00  -6.621813e+00 
  2.315116e+01   3.792499e-01  -5.974377e-02  -8.315030e+00  -8.952314e+00 
  2.541446e+01   3.749750e-01  -4.943511e-02  -8.445118e+00  -7.510320e+00 
  2.789902e+01   3.876512e-01  -6.580799e-02  -8.107788e+00  -9.634725e+00 
  3.062647e+01   3.761613e-01  -7.227002e-02  -8.335098e+00  -1.087544e+01 
  3.362057e+01   3.744855e-01  -7.109018e-02  -8.377546e+00  -1.074880e+01 
  3.690737e+01   3.699283e-01  -7.823717e-02  -8.447612e+00  -1.194167e+01 
  4.051550e+01   3.618590e-01  -8.362603e-02  -8.603247e+00  -1.301267e+01 
  4.447636e+01   3.525321e-01  -8.599128e-02  -8.805019e+00  -1.370816e+01 
  4.882445e+01   3.469385e-01  -8.998623e-02  -8.912191e+00  -1.454052e+01 
  5.359761e+01   3.353346e-01  -9.134074e-02  -9.179605e+00  -1.523696e+01 
  5.883741e+01   3.299263e-01  -9.976809e-02  -9.251651e+00  -1.682506e+01 
  6.458945e+01   3.206694e-01  -9.865742e-02  -9.486075e+00  -1.710108e+01 
  7.090383e+01   3.067450e-01  -9.862743e-02  -9.837195e+00  -1.782410e+01 
  7.783551e+01   2.992093e-01  -9.547850e-02  -1.005937e+01  -1.769803e+01 
  8.544484e+01   2.911714e-01  -9.281334e-02  -1.029676e+01  -1.768012e+01 
  9.379807e+01   2.813272e-01  -9.505018e-02  -1.054632e+01  -1.866823e+01 
  1.029679e+02   2.737674e-01  -9.264072e-02  -1.078153e+01  -1.869541e+01 
  1.130343e+02   2.655685e-01  -8.736022e-02  -1.107024e+01  -1.820890e+01 
  1.240847e+02   2.590572e-01  -8.172818e-02  -1.132002e+01  -1.750961e+01 
  1.362154e+02   2.506522e-01  -7.655451e-02  -1.163125e+01  -1.698378e+01 
  1.495321e+02   2.474508e-01  -7.181470e-02  -1.177902e+01  -1.618369e+01 
  1.641506e+02   2.400781e-01  -6.478073e-02  -1.208772e+01  -1.510060e+01 
  1.801982e+02   2.418541e-01  -6.514604e-02  -1.202474e+01  -1.507544e+01 
  1.978147e+02   2.342744e-01  -5.560580e-02  -1.236748e+01  -1.335226e+01 
  2.171534e+02   2.303063e-01  -5.609636e-02  -1.250358e+01  -1.368914e+01 
  2.383827e+02   2.247920e-01  -4.646022e-02  -1.278272e+01  -1.167752e+01 
  2.616874e+02   2.245646e-01  -4.358657e-02  -1.281257e+01  -1.098417e+01 
  2.872704e+02   2.192930e-01  -3.936549e-02  -1.304176e+01  -1.017683e+01 
  3.153545e+02   2.170259e-01  -3.420470e-02  -1.316321e+01  -8.956514e+00 
  3.461841e+02   2.169792e-01  -2.905031e-02  -1.319448e+01  -7.625709e+00 
  3.800276e+02   2.101511e-01  -2.783623e-02  -1.347383e+01  -7.545372e+00 
  4.171797e+02   2.064069e-01  -2.358932e-02  -1.364916e+01  -6.519791e+00 
  4.579640e+02   2.063703e-01  -1.900019e-02  -1.367040e+01  -5.260303e+00 
  5.027353e+02   2.072479e-01  -1.500805e-02  -1.364748e+01  -4.141898e+00 
  5.518835e+02   2.099013e-01  -1.781912e-02  -1.352851e+01  -4.852368e+00 
  6.058367e+02   2.101420e-01  -1.504120e-02  -1.352755e+01  -4.094040e+00 
  6.650643e+02   2.104865e-01  -1.366715e-02  -1.351724e+01  -3.715070e+00 
  7.300821e+02   2.103148e-01  -1.216016e-02  -1.352811e+01  -3.309092e+00 
  8.014562e+02   2.127489e-01  -9.475054e-03  -1.343405e+01  -2.550058e+00 
  8.798079e+02   2.100490e-01  -9.179932e-03  -1.354530e+01  -2.502449e+00 
  9.658195e+02   2.127176e-01  -5.187094e-03  -1.344135e+01  -1.396874e+00 
  1.060240e+03   2.117390e-01  -5.337062e-03  -1.348122e+01  -1.443883e+00 
  1.163890e+03   2.106550e-01  -3.589417e-03  -1.352730e+01  -9.761862e-01 
  1.277674e+03   2.153836e-01  -1.716547e-03  -1.333547e+01  -4.566218e-01 
  1.402582e+03   2.139833e-01  -1.910400e-03  -1.339206e+01  -5.115116e-01 
  1.539701e+03   2.151901e-01  -1.413821e-04  -1.334355e+01  -3.764390e-02 
  1.690225e+03   2.124896e-01   6.480343e-05  -1.345324e+01   1.747362e-02 
  1.855464e+03   2.128356e-01   2.268784e-03  -1.343862e+01   6.107382e-01 
  2.036857e+03   2.191696e-01   5.717533e-03  -1.318144e+01   1.494351e+00 
  2.235984e+03   2.213222e-01   6.253399e-03  -1.309604e+01   1.618446e+00 
  2.454577e+03   2.228432e-01   8.330354e-03  -1.303395e+01   2.140842e+00 
  2.694541e+03   2.220781e-01   8.703574e-03  -1.306322e+01   2.244359e+00 
  2.957964e+03   2.246148e-01   1.123173e-02  -1.296039e+01   2.862657e+00 
  3.247140e+03   2.259981e-01   1.130416e-02  -1.290705e+01   2.863481e+00 
  3.564586e+03   2.296635e-01   1.219815e-02  -1.276593e+01   3.040303e+00 
  3.913066e+03   2.307223e-01   1.283651e-02  -1.272479e+01   3.184438e+00 
  4.295614e+03   2.330673e-01   1.244627e-02  -1.263800e+01   3.056808e+00 
  4.715561e+03   2.347414e-01   1.233643e-02  -1.257623e+01   3.008315e+00 
  5.176562e+03   2.417785e-01   1.071287e-02  -1.232313e+01   2.537036e+00 
  5.682631e+03   2.456362e-01   1.133304e-02  -1.218492e+01   2.641610e+00 
  6.238175e+03   2.492688e-01   8.139584e-03  -1.206201e+01   1.870263e+00 
  6.848030e+03   2.539394e-01   4.505434e-03  -1.190403e+01   1.016444e+00 
  7.517505e+03   2.600105e-01   6.106262e-05  -1.170018e+01   1.345572e-02 
  8.252429e+03   2.631013e-01  -4.783888e-03  -1.159611e+01  -1.041676e+00 
  9.059200e+03   2.645879e-01  -1.146135e-02  -1.154046e+01  -2.480372e+00 
  9.944844e+03   2.660536e-01  -1.772660e-02  -1.148138e+01  -3.811867e+00 
  1.091707e+04   2.691311e-01  -2.738120e-02  -1.135600e+01  -5.809243e+00 
  1.198434e+04   2.728442e-01  -3.384077e-02  -1.121541e+01  -7.070268e+00 
  1.315595e+04   2.724642e-01  -4.782065e-02  -1.116205e+01  -9.954689e+00 
  1.444210e+04   2.705478e-01  -5.756415e-02  -1.116283e+01  -1.201164e+01 
  1.585398e+04   2.688462e-01  -6.849914e-02  -1.113676e+01  -1.429421e+01 
  1.740389e+04   2.674921e-01  -8.067163e-02  -1.107572e+01  -1.678253e+01 
  1.910533e+04   2.590573e-01  -9.242773e-02  -1.121171e+01  -1.963564e+01 
  2.097310e+04   2.512206e-01  -1.008551e-01  -1.134994e+01  -2.187350e+01 
  2.302346e+04   2.453085e-01  -1.140111e-01  -1.135638e+01  -2.492742e+01 
  2.527428e+04   2.357912e-01  -1.245079e-01  -1.148132e+01  -2.783598e+01 
  2.774513e+04   2.223618e-01  -1.384026e-01  -1.163676e+01  -3.189900e+01 
  3.045755e+04   2.079035e-01  -1.460450e-01  -1.190084e+01  -3.508669e+01 
  3.343513e+04   1.965844e-01  -1.533320e-01  -1.206516e+01  -3.795354e+01 
  3.670380e+04   1.807415e-01  -1.598306e-01  -1.234978e+01  -4.148647e+01 
  4.029203e+04   1.664509e-01  -1.636766e-01  -1.263636e+01  -4.451852e+01 
  4.423105e+04   1.529525e-01  -1.707814e-01  -1.279338e+01  -4.815225e+01 
  4.855515e+04   1.353383e-01  -1.748244e-01  -1.310869e+01  -5.225517e+01 
  5.330199e+04   1.162491e-01  -1.779570e-01  -1.345029e+01  -5.684571e+01 
  5.851288e+04   9.646299e-02  -1.786291e-01  -1.384961e+01  -6.163013e+01 
  6.423320e+04   7.515792e-02  -1.696472e-01  -1.463077e+01  -6.610547e+01 
  7.051275e+04   6.991514e-02  -1.638802e-01  -1.498327e+01  -6.689577e+01 
  7.740620e+04   5.510626e-02  -1.644042e-01  -1.521932e+01  -7.146948e+01 
  8.497355e+04   3.856921e-02  -1.616103e-01  -1.559005e+01  -7.657711e+01 
  9.328072e+04   2.240834e-02  -1.563546e-01  -1.602948e+01  -8.184405e+01 
  1.024000e+05   7.946685e-03  -1.464564e-01  -1.667307e+01  -8.689419e+01 
