  0.000000e+00   5.136802e-04   6.545292e-07   5.136806e-04   7.300600e-02 
  1.600000e+01   3.596820e-04   7.030698e-05   3.664890e-04   1.106014e+01 
  3.200000e+01   1.220458e-04   5.626579e-05   1.343913e-04   2.475073e+01 
  4.800000e+01   2.796611e-05   2.233121e-05   3.578807e-05   3.860771e+01 
  6.400000e+01   1.329070e-05   1.246331e-05   1.822023e-05   4.315992e+01 
  8.000000e+01   1.189659e-05   1.164993e-05   1.665082e-05   4.439982e+01 
  9.600000e+01   1.452465e-05   1.472119e-05   2.068040e-05   4.538504e+01 
  1.120000e+02   1.231125e-05   1.284760e-05   1.779404e-05   4.622128e+01 
  1.280000e+02   7.183548e-06   8.012214e-06   1.076099e-05   4.812140e+01 
  1.440000e+02   5.718767e-06   6.343789e-06   8.540957e-06   4.796613e+01 
  1.600000e+02   6.093616e-06   6.342769e-06   8.795617e-06   4.614772e+01 
  1.760000e+02   6.755283e-06   6.897892e-06   9.654779e-06   4.559843e+01 
  1.920000e+02   8.095963e-06   7.352666e-06   1.093647e-05   4.224539e+01 
  2.080000e+02   8.070660e-06   7.149563e-06   1.078201e-05   4.153680e+01 
  2.240000e+02   6.802525e-06   6.857752e-06   9.659354e-06   4.523164e+01 
  2.400000e+02   6.660885e-06   6.763553e-06   9.492788e-06   4.543818e+01 
  2.560000e+02   7.075555e-06   6.785145e-06   9.803146e-06   4.379971e+01 
  2.720000e+02   7.260885e-06   7.021078e-06   1.010030e-05   4.403804e+01 
  2.880000e+02   7.190733e-06   7.159839e-06   1.014741e-05   4.487665e+01 
  3.040000e+02   7.327228e-06   7.352053e-06   1.037983e-05   4.509689e+01 
  3.200000e+02   7.489470e-06   7.708203e-06   1.074749e-05   4.582457e+01 
  3.360000e+02   7.684951e-06   7.931912e-06   1.104417e-05   4.590598e+01 
  3.520000e+02   7.900955e-06   7.892749e-06   1.116784e-05   4.497023e+01 
  3.680000e+02   8.678245e-06   7.870291e-06   1.171552e-05   4.220485e+01 
  3.840000e+02   9.117422e-06   8.510196e-06   1.247200e-05   4.302709e+01 
  4.000000e+02   9.098369e-06   8.850600e-06   1.269305e-05   4.420913e+01 
  4.160000e+02   8.755344e-06   9.207904e-06   1.270596e-05   4.644318e+01 
  4.320000e+02   8.578502e-06   9.862008e-06   1.307096e-05   4.898150e+01 
  4.480000e+02   8.625684e-06   9.818283e-06   1.306909e-05   4.869963e+01 
  4.640000e+02   8.711639e-06   9.617947e-06   1.297681e-05   4.783069e+01 
  4.800000e+02   9.343930e-06   1.021978e-05   1.384749e-05   4.756335e+01 
  4.960000e+02   1.034843e-05   1.036860e-05   1.464916e-05   4.505577e+01 
  5.120000e+02   1.048288e-05   1.011577e-05   1.456776e-05   4.397900e+01 
  5.280000e+02   1.015682e-05   1.047366e-05   1.458967e-05   4.587988e+01 
  5.440000e+02   1.063489e-05   1.135372e-05   1.555660e-05   4.687239e+01 
  5.600000e+02   1.157745e-05   1.172826e-05   1.647997e-05   4.537075e+01 
  5.760000e+02   1.235079e-05   1.155806e-05   1.691540e-05   4.310099e+01 
  5.920000e+02   1.275883e-05   1.216069e-05   1.762583e-05   4.362501e+01 
  6.080000e+02   1.315848e-05   1.270038e-05   1.828784e-05   4.398508e+01 
  6.240000e+02   1.300446e-05   1.305984e-05   1.843028e-05   4.512173e+01 
  6.400000e+02   1.335042e-05   1.361606e-05   1.906911e-05   4.556437e+01 
  6.560000e+02   1.403404e-05   1.394464e-05   1.978401e-05   4.481693e+01 
  6.720000e+02   1.457435e-05   1.441332e-05   2.049770e-05   4.468172e+01 
  6.880000e+02   1.536721e-05   1.565577e-05   2.193751e-05   4.553291e+01 
  7.040000e+02   1.621654e-05   1.704998e-05   2.353036e-05   4.643516e+01 
  7.200000e+02   1.649285e-05   1.723424e-05   2.385442e-05   4.625927e+01 
  7.360000e+02   1.671433e-05   1.688103e-05   2.375580e-05   4.528429e+01 
  7.520000e+02   1.735330e-05   1.665020e-05   2.404924e-05   4.381543e+01 
  7.680000e+02   1.758021e-05   1.729583e-05   2.466190e-05   4.453281e+01 
  7.840000e+02   1.839627e-05   1.877559e-05   2.628585e-05   4.558465e+01 
  8.000000e+02   1.891941e-05   2.107060e-05   2.831809e-05   4.807915e+01 
  8.160000e+02   2.046427e-05   2.245365e-05   3.038013e-05   4.765393e+01 
  8.320000e+02   2.273667e-05   2.275970e-05   3.217080e-05   4.502901e+01 
  8.480000e+02   2.473420e-05   2.274165e-05   3.360005e-05   4.259671e+01 
  8.640000e+02   2.573036e-05   2.362154e-05   3.492890e-05   4.255322e+01 
  8.800000e+02   2.523947e-05   2.504400e-05   3.555606e-05   4.477727e+01 
  8.960000e+02   2.549405e-05   2.655704e-05   3.681336e-05   4.616993e+01 
  9.120000e+02   2.813226e-05   2.876446e-05   4.023454e-05   4.563660e+01 
  9.280000e+02   3.052431e-05   3.036199e-05   4.305327e-05   4.484726e+01 
  9.440000e+02   3.245490e-05   3.224754e-05   4.575177e-05   4.481638e+01 
  9.600000e+02   3.446015e-05   3.420793e-05   4.855599e-05   4.478955e+01 
  9.760000e+02   3.636631e-05   3.458754e-05   5.018771e-05   4.356392e+01 
  9.920000e+02   3.806814e-05   3.661385e-05   5.281815e-05   4.388441e+01 
  1.008000e+03   3.828645e-05   4.012148e-05   5.545796e-05   4.634068e+01 
  1.024000e+03   4.223033e-05   4.328935e-05   6.047618e-05   4.570947e+01 
  1.040000e+03   4.693828e-05   4.568695e-05   6.550190e-05   4.422600e+01 
  1.056000e+03   5.021196e-05   4.775742e-05   6.929656e-05   4.356480e+01 
  1.072000e+03   5.411567e-05   5.310155e-05   7.581741e-05   4.445807e+01 
  1.088000e+03   5.899591e-05   5.801644e-05   8.274312e-05   4.452041e+01 
  1.104000e+03   6.382592e-05   6.050622e-05   8.794743e-05   4.347055e+01 
  1.120000e+03   6.581792e-05   6.365618e-05   9.156478e-05   4.404346e+01 
  1.136000e+03   6.615886e-05   6.684548e-05   9.404953e-05   4.529578e+01 
  1.152000e+03   6.939402e-05   6.715496e-05   9.656768e-05   4.406057e+01 
  1.168000e+03   6.975012e-05   6.647878e-05   9.635615e-05   4.362439e+01 
  1.184000e+03   6.355095e-05   6.315618e-05   8.959590e-05   4.482148e+01 
  1.200000e+03   5.812369e-05   5.614905e-05   8.081509e-05   4.401003e+01 
  1.216000e+03   5.305082e-05   5.353537e-05   7.536860e-05   4.526047e+01 
  1.232000e+03   5.036601e-05   5.340482e-05   7.340851e-05   4.667736e+01 
  1.248000e+03   5.044398e-05   4.948404e-05   7.066304e-05   4.444961e+01 
  1.264000e+03   4.663358e-05   4.486244e-05   6.470957e-05   4.389103e+01 
  1.280000e+03   4.081213e-05   4.242699e-05   5.887003e-05   4.611141e+01 
  1.296000e+03   3.789205e-05   4.081945e-05   5.569591e-05   4.712994e+01 
  1.312000e+03   3.648424e-05   3.755574e-05   5.235965e-05   4.582912e+01 
  1.328000e+03   3.281442e-05   3.534585e-05   4.822981e-05   4.712695e+01 
  1.344000e+03   3.006412e-05   3.404632e-05   4.542029e-05   4.855434e+01 
  1.360000e+03   2.981268e-05   3.242184e-05   4.404511e-05   4.740070e+01 
  1.376000e+03   2.884828e-05   3.041525e-05   4.192029e-05   4.651459e+01 
  1.392000e+03   2.749740e-05   2.844140e-05   3.956033e-05   4.596681e+01 
  1.408000e+03   2.675167e-05   2.706200e-05   3.805264e-05   4.533041e+01 
  1.424000e+03   2.587075e-05   2.567087e-05   3.644570e-05   4.477780e+01 
  1.440000e+03   2.531799e-05   2.598178e-05   3.627745e-05   4.574133e+01 
  1.456000e+03   2.545152e-05   2.617412e-05   3.650841e-05   4.580191e+01 
  1.472000e+03   2.477566e-05   2.556124e-05   3.559790e-05   4.589411e+01 
  1.488000e+03   2.382106e-05   2.453994e-05   3.420017e-05   4.585162e+01 
  1.504000e+03   2.313559e-05   2.313085e-05   3.271531e-05   4.499412e+01 
  1.520000e+03   2.278930e-05   2.243879e-05   3.198205e-05   4.455598e+01 
  1.536000e+03   2.228540e-05   2.137361e-05   3.087831e-05   4.380359e+01 
  1.552000e+03   2.186141e-05   2.154316e-05   3.069249e-05   4.457991e+01 
  1.568000e+03   2.135321e-05   2.156982e-05   3.035156e-05   4.528913e+01 
  1.584000e+03   2.150282e-05   2.161333e-05   3.048782e-05   4.514685e+01 
  1.600000e+03   2.123315e-05   2.179566e-05   3.042856e-05   4.574897e+01 
  1.616000e+03   2.246249e-05   2.258124e-05   3.185084e-05   4.515105e+01 
  1.632000e+03   2.343912e-05   2.263638e-05   3.258524e-05   4.400187e+01 
  1.648000e+03   2.154654e-05   2.162862e-05   3.052950e-05   4.510893e+01 
  1.664000e+03   2.107077e-05   2.127699e-05   2.994474e-05   4.527901e+01 
  1.680000e+03   2.188870e-05   2.143498e-05   3.063615e-05   4.439998e+01 
  1.696000e+03   2.104151e-05   2.099490e-05   2.972425e-05   4.493647e+01 
  1.712000e+03   2.032194e-05   2.168792e-05   2.972116e-05   4.686235e+01 
  1.728000e+03   2.071371e-05   2.225908e-05   3.040599e-05   4.705955e+01 
  1.744000e+03   2.136609e-05   2.152199e-05   3.032665e-05   4.520826e+01 
  1.760000e+03   2.221789e-05   2.186981e-05   3.117568e-05   4.454764e+01 
  1.776000e+03   2.267792e-05   2.369608e-05   3.279927e-05   4.625775e+01 
  1.792000e+03   2.244645e-05   2.422567e-05   3.302614e-05   4.718315e+01 
  1.808000e+03   2.236806e-05   2.282664e-05   3.195912e-05   4.558135e+01 
  1.824000e+03   2.328121e-05   2.158360e-05   3.174691e-05   4.283305e+01 
  1.840000e+03   2.366780e-05   2.218244e-05   3.243803e-05   4.314450e+01 
  1.856000e+03   2.301833e-05   2.362851e-05   3.298713e-05   4.574944e+01 
  1.872000e+03   2.355848e-05   2.378130e-05   3.347465e-05   4.526968e+01 
  1.888000e+03   2.400814e-05   2.448454e-05   3.429115e-05   4.556287e+01 
  1.904000e+03   2.481158e-05   2.489141e-05   3.514537e-05   4.509202e+01 
  1.920000e+03   2.616945e-05   2.502087e-05   3.620613e-05   4.371464e+01 
  1.936000e+03   2.595498e-05   2.566513e-05   3.650150e-05   4.467829e+01 
  1.952000e+03   2.517007e-05   2.610438e-05   3.626253e-05   4.604391e+01 
  1.968000e+03   2.550383e-05   2.519049e-05   3.584698e-05   4.464585e+01 
  1.984000e+03   2.705219e-05   2.549759e-05   3.717456e-05   4.330549e+01 
  2.000000e+03   2.854333e-05   2.687596e-05   3.920509e-05   4.327669e+01 
  2.016000e+03   2.862872e-05   2.792252e-05   3.999088e-05   4.428454e+01 
  2.032000e+03   2.773136e-05   2.824390e-05   3.958214e-05   4.552460e+01 
  2.048000e+03   2.898265e-05   2.776418e-05   4.013531e-05   4.376993e+01 
  2.064000e+03   3.081337e-05   2.906499e-05   4.235844e-05   4.332750e+01 
  2.080000e+03   2.986837e-05   3.159623e-05   4.347921e-05   4.661024e+01 
  2.096000e+03   3.013672e-05   3.281328e-05   4.455259e-05   4.743468e+01 
  2.112000e+03   3.239407e-05   3.234969e-05   4.578077e-05   4.496072e+01 
  2.128000e+03   3.243929e-05   3.194655e-05   4.552899e-05   4.456153e+01 
  2.144000e+03   2.999575e-05   3.063590e-05   4.287544e-05   4.560491e+01 
  2.160000e+03   2.882037e-05   3.010384e-05   4.167559e-05   4.624780e+01 
  2.176000e+03   3.016323e-05   3.202469e-05   4.399319e-05   4.671451e+01 
  2.192000e+03   3.128257e-05   3.257482e-05   4.516324e-05   4.615930e+01 
  2.208000e+03   3.184467e-05   3.191585e-05   4.508552e-05   4.506395e+01 
  2.224000e+03   3.110296e-05   3.162513e-05   4.435700e-05   4.547693e+01 
  2.240000e+03   3.099420e-05   3.126901e-05   4.402717e-05   4.525288e+01 
  2.256000e+03   3.064337e-05   3.210995e-05   4.438542e-05   4.633879e+01 
  2.272000e+03   3.001947e-05   3.294304e-05   4.456919e-05   4.765853e+01 
  2.288000e+03   3.211890e-05   3.131616e-05   4.485896e-05   4.427499e+01 
  2.304000e+03   3.211447e-05   3.098148e-05   4.462276e-05   4.397127e+01 
  2.320000e+03   2.997312e-05   3.041219e-05   4.269999e-05   4.541660e+01 
  2.336000e+03   2.823936e-05   2.882818e-05   4.035499e-05   4.559115e+01 
  2.352000e+03   2.841351e-05   2.838132e-05   4.016001e-05   4.496752e+01 
  2.368000e+03   2.882946e-05   2.842247e-05   4.048425e-05   4.459270e+01 
  2.384000e+03   2.720786e-05   2.804192e-05   3.907194e-05   4.586488e+01 
  2.400000e+03   2.589170e-05   2.750465e-05   3.777414e-05   4.673021e+01 
  2.416000e+03   2.594183e-05   2.623722e-05   3.689675e-05   4.532435e+01 
  2.432000e+03   2.448925e-05   2.718177e-05   3.658650e-05   4.798292e+01 
  2.448000e+03   2.521311e-05   2.756380e-05   3.735591e-05   4.755027e+01 
  2.464000e+03   2.675655e-05   2.512769e-05   3.670578e-05   4.320184e+01 
  2.480000e+03   2.599388e-05   2.445578e-05   3.568987e-05   4.325372e+01 
  2.496000e+03   2.577412e-05   2.522649e-05   3.606496e-05   4.438479e+01 
  2.512000e+03   2.683870e-05   2.445704e-05   3.631064e-05   4.234167e+01 
  2.528000e+03   2.627109e-05   2.331428e-05   3.512443e-05   4.158744e+01 
  2.544000e+03   2.482481e-05   2.285937e-05   3.374643e-05   4.263973e+01 
  2.560000e+03   2.444601e-05   2.380787e-05   3.412363e-05   4.424232e+01 
  2.576000e+03   2.340345e-05   2.408445e-05   3.358247e-05   4.582159e+01 
  2.592000e+03   2.212684e-05   2.134829e-05   3.074649e-05   4.397406e+01 
  2.608000e+03   2.244913e-05   2.012437e-05   3.014886e-05   4.187442e+01 
  2.624000e+03   2.262104e-05   2.110820e-05   3.093974e-05   4.301860e+01 
  2.640000e+03   2.106770e-05   2.098440e-05   2.973538e-05   4.488649e+01 
  2.656000e+03   2.060826e-05   2.061257e-05   2.914753e-05   4.500598e+01 
  2.672000e+03   2.090632e-05   2.106155e-05   2.967597e-05   4.521193e+01 
  2.688000e+03   2.127506e-05   2.094280e-05   2.985346e-05   4.454908e+01 
  2.704000e+03   2.117873e-05   2.054479e-05   2.950639e-05   4.412953e+01 
  2.720000e+03   2.164230e-05   2.015770e-05   2.957570e-05   4.296589e+01 
  2.736000e+03   2.110106e-05   2.037517e-05   2.933262e-05   4.399734e+01 
  2.752000e+03   2.031550e-05   2.141321e-05   2.951686e-05   4.650687e+01 
  2.768000e+03   1.982361e-05   2.150986e-05   2.925149e-05   4.733615e+01 
  2.784000e+03   1.938725e-05   2.044289e-05   2.817405e-05   4.651818e+01 
  2.800000e+03   1.982384e-05   1.960052e-05   2.787768e-05   4.467545e+01 
  2.816000e+03   2.139366e-05   1.959503e-05   2.901127e-05   4.248742e+01 
  2.832000e+03   2.199294e-05   1.978521e-05   2.958283e-05   4.197507e+01 
  2.848000e+03   2.020829e-05   1.909223e-05   2.780087e-05   4.337335e+01 
  2.864000e+03   1.921028e-05   1.871244e-05   2.681772e-05   4.424789e+01 
  2.880000e+03   1.890499e-05   1.968605e-05   2.729357e-05   4.615947e+01 
  2.896000e+03   1.956457e-05   2.103928e-05   2.873019e-05   4.708004e+01 
  2.912000e+03   1.949519e-05   2.077946e-05   2.849295e-05   4.682641e+01 
  2.928000e+03   1.878986e-05   1.872666e-05   2.652823e-05   4.490348e+01 
  2.944000e+03   1.813156e-05   1.847343e-05   2.588477e-05   4.553509e+01 
  2.960000e+03   1.840648e-05   1.946828e-05   2.679202e-05   4.660584e+01 
  2.976000e+03   1.932279e-05   1.893325e-05   2.705251e-05   4.441661e+01 
  2.992000e+03   1.974818e-05   1.881454e-05   2.727595e-05   4.361309e+01 
  3.008000e+03   2.036494e-05   1.927041e-05   2.803711e-05   4.341818e+01 
  3.024000e+03   2.068354e-05   1.966891e-05   2.854251e-05   4.355964e+01 
  3.040000e+03   1.974527e-05   2.009244e-05   2.817059e-05   4.549929e+01 
  3.056000e+03   1.844040e-05   1.947607e-05   2.682099e-05   4.656463e+01 
  3.072000e+03   1.772809e-05   1.947071e-05   2.633237e-05   4.768213e+01 
  3.088000e+03   1.814234e-05   1.898961e-05   2.626309e-05   4.630714e+01 
  3.104000e+03   1.820675e-05   1.745691e-05   2.522359e-05   4.379551e+01 
  3.120000e+03   1.749057e-05   1.757493e-05   2.479513e-05   4.513784e+01 
  3.136000e+03   1.775136e-05   1.748976e-05   2.491992e-05   4.457469e+01 
  3.152000e+03   1.807797e-05   1.771901e-05   2.531356e-05   4.442548e+01 
  3.168000e+03   1.810017e-05   1.773507e-05   2.534066e-05   4.441628e+01 
  3.184000e+03   1.788471e-05   1.791309e-05   2.531288e-05   4.504541e+01 
  3.200000e+03   1.871688e-05   1.872217e-05   2.647341e-05   4.500809e+01 
  3.216000e+03   1.913279e-05   1.838018e-05   2.653101e-05   4.385065e+01 
  3.232000e+03   1.849674e-05   1.795419e-05   2.577755e-05   4.414725e+01 
  3.248000e+03   1.802484e-05   1.790629e-05   2.540728e-05   4.481095e+01 
  3.264000e+03   1.854802e-05   1.750510e-05   2.550407e-05   4.334305e+01 
  3.280000e+03   1.897823e-05   1.740496e-05   2.575084e-05   4.252398e+01 
  3.296000e+03   1.843822e-05   1.696821e-05   2.505770e-05   4.262255e+01 
  3.312000e+03   1.772106e-05   1.706574e-05   2.460235e-05   4.392078e+01 
  3.328000e+03   1.753502e-05   1.696319e-05   2.439727e-05   4.405037e+01 
  3.344000e+03   1.754653e-05   1.659407e-05   2.415044e-05   4.340197e+01 
  3.360000e+03   1.664418e-05   1.671474e-05   2.358837e-05   4.512119e+01 
  3.376000e+03   1.629743e-05   1.611546e-05   2.291974e-05   4.467834e+01 
  3.392000e+03   1.724579e-05   1.551045e-05   2.319464e-05   4.196746e+01 
  3.408000e+03   1.700834e-05   1.557204e-05   2.306018e-05   4.247575e+01 
  3.424000e+03   1.652302e-05   1.683430e-05   2.358821e-05   4.553466e+01 
  3.440000e+03   1.720034e-05   1.737928e-05   2.445181e-05   4.529649e+01 
  3.456000e+03   1.750623e-05   1.676428e-05   2.423859e-05   4.375976e+01 
  3.472000e+03   1.626550e-05   1.599470e-05   2.281221e-05   4.451906e+01 
  3.488000e+03   1.669233e-05   1.581329e-05   2.299334e-05   4.345095e+01 
  3.504000e+03   1.756658e-05   1.575061e-05   2.359378e-05   4.188015e+01 
  3.520000e+03   1.686764e-05   1.546533e-05   2.288435e-05   4.251658e+01 
  3.536000e+03   1.568812e-05   1.466952e-05   2.147818e-05   4.307825e+01 
  3.552000e+03   1.542460e-05   1.442582e-05   2.111925e-05   4.308361e+01 
  3.568000e+03   1.521073e-05   1.446175e-05   2.098829e-05   4.355407e+01 
  3.584000e+03   1.405256e-05   1.458986e-05   2.025681e-05   4.607469e+01 
  3.600000e+03   1.353648e-05   1.486117e-05   2.010200e-05   4.767078e+01 
  3.616000e+03   1.343178e-05   1.467780e-05   1.989600e-05   4.753810e+01 
  3.632000e+03   1.363251e-05   1.476532e-05   2.009626e-05   4.728436e+01 
  3.648000e+03   1.390465e-05   1.500209e-05   2.045487e-05   4.717417e+01 
  3.664000e+03   1.426485e-05   1.495535e-05   2.066757e-05   4.635369e+01 
  3.680000e+03   1.421156e-05   1.472059e-05   2.046128e-05   4.600794e+01 
  3.696000e+03   1.384636e-05   1.333316e-05   1.922225e-05   4.391829e+01 
  3.712000e+03   1.347020e-05   1.328145e-05   1.891675e-05   4.459575e+01 
  3.728000e+03   1.358012e-05   1.454496e-05   1.989914e-05   4.696478e+01 
  3.744000e+03   1.332900e-05   1.408897e-05   1.939488e-05   4.658772e+01 
  3.760000e+03   1.264040e-05   1.369933e-05   1.864005e-05   4.730220e+01 
  3.776000e+03   1.274160e-05   1.296503e-05   1.817802e-05   4.549798e+01 
  3.792000e+03   1.222130e-05   1.255104e-05   1.751824e-05   4.576262e+01 
  3.808000e+03   1.186228e-05   1.317850e-05   1.773095e-05   4.800886e+01 
  3.824000e+03   1.274485e-05   1.327286e-05   1.840109e-05   4.616262e+01 
  3.840000e+03   1.259669e-05   1.291047e-05   1.803765e-05   4.570481e+01 
  3.856000e+03   1.239176e-05   1.236915e-05   1.750861e-05   4.494769e+01 
  3.872000e+03   1.260141e-05   1.167912e-05   1.718131e-05   4.282469e+01 
  3.888000e+03   1.249894e-05   1.153914e-05   1.701103e-05   4.271350e+01 
  3.904000e+03   1.185716e-05   1.215175e-05   1.697814e-05   4.570298e+01 
  3.920000e+03   1.129192e-05   1.255185e-05   1.688361e-05   4.802475e+01 
  3.936000e+03   1.146063e-05   1.289166e-05   1.724937e-05   4.836302e+01 
  3.952000e+03   1.189495e-05   1.271429e-05   1.741100e-05   4.690689e+01 
  3.968000e+03   1.195865e-05   1.173901e-05   1.675750e-05   4.446898e+01 
  3.984000e+03   1.214053e-05   1.112345e-05   1.646583e-05   4.249667e+01 
  4.000000e+03   1.236512e-05   1.105943e-05   1.658937e-05   4.180962e+01 
  4.016000e+03   1.224800e-05   1.151592e-05   1.681160e-05   4.323547e+01 
  4.032000e+03   1.154746e-05   1.162612e-05   1.638629e-05   4.519447e+01 
  4.048000e+03   1.126643e-05   1.102659e-05   1.576446e-05   4.438358e+01 
  4.064000e+03   1.135426e-05   1.104071e-05   1.583719e-05   4.419785e+01 
  4.080000e+03   1.125237e-05   1.191827e-05   1.639088e-05   4.664617e+01 
  4.096000e+03   1.127982e-05   1.259745e-05   1.690947e-05   4.815857e+01 
  4.112000e+03   1.126434e-05   1.208796e-05   1.652284e-05   4.701993e+01 
  4.128000e+03   1.086877e-05   1.138962e-05   1.574337e-05   4.634048e+01 
  4.144000e+03   1.046213e-05   1.064528e-05   1.492576e-05   4.549716e+01 
  4.160000e+03   1.041236e-05   1.059010e-05   1.485151e-05   4.548487e+01 
  4.176000e+03   1.040695e-05   1.059952e-05   1.485444e-05   4.552523e+01 
  4.192000e+03   1.051648e-05   1.025309e-05   1.468748e-05   4.427342e+01 
  4.208000e+03   1.055147e-05   1.002845e-05   1.455689e-05   4.354418e+01 
  4.224000e+03   1.078581e-05   1.009355e-05   1.477205e-05   4.310104e+01 
  4.240000e+03   1.097949e-05   1.004408e-05   1.488061e-05   4.245239e+01 
  4.256000e+03   1.043972e-05   9.502069e-06   1.411655e-05   4.230796e+01 
  4.272000e+03   1.015612e-05   8.992722e-06   1.356525e-05   4.152322e+01 
  4.288000e+03   9.332643e-06   9.133661e-06   1.305841e-05   4.438263e+01 
  4.304000e+03   9.075159e-06   9.494996e-06   1.313444e-05   4.629513e+01 
  4.320000e+03   9.950282e-06   9.838699e-06   1.399315e-05   4.467693e+01 
  4.336000e+03   1.040733e-05   1.029809e-05   1.464115e-05   4.469773e+01 
  4.352000e+03   1.030844e-05   1.017146e-05   1.448180e-05   4.461678e+01 
  4.368000e+03   9.441111e-06   9.976995e-06   1.373590e-05   4.658080e+01 
  4.384000e+03   9.023802e-06   9.371124e-06   1.300949e-05   4.608170e+01 
  4.400000e+03   8.654815e-06   8.833593e-06   1.236682e-05   4.558569e+01 
  4.416000e+03   8.892197e-06   8.776980e-06   1.249426e-05   4.462639e+01 
  4.432000e+03   8.929733e-06   9.083319e-06   1.273761e-05   4.548851e+01 
  4.448000e+03   8.728379e-06   9.038611e-06   1.256507e-05   4.600035e+01 
  4.464000e+03   8.838935e-06   8.873541e-06   1.252464e-05   4.511194e+01 
  4.480000e+03   8.690450e-06   8.936557e-06   1.246539e-05   4.579990e+01 
  4.496000e+03   8.670420e-06   8.605774e-06   1.221620e-05   4.478560e+01 
  4.512000e+03   8.710149e-06   8.481615e-06   1.215749e-05   4.423840e+01 
  4.528000e+03   8.493555e-06   8.364897e-06   1.192107e-05   4.456275e+01 
  4.544000e+03   8.220723e-06   8.579232e-06   1.188207e-05   4.622249e+01 
  4.560000e+03   8.385579e-06   9.168341e-06   1.242483e-05   4.755323e+01 
  4.576000e+03   8.406109e-06   9.082290e-06   1.237541e-05   4.721421e+01 
  4.592000e+03   8.246691e-06   8.922700e-06   1.215000e-05   4.725473e+01 
  4.608000e+03   8.568487e-06   9.148827e-06   1.253475e-05   4.687608e+01 
  4.624000e+03   8.917169e-06   9.219902e-06   1.282663e-05   4.595626e+01 
  4.640000e+03   8.850576e-06   9.126057e-06   1.271289e-05   4.587796e+01 
  4.656000e+03   8.524099e-06   8.799086e-06   1.225088e-05   4.590943e+01 
  4.672000e+03   8.038106e-06   8.518884e-06   1.171249e-05   4.666327e+01 
  4.688000e+03   7.644918e-06   8.413926e-06   1.136833e-05   4.774162e+01 
  4.704000e+03   7.405265e-06   8.095066e-06   1.097124e-05   4.754811e+01 
  4.720000e+03   7.622840e-06   7.753480e-06   1.087309e-05   4.548678e+01 
  4.736000e+03   7.750344e-06   7.648440e-06   1.088882e-05   4.462084e+01 
  4.752000e+03   7.764493e-06   7.764669e-06   1.098078e-05   4.500065e+01 
  4.768000e+03   7.744275e-06   7.944980e-06   1.109489e-05   4.573291e+01 
  4.784000e+03   8.004901e-06   8.184902e-06   1.144863e-05   4.563700e+01 
  4.800000e+03   8.410428e-06   8.165119e-06   1.172197e-05   4.415211e+01 
  4.816000e+03   8.231722e-06   7.840792e-06   1.136835e-05   4.360667e+01 
  4.832000e+03   8.081992e-06   7.500970e-06   1.102647e-05   4.286467e+01 
  4.848000e+03   7.737689e-06   7.423591e-06   1.072294e-05   4.381316e+01 
  4.864000e+03   7.428833e-06   7.353391e-06   1.045275e-05   4.470759e+01 
  4.880000e+03   7.677173e-06   7.469281e-06   1.071117e-05   4.421363e+01 
  4.896000e+03   7.923865e-06   7.557773e-06   1.095023e-05   4.364539e+01 
  4.912000e+03   7.835687e-06   7.127457e-06   1.059239e-05   4.229012e+01 
  4.928000e+03   7.371545e-06   6.675470e-06   9.944927e-06   4.216313e+01 
  4.944000e+03   6.891721e-06   6.653892e-06   9.579671e-06   4.399413e+01 
  4.960000e+03   6.953750e-06   6.752712e-06   9.692975e-06   4.415968e+01 
  4.976000e+03   7.118741e-06   6.943305e-06   9.944141e-06   4.428522e+01 
  4.992000e+03   7.303704e-06   7.164476e-06   1.023102e-05   4.444865e+01 
  5.008000e+03   7.441197e-06   6.823071e-06   1.009583e-05   4.251870e+01 
  5.024000e+03   7.115727e-06   6.360676e-06   9.544201e-06   4.179320e+01 
  5.040000e+03   6.806797e-06   6.561608e-06   9.454479e-06   4.394926e+01 
  5.056000e+03   6.789226e-06   7.051778e-06   9.788828e-06   4.608672e+01 
  5.072000e+03   6.771136e-06   7.527509e-06   1.012481e-05   4.802802e+01 
  5.088000e+03   6.406009e-06   7.422820e-06   9.804856e-06   4.920530e+01 
  5.104000e+03   6.311169e-06   7.010181e-06   9.432575e-06   4.800373e+01 
  5.120000e+03   6.857964e-06   6.540737e-06   9.476968e-06   4.364372e+01 
  5.136000e+03   7.067219e-06   6.525150e-06   9.618896e-06   4.271623e+01 
  5.152000e+03   6.854189e-06   6.643171e-06   9.545241e-06   4.410431e+01 
  5.168000e+03   6.739512e-06   6.688797e-06   9.495316e-06   4.478361e+01 
  5.184000e+03   6.461740e-06   6.795667e-06   9.377376e-06   4.644286e+01 
  5.200000e+03   6.053132e-06   6.637989e-06   8.983502e-06   4.763855e+01 
  5.216000e+03   6.120973e-06   6.485542e-06   8.917879e-06   4.665648e+01 
  5.232000e+03   6.504197e-06   6.497447e-06   9.193552e-06   4.497025e+01 
  5.248000e+03   6.865117e-06   6.344116e-06   9.347601e-06   4.274129e+01 
  5.264000e+03   6.954000e-06   6.074242e-06   9.233338e-06   4.113685e+01 
  5.280000e+03   6.821123e-06   6.175901e-06   9.201602e-06   4.215795e+01 
  5.296000e+03   6.432940e-06   6.368146e-06   9.051851e-06   4.470999e+01 
  5.312000e+03   6.128446e-06   6.266495e-06   8.765091e-06   4.563811e+01 
  5.328000e+03   6.131708e-06   6.575961e-06   8.991168e-06   4.700221e+01 
  5.344000e+03   6.191261e-06   6.593164e-06   9.044419e-06   4.680061e+01 
  5.360000e+03   6.260352e-06   6.238952e-06   8.838356e-06   4.490191e+01 
  5.376000e+03   6.093485e-06   6.257844e-06   8.734482e-06   4.576239e+01 
  5.392000e+03   5.955846e-06   6.187096e-06   8.587913e-06   4.609101e+01 
  5.408000e+03   6.006605e-06   5.949692e-06   8.454474e-06   4.472726e+01 
  5.424000e+03   6.094164e-06   6.008222e-06   8.557895e-06   4.459313e+01 
  5.440000e+03   6.402377e-06   6.242063e-06   8.941687e-06   4.427361e+01 
  5.456000e+03   6.655514e-06   6.385569e-06   9.223414e-06   4.381417e+01 
  5.472000e+03   6.701999e-06   6.610643e-06   9.413680e-06   4.460682e+01 
  5.488000e+03   6.651171e-06   6.707449e-06   9.446055e-06   4.524137e+01 
  5.504000e+03   6.301990e-06   6.426166e-06   9.000594e-06   4.555896e+01 
  5.520000e+03   6.238089e-06   5.876097e-06   8.569847e-06   4.328841e+01 
  5.536000e+03   6.308439e-06   5.704605e-06   8.505229e-06   4.212245e+01 
  5.552000e+03   6.166196e-06   5.877783e-06   8.518820e-06   4.362822e+01 
  5.568000e+03   6.095327e-06   6.142619e-06   8.653599e-06   4.522141e+01 
  5.584000e+03   6.002034e-06   6.181812e-06   8.616217e-06   4.584536e+01 
  5.600000e+03   5.867249e-06   6.033476e-06   8.415904e-06   4.580025e+01 
  5.616000e+03   6.003820e-06   5.766123e-06   8.324303e-06   4.384305e+01 
  5.632000e+03   6.195448e-06   5.723752e-06   8.434745e-06   4.273373e+01 
  5.648000e+03   6.223037e-06   6.256774e-06   8.824592e-06   4.515489e+01 
  5.664000e+03   5.937526e-06   6.526758e-06   8.823422e-06   4.770656e+01 
  5.680000e+03   5.867609e-06   6.090769e-06   8.457322e-06   4.606910e+01 
  5.696000e+03   6.129370e-06   5.477624e-06   8.220312e-06   4.178615e+01 
  5.712000e+03   6.257361e-06   5.376641e-06   8.250021e-06   4.067084e+01 
  5.728000e+03   6.260704e-06   5.552524e-06   8.368210e-06   4.156934e+01 
  5.744000e+03   6.246418e-06   5.822997e-06   8.539616e-06   4.299076e+01 
  5.760000e+03   6.153298e-06   6.037707e-06   8.620730e-06   4.445675e+01 
  5.776000e+03   5.966988e-06   6.378224e-06   8.734225e-06   4.690789e+01 
  5.792000e+03   5.933165e-06   6.411798e-06   8.735766e-06   4.722033e+01 
  5.808000e+03   6.065066e-06   6.133461e-06   8.625797e-06   4.532124e+01 
  5.824000e+03   6.212111e-06   5.833209e-06   8.521541e-06   4.319828e+01 
  5.840000e+03   6.273820e-06   5.774932e-06   8.527054e-06   4.262898e+01 
  5.856000e+03   6.090624e-06   5.915967e-06   8.490840e-06   4.416659e+01 
  5.872000e+03   5.753919e-06   6.062332e-06   8.358196e-06   4.649512e+01 
  5.888000e+03   5.991151e-06   6.116777e-06   8.562059e-06   4.559445e+01 
  5.904000e+03   6.230001e-06   6.043956e-06   8.679996e-06   4.413159e+01 
  5.920000e+03   6.399595e-06   6.189892e-06   8.903346e-06   4.404571e+01 
  5.936000e+03   6.391791e-06   6.435753e-06   9.070496e-06   4.519636e+01 
  5.952000e+03   6.130867e-06   6.293268e-06   8.785941e-06   4.574889e+01 
  5.968000e+03   5.987773e-06   6.094316e-06   8.543660e-06   4.550523e+01 
  5.984000e+03   6.119913e-06   6.014428e-06   8.580599e-06   4.450193e+01 
  6.000000e+03   6.344261e-06   5.943048e-06   8.693070e-06   4.312980e+01 
  6.016000e+03   6.204133e-06   5.780335e-06   8.479596e-06   4.297474e+01 
  6.032000e+03   6.253372e-06   5.846990e-06   8.561072e-06   4.307648e+01 
  6.048000e+03   6.397311e-06   5.829870e-06   8.655228e-06   4.234291e+01 
  6.064000e+03   6.183828e-06   6.011246e-06   8.624083e-06   4.418922e+01 
  6.080000e+03   6.015831e-06   6.475668e-06   8.838806e-06   4.710822e+01 
  6.096000e+03   5.886985e-06   6.488269e-06   8.760949e-06   4.778167e+01 
  6.112000e+03   5.719500e-06   6.130769e-06   8.384451e-06   4.698767e+01 
  6.128000e+03   5.929720e-06   6.007943e-06   8.441384e-06   4.537543e+01 
  6.144000e+03   6.083513e-06   6.093803e-06   8.610666e-06   4.504841e+01 
  6.160000e+03   6.007641e-06   6.140212e-06   8.590341e-06   4.562525e+01 
  6.176000e+03   6.356402e-06   6.120567e-06   8.824125e-06   4.391715e+01 
  6.192000e+03   6.486871e-06   6.412259e-06   9.121215e-06   4.466859e+01 
  6.208000e+03   6.019076e-06   6.738928e-06   9.035621e-06   4.822940e+01 
  6.224000e+03   5.862658e-06   6.381758e-06   8.665887e-06   4.742759e+01 
  6.240000e+03   6.132491e-06   6.302589e-06   8.793751e-06   4.578369e+01 
  6.256000e+03   6.283958e-06   6.496066e-06   9.038086e-06   4.595084e+01 
  6.272000e+03   6.272433e-06   6.626457e-06   9.124327e-06   4.657214e+01 
  6.288000e+03   6.299079e-06   6.603530e-06   9.126062e-06   4.635170e+01 
  6.304000e+03   6.374843e-06   6.105945e-06   8.827298e-06   4.376575e+01 
  6.320000e+03   6.231556e-06   5.782168e-06   8.500927e-06   4.285778e+01 
  6.336000e+03   6.073567e-06   5.959172e-06   8.508816e-06   4.445530e+01 
  6.352000e+03   6.332846e-06   6.033899e-06   8.747164e-06   4.361523e+01 
  6.368000e+03   6.380286e-06   6.361380e-06   9.009728e-06   4.491498e+01 
  6.384000e+03   6.281784e-06   6.982081e-06   9.392032e-06   4.802225e+01 
  6.400000e+03   6.312188e-06   6.970415e-06   9.403744e-06   4.783700e+01 
  6.416000e+03   6.499658e-06   6.568761e-06   9.240897e-06   4.530297e+01 
  6.432000e+03   6.580936e-06   6.292144e-06   9.104932e-06   4.371485e+01 
  6.448000e+03   6.552221e-06   6.489253e-06   9.221822e-06   4.472336e+01 
  6.464000e+03   6.754841e-06   6.511969e-06   9.382623e-06   4.395122e+01 
  6.480000e+03   6.632752e-06   6.280743e-06   9.134612e-06   4.343856e+01 
  6.496000e+03   6.249480e-06   6.138701e-06   8.760117e-06   4.448766e+01 
  6.512000e+03   6.172437e-06   6.242794e-06   8.779035e-06   4.532469e+01 
  6.528000e+03   6.209223e-06   6.242011e-06   8.804383e-06   4.515088e+01 
  6.544000e+03   6.296968e-06   6.169830e-06   8.815816e-06   4.441571e+01 
  6.560000e+03   6.553799e-06   6.122659e-06   8.968792e-06   4.305206e+01 
  6.576000e+03   6.628676e-06   6.166212e-06   9.053259e-06   4.292998e+01 
  6.592000e+03   6.352436e-06   6.423263e-06   9.033923e-06   4.531763e+01 
  6.608000e+03   6.006145e-06   6.575156e-06   8.905417e-06   4.758953e+01 
  6.624000e+03   6.059697e-06   6.564121e-06   8.933510e-06   4.728821e+01 
  6.640000e+03   6.224988e-06   6.627837e-06   9.092782e-06   4.679524e+01 
  6.656000e+03   6.451359e-06   6.948521e-06   9.481666e-06   4.712481e+01 
  6.672000e+03   6.468756e-06   6.667228e-06   9.289603e-06   4.586562e+01 
  6.688000e+03   6.309196e-06   6.386463e-06   8.977353e-06   4.534870e+01 
  6.704000e+03   6.217794e-06   6.150965e-06   8.746161e-06   4.469043e+01 
  6.720000e+03   6.491216e-06   6.033724e-06   8.862376e-06   4.290812e+01 
  6.736000e+03   6.655027e-06   6.327466e-06   9.182931e-06   4.355467e+01 
  6.752000e+03   6.636817e-06   6.750804e-06   9.466820e-06   4.548783e+01 
  6.768000e+03   6.772367e-06   6.894795e-06   9.664531e-06   4.551323e+01 
  6.784000e+03   6.586399e-06   6.722838e-06   9.411547e-06   4.558735e+01 
  6.800000e+03   6.313568e-06   6.425134e-06   9.007968e-06   4.550178e+01 
  6.816000e+03   6.292983e-06   6.331552e-06   8.926936e-06   4.517504e+01 
  6.832000e+03   6.237266e-06   6.590252e-06   9.073859e-06   4.657626e+01 
  6.848000e+03   6.007702e-06   6.680554e-06   8.984558e-06   4.803552e+01 
  6.864000e+03   5.869048e-06   6.421386e-06   8.699421e-06   4.757317e+01 
  6.880000e+03   6.035190e-06   6.450728e-06   8.833766e-06   4.690613e+01 
  6.896000e+03   6.223055e-06   6.602579e-06   9.073063e-06   4.669494e+01 
  6.912000e+03   6.523966e-06   6.587826e-06   9.271546e-06   4.527905e+01 
  6.928000e+03   6.611405e-06   6.497161e-06   9.269508e-06   4.450066e+01 
  6.944000e+03   6.390446e-06   6.885909e-06   9.394336e-06   4.713724e+01 
  6.960000e+03   6.267981e-06   6.637180e-06   9.129061e-06   4.663870e+01 
  6.976000e+03   6.437733e-06   6.161877e-06   8.911405e-06   4.374577e+01 
  6.992000e+03   6.727256e-06   6.446844e-06   9.317605e-06   4.378063e+01 
  7.008000e+03   6.889775e-06   6.576842e-06   9.524907e-06   4.366882e+01 
  7.024000e+03   6.513010e-06   6.421677e-06   9.146433e-06   4.459543e+01 
  7.040000e+03   6.322894e-06   6.366889e-06   8.973086e-06   4.519864e+01 
  7.056000e+03   6.324151e-06   6.290499e-06   8.919937e-06   4.484715e+01 
  7.072000e+03   6.299501e-06   6.604943e-06   9.127376e-06   4.635591e+01 
  7.088000e+03   6.528846e-06   6.811793e-06   9.435377e-06   4.621502e+01 
  7.104000e+03   6.608877e-06   6.776725e-06   9.465793e-06   4.571841e+01 
  7.120000e+03   6.369357e-06   6.590449e-06   9.165300e-06   4.597736e+01 
  7.136000e+03   6.534201e-06   6.117787e-06   8.951150e-06   4.311491e+01 
  7.152000e+03   6.869227e-06   6.056841e-06   9.158144e-06   4.140377e+01 
  7.168000e+03   6.838107e-06   6.356213e-06   9.336014e-06   4.290832e+01 
  7.184000e+03   6.659191e-06   6.617141e-06   9.387832e-06   4.481853e+01 
  7.200000e+03   6.414384e-06   6.200069e-06   8.921053e-06   4.402666e+01 
  7.216000e+03   6.034038e-06   6.225595e-06   8.669928e-06   4.589517e+01 
  7.232000e+03   5.840614e-06   6.393062e-06   8.659331e-06   4.758560e+01 
  7.248000e+03   5.853717e-06   6.214977e-06   8.537678e-06   4.671456e+01 
  7.264000e+03   6.165726e-06   6.218072e-06   8.756746e-06   4.524219e+01 
  7.280000e+03   6.371753e-06   6.408708e-06   9.037190e-06   4.516567e+01 
  7.296000e+03   6.178217e-06   6.456559e-06   8.936303e-06   4.626201e+01 
  7.312000e+03   5.991108e-06   6.362776e-06   8.739468e-06   4.672323e+01 
  7.328000e+03   6.163203e-06   6.496425e-06   8.954809e-06   4.650777e+01 
  7.344000e+03   6.510150e-06   6.526995e-06   9.218661e-06   4.507403e+01 
  7.360000e+03   6.606706e-06   6.614464e-06   9.348781e-06   4.503362e+01 
  7.376000e+03   6.228492e-06   6.818740e-06   9.235222e-06   4.759025e+01 
  7.392000e+03   6.129557e-06   6.842871e-06   9.186749e-06   4.814735e+01 
  7.408000e+03   6.191503e-06   6.761976e-06   9.168371e-06   4.752168e+01 
  7.424000e+03   6.148646e-06   6.518386e-06   8.960759e-06   4.667194e+01 
  7.440000e+03   6.384492e-06   6.533040e-06   9.134679e-06   4.565885e+01 
  7.456000e+03   6.388755e-06   6.388387e-06   9.034803e-06   4.499835e+01 
  7.472000e+03   6.218436e-06   6.179917e-06   8.767002e-06   4.482199e+01 
  7.488000e+03   6.358820e-06   6.680412e-06   9.222934e-06   4.641282e+01 
  7.504000e+03   5.942956e-06   6.676162e-06   8.938114e-06   4.832530e+01 
  7.520000e+03   5.758930e-06   6.331037e-06   8.558463e-06   4.770926e+01 
  7.536000e+03   6.149676e-06   6.612687e-06   9.030290e-06   4.707774e+01 
  7.552000e+03   6.112382e-06   6.904867e-06   9.221627e-06   4.848384e+01 
  7.568000e+03   5.950853e-06   6.696169e-06   8.958311e-06   4.837266e+01 
  7.584000e+03   5.978858e-06   6.413662e-06   8.768227e-06   4.700945e+01 
  7.600000e+03   6.217451e-06   6.178221e-06   8.765108e-06   4.481867e+01 
  7.616000e+03   6.152783e-06   6.246368e-06   8.767774e-06   4.543244e+01 
  7.632000e+03   6.064736e-06   6.320772e-06   8.759747e-06   4.618426e+01 
  7.648000e+03   5.887707e-06   6.079656e-06   8.463293e-06   4.591891e+01 
  7.664000e+03   5.985424e-06   6.010784e-06   8.482619e-06   4.512112e+01 
  7.680000e+03   6.191110e-06   6.247702e-06   8.795660e-06   4.526067e+01 
  7.696000e+03   6.226246e-06   5.931820e-06   8.599572e-06   4.361277e+01 
  7.712000e+03   6.384378e-06   5.584673e-06   8.482267e-06   4.117750e+01 
  7.728000e+03   6.219705e-06   5.710109e-06   8.443344e-06   4.255403e+01 
  7.744000e+03   5.852691e-06   5.888354e-06   8.302211e-06   4.517403e+01 
  7.760000e+03   5.735473e-06   5.783501e-06   8.145215e-06   4.523889e+01 
  7.776000e+03   5.669846e-06   5.926031e-06   8.201524e-06   4.626561e+01 
  7.792000e+03   5.685936e-06   6.247119e-06   8.447269e-06   4.769249e+01 
  7.808000e+03   6.150879e-06   6.245081e-06   8.765521e-06   4.543541e+01 
  7.824000e+03   6.080337e-06   6.110400e-06   8.620179e-06   4.514130e+01 
  7.840000e+03   5.977774e-06   6.162019e-06   8.585119e-06   4.586950e+01 
  7.856000e+03   6.372878e-06   6.200511e-06   8.891564e-06   4.421458e+01 
  7.872000e+03   6.681571e-06   6.304011e-06   9.186073e-06   4.333457e+01 
  7.888000e+03   6.472001e-06   6.190314e-06   8.955824e-06   4.372560e+01 
  7.904000e+03   5.905849e-06   6.099635e-06   8.490265e-06   4.592476e+01 
  7.920000e+03   5.843558e-06   5.980658e-06   8.361544e-06   4.566430e+01 
  7.936000e+03   5.928964e-06   5.810339e-06   8.301365e-06   4.442105e+01 
  7.952000e+03   5.913678e-06   5.442761e-06   8.037116e-06   4.262548e+01 
  7.968000e+03   5.821996e-06   5.175893e-06   7.790090e-06   4.163785e+01 
  7.984000e+03   5.661307e-06   5.526905e-06   7.911831e-06   4.431175e+01 
  8.000000e+03   5.616982e-06   5.939338e-06   8.174730e-06   4.659781e+01 
  8.016000e+03   5.751177e-06   6.031003e-06   8.333609e-06   4.636052e+01 
  8.032000e+03   5.551115e-06   5.987262e-06   8.164691e-06   4.716473e+01 
  8.048000e+03   5.556153e-06   5.757775e-06   8.001425e-06   4.602094e+01 
  8.064000e+03   5.765623e-06   5.780239e-06   8.164165e-06   4.507253e+01 
  8.080000e+03   5.918436e-06   5.809997e-06   8.293609e-06   4.447027e+01 
  8.096000e+03   6.092465e-06   5.692459e-06   8.337998e-06   4.305600e+01 
  8.112000e+03   5.982798e-06   5.851512e-06   8.368635e-06   4.436440e+01 
  8.128000e+03   6.027490e-06   5.769822e-06   8.343949e-06   4.374879e+01 
  8.144000e+03   5.919306e-06   5.569830e-06   8.127804e-06   4.325771e+01 
  8.160000e+03   5.794601e-06   5.432827e-06   7.943111e-06   4.315443e+01 
  8.176000e+03   5.999663e-06   5.632386e-06   8.229200e-06   4.319151e+01 
  8.192000e+03   6.049768e-06   5.879097e-06   8.435844e-06   4.418030e+01 
  8.208000e+03   5.766031e-06   5.531818e-06   7.990502e-06   4.381238e+01 
  8.224000e+03   5.778667e-06   5.254840e-06   7.810656e-06   4.228186e+01 
  8.240000e+03   5.960330e-06   5.462573e-06   8.084878e-06   4.250489e+01 
  8.256000e+03   5.905526e-06   5.399744e-06   8.002030e-06   4.243837e+01 
  8.272000e+03   5.563532e-06   5.224922e-06   7.632345e-06   4.320228e+01 
  8.288000e+03   5.574193e-06   5.431545e-06   7.782885e-06   4.425741e+01 
  8.304000e+03   5.751201e-06   5.375553e-06   7.872285e-06   4.306638e+01 
  8.320000e+03   5.606046e-06   5.269936e-06   7.694152e-06   4.322990e+01 
  8.336000e+03   5.561101e-06   5.438277e-06   7.778220e-06   4.436023e+01 
  8.352000e+03   5.548523e-06   5.533152e-06   7.835935e-06   4.492052e+01 
  8.368000e+03   5.512335e-06   5.782979e-06   7.989285e-06   4.637259e+01 
  8.384000e+03   5.543706e-06   5.824011e-06   8.040633e-06   4.641251e+01 
  8.400000e+03   5.501343e-06   5.651844e-06   7.887213e-06   4.577310e+01 
  8.416000e+03   5.372933e-06   5.671312e-06   7.812310e-06   4.654757e+01 
  8.432000e+03   5.522783e-06   5.549117e-06   7.829038e-06   4.513627e+01 
  8.448000e+03   5.781525e-06   5.403729e-06   7.913679e-06   4.306549e+01 
  8.464000e+03   5.584782e-06   5.535807e-06   7.863520e-06   4.474767e+01 
  8.480000e+03   5.436096e-06   5.699451e-06   7.876222e-06   4.635479e+01 
  8.496000e+03   5.595780e-06   5.349401e-06   7.741372e-06   4.371048e+01 
  8.512000e+03   5.597060e-06   4.995331e-06   7.502027e-06   4.174865e+01 
  8.528000e+03   5.425597e-06   4.856148e-06   7.281433e-06   4.182994e+01 
  8.544000e+03   5.281689e-06   4.660525e-06   7.043914e-06   4.142495e+01 
  8.560000e+03   5.331623e-06   4.556876e-06   7.013653e-06   4.052012e+01 
  8.576000e+03   5.267162e-06   4.979044e-06   7.248026e-06   4.338929e+01 
  8.592000e+03   5.374906e-06   5.356525e-06   7.588279e-06   4.490186e+01 
  8.608000e+03   5.448298e-06   5.466576e-06   7.717992e-06   4.509594e+01 
  8.624000e+03   5.309102e-06   5.358602e-06   7.543287e-06   4.526586e+01 
  8.640000e+03   5.129281e-06   5.301699e-06   7.376824e-06   4.594698e+01 
  8.656000e+03   4.873597e-06   5.321770e-06   7.216176e-06   4.751702e+01 
  8.672000e+03   4.826719e-06   5.260450e-06   7.139296e-06   4.746210e+01 
  8.688000e+03   4.879869e-06   5.120942e-06   7.073695e-06   4.638086e+01 
  8.704000e+03   4.827129e-06   5.148493e-06   7.057489e-06   4.684514e+01 
  8.720000e+03   4.955210e-06   5.122330e-06   7.126876e-06   4.595007e+01 
  8.736000e+03   4.910971e-06   4.920959e-06   6.952228e-06   4.505820e+01 
  8.752000e+03   4.908280e-06   4.829108e-06   6.885601e-06   4.453415e+01 
  8.768000e+03   5.153305e-06   4.689000e-06   6.967300e-06   4.229910e+01 
  8.784000e+03   5.294989e-06   4.790252e-06   7.140268e-06   4.213490e+01 
  8.800000e+03   4.894648e-06   4.878078e-06   6.910371e-06   4.490285e+01 
  8.816000e+03   4.620044e-06   4.721730e-06   6.606023e-06   4.562364e+01 
  8.832000e+03   4.982190e-06   4.628915e-06   6.800667e-06   4.289493e+01 
  8.848000e+03   5.190774e-06   4.647904e-06   6.967578e-06   4.184179e+01 
  8.864000e+03   4.944558e-06   4.557783e-06   6.724733e-06   4.266917e+01 
  8.880000e+03   4.844679e-06   4.865217e-06   6.865949e-06   4.512119e+01 
  8.896000e+03   5.079457e-06   5.217001e-06   7.281345e-06   4.576533e+01 
  8.912000e+03   5.295810e-06   5.173385e-06   7.403345e-06   4.433002e+01 
  8.928000e+03   5.250356e-06   4.872394e-06   7.162853e-06   4.286169e+01 
  8.944000e+03   5.067400e-06   4.566408e-06   6.821336e-06   4.202309e+01 
  8.960000e+03   4.952960e-06   4.635553e-06   6.783816e-06   4.310404e+01 
  8.976000e+03   4.710431e-06   4.604102e-06   6.586799e-06   4.434597e+01 
  8.992000e+03   4.239170e-06   4.592561e-06   6.249974e-06   4.729140e+01 
  9.008000e+03   4.385434e-06   4.633876e-06   6.380034e-06   4.657784e+01 
  9.024000e+03   4.851911e-06   4.653519e-06   6.722818e-06   4.380433e+01 
  9.040000e+03   4.970928e-06   4.711887e-06   6.849234e-06   4.346755e+01 
  9.056000e+03   4.894092e-06   4.739401e-06   6.812786e-06   4.408004e+01 
  9.072000e+03   4.599234e-06   4.846152e-06   6.681179e-06   4.649746e+01 
  9.088000e+03   4.400537e-06   5.021284e-06   6.676677e-06   4.876942e+01 
  9.104000e+03   4.545770e-06   5.013766e-06   6.767707e-06   4.780273e+01 
  9.120000e+03   4.667059e-06   4.684147e-06   6.612313e-06   4.510470e+01 
  9.136000e+03   4.549193e-06   4.335909e-06   6.284526e-06   4.362490e+01 
  9.152000e+03   4.401671e-06   4.204967e-06   6.087402e-06   4.369074e+01 
  9.168000e+03   4.376090e-06   4.321994e-06   6.150593e-06   4.464367e+01 
  9.184000e+03   4.639894e-06   4.593761e-06   6.529262e-06   4.471374e+01 
  9.200000e+03   4.544651e-06   4.481288e-06   6.382460e-06   4.459778e+01 
  9.216000e+03   4.406886e-06   4.279525e-06   6.142880e-06   4.415999e+01 
  9.232000e+03   4.500559e-06   4.305843e-06   6.228589e-06   4.373335e+01 
  9.248000e+03   4.565559e-06   4.467442e-06   6.387673e-06   4.437767e+01 
  9.264000e+03   4.741536e-06   4.601636e-06   6.607361e-06   4.414214e+01 
  9.280000e+03   4.646737e-06   4.687239e-06   6.600179e-06   4.524862e+01 
  9.296000e+03   4.439577e-06   4.751971e-06   6.503159e-06   4.694657e+01 
  9.312000e+03   4.471517e-06   4.593662e-06   6.410631e-06   4.577197e+01 
  9.328000e+03   4.359955e-06   4.417659e-06   6.206844e-06   4.537666e+01 
  9.344000e+03   4.199304e-06   4.254893e-06   5.978150e-06   4.537672e+01 
  9.360000e+03   4.411282e-06   4.368742e-06   6.208487e-06   4.472240e+01 
  9.376000e+03   4.542738e-06   4.643712e-06   6.496193e-06   4.562975e+01 
  9.392000e+03   4.389164e-06   4.557176e-06   6.327133e-06   4.607588e+01 
  9.408000e+03   4.410787e-06   4.292659e-06   6.154833e-06   4.422240e+01 
  9.424000e+03   4.453662e-06   4.374888e-06   6.242976e-06   4.448878e+01 
  9.440000e+03   4.160843e-06   4.612629e-06   6.212001e-06   4.794781e+01 
  9.456000e+03   3.846766e-06   4.506184e-06   5.924804e-06   4.951382e+01 
  9.472000e+03   4.025957e-06   4.226571e-06   5.837142e-06   4.639255e+01 
  9.488000e+03   4.237161e-06   4.208322e-06   5.971893e-06   4.480435e+01 
  9.504000e+03   4.296343e-06   4.335735e-06   6.103865e-06   4.526146e+01 
  9.520000e+03   4.462700e-06   4.365555e-06   6.242897e-06   4.436955e+01 
  9.536000e+03   4.285482e-06   4.417567e-06   6.154694e-06   4.586951e+01 
  9.552000e+03   3.973832e-06   4.296439e-06   5.852412e-06   4.723386e+01 
  9.568000e+03   4.037415e-06   4.184039e-06   5.814371e-06   4.602172e+01 
  9.584000e+03   4.177779e-06   4.372658e-06   6.047642e-06   4.630563e+01 
  9.600000e+03   4.304904e-06   4.329211e-06   6.105265e-06   4.516130e+01 
  9.616000e+03   4.253268e-06   4.193564e-06   5.972961e-06   4.459503e+01 
  9.632000e+03   4.281881e-06   4.150441e-06   5.963277e-06   4.410696e+01 
  9.648000e+03   4.301736e-06   4.034087e-06   5.897355e-06   4.316096e+01 
  9.664000e+03   4.201950e-06   3.939094e-06   5.759588e-06   4.315070e+01 
  9.680000e+03   4.125582e-06   4.217648e-06   5.899913e-06   4.563222e+01 
  9.696000e+03   4.050714e-06   4.418147e-06   5.994023e-06   4.748429e+01 
  9.712000e+03   3.813645e-06   4.349435e-06   5.784590e-06   4.875526e+01 
  9.728000e+03   3.945595e-06   4.217072e-06   5.775069e-06   4.690486e+01 
  9.744000e+03   4.054787e-06   4.210841e-06   5.845723e-06   4.608161e+01 
  9.760000e+03   4.089368e-06   4.432197e-06   6.030531e-06   4.730381e+01 
  9.776000e+03   4.291042e-06   4.319203e-06   6.088395e-06   4.518739e+01 
  9.792000e+03   4.269029e-06   4.011414e-06   5.857991e-06   4.321803e+01 
  9.808000e+03   4.067012e-06   4.092703e-06   5.769819e-06   4.518039e+01 
  9.824000e+03   3.962611e-06   4.157556e-06   5.743480e-06   4.637526e+01 
  9.840000e+03   3.838922e-06   4.111791e-06   5.625312e-06   4.696562e+01 
  9.856000e+03   3.767685e-06   4.061073e-06   5.539654e-06   4.714619e+01 
  9.872000e+03   3.802109e-06   4.139617e-06   5.620718e-06   4.743349e+01 
  9.888000e+03   4.002192e-06   4.214206e-06   5.811804e-06   4.647811e+01 
  9.904000e+03   4.197077e-06   4.151425e-06   5.903370e-06   4.468670e+01 
  9.920000e+03   3.979882e-06   4.021436e-06   5.657863e-06   4.529756e+01 
  9.936000e+03   3.868994e-06   3.789121e-06   5.415399e-06   4.440243e+01 
  9.952000e+03   4.079556e-06   3.803989e-06   5.577912e-06   4.299806e+01 
  9.968000e+03   4.016562e-06   3.926765e-06   5.617140e-06   4.435231e+01 
  9.984000e+03   3.856444e-06   3.919184e-06   5.498378e-06   4.546229e+01 
  1.000000e+04   3.856373e-06   3.745107e-06   5.375633e-06   4.416140e+01 
  1.001600e+04   3.928741e-06   3.724008e-06   5.413247e-06   4.346754e+01 
  1.003200e+04   4.048834e-06   3.750454e-06   5.518964e-06   4.280908e+01 
  1.004800e+04   4.135772e-06   3.740667e-06   5.576486e-06   4.212828e+01 
  1.006400e+04   4.062594e-06   3.629915e-06   5.448022e-06   4.178069e+01 
  1.008000e+04   3.969402e-06   3.495168e-06   5.288889e-06   4.136480e+01 
  1.009600e+04   3.835752e-06   3.568467e-06   5.238984e-06   4.293258e+01 
  1.011200e+04   3.648537e-06   3.763162e-06   5.241489e-06   4.588602e+01 
  1.012800e+04   3.716027e-06   3.915868e-06   5.398414e-06   4.649994e+01 
  1.014400e+04   3.987212e-06   3.825996e-06   5.525949e-06   4.381794e+01 
  1.016000e+04   3.932487e-06   3.621265e-06   5.345841e-06   4.264069e+01 
  1.017600e+04   3.963518e-06   3.771830e-06   5.471396e-06   4.358045e+01 
  1.019200e+04   4.050455e-06   3.961506e-06   5.665660e-06   4.436392e+01 
  1.020800e+04   3.895395e-06   3.971441e-06   5.562953e-06   4.555384e+01 
  1.022400e+04   3.582140e-06   4.047210e-06   5.404779e-06   4.848832e+01 
  1.024000e+04   3.488395e-06   4.015141e-06   5.318859e-06   4.901556e+01 
  1.025600e+04   3.508215e-06   4.018476e-06   5.334391e-06   4.887835e+01 
  1.027200e+04   3.840657e-06   4.075423e-06   5.599975e-06   4.669872e+01 
  1.028800e+04   4.044480e-06   3.966046e-06   5.664569e-06   4.443901e+01 
  1.030400e+04   4.058537e-06   3.921590e-06   5.643633e-06   4.401685e+01 
  1.032000e+04   3.953407e-06   3.825051e-06   5.500949e-06   4.405462e+01 
  1.033600e+04   4.034214e-06   3.639628e-06   5.433395e-06   4.205646e+01 
  1.035200e+04   3.970984e-06   3.475149e-06   5.276871e-06   4.119032e+01 
  1.036800e+04   3.811243e-06   3.786661e-06   5.372558e-06   4.481463e+01 
  1.038400e+04   3.867995e-06   3.917527e-06   5.505307e-06   4.536451e+01 
  1.040000e+04   3.939333e-06   3.892396e-06   5.537968e-06   4.465662e+01 
  1.041600e+04   3.855575e-06   3.953515e-06   5.522294e-06   4.571855e+01 
  1.043200e+04   3.799177e-06   3.930779e-06   5.466697e-06   4.597536e+01 
  1.044800e+04   3.831011e-06   3.913318e-06   5.476377e-06   4.560891e+01 
  1.046400e+04   3.905179e-06   3.818446e-06   5.461772e-06   4.435662e+01 
  1.048000e+04   4.140797e-06   3.900881e-06   5.688854e-06   4.329114e+01 
  1.049600e+04   4.067017e-06   3.820710e-06   5.580184e-06   4.321143e+01 
  1.051200e+04   3.945554e-06   3.675388e-06   5.392205e-06   4.296969e+01 
  1.052800e+04   4.184974e-06   4.242737e-06   5.959432e-06   4.539269e+01 
  1.054400e+04   4.176512e-06   4.573212e-06   6.193345e-06   4.759593e+01 
  1.056000e+04   3.863718e-06   4.103941e-06   5.636545e-06   4.672693e+01 
  1.057600e+04   3.765970e-06   3.663949e-06   5.254241e-06   4.421331e+01 
  1.059200e+04   3.647010e-06   3.755398e-06   5.234854e-06   4.583887e+01 
  1.060800e+04   3.570800e-06   3.974254e-06   5.342781e-06   4.806084e+01 
  1.062400e+04   3.620621e-06   3.955931e-06   5.362675e-06   4.753404e+01 
  1.064000e+04   3.771846e-06   3.810027e-06   5.361262e-06   4.528852e+01 
  1.065600e+04   3.876103e-06   3.794256e-06   5.424072e-06   4.438865e+01 
  1.067200e+04   3.790184e-06   3.816884e-06   5.379043e-06   4.520109e+01 
  1.068800e+04   3.708554e-06   3.960818e-06   5.425998e-06   4.688391e+01 
  1.070400e+04   3.727356e-06   4.133707e-06   5.566032e-06   4.795908e+01 
  1.072000e+04   3.702714e-06   4.027056e-06   5.470582e-06   4.740273e+01 
  1.073600e+04   3.714861e-06   3.955403e-06   5.426363e-06   4.679622e+01 
  1.075200e+04   3.871746e-06   4.023108e-06   5.583530e-06   4.609835e+01 
  1.076800e+04   3.892360e-06   3.930727e-06   5.531824e-06   4.528099e+01 
  1.078400e+04   3.768672e-06   3.898891e-06   5.422567e-06   4.597297e+01 
  1.080000e+04   3.876463e-06   4.110130e-06   5.649791e-06   4.667584e+01 
  1.081600e+04   3.935013e-06   3.943274e-06   5.570793e-06   4.506008e+01 
  1.083200e+04   3.741729e-06   3.790707e-06   5.326348e-06   4.537254e+01 
  1.084800e+04   3.638952e-06   3.835792e-06   5.287275e-06   4.650848e+01 
  1.086400e+04   3.686426e-06   3.896537e-06   5.364023e-06   4.658715e+01 
  1.088000e+04   3.652447e-06   3.832825e-06   5.294423e-06   4.638043e+01 
  1.089600e+04   3.631208e-06   3.841302e-06   5.285950e-06   4.661048e+01 
  1.091200e+04   3.694563e-06   3.923315e-06   5.389081e-06   4.671998e+01 
  1.092800e+04   3.877572e-06   3.897149e-06   5.497575e-06   4.514427e+01 
  1.094400e+04   4.048720e-06   3.824937e-06   5.569765e-06   4.337199e+01 
  1.096000e+04   3.948373e-06   3.690095e-06   5.404299e-06   4.306340e+01 
  1.097600e+04   3.650756e-06   3.681993e-06   5.185083e-06   4.524407e+01 
  1.099200e+04   3.634210e-06   3.912708e-06   5.340109e-06   4.711338e+01 
  1.100800e+04   3.843354e-06   4.104410e-06   5.622949e-06   4.688129e+01 
  1.102400e+04   3.912013e-06   4.100670e-06   5.667393e-06   4.634877e+01 
  1.104000e+04   3.864420e-06   4.113952e-06   5.644320e-06   4.679140e+01 
  1.105600e+04   3.721671e-06   3.984051e-06   5.451926e-06   4.695016e+01 
  1.107200e+04   3.684409e-06   3.989269e-06   5.430391e-06   4.727505e+01 
  1.108800e+04   3.899914e-06   4.097128e-06   5.656481e-06   4.641267e+01 
  1.110400e+04   3.971468e-06   3.885763e-06   5.556232e-06   4.437506e+01 
  1.112000e+04   3.797041e-06   3.658696e-06   5.272909e-06   4.393697e+01 
  1.113600e+04   3.707223e-06   3.610148e-06   5.174618e-06   4.423994e+01 
  1.115200e+04   3.866059e-06   3.663920e-06   5.326417e-06   4.346229e+01 
  1.116800e+04   4.063224e-06   3.751395e-06   5.530168e-06   4.271492e+01 
  1.118400e+04   3.969234e-06   3.943564e-06   5.595223e-06   4.481413e+01 
  1.120000e+04   3.807572e-06   3.934580e-06   5.475265e-06   4.593984e+01 
  1.121600e+04   3.794683e-06   4.017689e-06   5.526431e-06   4.663508e+01 
  1.123200e+04   3.736287e-06   4.015428e-06   5.484842e-06   4.706234e+01 
  1.124800e+04   3.543604e-06   3.900694e-06   5.269966e-06   4.774627e+01 
  1.126400e+04   3.608729e-06   3.784764e-06   5.229471e-06   4.636391e+01 
  1.128000e+04   3.630016e-06   3.693829e-06   5.178937e-06   4.549921e+01 
  1.129600e+04   3.645405e-06   3.817099e-06   5.278184e-06   4.631800e+01 
  1.131200e+04   3.772258e-06   3.943633e-06   5.457304e-06   4.627237e+01 
  1.132800e+04   3.809701e-06   3.964354e-06   5.498175e-06   4.613966e+01 
  1.134400e+04   3.682919e-06   3.761339e-06   5.264177e-06   4.560355e+01 
  1.136000e+04   3.759307e-06   3.759542e-06   5.316630e-06   4.500179e+01 
  1.137600e+04   3.727288e-06   3.845216e-06   5.355218e-06   4.589220e+01 
  1.139200e+04   3.634124e-06   3.851336e-06   5.295248e-06   4.666213e+01 
  1.140800e+04   3.760655e-06   3.904604e-06   5.421112e-06   4.607585e+01 
  1.142400e+04   3.847519e-06   3.805449e-06   5.411547e-06   4.468504e+01 
  1.144000e+04   3.920858e-06   3.725310e-06   5.408424e-06   4.353500e+01 
  1.145600e+04   3.753512e-06   3.650292e-06   5.235789e-06   4.420127e+01 
  1.147200e+04   3.558762e-06   3.667012e-06   5.109967e-06   4.585829e+01 
  1.148800e+04   3.696731e-06   3.613221e-06   5.169254e-06   4.434548e+01 
  1.150400e+04   3.736408e-06   3.508531e-06   5.125479e-06   4.319845e+01 
  1.152000e+04   3.719972e-06   3.560376e-06   5.149220e-06   4.374420e+01 
  1.153600e+04   3.771930e-06   3.629877e-06   5.234832e-06   4.390053e+01 
  1.155200e+04   3.888739e-06   3.665539e-06   5.344013e-06   4.330762e+01 
  1.156800e+04   3.966114e-06   3.821714e-06   5.507772e-06   4.393776e+01 
  1.158400e+04   3.873570e-06   4.065861e-06   5.615671e-06   4.638741e+01 
  1.160000e+04   3.722836e-06   4.076619e-06   5.520718e-06   4.759715e+01 
  1.161600e+04   3.602549e-06   3.858542e-06   5.278893e-06   4.696507e+01 
  1.163200e+04   3.658374e-06   3.591437e-06   5.126608e-06   4.447100e+01 
  1.164800e+04   3.647830e-06   3.631544e-06   5.147308e-06   4.487181e+01 
  1.166400e+04   3.886263e-06   3.765882e-06   5.411553e-06   4.409871e+01 
  1.168000e+04   3.986867e-06   3.799665e-06   5.507501e-06   4.362277e+01 
  1.169600e+04   3.775667e-06   3.765334e-06   5.332298e-06   4.492149e+01 
  1.171200e+04   3.695125e-06   3.797400e-06   5.298509e-06   4.578205e+01 
  1.172800e+04   3.766939e-06   3.831807e-06   5.373320e-06   4.548910e+01 
  1.174400e+04   3.851551e-06   3.716454e-06   5.352240e-06   4.397731e+01 
  1.176000e+04   3.726587e-06   3.685003e-06   5.240868e-06   4.467854e+01 
  1.177600e+04   3.542521e-06   3.758452e-06   5.164824e-06   4.669407e+01 
  1.179200e+04   3.686486e-06   3.889964e-06   5.359291e-06   4.653840e+01 
  1.180800e+04   4.139938e-06   3.831586e-06   5.640934e-06   4.278480e+01 
  1.182400e+04   4.121579e-06   3.740585e-06   5.565913e-06   4.222566e+01 
  1.184000e+04   3.610687e-06   3.771882e-06   5.221508e-06   4.625082e+01 
  1.185600e+04   3.495991e-06   3.621284e-06   5.033452e-06   4.600853e+01 
  1.187200e+04   3.622184e-06   3.513194e-06   5.046063e-06   4.412489e+01 
  1.188800e+04   3.849960e-06   3.656731e-06   5.309791e-06   4.352548e+01 
  1.190400e+04   3.976285e-06   3.721096e-06   5.445861e-06   4.310118e+01 
  1.192000e+04   3.674904e-06   3.782627e-06   5.273821e-06   4.582757e+01 
  1.193600e+04   3.434311e-06   3.826998e-06   5.142024e-06   4.809550e+01 
  1.195200e+04   3.544628e-06   3.675634e-06   5.106337e-06   4.603947e+01 
  1.196800e+04   3.673008e-06   3.571591e-06   5.123207e-06   4.419797e+01 
  1.198400e+04   3.664151e-06   3.644447e-06   5.167979e-06   4.484553e+01 
  1.200000e+04   3.703215e-06   3.741429e-06   5.264228e-06   4.529410e+01 
  1.201600e+04   3.648034e-06   3.781978e-06   5.254665e-06   4.603278e+01 
  1.203200e+04   3.670504e-06   3.850814e-06   5.319903e-06   4.637330e+01 
  1.204800e+04   3.728079e-06   3.775121e-06   5.305668e-06   4.535921e+01 
  1.206400e+04   3.493078e-06   3.651638e-06   5.053321e-06   4.627133e+01 
  1.208000e+04   3.523382e-06   3.588802e-06   5.029286e-06   4.552700e+01 
  1.209600e+04   3.754596e-06   3.585340e-06   5.191499e-06   4.367902e+01 
  1.211200e+04   3.842399e-06   3.699985e-06   5.334221e-06   4.391828e+01 
  1.212800e+04   3.680543e-06   3.765724e-06   5.265651e-06   4.565540e+01 
  1.214400e+04   3.532829e-06   3.695567e-06   5.112543e-06   4.628972e+01 
  1.216000e+04   3.438722e-06   3.577420e-06   4.962131e-06   4.613249e+01 
  1.217600e+04   3.528794e-06   3.622757e-06   5.057347e-06   4.575276e+01 
  1.219200e+04   3.601148e-06   3.681734e-06   5.150091e-06   4.563395e+01 
  1.220800e+04   3.597055e-06   3.576708e-06   5.072637e-06   4.483750e+01 
  1.222400e+04   3.574311e-06   3.464427e-06   4.977746e-06   4.410561e+01 
  1.224000e+04   3.562704e-06   3.492672e-06   4.989150e-06   4.443129e+01 
  1.225600e+04   3.619622e-06   3.497582e-06   5.033363e-06   4.401763e+01 
  1.227200e+04   3.762477e-06   3.511199e-06   5.146334e-06   4.302143e+01 
  1.228800e+04   3.881729e-06   3.528613e-06   5.245849e-06   4.227181e+01 
  1.230400e+04   3.823854e-06   3.709953e-06   5.327815e-06   4.413383e+01 
  1.232000e+04   3.680840e-06   3.863275e-06   5.336054e-06   4.638528e+01 
  1.233600e+04   3.587244e-06   3.991752e-06   5.366787e-06   4.805510e+01 
  1.235200e+04   3.641188e-06   3.965878e-06   5.383905e-06   4.744405e+01 
  1.236800e+04   3.607712e-06   3.675057e-06   5.149916e-06   4.552980e+01 
  1.238400e+04   3.651704e-06   3.655244e-06   5.166793e-06   4.502776e+01 
  1.240000e+04   3.774625e-06   3.807846e-06   5.361668e-06   4.525103e+01 
  1.241600e+04   3.839456e-06   3.775066e-06   5.384473e-06   4.451551e+01 
  1.243200e+04   3.658819e-06   3.754703e-06   5.242590e-06   4.574100e+01 
  1.244800e+04   3.431782e-06   3.434562e-06   4.855239e-06   4.502319e+01 
  1.246400e+04   3.393008e-06   3.222415e-06   4.679366e-06   4.352283e+01 
  1.248000e+04   3.380793e-06   3.348312e-06   4.758251e-06   4.472343e+01 
  1.249600e+04   3.352723e-06   3.513958e-06   4.856815e-06   4.634510e+01 
  1.251200e+04   3.341398e-06   3.533305e-06   4.863043e-06   4.659899e+01 
  1.252800e+04   3.534867e-06   3.504618e-06   4.977714e-06   4.475380e+01 
  1.254400e+04   3.610894e-06   3.493549e-06   5.024285e-06   4.405372e+01 
  1.256000e+04   3.648886e-06   3.563048e-06   5.099968e-06   4.431808e+01 
  1.257600e+04   3.564942e-06   3.632913e-06   5.089879e-06   4.554104e+01 
  1.259200e+04   3.378828e-06   3.643117e-06   4.968781e-06   4.715546e+01 
  1.260800e+04   3.160214e-06   3.435629e-06   4.668030e-06   4.739104e+01 
  1.262400e+04   3.293899e-06   3.304385e-06   4.665697e-06   4.509105e+01 
  1.264000e+04   3.542458e-06   3.480963e-06   4.966499e-06   4.449834e+01 
  1.265600e+04   3.556680e-06   3.562482e-06   5.034010e-06   4.504669e+01 
  1.267200e+04   3.609847e-06   3.576657e-06   5.081680e-06   4.473538e+01 
  1.268800e+04   3.559329e-06   3.691609e-06   5.128040e-06   4.604514e+01 
  1.270400e+04   3.646655e-06   3.772428e-06   5.246838e-06   4.597123e+01 
  1.272000e+04   3.590399e-06   3.668327e-06   5.132990e-06   4.561509e+01 
  1.273600e+04   3.478818e-06   3.422671e-06   4.880251e-06   4.453388e+01 
  1.275200e+04   3.344555e-06   3.228272e-06   4.648418e-06   4.398645e+01 
  1.276800e+04   3.328515e-06   3.378171e-06   4.742473e-06   4.542420e+01 
  1.278400e+04   3.505271e-06   3.594824e-06   5.020924e-06   4.572263e+01 
  1.280000e+04   3.653605e-06   3.616377e-06   5.140721e-06   4.470660e+01 
