  0.000000e+00   2.295103e-03   0.000000e+00   2.295103e-03   0.000000e+00 
  2.500000e-01   3.087361e-03   0.000000e+00   3.087361e-03   0.000000e+00 
  5.000000e-01   3.133518e-03   0.000000e+00   3.133518e-03   0.000000e+00 
  7.500000e-01   2.766146e-03   0.000000e+00   2.766146e-03   0.000000e+00 
  1.000000e+00   1.960731e-03   0.000000e+00   1.960731e-03   0.000000e+00 
  1.250000e+00   1.592642e-03   0.000000e+00   1.592642e-03   0.000000e+00 
  1.500000e+00   1.760883e-03   0.000000e+00   1.760883e-03   0.000000e+00 
  1.750000e+00   1.906961e-03   0.000000e+00   1.906961e-03   0.000000e+00 
  2.000000e+00   1.314417e-03   0.000000e+00   1.314417e-03   0.000000e+00 
  2.250000e+00   1.140579e-03   0.000000e+00   1.140579e-03   0.000000e+00 
  2.500000e+00   1.078181e-03   0.000000e+00   1.078181e-03   0.000000e+00 
  2.750000e+00   9.694573e-04   0.000000e+00   9.694573e-04   0.000000e+00 
  3.000000e+00   1.264032e-03   0.000000e+00   1.264032e-03   0.000000e+00 
  3.250000e+00   1.294973e-03   0.000000e+00   1.294973e-03   0.000000e+00 
  3.500000e+00   9.971067e-04   0.000000e+00   9.971067e-04   0.000000e+00 
  3.750000e+00   1.081200e-03   0.000000e+00   1.081200e-03   0.000000e+00 
  4.000000e+00   9.836731e-04   0.000000e+00   9.836731e-04   0.000000e+00 
  4.250000e+00   1.065191e-03   0.000000e+00   1.065191e-03   0.000000e+00 
  4.500000e+00   9.117851e-04   0.000000e+00   9.117851e-04   0.000000e+00 
  4.750000e+00   1.027657e-03   0.000000e+00   1.027657e-03   0.000000e+00 
  5.000000e+00   7.507181e-04   0.000000e+00   7.507181e-04   0.000000e+00 
  5.250000e+00   6.283403e-04   0.000000e+00   6.283403e-04   0.000000e+00 
  5.500000e+00   5.350603e-04   0.000000e+00   5.350603e-04   0.000000e+00 
  5.750000e+00   7.762082e-04   0.000000e+00   7.762082e-04   0.000000e+00 
  6.000000e+00   7.117090e-04   0.000000e+00   7.117090e-04   0.000000e+00 
  6.250000e+00   6.012019e-04   0.000000e+00   6.012019e-04   0.000000e+00 
  6.500000e+00   6.354956e-04   0.000000e+00   6.354956e-04   0.000000e+00 
  6.750000e+00   8.264800e-04   0.000000e+00   8.264800e-04   0.000000e+00 
  7.000000e+00   8.033042e-04   0.000000e+00   8.033042e-04   0.000000e+00 
  7.250000e+00   5.333422e-04   0.000000e+00   5.333422e-04   0.000000e+00 
  7.500000e+00   6.204334e-04   0.000000e+00   6.204334e-04   0.000000e+00 
  7.750000e+00   5.518336e-04   0.000000e+00   5.518336e-04   0.000000e+00 
  8.000000e+00   5.593817e-04   0.000000e+00   5.593817e-04   0.000000e+00 
  8.250000e+00   6.634874e-04   0.000000e+00   6.634874e-04   0.000000e+00 
  8.500000e+00   6.020016e-04   0.000000e+00   6.020016e-04   0.000000e+00 
  8.750000e+00   4.746486e-04   0.000000e+00   4.746486e-04   0.000000e+00 
  9.000000e+00   5.350742e-04   0.000000e+00   5.350742e-04   0.000000e+00 
  9.250000e+00   4.662045e-04   0.000000e+00   4.662045e-04   0.000000e+00 
  9.500000e+00   5.396591e-04   0.000000e+00   5.396591e-04   0.000000e+00 
  9.750000e+00   6.068939e-04   0.000000e+00   6.068939e-04   0.000000e+00 
  1.000000e+01   6.241224e-04   0.000000e+00   6.241224e-04   0.000000e+00 
  1.025000e+01   5.114019e-04   0.000000e+00   5.114019e-04   0.000000e+00 
  1.050000e+01   4.543926e-04   0.000000e+00   4.543926e-04   0.000000e+00 
  1.075000e+01   4.635261e-04   0.000000e+00   4.635261e-04   0.000000e+00 
  1.100000e+01   5.325025e-04   0.000000e+00   5.325025e-04   0.000000e+00 
  1.125000e+01   5.416348e-04   0.000000e+00   5.416348e-04   0.000000e+00 
  1.150000e+01   3.795275e-04   0.000000e+00   3.795275e-04   0.000000e+00 
  1.175000e+01   3.316440e-04   0.000000e+00   3.316440e-04   0.000000e+00 
  1.200000e+01   3.946508e-04   0.000000e+00   3.946508e-04   0.000000e+00 
  1.225000e+01   4.167954e-04   0.000000e+00   4.167954e-04   0.000000e+00 
  1.250000e+01   4.482689e-04   0.000000e+00   4.482689e-04   0.000000e+00 
  1.275000e+01   3.999449e-04   0.000000e+00   3.999449e-04   0.000000e+00 
  1.300000e+01   4.663853e-04   0.000000e+00   4.663853e-04   0.000000e+00 
  1.325000e+01   4.411504e-04   0.000000e+00   4.411504e-04   0.000000e+00 
  1.350000e+01   4.875255e-04   0.000000e+00   4.875255e-04   0.000000e+00 
  1.375000e+01   4.742845e-04   0.000000e+00   4.742845e-04   0.000000e+00 
  1.400000e+01   4.578767e-04   0.000000e+00   4.578767e-04   0.000000e+00 
  1.425000e+01   3.801571e-04   0.000000e+00   3.801571e-04   0.000000e+00 
  1.450000e+01   3.799776e-04   0.000000e+00   3.799776e-04   0.000000e+00 
  1.475000e+01   3.160888e-04   0.000000e+00   3.160888e-04   0.000000e+00 
  1.500000e+01   4.064223e-04   0.000000e+00   4.064223e-04   0.000000e+00 
  1.525000e+01   3.502536e-04   0.000000e+00   3.502536e-04   0.000000e+00 
  1.550000e+01   2.646636e-04   0.000000e+00   2.646636e-04   0.000000e+00 
  1.575000e+01   3.644489e-04   0.000000e+00   3.644489e-04   0.000000e+00 
  1.600000e+01   3.411373e-04   0.000000e+00   3.411373e-04   0.000000e+00 
  1.625000e+01   2.802632e-04   0.000000e+00   2.802632e-04   0.000000e+00 
  1.650000e+01   3.187449e-04   0.000000e+00   3.187449e-04   0.000000e+00 
  1.675000e+01   3.685565e-04   0.000000e+00   3.685565e-04   0.000000e+00 
  1.700000e+01   3.377595e-04   0.000000e+00   3.377595e-04   0.000000e+00 
  1.725000e+01   2.358625e-04   0.000000e+00   2.358625e-04   0.000000e+00 
  1.750000e+01   2.330882e-04   0.000000e+00   2.330882e-04   0.000000e+00 
  1.775000e+01   3.238174e-04   0.000000e+00   3.238174e-04   0.000000e+00 
  1.800000e+01   3.606129e-04   0.000000e+00   3.606129e-04   0.000000e+00 
  1.825000e+01   2.979626e-04   0.000000e+00   2.979626e-04   0.000000e+00 
  1.850000e+01   2.265038e-04   0.000000e+00   2.265038e-04   0.000000e+00 
  1.875000e+01   2.182887e-04   0.000000e+00   2.182887e-04   0.000000e+00 
  1.900000e+01   2.018125e-04   0.000000e+00   2.018125e-04   0.000000e+00 
  1.925000e+01   2.914995e-04   0.000000e+00   2.914995e-04   0.000000e+00 
  1.950000e+01   3.192670e-04   0.000000e+00   3.192670e-04   0.000000e+00 
  1.975000e+01   2.155853e-04   0.000000e+00   2.155853e-04   0.000000e+00 
  2.000000e+01   1.474339e-04   0.000000e+00   1.474339e-04   0.000000e+00 
  2.025000e+01   1.827048e-04   0.000000e+00   1.827048e-04   0.000000e+00 
  2.050000e+01   2.674700e-04   0.000000e+00   2.674700e-04   0.000000e+00 
  2.075000e+01   2.692518e-04   0.000000e+00   2.692518e-04   0.000000e+00 
  2.100000e+01   1.831292e-04   0.000000e+00   1.831292e-04   0.000000e+00 
  2.125000e+01   1.396297e-04   0.000000e+00   1.396297e-04   0.000000e+00 
  2.150000e+01   2.431415e-04   0.000000e+00   2.431415e-04   0.000000e+00 
  2.175000e+01   2.040355e-04   0.000000e+00   2.040355e-04   0.000000e+00 
  2.200000e+01   1.387449e-04   0.000000e+00   1.387449e-04   0.000000e+00 
  2.225000e+01   2.208602e-04   0.000000e+00   2.208602e-04   0.000000e+00 
  2.250000e+01   1.831092e-04   0.000000e+00   1.831092e-04   0.000000e+00 
  2.275000e+01   2.339230e-04   0.000000e+00   2.339230e-04   0.000000e+00 
  2.300000e+01   1.596372e-04   0.000000e+00   1.596372e-04   0.000000e+00 
  2.325000e+01   1.729292e-04   0.000000e+00   1.729292e-04   0.000000e+00 
  2.350000e+01   1.732689e-04   0.000000e+00   1.732689e-04   0.000000e+00 
  2.375000e+01   1.391737e-04   0.000000e+00   1.391737e-04   0.000000e+00 
  2.400000e+01   1.522188e-04   0.000000e+00   1.522188e-04   0.000000e+00 
  2.425000e+01   1.538824e-04   0.000000e+00   1.538824e-04   0.000000e+00 
  2.450000e+01   2.244148e-04   0.000000e+00   2.244148e-04   0.000000e+00 
  2.475000e+01   1.609184e-04   0.000000e+00   1.609184e-04   0.000000e+00 
  2.500000e+01   1.622844e-04   0.000000e+00   1.622844e-04   0.000000e+00 
  2.525000e+01   1.392901e-04   0.000000e+00   1.392901e-04   0.000000e+00 
  2.550000e+01   1.828420e-04   0.000000e+00   1.828420e-04   0.000000e+00 
  2.575000e+01   1.966689e-04   0.000000e+00   1.966689e-04   0.000000e+00 
  2.600000e+01   2.481761e-04   0.000000e+00   2.481761e-04   0.000000e+00 
  2.625000e+01   2.861379e-04   0.000000e+00   2.861379e-04   0.000000e+00 
  2.650000e+01   2.158370e-04   0.000000e+00   2.158370e-04   0.000000e+00 
  2.675000e+01   1.434681e-04   0.000000e+00   1.434681e-04   0.000000e+00 
  2.700000e+01   1.170027e-04   0.000000e+00   1.170027e-04   0.000000e+00 
  2.725000e+01   1.102993e-04   0.000000e+00   1.102993e-04   0.000000e+00 
  2.750000e+01   7.950267e-05   0.000000e+00   7.950267e-05   0.000000e+00 
  2.775000e+01   9.598852e-05   0.000000e+00   9.598852e-05   0.000000e+00 
  2.800000e+01   9.742616e-05   0.000000e+00   9.742616e-05   0.000000e+00 
  2.825000e+01   1.394094e-04   0.000000e+00   1.394094e-04   0.000000e+00 
  2.850000e+01   1.003646e-04   0.000000e+00   1.003646e-04   0.000000e+00 
  2.875000e+01   1.302080e-04   0.000000e+00   1.302080e-04   0.000000e+00 
  2.900000e+01   1.444282e-04   0.000000e+00   1.444282e-04   0.000000e+00 
  2.925000e+01   1.082340e-04   0.000000e+00   1.082340e-04   0.000000e+00 
  2.950000e+01   1.773746e-04   0.000000e+00   1.773746e-04   0.000000e+00 
  2.975000e+01   1.743044e-04   0.000000e+00   1.743044e-04   0.000000e+00 
  3.000000e+01   1.530108e-04   0.000000e+00   1.530108e-04   0.000000e+00 
  3.025000e+01   1.723347e-04   0.000000e+00   1.723347e-04   0.000000e+00 
  3.050000e+01   1.502973e-04   0.000000e+00   1.502973e-04   0.000000e+00 
  3.075000e+01   1.161650e-04   0.000000e+00   1.161650e-04   0.000000e+00 
  3.100000e+01   1.152649e-04   0.000000e+00   1.152649e-04   0.000000e+00 
  3.125000e+01   1.159794e-04   0.000000e+00   1.159794e-04   0.000000e+00 
  3.150000e+01   1.125313e-04   0.000000e+00   1.125313e-04   0.000000e+00 
  3.175000e+01   1.037248e-04   0.000000e+00   1.037248e-04   0.000000e+00 
  3.200000e+01   1.054172e-04   0.000000e+00   1.054172e-04   0.000000e+00 
  3.225000e+01   1.260982e-04   0.000000e+00   1.260982e-04   0.000000e+00 
  3.250000e+01   1.267520e-04   0.000000e+00   1.267520e-04   0.000000e+00 
  3.275000e+01   8.474492e-05   0.000000e+00   8.474492e-05   0.000000e+00 
  3.300000e+01   9.540102e-05   0.000000e+00   9.540102e-05   0.000000e+00 
  3.325000e+01   1.332401e-04   0.000000e+00   1.332401e-04   0.000000e+00 
  3.350000e+01   1.402624e-04   0.000000e+00   1.402624e-04   0.000000e+00 
  3.375000e+01   1.192225e-04   0.000000e+00   1.192225e-04   0.000000e+00 
  3.400000e+01   9.651683e-05   0.000000e+00   9.651683e-05   0.000000e+00 
  3.425000e+01   1.031505e-04   0.000000e+00   1.031505e-04   0.000000e+00 
  3.450000e+01   1.049414e-04   0.000000e+00   1.049414e-04   0.000000e+00 
  3.475000e+01   8.894225e-05   0.000000e+00   8.894225e-05   0.000000e+00 
  3.500000e+01   7.983151e-05   0.000000e+00   7.983151e-05   0.000000e+00 
  3.525000e+01   1.147980e-04   0.000000e+00   1.147980e-04   0.000000e+00 
  3.550000e+01   1.273288e-04   0.000000e+00   1.273288e-04   0.000000e+00 
  3.575000e+01   1.189724e-04   0.000000e+00   1.189724e-04   0.000000e+00 
  3.600000e+01   1.020131e-04   0.000000e+00   1.020131e-04   0.000000e+00 
  3.625000e+01   9.392392e-05   0.000000e+00   9.392392e-05   0.000000e+00 
  3.650000e+01   1.147602e-04   0.000000e+00   1.147602e-04   0.000000e+00 
  3.675000e+01   1.057613e-04   0.000000e+00   1.057613e-04   0.000000e+00 
  3.700000e+01   1.003640e-04   0.000000e+00   1.003640e-04   0.000000e+00 
  3.725000e+01   9.933955e-05   0.000000e+00   9.933955e-05   0.000000e+00 
  3.750000e+01   9.169635e-05   0.000000e+00   9.169635e-05   0.000000e+00 
  3.775000e+01   7.060686e-05   0.000000e+00   7.060686e-05   0.000000e+00 
  3.800000e+01   6.433957e-05   0.000000e+00   6.433957e-05   0.000000e+00 
  3.825000e+01   6.964082e-05   0.000000e+00   6.964082e-05   0.000000e+00 
  3.850000e+01   7.759745e-05   0.000000e+00   7.759745e-05   0.000000e+00 
  3.875000e+01   8.604752e-05   0.000000e+00   8.604752e-05   0.000000e+00 
  3.900000e+01   8.211350e-05   0.000000e+00   8.211350e-05   0.000000e+00 
  3.925000e+01   7.473094e-05   0.000000e+00   7.473094e-05   0.000000e+00 
  3.950000e+01   5.729757e-05   0.000000e+00   5.729757e-05   0.000000e+00 
  3.975000e+01   8.125903e-05   0.000000e+00   8.125903e-05   0.000000e+00 
  4.000000e+01   9.586772e-05   0.000000e+00   9.586772e-05   0.000000e+00 
  4.025000e+01   7.526004e-05   0.000000e+00   7.526004e-05   0.000000e+00 
  4.050000e+01   7.210480e-05   0.000000e+00   7.210480e-05   0.000000e+00 
  4.075000e+01   7.075712e-05   0.000000e+00   7.075712e-05   0.000000e+00 
  4.100000e+01   6.603533e-05   0.000000e+00   6.603533e-05   0.000000e+00 
  4.125000e+01   6.380702e-05   0.000000e+00   6.380702e-05   0.000000e+00 
  4.150000e+01   5.719831e-05   0.000000e+00   5.719831e-05   0.000000e+00 
  4.175000e+01   7.144191e-05   0.000000e+00   7.144191e-05   0.000000e+00 
  4.200000e+01   8.420544e-05   0.000000e+00   8.420544e-05   0.000000e+00 
  4.225000e+01   7.008968e-05   0.000000e+00   7.008968e-05   0.000000e+00 
  4.250000e+01   6.997091e-05   0.000000e+00   6.997091e-05   0.000000e+00 
  4.275000e+01   7.518144e-05   0.000000e+00   7.518144e-05   0.000000e+00 
  4.300000e+01   5.934514e-05   0.000000e+00   5.934514e-05   0.000000e+00 
  4.325000e+01   4.269361e-05   0.000000e+00   4.269361e-05   0.000000e+00 
  4.350000e+01   7.418767e-05   0.000000e+00   7.418767e-05   0.000000e+00 
  4.375000e+01   7.493936e-05   0.000000e+00   7.493936e-05   0.000000e+00 
  4.400000e+01   5.031445e-05   0.000000e+00   5.031445e-05   0.000000e+00 
  4.425000e+01   5.728779e-05   0.000000e+00   5.728779e-05   0.000000e+00 
  4.450000e+01   7.862746e-05   0.000000e+00   7.862746e-05   0.000000e+00 
  4.475000e+01   6.515565e-05   0.000000e+00   6.515565e-05   0.000000e+00 
  4.500000e+01   6.247278e-05   0.000000e+00   6.247278e-05   0.000000e+00 
  4.525000e+01   6.001545e-05   0.000000e+00   6.001545e-05   0.000000e+00 
  4.550000e+01   5.994887e-05   0.000000e+00   5.994887e-05   0.000000e+00 
  4.575000e+01   5.628432e-05   0.000000e+00   5.628432e-05   0.000000e+00 
  4.600000e+01   6.428231e-05   0.000000e+00   6.428231e-05   0.000000e+00 
  4.625000e+01   7.528118e-05   0.000000e+00   7.528118e-05   0.000000e+00 
  4.650000e+01   6.799208e-05   0.000000e+00   6.799208e-05   0.000000e+00 
  4.675000e+01   7.576746e-05   0.000000e+00   7.576746e-05   0.000000e+00 
  4.700000e+01   7.009621e-05   0.000000e+00   7.009621e-05   0.000000e+00 
  4.725000e+01   5.487248e-05   0.000000e+00   5.487248e-05   0.000000e+00 
  4.750000e+01   4.488933e-05   0.000000e+00   4.488933e-05   0.000000e+00 
  4.775000e+01   5.700575e-05   0.000000e+00   5.700575e-05   0.000000e+00 
  4.800000e+01   4.339263e-05   0.000000e+00   4.339263e-05   0.000000e+00 
  4.825000e+01   4.327503e-05   0.000000e+00   4.327503e-05   0.000000e+00 
  4.850000e+01   6.008595e-05   0.000000e+00   6.008595e-05   0.000000e+00 
  4.875000e+01   4.042974e-05   0.000000e+00   4.042974e-05   0.000000e+00 
  4.900000e+01   5.267428e-05   0.000000e+00   5.267428e-05   0.000000e+00 
  4.925000e+01   5.844756e-05   0.000000e+00   5.844756e-05   0.000000e+00 
  4.950000e+01   5.623357e-05   0.000000e+00   5.623357e-05   0.000000e+00 
  4.975000e+01   4.911391e-05   0.000000e+00   4.911391e-05   0.000000e+00 
  5.000000e+01   4.263939e-05   0.000000e+00   4.263939e-05   0.000000e+00 
  5.025000e+01   4.746228e-05   0.000000e+00   4.746228e-05   0.000000e+00 
  5.050000e+01   4.660161e-05   0.000000e+00   4.660161e-05   0.000000e+00 
  5.075000e+01   5.528918e-05   0.000000e+00   5.528918e-05   0.000000e+00 
  5.100000e+01   3.651751e-05   0.000000e+00   3.651751e-05   0.000000e+00 
  5.125000e+01   2.884588e-05   0.000000e+00   2.884588e-05   0.000000e+00 
  5.150000e+01   3.849887e-05   0.000000e+00   3.849887e-05   0.000000e+00 
  5.175000e+01   5.299414e-05   0.000000e+00   5.299414e-05   0.000000e+00 
  5.200000e+01   3.955906e-05   0.000000e+00   3.955906e-05   0.000000e+00 
  5.225000e+01   3.652298e-05   0.000000e+00   3.652298e-05   0.000000e+00 
  5.250000e+01   5.909289e-05   0.000000e+00   5.909289e-05   0.000000e+00 
  5.275000e+01   6.429924e-05   0.000000e+00   6.429924e-05   0.000000e+00 
  5.300000e+01   4.815117e-05   0.000000e+00   4.815117e-05   0.000000e+00 
  5.325000e+01   3.100443e-05   0.000000e+00   3.100443e-05   0.000000e+00 
  5.350000e+01   4.690877e-05   0.000000e+00   4.690877e-05   0.000000e+00 
  5.375000e+01   5.495034e-05   0.000000e+00   5.495034e-05   0.000000e+00 
  5.400000e+01   4.714091e-05   0.000000e+00   4.714091e-05   0.000000e+00 
  5.425000e+01   4.960985e-05   0.000000e+00   4.960985e-05   0.000000e+00 
  5.450000e+01   5.442137e-05   0.000000e+00   5.442137e-05   0.000000e+00 
  5.475000e+01   4.810730e-05   0.000000e+00   4.810730e-05   0.000000e+00 
  5.500000e+01   5.696153e-05   0.000000e+00   5.696153e-05   0.000000e+00 
  5.525000e+01   5.356006e-05   0.000000e+00   5.356006e-05   0.000000e+00 
  5.550000e+01   4.252770e-05   0.000000e+00   4.252770e-05   0.000000e+00 
  5.575000e+01   3.229594e-05   0.000000e+00   3.229594e-05   0.000000e+00 
  5.600000e+01   5.047118e-05   0.000000e+00   5.047118e-05   0.000000e+00 
  5.625000e+01   5.690739e-05   0.000000e+00   5.690739e-05   0.000000e+00 
  5.650000e+01   4.760278e-05   0.000000e+00   4.760278e-05   0.000000e+00 
  5.675000e+01   4.692701e-05   0.000000e+00   4.692701e-05   0.000000e+00 
  5.700000e+01   5.377445e-05   0.000000e+00   5.377445e-05   0.000000e+00 
  5.725000e+01   5.021609e-05   0.000000e+00   5.021609e-05   0.000000e+00 
  5.750000e+01   4.341107e-05   0.000000e+00   4.341107e-05   0.000000e+00 
  5.775000e+01   3.621225e-05   0.000000e+00   3.621225e-05   0.000000e+00 
  5.800000e+01   4.551811e-05   0.000000e+00   4.551811e-05   0.000000e+00 
  5.825000e+01   4.202345e-05   0.000000e+00   4.202345e-05   0.000000e+00 
  5.850000e+01   3.418146e-05   0.000000e+00   3.418146e-05   0.000000e+00 
  5.875000e+01   3.920797e-05   0.000000e+00   3.920797e-05   0.000000e+00 
  5.900000e+01   3.625483e-05   0.000000e+00   3.625483e-05   0.000000e+00 
  5.925000e+01   3.151728e-05   0.000000e+00   3.151728e-05   0.000000e+00 
  5.950000e+01   3.563817e-05   0.000000e+00   3.563817e-05   0.000000e+00 
  5.975000e+01   4.857568e-05   0.000000e+00   4.857568e-05   0.000000e+00 
  6.000000e+01   6.634602e-05   0.000000e+00   6.634602e-05   0.000000e+00 
  6.025000e+01   3.602682e-05   0.000000e+00   3.602682e-05   0.000000e+00 
  6.050000e+01   3.751164e-05   0.000000e+00   3.751164e-05   0.000000e+00 
  6.075000e+01   3.083564e-05   0.000000e+00   3.083564e-05   0.000000e+00 
  6.100000e+01   2.604852e-05   0.000000e+00   2.604852e-05   0.000000e+00 
  6.125000e+01   2.657246e-05   0.000000e+00   2.657246e-05   0.000000e+00 
  6.150000e+01   3.161477e-05   0.000000e+00   3.161477e-05   0.000000e+00 
  6.175000e+01   2.910404e-05   0.000000e+00   2.910404e-05   0.000000e+00 
  6.200000e+01   3.162181e-05   0.000000e+00   3.162181e-05   0.000000e+00 
  6.225000e+01   2.569333e-05   0.000000e+00   2.569333e-05   0.000000e+00 
  6.250000e+01   2.685020e-05   0.000000e+00   2.685020e-05   0.000000e+00 
  6.275000e+01   3.293417e-05   0.000000e+00   3.293417e-05   0.000000e+00 
  6.300000e+01   3.007059e-05   0.000000e+00   3.007059e-05   0.000000e+00 
  6.325000e+01   2.044012e-05   0.000000e+00   2.044012e-05   0.000000e+00 
  6.350000e+01   2.685717e-05   0.000000e+00   2.685717e-05   0.000000e+00 
  6.375000e+01   3.620153e-05   0.000000e+00   3.620153e-05   0.000000e+00 
  6.400000e+01   3.244648e-05   0.000000e+00   3.244648e-05   0.000000e+00 
  6.425000e+01   2.617742e-05   0.000000e+00   2.617742e-05   0.000000e+00 
  6.450000e+01   2.061989e-05   0.000000e+00   2.061989e-05   0.000000e+00 
  6.475000e+01   2.434083e-05   0.000000e+00   2.434083e-05   0.000000e+00 
  6.500000e+01   2.799743e-05   0.000000e+00   2.799743e-05   0.000000e+00 
  6.525000e+01   1.861743e-05   0.000000e+00   1.861743e-05   0.000000e+00 
  6.550000e+01   1.444127e-05   0.000000e+00   1.444127e-05   0.000000e+00 
  6.575000e+01   2.912153e-05   0.000000e+00   2.912153e-05   0.000000e+00 
  6.600000e+01   3.169925e-05   0.000000e+00   3.169925e-05   0.000000e+00 
  6.625000e+01   2.095906e-05   0.000000e+00   2.095906e-05   0.000000e+00 
  6.650000e+01   2.482721e-05   0.000000e+00   2.482721e-05   0.000000e+00 
  6.675000e+01   2.095971e-05   0.000000e+00   2.095971e-05   0.000000e+00 
  6.700000e+01   2.325488e-05   0.000000e+00   2.325488e-05   0.000000e+00 
  6.725000e+01   1.960240e-05   0.000000e+00   1.960240e-05   0.000000e+00 
  6.750000e+01   1.856906e-05   0.000000e+00   1.856906e-05   0.000000e+00 
  6.775000e+01   2.601573e-05   0.000000e+00   2.601573e-05   0.000000e+00 
  6.800000e+01   2.818625e-05   0.000000e+00   2.818625e-05   0.000000e+00 
  6.825000e+01   3.244012e-05   0.000000e+00   3.244012e-05   0.000000e+00 
  6.850000e+01   3.540701e-05   0.000000e+00   3.540701e-05   0.000000e+00 
  6.875000e+01   3.130676e-05   0.000000e+00   3.130676e-05   0.000000e+00 
  6.900000e+01   2.473395e-05   0.000000e+00   2.473395e-05   0.000000e+00 
  6.925000e+01   2.401736e-05   0.000000e+00   2.401736e-05   0.000000e+00 
  6.950000e+01   2.414191e-05   0.000000e+00   2.414191e-05   0.000000e+00 
  6.975000e+01   2.332707e-05   0.000000e+00   2.332707e-05   0.000000e+00 
  7.000000e+01   3.132474e-05   0.000000e+00   3.132474e-05   0.000000e+00 
  7.025000e+01   2.781006e-05   0.000000e+00   2.781006e-05   0.000000e+00 
  7.050000e+01   3.047533e-05   0.000000e+00   3.047533e-05   0.000000e+00 
  7.075000e+01   2.954437e-05   0.000000e+00   2.954437e-05   0.000000e+00 
  7.100000e+01   2.208683e-05   0.000000e+00   2.208683e-05   0.000000e+00 
  7.125000e+01   2.536479e-05   0.000000e+00   2.536479e-05   0.000000e+00 
  7.150000e+01   2.050109e-05   0.000000e+00   2.050109e-05   0.000000e+00 
  7.175000e+01   1.869298e-05   0.000000e+00   1.869298e-05   0.000000e+00 
  7.200000e+01   2.714316e-05   0.000000e+00   2.714316e-05   0.000000e+00 
  7.225000e+01   2.800303e-05   0.000000e+00   2.800303e-05   0.000000e+00 
  7.250000e+01   2.310953e-05   0.000000e+00   2.310953e-05   0.000000e+00 
  7.275000e+01   2.692163e-05   0.000000e+00   2.692163e-05   0.000000e+00 
  7.300000e+01   2.778955e-05   0.000000e+00   2.778955e-05   0.000000e+00 
  7.325000e+01   2.944896e-05   0.000000e+00   2.944896e-05   0.000000e+00 
  7.350000e+01   2.702394e-05   0.000000e+00   2.702394e-05   0.000000e+00 
  7.375000e+01   2.859530e-05   0.000000e+00   2.859530e-05   0.000000e+00 
  7.400000e+01   2.795479e-05   0.000000e+00   2.795479e-05   0.000000e+00 
  7.425000e+01   2.230201e-05   0.000000e+00   2.230201e-05   0.000000e+00 
  7.450000e+01   1.999734e-05   0.000000e+00   1.999734e-05   0.000000e+00 
  7.475000e+01   2.570620e-05   0.000000e+00   2.570620e-05   0.000000e+00 
  7.500000e+01   2.825022e-05   0.000000e+00   2.825022e-05   0.000000e+00 
  7.525000e+01   2.206683e-05   0.000000e+00   2.206683e-05   0.000000e+00 
  7.550000e+01   1.977872e-05   0.000000e+00   1.977872e-05   0.000000e+00 
  7.575000e+01   2.699396e-05   0.000000e+00   2.699396e-05   0.000000e+00 
  7.600000e+01   2.877270e-05   0.000000e+00   2.877270e-05   0.000000e+00 
  7.625000e+01   2.290774e-05   0.000000e+00   2.290774e-05   0.000000e+00 
  7.650000e+01   2.091835e-05   0.000000e+00   2.091835e-05   0.000000e+00 
  7.675000e+01   2.728119e-05   0.000000e+00   2.728119e-05   0.000000e+00 
  7.700000e+01   3.073868e-05   0.000000e+00   3.073868e-05   0.000000e+00 
  7.725000e+01   2.370643e-05   0.000000e+00   2.370643e-05   0.000000e+00 
  7.750000e+01   2.105138e-05   0.000000e+00   2.105138e-05   0.000000e+00 
  7.775000e+01   2.341470e-05   0.000000e+00   2.341470e-05   0.000000e+00 
  7.800000e+01   1.948170e-05   0.000000e+00   1.948170e-05   0.000000e+00 
  7.825000e+01   2.070363e-05   0.000000e+00   2.070363e-05   0.000000e+00 
  7.850000e+01   1.997131e-05   0.000000e+00   1.997131e-05   0.000000e+00 
  7.875000e+01   1.280585e-05   0.000000e+00   1.280585e-05   0.000000e+00 
  7.900000e+01   1.984708e-05   0.000000e+00   1.984708e-05   0.000000e+00 
  7.925000e+01   2.462472e-05   0.000000e+00   2.462472e-05   0.000000e+00 
  7.950000e+01   2.010224e-05   0.000000e+00   2.010224e-05   0.000000e+00 
  7.975000e+01   2.052654e-05   0.000000e+00   2.052654e-05   0.000000e+00 
  8.000000e+01   2.887908e-05   0.000000e+00   2.887908e-05   0.000000e+00 
  8.025000e+01   2.434720e-05   0.000000e+00   2.434720e-05   0.000000e+00 
  8.050000e+01   2.655966e-05   0.000000e+00   2.655966e-05   0.000000e+00 
  8.075000e+01   2.796229e-05   0.000000e+00   2.796229e-05   0.000000e+00 
  8.100000e+01   2.402039e-05   0.000000e+00   2.402039e-05   0.000000e+00 
  8.125000e+01   2.328542e-05   0.000000e+00   2.328542e-05   0.000000e+00 
  8.150000e+01   2.951290e-05   0.000000e+00   2.951290e-05   0.000000e+00 
  8.175000e+01   3.107658e-05   0.000000e+00   3.107658e-05   0.000000e+00 
  8.200000e+01   2.610738e-05   0.000000e+00   2.610738e-05   0.000000e+00 
  8.225000e+01   2.102338e-05   0.000000e+00   2.102338e-05   0.000000e+00 
  8.250000e+01   1.989684e-05   0.000000e+00   1.989684e-05   0.000000e+00 
  8.275000e+01   2.276609e-05   0.000000e+00   2.276609e-05   0.000000e+00 
  8.300000e+01   1.767589e-05   0.000000e+00   1.767589e-05   0.000000e+00 
  8.325000e+01   2.391342e-05   0.000000e+00   2.391342e-05   0.000000e+00 
  8.350000e+01   2.942781e-05   0.000000e+00   2.942781e-05   0.000000e+00 
  8.375000e+01   2.136101e-05   0.000000e+00   2.136101e-05   0.000000e+00 
  8.400000e+01   2.639488e-05   0.000000e+00   2.639488e-05   0.000000e+00 
  8.425000e+01   2.336006e-05   0.000000e+00   2.336006e-05   0.000000e+00 
  8.450000e+01   2.246872e-05   0.000000e+00   2.246872e-05   0.000000e+00 
  8.475000e+01   2.205599e-05   0.000000e+00   2.205599e-05   0.000000e+00 
  8.500000e+01   2.220815e-05   0.000000e+00   2.220815e-05   0.000000e+00 
  8.525000e+01   2.919068e-05   0.000000e+00   2.919068e-05   0.000000e+00 
  8.550000e+01   2.960646e-05   0.000000e+00   2.960646e-05   0.000000e+00 
  8.575000e+01   3.130785e-05   0.000000e+00   3.130785e-05   0.000000e+00 
  8.600000e+01   3.073202e-05   0.000000e+00   3.073202e-05   0.000000e+00 
  8.625000e+01   1.868597e-05   0.000000e+00   1.868597e-05   0.000000e+00 
  8.650000e+01   2.098370e-05   0.000000e+00   2.098370e-05   0.000000e+00 
  8.675000e+01   1.940644e-05   0.000000e+00   1.940644e-05   0.000000e+00 
  8.700000e+01   2.358800e-05   0.000000e+00   2.358800e-05   0.000000e+00 
  8.725000e+01   2.828647e-05   0.000000e+00   2.828647e-05   0.000000e+00 
  8.750000e+01   2.940903e-05   0.000000e+00   2.940903e-05   0.000000e+00 
  8.775000e+01   3.679333e-05   0.000000e+00   3.679333e-05   0.000000e+00 
  8.800000e+01   2.489440e-05   0.000000e+00   2.489440e-05   0.000000e+00 
  8.825000e+01   1.802495e-05   0.000000e+00   1.802495e-05   0.000000e+00 
  8.850000e+01   2.080709e-05   0.000000e+00   2.080709e-05   0.000000e+00 
  8.875000e+01   2.298997e-05   0.000000e+00   2.298997e-05   0.000000e+00 
  8.900000e+01   2.531058e-05   0.000000e+00   2.531058e-05   0.000000e+00 
  8.925000e+01   3.565834e-05   0.000000e+00   3.565834e-05   0.000000e+00 
  8.950000e+01   3.616226e-05   0.000000e+00   3.616226e-05   0.000000e+00 
  8.975000e+01   2.997193e-05   0.000000e+00   2.997193e-05   0.000000e+00 
  9.000000e+01   3.317016e-05   0.000000e+00   3.317016e-05   0.000000e+00 
  9.025000e+01   2.572198e-05   0.000000e+00   2.572198e-05   0.000000e+00 
  9.050000e+01   2.334017e-05   0.000000e+00   2.334017e-05   0.000000e+00 
  9.075000e+01   2.599309e-05   0.000000e+00   2.599309e-05   0.000000e+00 
  9.100000e+01   2.334222e-05   0.000000e+00   2.334222e-05   0.000000e+00 
  9.125000e+01   2.120051e-05   0.000000e+00   2.120051e-05   0.000000e+00 
  9.150000e+01   2.358431e-05   0.000000e+00   2.358431e-05   0.000000e+00 
  9.175000e+01   3.195915e-05   0.000000e+00   3.195915e-05   0.000000e+00 
  9.200000e+01   2.625594e-05   0.000000e+00   2.625594e-05   0.000000e+00 
  9.225000e+01   2.276744e-05   0.000000e+00   2.276744e-05   0.000000e+00 
  9.250000e+01   2.123262e-05   0.000000e+00   2.123262e-05   0.000000e+00 
  9.275000e+01   1.948730e-05   0.000000e+00   1.948730e-05   0.000000e+00 
  9.300000e+01   1.799780e-05   0.000000e+00   1.799780e-05   0.000000e+00 
  9.325000e+01   1.924837e-05   0.000000e+00   1.924837e-05   0.000000e+00 
  9.350000e+01   2.888835e-05   0.000000e+00   2.888835e-05   0.000000e+00 
  9.375000e+01   2.401848e-05   0.000000e+00   2.401848e-05   0.000000e+00 
  9.400000e+01   1.690782e-05   0.000000e+00   1.690782e-05   0.000000e+00 
  9.425000e+01   2.349389e-05   0.000000e+00   2.349389e-05   0.000000e+00 
  9.450000e+01   2.415734e-05   0.000000e+00   2.415734e-05   0.000000e+00 
  9.475000e+01   2.585998e-05   0.000000e+00   2.585998e-05   0.000000e+00 
  9.500000e+01   3.192166e-05   0.000000e+00   3.192166e-05   0.000000e+00 
  9.525000e+01   2.537325e-05   0.000000e+00   2.537325e-05   0.000000e+00 
  9.550000e+01   2.686985e-05   0.000000e+00   2.686985e-05   0.000000e+00 
  9.575000e+01   3.215121e-05   0.000000e+00   3.215121e-05   0.000000e+00 
  9.600000e+01   3.001346e-05   0.000000e+00   3.001346e-05   0.000000e+00 
  9.625000e+01   1.761365e-05   0.000000e+00   1.761365e-05   0.000000e+00 
  9.650000e+01   1.900511e-05   0.000000e+00   1.900511e-05   0.000000e+00 
  9.675000e+01   2.086702e-05   0.000000e+00   2.086702e-05   0.000000e+00 
  9.700000e+01   2.288388e-05   0.000000e+00   2.288388e-05   0.000000e+00 
  9.725000e+01   2.342343e-05   0.000000e+00   2.342343e-05   0.000000e+00 
  9.750000e+01   2.814049e-05   0.000000e+00   2.814049e-05   0.000000e+00 
  9.775000e+01   2.661434e-05   0.000000e+00   2.661434e-05   0.000000e+00 
  9.800000e+01   2.094561e-05   0.000000e+00   2.094561e-05   0.000000e+00 
  9.825000e+01   2.418934e-05   0.000000e+00   2.418934e-05   0.000000e+00 
  9.850000e+01   3.105279e-05   0.000000e+00   3.105279e-05   0.000000e+00 
  9.875000e+01   2.981684e-05   0.000000e+00   2.981684e-05   0.000000e+00 
  9.900000e+01   3.663488e-05   0.000000e+00   3.663488e-05   0.000000e+00 
  9.925000e+01   2.501453e-05   0.000000e+00   2.501453e-05   0.000000e+00 
  9.950000e+01   3.067995e-05   0.000000e+00   3.067995e-05   0.000000e+00 
  9.975000e+01   1.182497e-04   0.000000e+00   1.182497e-04   0.000000e+00 
  1.000000e+02   2.019101e-04   0.000000e+00   2.019101e-04   0.000000e+00 
  1.002500e+02   9.610505e-05   0.000000e+00   9.610505e-05   0.000000e+00 
  1.005000e+02   2.659295e-05   0.000000e+00   2.659295e-05   0.000000e+00 
  1.007500e+02   3.091205e-05   0.000000e+00   3.091205e-05   0.000000e+00 
  1.010000e+02   2.801327e-05   0.000000e+00   2.801327e-05   0.000000e+00 
  1.012500e+02   2.289474e-05   0.000000e+00   2.289474e-05   0.000000e+00 
  1.015000e+02   2.630244e-05   0.000000e+00   2.630244e-05   0.000000e+00 
  1.017500e+02   2.307920e-05   0.000000e+00   2.307920e-05   0.000000e+00 
  1.020000e+02   1.985057e-05   0.000000e+00   1.985057e-05   0.000000e+00 
  1.022500e+02   2.619546e-05   0.000000e+00   2.619546e-05   0.000000e+00 
  1.025000e+02   2.433582e-05   0.000000e+00   2.433582e-05   0.000000e+00 
  1.027500e+02   2.712827e-05   0.000000e+00   2.712827e-05   0.000000e+00 
  1.030000e+02   2.503909e-05   0.000000e+00   2.503909e-05   0.000000e+00 
  1.032500e+02   2.429249e-05   0.000000e+00   2.429249e-05   0.000000e+00 
  1.035000e+02   2.526136e-05   0.000000e+00   2.526136e-05   0.000000e+00 
  1.037500e+02   2.942887e-05   0.000000e+00   2.942887e-05   0.000000e+00 
  1.040000e+02   2.936516e-05   0.000000e+00   2.936516e-05   0.000000e+00 
  1.042500e+02   2.908110e-05   0.000000e+00   2.908110e-05   0.000000e+00 
  1.045000e+02   2.178434e-05   0.000000e+00   2.178434e-05   0.000000e+00 
  1.047500e+02   2.302639e-05   0.000000e+00   2.302639e-05   0.000000e+00 
  1.050000e+02   3.004402e-05   0.000000e+00   3.004402e-05   0.000000e+00 
  1.052500e+02   2.959694e-05   0.000000e+00   2.959694e-05   0.000000e+00 
  1.055000e+02   3.076086e-05   0.000000e+00   3.076086e-05   0.000000e+00 
  1.057500e+02   2.994872e-05   0.000000e+00   2.994872e-05   0.000000e+00 
  1.060000e+02   3.486111e-05   0.000000e+00   3.486111e-05   0.000000e+00 
  1.062500e+02   3.258450e-05   0.000000e+00   3.258450e-05   0.000000e+00 
  1.065000e+02   3.787369e-05   0.000000e+00   3.787369e-05   0.000000e+00 
  1.067500e+02   4.131376e-05   0.000000e+00   4.131376e-05   0.000000e+00 
  1.070000e+02   2.862752e-05   0.000000e+00   2.862752e-05   0.000000e+00 
  1.072500e+02   2.479757e-05   0.000000e+00   2.479757e-05   0.000000e+00 
  1.075000e+02   2.380104e-05   0.000000e+00   2.380104e-05   0.000000e+00 
  1.077500e+02   2.511983e-05   0.000000e+00   2.511983e-05   0.000000e+00 
  1.080000e+02   4.091948e-05   0.000000e+00   4.091948e-05   0.000000e+00 
  1.082500e+02   3.970200e-05   0.000000e+00   3.970200e-05   0.000000e+00 
  1.085000e+02   2.507086e-05   0.000000e+00   2.507086e-05   0.000000e+00 
  1.087500e+02   2.578980e-05   0.000000e+00   2.578980e-05   0.000000e+00 
  1.090000e+02   3.349145e-05   0.000000e+00   3.349145e-05   0.000000e+00 
  1.092500e+02   3.406335e-05   0.000000e+00   3.406335e-05   0.000000e+00 
  1.095000e+02   3.348476e-05   0.000000e+00   3.348476e-05   0.000000e+00 
  1.097500e+02   3.669400e-05   0.000000e+00   3.669400e-05   0.000000e+00 
  1.100000e+02   4.355134e-05   0.000000e+00   4.355134e-05   0.000000e+00 
  1.102500e+02   4.280492e-05   0.000000e+00   4.280492e-05   0.000000e+00 
  1.105000e+02   4.285589e-05   0.000000e+00   4.285589e-05   0.000000e+00 
  1.107500e+02   3.823799e-05   0.000000e+00   3.823799e-05   0.000000e+00 
  1.110000e+02   4.043890e-05   0.000000e+00   4.043890e-05   0.000000e+00 
  1.112500e+02   3.613247e-05   0.000000e+00   3.613247e-05   0.000000e+00 
  1.115000e+02   3.591739e-05   0.000000e+00   3.591739e-05   0.000000e+00 
  1.117500e+02   3.779445e-05   0.000000e+00   3.779445e-05   0.000000e+00 
  1.120000e+02   2.897844e-05   0.000000e+00   2.897844e-05   0.000000e+00 
  1.122500e+02   2.924648e-05   0.000000e+00   2.924648e-05   0.000000e+00 
  1.125000e+02   4.406990e-05   0.000000e+00   4.406990e-05   0.000000e+00 
  1.127500e+02   3.846790e-05   0.000000e+00   3.846790e-05   0.000000e+00 
  1.130000e+02   4.359407e-05   0.000000e+00   4.359407e-05   0.000000e+00 
  1.132500e+02   3.420691e-05   0.000000e+00   3.420691e-05   0.000000e+00 
  1.135000e+02   3.039569e-05   0.000000e+00   3.039569e-05   0.000000e+00 
  1.137500e+02   3.764100e-05   0.000000e+00   3.764100e-05   0.000000e+00 
  1.140000e+02   3.906418e-05   0.000000e+00   3.906418e-05   0.000000e+00 
  1.142500e+02   3.942922e-05   0.000000e+00   3.942922e-05   0.000000e+00 
  1.145000e+02   3.575319e-05   0.000000e+00   3.575319e-05   0.000000e+00 
  1.147500e+02   3.711944e-05   0.000000e+00   3.711944e-05   0.000000e+00 
  1.150000e+02   4.217136e-05   0.000000e+00   4.217136e-05   0.000000e+00 
  1.152500e+02   3.809348e-05   0.000000e+00   3.809348e-05   0.000000e+00 
  1.155000e+02   2.415414e-05   0.000000e+00   2.415414e-05   0.000000e+00 
  1.157500e+02   3.706984e-05   0.000000e+00   3.706984e-05   0.000000e+00 
  1.160000e+02   4.942030e-05   0.000000e+00   4.942030e-05   0.000000e+00 
  1.162500e+02   4.581848e-05   0.000000e+00   4.581848e-05   0.000000e+00 
  1.165000e+02   5.039844e-05   0.000000e+00   5.039844e-05   0.000000e+00 
  1.167500e+02   4.032841e-05   0.000000e+00   4.032841e-05   0.000000e+00 
  1.170000e+02   3.523301e-05   0.000000e+00   3.523301e-05   0.000000e+00 
  1.172500e+02   2.910057e-05   0.000000e+00   2.910057e-05   0.000000e+00 
  1.175000e+02   3.344521e-05   0.000000e+00   3.344521e-05   0.000000e+00 
  1.177500e+02   3.348266e-05   0.000000e+00   3.348266e-05   0.000000e+00 
  1.180000e+02   4.473612e-05   0.000000e+00   4.473612e-05   0.000000e+00 
  1.182500e+02   4.151836e-05   0.000000e+00   4.151836e-05   0.000000e+00 
  1.185000e+02   3.277960e-05   0.000000e+00   3.277960e-05   0.000000e+00 
  1.187500e+02   2.441185e-05   0.000000e+00   2.441185e-05   0.000000e+00 
  1.190000e+02   3.321552e-05   0.000000e+00   3.321552e-05   0.000000e+00 
  1.192500e+02   3.954510e-05   0.000000e+00   3.954510e-05   0.000000e+00 
  1.195000e+02   4.879019e-05   0.000000e+00   4.879019e-05   0.000000e+00 
  1.197500e+02   2.535307e-04   0.000000e+00   2.535307e-04   0.000000e+00 
  1.200000e+02   3.573835e-04   0.000000e+00   3.573835e-04   0.000000e+00 
  1.202500e+02   1.271142e-04   0.000000e+00   1.271142e-04   0.000000e+00 
  1.205000e+02   4.513519e-05   0.000000e+00   4.513519e-05   0.000000e+00 
  1.207500e+02   2.694734e-05   0.000000e+00   2.694734e-05   0.000000e+00 
  1.210000e+02   5.058242e-05   0.000000e+00   5.058242e-05   0.000000e+00 
  1.212500e+02   4.659843e-05   0.000000e+00   4.659843e-05   0.000000e+00 
  1.215000e+02   4.283583e-05   0.000000e+00   4.283583e-05   0.000000e+00 
  1.217500e+02   3.841809e-05   0.000000e+00   3.841809e-05   0.000000e+00 
  1.220000e+02   3.580359e-05   0.000000e+00   3.580359e-05   0.000000e+00 
  1.222500e+02   3.161113e-05   0.000000e+00   3.161113e-05   0.000000e+00 
  1.225000e+02   3.411339e-05   0.000000e+00   3.411339e-05   0.000000e+00 
  1.227500e+02   3.871223e-05   0.000000e+00   3.871223e-05   0.000000e+00 
  1.230000e+02   3.506527e-05   0.000000e+00   3.506527e-05   0.000000e+00 
  1.232500e+02   4.914128e-05   0.000000e+00   4.914128e-05   0.000000e+00 
  1.235000e+02   4.925305e-05   0.000000e+00   4.925305e-05   0.000000e+00 
  1.237500e+02   3.445191e-05   0.000000e+00   3.445191e-05   0.000000e+00 
  1.240000e+02   3.924941e-05   0.000000e+00   3.924941e-05   0.000000e+00 
  1.242500e+02   4.960299e-05   0.000000e+00   4.960299e-05   0.000000e+00 
  1.245000e+02   4.910348e-05   0.000000e+00   4.910348e-05   0.000000e+00 
  1.247500e+02   4.224854e-05   0.000000e+00   4.224854e-05   0.000000e+00 
  1.250000e+02   4.542354e-05   0.000000e+00   4.542354e-05   0.000000e+00 
  1.252500e+02   4.061888e-05   0.000000e+00   4.061888e-05   0.000000e+00 
  1.255000e+02   4.299952e-05   0.000000e+00   4.299952e-05   0.000000e+00 
  1.257500e+02   4.361302e-05   0.000000e+00   4.361302e-05   0.000000e+00 
  1.260000e+02   4.277961e-05   0.000000e+00   4.277961e-05   0.000000e+00 
  1.262500e+02   4.410370e-05   0.000000e+00   4.410370e-05   0.000000e+00 
  1.265000e+02   3.783752e-05   0.000000e+00   3.783752e-05   0.000000e+00 
  1.267500e+02   4.622077e-05   0.000000e+00   4.622077e-05   0.000000e+00 
  1.270000e+02   5.401248e-05   0.000000e+00   5.401248e-05   0.000000e+00 
  1.272500e+02   4.551763e-05   0.000000e+00   4.551763e-05   0.000000e+00 
  1.275000e+02   6.173479e-05   0.000000e+00   6.173479e-05   0.000000e+00 
  1.277500e+02   6.350310e-05   0.000000e+00   6.350310e-05   0.000000e+00 
  1.280000e+02   6.522564e-05   0.000000e+00   6.522564e-05   0.000000e+00 
  1.282500e+02   5.062504e-05   0.000000e+00   5.062504e-05   0.000000e+00 
  1.285000e+02   4.894364e-05   0.000000e+00   4.894364e-05   0.000000e+00 
  1.287500e+02   5.587441e-05   0.000000e+00   5.587441e-05   0.000000e+00 
  1.290000e+02   3.803684e-05   0.000000e+00   3.803684e-05   0.000000e+00 
  1.292500e+02   3.560435e-05   0.000000e+00   3.560435e-05   0.000000e+00 
  1.295000e+02   5.802399e-05   0.000000e+00   5.802399e-05   0.000000e+00 
  1.297500e+02   6.046669e-05   0.000000e+00   6.046669e-05   0.000000e+00 
  1.300000e+02   4.765113e-05   0.000000e+00   4.765113e-05   0.000000e+00 
  1.302500e+02   4.982208e-05   0.000000e+00   4.982208e-05   0.000000e+00 
  1.305000e+02   3.969250e-05   0.000000e+00   3.969250e-05   0.000000e+00 
  1.307500e+02   4.175151e-05   0.000000e+00   4.175151e-05   0.000000e+00 
  1.310000e+02   3.987740e-05   0.000000e+00   3.987740e-05   0.000000e+00 
  1.312500e+02   5.277110e-05   0.000000e+00   5.277110e-05   0.000000e+00 
  1.315000e+02   5.210589e-05   0.000000e+00   5.210589e-05   0.000000e+00 
  1.317500e+02   5.697011e-05   0.000000e+00   5.697011e-05   0.000000e+00 
  1.320000e+02   5.843544e-05   0.000000e+00   5.843544e-05   0.000000e+00 
  1.322500e+02   4.731485e-05   0.000000e+00   4.731485e-05   0.000000e+00 
  1.325000e+02   4.545072e-05   0.000000e+00   4.545072e-05   0.000000e+00 
  1.327500e+02   4.815609e-05   0.000000e+00   4.815609e-05   0.000000e+00 
  1.330000e+02   4.639517e-05   0.000000e+00   4.639517e-05   0.000000e+00 
  1.332500e+02   5.260112e-05   0.000000e+00   5.260112e-05   0.000000e+00 
  1.335000e+02   4.565043e-05   0.000000e+00   4.565043e-05   0.000000e+00 
  1.337500e+02   5.023992e-05   0.000000e+00   5.023992e-05   0.000000e+00 
  1.340000e+02   4.971301e-05   0.000000e+00   4.971301e-05   0.000000e+00 
  1.342500e+02   4.698936e-05   0.000000e+00   4.698936e-05   0.000000e+00 
  1.345000e+02   3.127127e-05   0.000000e+00   3.127127e-05   0.000000e+00 
  1.347500e+02   5.058097e-05   0.000000e+00   5.058097e-05   0.000000e+00 
  1.350000e+02   4.458116e-05   0.000000e+00   4.458116e-05   0.000000e+00 
  1.352500e+02   5.106750e-05   0.000000e+00   5.106750e-05   0.000000e+00 
  1.355000e+02   4.888433e-05   0.000000e+00   4.888433e-05   0.000000e+00 
  1.357500e+02   5.694801e-05   0.000000e+00   5.694801e-05   0.000000e+00 
  1.360000e+02   6.859455e-05   0.000000e+00   6.859455e-05   0.000000e+00 
  1.362500e+02   1.111992e-04   0.000000e+00   1.111992e-04   0.000000e+00 
  1.365000e+02   1.089506e-04   0.000000e+00   1.089506e-04   0.000000e+00 
  1.367500e+02   6.301989e-05   0.000000e+00   6.301989e-05   0.000000e+00 
  1.370000e+02   7.740860e-05   0.000000e+00   7.740860e-05   0.000000e+00 
  1.372500e+02   6.791890e-05   0.000000e+00   6.791890e-05   0.000000e+00 
  1.375000e+02   8.356926e-05   0.000000e+00   8.356926e-05   0.000000e+00 
  1.377500e+02   7.490607e-05   0.000000e+00   7.490607e-05   0.000000e+00 
  1.380000e+02   5.110927e-05   0.000000e+00   5.110927e-05   0.000000e+00 
  1.382500e+02   6.493407e-05   0.000000e+00   6.493407e-05   0.000000e+00 
  1.385000e+02   6.668948e-05   0.000000e+00   6.668948e-05   0.000000e+00 
  1.387500e+02   7.356479e-05   0.000000e+00   7.356479e-05   0.000000e+00 
  1.390000e+02   6.899066e-05   0.000000e+00   6.899066e-05   0.000000e+00 
  1.392500e+02   7.026493e-05   0.000000e+00   7.026493e-05   0.000000e+00 
  1.395000e+02   5.472706e-05   0.000000e+00   5.472706e-05   0.000000e+00 
  1.397500e+02   5.074279e-05   0.000000e+00   5.074279e-05   0.000000e+00 
  1.400000e+02   7.934092e-05   0.000000e+00   7.934092e-05   0.000000e+00 
  1.402500e+02   6.673754e-05   0.000000e+00   6.673754e-05   0.000000e+00 
  1.405000e+02   6.638342e-05   0.000000e+00   6.638342e-05   0.000000e+00 
  1.407500e+02   7.068741e-05   0.000000e+00   7.068741e-05   0.000000e+00 
  1.410000e+02   6.328389e-05   0.000000e+00   6.328389e-05   0.000000e+00 
  1.412500e+02   7.752988e-05   0.000000e+00   7.752988e-05   0.000000e+00 
  1.415000e+02   7.408313e-05   0.000000e+00   7.408313e-05   0.000000e+00 
  1.417500e+02   5.927312e-05   0.000000e+00   5.927312e-05   0.000000e+00 
  1.420000e+02   6.854822e-05   0.000000e+00   6.854822e-05   0.000000e+00 
  1.422500e+02   6.075354e-05   0.000000e+00   6.075354e-05   0.000000e+00 
  1.425000e+02   7.226250e-05   0.000000e+00   7.226250e-05   0.000000e+00 
  1.427500e+02   7.718948e-05   0.000000e+00   7.718948e-05   0.000000e+00 
  1.430000e+02   6.991091e-05   0.000000e+00   6.991091e-05   0.000000e+00 
  1.432500e+02   6.226123e-05   0.000000e+00   6.226123e-05   0.000000e+00 
  1.435000e+02   7.058345e-05   0.000000e+00   7.058345e-05   0.000000e+00 
  1.437500e+02   7.155514e-05   0.000000e+00   7.155514e-05   0.000000e+00 
  1.440000e+02   7.348145e-05   0.000000e+00   7.348145e-05   0.000000e+00 
  1.442500e+02   6.904636e-05   0.000000e+00   6.904636e-05   0.000000e+00 
  1.445000e+02   8.651680e-05   0.000000e+00   8.651680e-05   0.000000e+00 
  1.447500e+02   8.772000e-05   0.000000e+00   8.772000e-05   0.000000e+00 
  1.450000e+02   5.254876e-05   0.000000e+00   5.254876e-05   0.000000e+00 
  1.452500e+02   5.422059e-05   0.000000e+00   5.422059e-05   0.000000e+00 
  1.455000e+02   5.930571e-05   0.000000e+00   5.930571e-05   0.000000e+00 
  1.457500e+02   5.751673e-05   0.000000e+00   5.751673e-05   0.000000e+00 
  1.460000e+02   5.982937e-05   0.000000e+00   5.982937e-05   0.000000e+00 
  1.462500e+02   8.221673e-05   0.000000e+00   8.221673e-05   0.000000e+00 
  1.465000e+02   6.450992e-05   0.000000e+00   6.450992e-05   0.000000e+00 
  1.467500e+02   7.894626e-05   0.000000e+00   7.894626e-05   0.000000e+00 
  1.470000e+02   9.877580e-05   0.000000e+00   9.877580e-05   0.000000e+00 
  1.472500e+02   9.104606e-05   0.000000e+00   9.104606e-05   0.000000e+00 
  1.475000e+02   9.596052e-05   0.000000e+00   9.596052e-05   0.000000e+00 
  1.477500e+02   7.312503e-05   0.000000e+00   7.312503e-05   0.000000e+00 
  1.480000e+02   7.524656e-05   0.000000e+00   7.524656e-05   0.000000e+00 
  1.482500e+02   6.722511e-05   0.000000e+00   6.722511e-05   0.000000e+00 
  1.485000e+02   8.483234e-05   0.000000e+00   8.483234e-05   0.000000e+00 
  1.487500e+02   8.027250e-05   0.000000e+00   8.027250e-05   0.000000e+00 
  1.490000e+02   6.869939e-05   0.000000e+00   6.869939e-05   0.000000e+00 
  1.492500e+02   6.899259e-05   0.000000e+00   6.899259e-05   0.000000e+00 
  1.495000e+02   8.768270e-05   0.000000e+00   8.768270e-05   0.000000e+00 
  1.497500e+02   7.758932e-05   0.000000e+00   7.758932e-05   0.000000e+00 
  1.500000e+02   6.440241e-05   0.000000e+00   6.440241e-05   0.000000e+00 
  1.502500e+02   7.014029e-05   0.000000e+00   7.014029e-05   0.000000e+00 
  1.505000e+02   5.879145e-05   0.000000e+00   5.879145e-05   0.000000e+00 
  1.507500e+02   6.936459e-05   0.000000e+00   6.936459e-05   0.000000e+00 
  1.510000e+02   8.126170e-05   0.000000e+00   8.126170e-05   0.000000e+00 
  1.512500e+02   7.527026e-05   0.000000e+00   7.527026e-05   0.000000e+00 
  1.515000e+02   7.089767e-05   0.000000e+00   7.089767e-05   0.000000e+00 
  1.517500e+02   6.654307e-05   0.000000e+00   6.654307e-05   0.000000e+00 
  1.520000e+02   9.721703e-05   0.000000e+00   9.721703e-05   0.000000e+00 
  1.522500e+02   1.019046e-04   0.000000e+00   1.019046e-04   0.000000e+00 
  1.525000e+02   8.982436e-05   0.000000e+00   8.982436e-05   0.000000e+00 
  1.527500e+02   7.015032e-05   0.000000e+00   7.015032e-05   0.000000e+00 
  1.530000e+02   9.105763e-05   0.000000e+00   9.105763e-05   0.000000e+00 
  1.532500e+02   8.854829e-05   0.000000e+00   8.854829e-05   0.000000e+00 
  1.535000e+02   1.146711e-04   0.000000e+00   1.146711e-04   0.000000e+00 
  1.537500e+02   1.177498e-04   0.000000e+00   1.177498e-04   0.000000e+00 
  1.540000e+02   1.027959e-04   0.000000e+00   1.027959e-04   0.000000e+00 
  1.542500e+02   8.564797e-05   0.000000e+00   8.564797e-05   0.000000e+00 
  1.545000e+02   7.686993e-05   0.000000e+00   7.686993e-05   0.000000e+00 
  1.547500e+02   1.084706e-04   0.000000e+00   1.084706e-04   0.000000e+00 
  1.550000e+02   1.098526e-04   0.000000e+00   1.098526e-04   0.000000e+00 
  1.552500e+02   1.047517e-04   0.000000e+00   1.047517e-04   0.000000e+00 
  1.555000e+02   1.123456e-04   0.000000e+00   1.123456e-04   0.000000e+00 
  1.557500e+02   1.087642e-04   0.000000e+00   1.087642e-04   0.000000e+00 
  1.560000e+02   1.092907e-04   0.000000e+00   1.092907e-04   0.000000e+00 
  1.562500e+02   1.098211e-04   0.000000e+00   1.098211e-04   0.000000e+00 
  1.565000e+02   1.108962e-04   0.000000e+00   1.108962e-04   0.000000e+00 
  1.567500e+02   9.364891e-05   0.000000e+00   9.364891e-05   0.000000e+00 
  1.570000e+02   1.358344e-04   0.000000e+00   1.358344e-04   0.000000e+00 
  1.572500e+02   1.263116e-04   0.000000e+00   1.263116e-04   0.000000e+00 
  1.575000e+02   9.510628e-05   0.000000e+00   9.510628e-05   0.000000e+00 
  1.577500e+02   1.065935e-04   0.000000e+00   1.065935e-04   0.000000e+00 
  1.580000e+02   1.107625e-04   0.000000e+00   1.107625e-04   0.000000e+00 
  1.582500e+02   1.167380e-04   0.000000e+00   1.167380e-04   0.000000e+00 
  1.585000e+02   9.156595e-05   0.000000e+00   9.156595e-05   0.000000e+00 
  1.587500e+02   1.126872e-04   0.000000e+00   1.126872e-04   0.000000e+00 
  1.590000e+02   1.082505e-04   0.000000e+00   1.082505e-04   0.000000e+00 
  1.592500e+02   8.857121e-05   0.000000e+00   8.857121e-05   0.000000e+00 
  1.595000e+02   1.323525e-04   0.000000e+00   1.323525e-04   0.000000e+00 
  1.597500e+02   1.003320e-04   0.000000e+00   1.003320e-04   0.000000e+00 
  1.600000e+02   9.064346e-05   0.000000e+00   9.064346e-05   0.000000e+00 
  1.602500e+02   1.051317e-04   0.000000e+00   1.051317e-04   0.000000e+00 
  1.605000e+02   1.238539e-04   0.000000e+00   1.238539e-04   0.000000e+00 
  1.607500e+02   1.168078e-04   0.000000e+00   1.168078e-04   0.000000e+00 
  1.610000e+02   1.021155e-04   0.000000e+00   1.021155e-04   0.000000e+00 
  1.612500e+02   8.710201e-05   0.000000e+00   8.710201e-05   0.000000e+00 
  1.615000e+02   9.655062e-05   0.000000e+00   9.655062e-05   0.000000e+00 
  1.617500e+02   1.206042e-04   0.000000e+00   1.206042e-04   0.000000e+00 
  1.620000e+02   1.060057e-04   0.000000e+00   1.060057e-04   0.000000e+00 
  1.622500e+02   9.271326e-05   0.000000e+00   9.271326e-05   0.000000e+00 
  1.625000e+02   9.782287e-05   0.000000e+00   9.782287e-05   0.000000e+00 
  1.627500e+02   1.185320e-04   0.000000e+00   1.185320e-04   0.000000e+00 
  1.630000e+02   1.021144e-04   0.000000e+00   1.021144e-04   0.000000e+00 
  1.632500e+02   1.074254e-04   0.000000e+00   1.074254e-04   0.000000e+00 
  1.635000e+02   1.265169e-04   0.000000e+00   1.265169e-04   0.000000e+00 
  1.637500e+02   1.234131e-04   0.000000e+00   1.234131e-04   0.000000e+00 
  1.640000e+02   1.237378e-04   0.000000e+00   1.237378e-04   0.000000e+00 
  1.642500e+02   1.263423e-04   0.000000e+00   1.263423e-04   0.000000e+00 
  1.645000e+02   1.303248e-04   0.000000e+00   1.303248e-04   0.000000e+00 
  1.647500e+02   1.079672e-04   0.000000e+00   1.079672e-04   0.000000e+00 
  1.650000e+02   1.722137e-04   0.000000e+00   1.722137e-04   0.000000e+00 
  1.652500e+02   1.503568e-04   0.000000e+00   1.503568e-04   0.000000e+00 
  1.655000e+02   1.583369e-04   0.000000e+00   1.583369e-04   0.000000e+00 
  1.657500e+02   1.274832e-04   0.000000e+00   1.274832e-04   0.000000e+00 
  1.660000e+02   1.063414e-04   0.000000e+00   1.063414e-04   0.000000e+00 
  1.662500e+02   1.107300e-04   0.000000e+00   1.107300e-04   0.000000e+00 
  1.665000e+02   1.007520e-04   0.000000e+00   1.007520e-04   0.000000e+00 
  1.667500e+02   8.885925e-05   0.000000e+00   8.885925e-05   0.000000e+00 
  1.670000e+02   1.221038e-04   0.000000e+00   1.221038e-04   0.000000e+00 
  1.672500e+02   9.640140e-05   0.000000e+00   9.640140e-05   0.000000e+00 
  1.675000e+02   1.013535e-04   0.000000e+00   1.013535e-04   0.000000e+00 
  1.677500e+02   9.236739e-05   0.000000e+00   9.236739e-05   0.000000e+00 
  1.680000e+02   8.222155e-05   0.000000e+00   8.222155e-05   0.000000e+00 
  1.682500e+02   9.507732e-05   0.000000e+00   9.507732e-05   0.000000e+00 
  1.685000e+02   1.007738e-04   0.000000e+00   1.007738e-04   0.000000e+00 
  1.687500e+02   1.056449e-04   0.000000e+00   1.056449e-04   0.000000e+00 
  1.690000e+02   9.657649e-05   0.000000e+00   9.657649e-05   0.000000e+00 
  1.692500e+02   7.739718e-05   0.000000e+00   7.739718e-05   0.000000e+00 
  1.695000e+02   1.132996e-04   0.000000e+00   1.132996e-04   0.000000e+00 
  1.697500e+02   9.714294e-05   0.000000e+00   9.714294e-05   0.000000e+00 
  1.700000e+02   9.631948e-05   0.000000e+00   9.631948e-05   0.000000e+00 
  1.702500e+02   8.853950e-05   0.000000e+00   8.853950e-05   0.000000e+00 
  1.705000e+02   9.307866e-05   0.000000e+00   9.307866e-05   0.000000e+00 
  1.707500e+02   9.336250e-05   0.000000e+00   9.336250e-05   0.000000e+00 
  1.710000e+02   7.808951e-05   0.000000e+00   7.808951e-05   0.000000e+00 
  1.712500e+02   8.846002e-05   0.000000e+00   8.846002e-05   0.000000e+00 
  1.715000e+02   7.816379e-05   0.000000e+00   7.816379e-05   0.000000e+00 
  1.717500e+02   5.666767e-05   0.000000e+00   5.666767e-05   0.000000e+00 
  1.720000e+02   8.884537e-05   0.000000e+00   8.884537e-05   0.000000e+00 
  1.722500e+02   9.854406e-05   0.000000e+00   9.854406e-05   0.000000e+00 
  1.725000e+02   9.504241e-05   0.000000e+00   9.504241e-05   0.000000e+00 
  1.727500e+02   9.275888e-05   0.000000e+00   9.275888e-05   0.000000e+00 
  1.730000e+02   6.093351e-05   0.000000e+00   6.093351e-05   0.000000e+00 
  1.732500e+02   5.740559e-05   0.000000e+00   5.740559e-05   0.000000e+00 
  1.735000e+02   7.437012e-05   0.000000e+00   7.437012e-05   0.000000e+00 
  1.737500e+02   1.021839e-04   0.000000e+00   1.021839e-04   0.000000e+00 
  1.740000e+02   1.003476e-04   0.000000e+00   1.003476e-04   0.000000e+00 
  1.742500e+02   1.159441e-04   0.000000e+00   1.159441e-04   0.000000e+00 
  1.745000e+02   1.145183e-04   0.000000e+00   1.145183e-04   0.000000e+00 
  1.747500e+02   1.282747e-04   0.000000e+00   1.282747e-04   0.000000e+00 
  1.750000e+02   1.068991e-04   0.000000e+00   1.068991e-04   0.000000e+00 
  1.752500e+02   7.910200e-05   0.000000e+00   7.910200e-05   0.000000e+00 
  1.755000e+02   7.975967e-05   0.000000e+00   7.975967e-05   0.000000e+00 
  1.757500e+02   8.136275e-05   0.000000e+00   8.136275e-05   0.000000e+00 
  1.760000e+02   1.030059e-04   0.000000e+00   1.030059e-04   0.000000e+00 
  1.762500e+02   9.899114e-05   0.000000e+00   9.899114e-05   0.000000e+00 
  1.765000e+02   1.206343e-04   0.000000e+00   1.206343e-04   0.000000e+00 
  1.767500e+02   1.063257e-04   0.000000e+00   1.063257e-04   0.000000e+00 
  1.770000e+02   9.480299e-05   0.000000e+00   9.480299e-05   0.000000e+00 
  1.772500e+02   1.063748e-04   0.000000e+00   1.063748e-04   0.000000e+00 
  1.775000e+02   9.558770e-05   0.000000e+00   9.558770e-05   0.000000e+00 
  1.777500e+02   9.858152e-05   0.000000e+00   9.858152e-05   0.000000e+00 
  1.780000e+02   1.194233e-04   0.000000e+00   1.194233e-04   0.000000e+00 
  1.782500e+02   1.213615e-04   0.000000e+00   1.213615e-04   0.000000e+00 
  1.785000e+02   1.251485e-04   0.000000e+00   1.251485e-04   0.000000e+00 
  1.787500e+02   1.089886e-04   0.000000e+00   1.089886e-04   0.000000e+00 
  1.790000e+02   8.973436e-05   0.000000e+00   8.973436e-05   0.000000e+00 
  1.792500e+02   9.749660e-05   0.000000e+00   9.749660e-05   0.000000e+00 
  1.795000e+02   1.078863e-04   0.000000e+00   1.078863e-04   0.000000e+00 
  1.797500e+02   9.420623e-05   0.000000e+00   9.420623e-05   0.000000e+00 
  1.800000e+02   1.119428e-04   0.000000e+00   1.119428e-04   0.000000e+00 
  1.802500e+02   1.005929e-04   0.000000e+00   1.005929e-04   0.000000e+00 
  1.805000e+02   8.146718e-05   0.000000e+00   8.146718e-05   0.000000e+00 
  1.807500e+02   6.078906e-05   0.000000e+00   6.078906e-05   0.000000e+00 
  1.810000e+02   1.084682e-04   0.000000e+00   1.084682e-04   0.000000e+00 
  1.812500e+02   1.208641e-04   0.000000e+00   1.208641e-04   0.000000e+00 
  1.815000e+02   1.133357e-04   0.000000e+00   1.133357e-04   0.000000e+00 
  1.817500e+02   1.250695e-04   0.000000e+00   1.250695e-04   0.000000e+00 
  1.820000e+02   9.537614e-05   0.000000e+00   9.537614e-05   0.000000e+00 
  1.822500e+02   8.737377e-05   0.000000e+00   8.737377e-05   0.000000e+00 
  1.825000e+02   7.348657e-05   0.000000e+00   7.348657e-05   0.000000e+00 
  1.827500e+02   9.804253e-05   0.000000e+00   9.804253e-05   0.000000e+00 
  1.830000e+02   1.118008e-04   0.000000e+00   1.118008e-04   0.000000e+00 
  1.832500e+02   9.546579e-05   0.000000e+00   9.546579e-05   0.000000e+00 
  1.835000e+02   1.102324e-04   0.000000e+00   1.102324e-04   0.000000e+00 
  1.837500e+02   7.374201e-05   0.000000e+00   7.374201e-05   0.000000e+00 
  1.840000e+02   9.744289e-05   0.000000e+00   9.744289e-05   0.000000e+00 
  1.842500e+02   8.982766e-05   0.000000e+00   8.982766e-05   0.000000e+00 
  1.845000e+02   8.538747e-05   0.000000e+00   8.538747e-05   0.000000e+00 
  1.847500e+02   1.188223e-04   0.000000e+00   1.188223e-04   0.000000e+00 
  1.850000e+02   1.105367e-04   0.000000e+00   1.105367e-04   0.000000e+00 
  1.852500e+02   8.613014e-05   0.000000e+00   8.613014e-05   0.000000e+00 
  1.855000e+02   1.082803e-04   0.000000e+00   1.082803e-04   0.000000e+00 
  1.857500e+02   9.180311e-05   0.000000e+00   9.180311e-05   0.000000e+00 
  1.860000e+02   9.152812e-05   0.000000e+00   9.152812e-05   0.000000e+00 
  1.862500e+02   1.183970e-04   0.000000e+00   1.183970e-04   0.000000e+00 
  1.865000e+02   1.103598e-04   0.000000e+00   1.103598e-04   0.000000e+00 
  1.867500e+02   1.202902e-04   0.000000e+00   1.202902e-04   0.000000e+00 
  1.870000e+02   1.007332e-04   0.000000e+00   1.007332e-04   0.000000e+00 
  1.872500e+02   1.046417e-04   0.000000e+00   1.046417e-04   0.000000e+00 
  1.875000e+02   1.286109e-04   0.000000e+00   1.286109e-04   0.000000e+00 
  1.877500e+02   1.288631e-04   0.000000e+00   1.288631e-04   0.000000e+00 
  1.880000e+02   1.042401e-04   0.000000e+00   1.042401e-04   0.000000e+00 
  1.882500e+02   8.716123e-05   0.000000e+00   8.716123e-05   0.000000e+00 
  1.885000e+02   8.137361e-05   0.000000e+00   8.137361e-05   0.000000e+00 
  1.887500e+02   8.175174e-05   0.000000e+00   8.175174e-05   0.000000e+00 
  1.890000e+02   8.672089e-05   0.000000e+00   8.672089e-05   0.000000e+00 
  1.892500e+02   1.166344e-04   0.000000e+00   1.166344e-04   0.000000e+00 
  1.895000e+02   9.154722e-05   0.000000e+00   9.154722e-05   0.000000e+00 
  1.897500e+02   9.403932e-05   0.000000e+00   9.403932e-05   0.000000e+00 
  1.900000e+02   1.074644e-04   0.000000e+00   1.074644e-04   0.000000e+00 
  1.902500e+02   1.029285e-04   0.000000e+00   1.029285e-04   0.000000e+00 
  1.905000e+02   7.708820e-05   0.000000e+00   7.708820e-05   0.000000e+00 
  1.907500e+02   7.108561e-05   0.000000e+00   7.108561e-05   0.000000e+00 
  1.910000e+02   1.143785e-04   0.000000e+00   1.143785e-04   0.000000e+00 
  1.912500e+02   1.328635e-04   0.000000e+00   1.328635e-04   0.000000e+00 
  1.915000e+02   1.256687e-04   0.000000e+00   1.256687e-04   0.000000e+00 
  1.917500e+02   1.109482e-04   0.000000e+00   1.109482e-04   0.000000e+00 
  1.920000e+02   1.297230e-04   0.000000e+00   1.297230e-04   0.000000e+00 
  1.922500e+02   9.953776e-05   0.000000e+00   9.953776e-05   0.000000e+00 
  1.925000e+02   1.358814e-04   0.000000e+00   1.358814e-04   0.000000e+00 
  1.927500e+02   1.322923e-04   0.000000e+00   1.322923e-04   0.000000e+00 
  1.930000e+02   1.240228e-04   0.000000e+00   1.240228e-04   0.000000e+00 
  1.932500e+02   1.183121e-04   0.000000e+00   1.183121e-04   0.000000e+00 
  1.935000e+02   1.216710e-04   0.000000e+00   1.216710e-04   0.000000e+00 
  1.937500e+02   1.331605e-04   0.000000e+00   1.331605e-04   0.000000e+00 
  1.940000e+02   1.041552e-04   0.000000e+00   1.041552e-04   0.000000e+00 
  1.942500e+02   7.943568e-05   0.000000e+00   7.943568e-05   0.000000e+00 
  1.945000e+02   1.045915e-04   0.000000e+00   1.045915e-04   0.000000e+00 
  1.947500e+02   1.047480e-04   0.000000e+00   1.047480e-04   0.000000e+00 
  1.950000e+02   1.419263e-04   0.000000e+00   1.419263e-04   0.000000e+00 
  1.952500e+02   1.462810e-04   0.000000e+00   1.462810e-04   0.000000e+00 
  1.955000e+02   1.199385e-04   0.000000e+00   1.199385e-04   0.000000e+00 
  1.957500e+02   1.551691e-04   0.000000e+00   1.551691e-04   0.000000e+00 
  1.960000e+02   1.432729e-04   0.000000e+00   1.432729e-04   0.000000e+00 
  1.962500e+02   1.034520e-04   0.000000e+00   1.034520e-04   0.000000e+00 
  1.965000e+02   8.429818e-05   0.000000e+00   8.429818e-05   0.000000e+00 
  1.967500e+02   1.104864e-04   0.000000e+00   1.104864e-04   0.000000e+00 
  1.970000e+02   1.050939e-04   0.000000e+00   1.050939e-04   0.000000e+00 
  1.972500e+02   9.390261e-05   0.000000e+00   9.390261e-05   0.000000e+00 
  1.975000e+02   1.078460e-04   0.000000e+00   1.078460e-04   0.000000e+00 
  1.977500e+02   1.441252e-04   0.000000e+00   1.441252e-04   0.000000e+00 
  1.980000e+02   1.263370e-04   0.000000e+00   1.263370e-04   0.000000e+00 
  1.982500e+02   1.020762e-04   0.000000e+00   1.020762e-04   0.000000e+00 
  1.985000e+02   1.034344e-04   0.000000e+00   1.034344e-04   0.000000e+00 
  1.987500e+02   1.098446e-04   0.000000e+00   1.098446e-04   0.000000e+00 
  1.990000e+02   1.104026e-04   0.000000e+00   1.104026e-04   0.000000e+00 
  1.992500e+02   9.411589e-05   0.000000e+00   9.411589e-05   0.000000e+00 
  1.995000e+02   7.827859e-05   0.000000e+00   7.827859e-05   0.000000e+00 
  1.997500e+02   9.040776e-05   0.000000e+00   9.040776e-05   0.000000e+00 
  2.000000e+02   1.436824e-04   0.000000e+00   1.436824e-04   0.000000e+00 
