  1.000000e+01   1.577509e+03   1.959934e+03   6.801395e+01   5.117015e+01 
  1.047496e+01   1.555754e+03   2.411844e+03   6.915788e+01   5.717606e+01 
  1.097247e+01   5.364611e+03   3.487195e+03   7.612144e+01   3.302535e+01 
  1.149362e+01  -1.561039e+03  -2.099689e+03   6.835408e+01  -1.266294e+02 
  1.203952e+01   1.861024e+03   2.854573e+03   7.064907e+01   5.689787e+01 
  1.261134e+01  -7.389789e+02  -3.767366e+03   7.168472e+01  -1.010978e+02 
  1.321033e+01   3.433257e+03   1.700499e+03   7.166695e+01   2.634931e+01 
  1.383776e+01   1.734436e+03  -1.449960e+03   6.708476e+01  -3.989507e+01 
  1.449500e+01   2.080704e+03   2.344881e+03   6.992456e+01   4.841611e+01 
  1.518345e+01   1.037397e+04   3.903153e+03   8.089388e+01   2.061856e+01 
  1.590459e+01   1.180833e+02   2.376412e+03   6.752914e+01   8.715532e+01 
  1.666000e+01   2.570076e+03   1.886402e+03   7.007056e+01   3.627818e+01 
  1.745127e+01   1.769810e+03   2.896343e+03   7.061491e+01   5.857299e+01 
  1.828013e+01   3.568406e+03  -4.320279e+01   7.105012e+01  -6.936477e-01 
  1.914836e+01   1.429697e+03  -2.006931e+03   6.783318e+01  -5.453469e+01 
  2.005783e+01   1.311049e+03   8.281910e+02   6.381070e+01   3.228063e+01 
  2.101049e+01   1.798682e+03  -4.247990e+02   6.533481e+01  -1.328819e+01 
  2.200840e+01   2.557152e+03   4.923953e+02   6.831324e+01   1.089925e+01 
  2.305370e+01   1.609981e+03  -9.944981e+02   6.554012e+01  -3.170395e+01 
  2.414865e+01   1.290610e+03   3.726268e+02   6.256363e+01   1.610456e+01 
  2.529561e+01   1.855081e+03  -6.995618e+02   6.594471e+01  -2.066175e+01 
  2.649705e+01   2.509143e+03  -2.749250e+03   7.141581e+01  -4.761441e+01 
  2.775554e+01   1.579517e+03  -1.319339e+03   6.626907e+01  -3.987133e+01 
  2.907381e+01   1.547953e+02   3.052125e+03   6.970320e+01   8.709660e+01 
  3.045470e+01   1.871733e+03  -3.696296e+02   6.561102e+01  -1.117103e+01 
  3.190116e+01   1.039376e+03   3.298672e+02   6.075224e+01   1.760789e+01 
  3.341633e+01   3.461043e+03  -2.737028e+03   7.289369e+01  -3.833731e+01 
  3.500347e+01   4.025133e+03   3.835086e+03   7.490093e+01   4.361495e+01 
  3.666598e+01   4.073814e+02  -1.491841e+03   6.378680e+01  -7.472645e+01 
  3.840746e+01   1.400448e+03  -4.714547e+02   6.339158e+01  -1.860557e+01 
  4.023165e+01   1.843772e+03  -3.174160e+03   7.129522e+01  -5.984901e+01 
  4.214248e+01   7.465392e+01   1.385118e+03   6.284233e+01   8.691489e+01 
  4.414407e+01   2.866013e+03  -4.620606e+02   6.925700e+01  -9.158459e+00 
  4.624072e+01  -1.552529e+04   1.111547e+04   8.561803e+01   1.443989e+02 
  4.843696e+01   1.281476e+03  -3.413071e+01   6.215729e+01  -1.525650e+00 
  5.073751e+01  -2.704887e+03   5.871335e+03   7.621062e+01   1.147352e+02 
  5.314732e+01  -9.608939e+02   2.132470e+03   6.738046e+01   1.142564e+02 
  5.567159e+01  -2.084824e+02   1.109819e+03   6.105566e+01   1.006392e+02 
  5.831576e+01   3.081256e+03  -6.244198e+02   6.994934e+01  -1.145591e+01 
  6.108551e+01  -1.121737e+04  -4.905890e+03   8.175793e+01  -1.563779e+02 
  6.398681e+01   3.234894e+03  -4.145910e+03   7.441744e+01  -5.203645e+01 
  6.702591e+01   1.002108e+03  -3.800975e+03   7.188974e+01  -7.523034e+01 
  7.020935e+01   5.764470e+02   1.025016e+03   6.140806e+01   6.064753e+01 
  7.354400e+01   4.686427e+02   1.595895e+03   6.441932e+01   7.363485e+01 
  7.703703e+01   2.651019e+03  -4.364523e+02   6.858440e+01  -9.349064e+00 
  8.069595e+01   9.796341e+02  -2.455450e+02   6.008590e+01  -1.407127e+01 
  8.452866e+01   8.603530e+02   1.997710e+03   6.674957e+01   6.669991e+01 
  8.854342e+01   2.845541e+03  -2.940424e+02   6.912943e+01  -5.899690e+00 
  9.274885e+01  -1.539527e+03   3.495765e+03   7.164071e+01   1.137686e+02 
  9.715402e+01   1.719425e+03  -3.300526e+02   6.486481e+01  -1.086605e+01 
  1.017684e+02  -2.352157e+03  -7.160910e+02   6.781427e+01  -1.630676e+02 
  1.066020e+02  -1.905319e+03   1.571843e+03   6.785396e+01   1.404782e+02 
  1.116651e+02   1.786692e+03   5.251301e+02   6.540083e+01   1.637869e+01 
  1.169688e+02  -9.708871e+02   1.002265e+03   6.289401e+01   1.340889e+02 
  1.225243e+02   1.134278e+03  -2.799428e+02   6.135118e+01  -1.386370e+01 
  1.283436e+02   2.588082e+03  -2.253304e+02   6.829236e+01  -4.975889e+00 
  1.344394e+02  -1.664519e+03   7.992391e+02   6.532679e+01   1.543514e+02 
  1.408247e+02   1.076973e+03   1.879584e+03   6.671423e+01   6.018794e+01 
  1.475133e+02  -3.918981e+03  -1.226219e+03   7.226910e+01  -1.626255e+02 
  1.545195e+02   5.095844e+02  -4.224940e+01   5.417407e+01  -4.739526e+00 
  1.618586e+02   1.230766e+03   5.107059e+02   6.249347e+01   2.253599e+01 
  1.695461e+02   4.370053e+02   1.069828e+03   6.125646e+01   6.778088e+01 
  1.775989e+02  -2.265286e+03  -2.181668e+03   6.995249e+01  -1.360772e+02 
  1.860341e+02   4.513405e+01   5.234000e+03   7.437700e+01   8.950593e+01 
  1.948699e+02   1.147072e+03   1.065229e+03   6.389252e+01   4.288134e+01 
  2.041254e+02   4.629189e+02   4.276260e+02   5.598963e+01   4.273051e+01 
  2.138204e+02  -8.988961e+02   5.513393e+01   5.909050e+01   1.764901e+02 
  2.239760e+02   3.175166e+02  -2.145101e+02   5.166819e+01  -3.404246e+01 
  2.346139e+02  -5.701771e+02  -9.394119e+02   6.081922e+01  -1.212557e+02 
  2.457571e+02   3.543076e+02  -2.374877e+03   6.760843e+01  -8.151463e+01 
  2.574295e+02  -4.292299e+01  -5.523973e+02   5.487117e+01  -9.444312e+01 
  2.696563e+02  -1.216913e+03  -1.231444e+03   6.476735e+01  -1.346600e+02 
  2.824638e+02  -8.840266e+02  -8.216652e+02   6.163351e+01  -1.370938e+02 
  2.958796e+02  -6.449385e+02   3.706617e+02   5.742989e+01   1.501130e+02 
  3.099326e+02   4.005413e+02  -4.998551e+02   5.613089e+01  -5.129428e+01 
  3.246531e+02  -2.784555e+02   1.076248e+02   4.949978e+01   1.588682e+02 
  3.400728e+02   5.449303e+02  -3.458249e+02   5.619661e+01  -3.240012e+01 
  3.562248e+02  -7.625657e+02  -2.142072e+02   5.797538e+01  -1.643098e+02 
  3.731439e+02  -6.257670e+02  -5.390892e+02   5.833913e+01  -1.392556e+02 
  3.908667e+02  -6.572633e+02   1.686969e+02   5.663186e+01   1.656049e+02 
  4.094312e+02   3.829525e+02   2.596534e+02   5.330561e+01   3.413845e+01 
  4.288774e+02   3.964904e+02  -3.933879e+01   5.200720e+01  -5.666201e+00 
  4.492472e+02  -7.997087e+02   7.937690e+02   6.103668e+01   1.352136e+02 
  4.705846e+02   6.107040e+02  -7.956141e+02   6.002581e+01  -5.249057e+01 
  4.929353e+02  -2.856913e+02  -7.446262e+02   5.803517e+01  -1.109903e+02 
  5.163477e+02  -2.629148e+02   3.342840e+02   5.257367e+01   1.281851e+02 
  5.408719e+02  -5.907413e+00  -1.072547e+03   6.060846e+01  -9.031557e+01 
  5.665610e+02  -2.596255e+02  -1.570006e+02   4.964046e+01  -1.488378e+02 
  5.934703e+02  -1.933353e+02  -2.731460e+02   5.049169e+01  -1.252912e+02 
  6.216576e+02   1.405097e+03   3.334851e+02   6.319212e+01   1.335151e+01 
  6.511837e+02   6.917432e+02   3.281752e+02   5.768052e+01   2.538049e+01 
  6.821121e+02  -5.775263e+02  -8.638533e+01   5.532753e+01  -1.714929e+02 
  7.145095e+02  -5.410467e+01  -1.770590e+02   4.535006e+01  -1.069918e+02 
  7.484457e+02  -2.712990e+02   2.488814e+02   5.132084e+01   1.374677e+02 
  7.839937e+02  -6.715233e+02  -7.615866e+01   5.659673e+01  -1.735296e+02 
  8.212300e+02  -2.891814e+02   4.383726e+01   4.932208e+01   1.713801e+02 
  8.602349e+02   3.000337e+02  -3.759796e+02   5.364328e+01  -5.140995e+01 
  9.010924e+02  -2.054226e+02   2.170901e+02   4.950981e+01   1.334182e+02 
  9.438904e+02  -1.017229e+02   5.159479e+02   5.441773e+01   1.011532e+02 
  9.887212e+02  -1.745648e+02  -1.302377e+02   4.676096e+01  -1.432745e+02 
  1.035681e+03   4.756671e+00   2.617084e+02   4.835779e+01   8.895873e+01 
  1.084872e+03  -8.015713e+01   9.201394e+01   4.172945e+01   1.310605e+02 
  1.136398e+03  -2.571334e+02  -1.496425e+01   4.821785e+01  -1.766693e+02 
  1.190373e+03  -1.689889e+02   5.550829e+01   4.500215e+01   1.618160e+02 
  1.246910e+03  -3.411539e+02   1.768735e+02   5.169293e+01   1.525952e+02 
  1.306133e+03   1.160568e+02   1.116320e+02   4.413818e+01   4.388666e+01 
  1.368169e+03  -1.435795e+02  -1.030783e+02   4.494714e+01  -1.443247e+02 
  1.433151e+03  -7.009238e+01   2.042395e+01   3.726734e+01   1.637546e+02 
  1.501219e+03  -1.858586e+02   2.156902e+02   4.908837e+01   1.307512e+02 
  1.572521e+03  -1.342435e+02   5.468112e+01   4.322454e+01   1.578376e+02 
  1.647209e+03  -8.983473e+01   2.737967e+01   3.945465e+01   1.630499e+02 
  1.725444e+03  -6.644395e+01  -7.061125e-01   3.644960e+01  -1.793911e+02 
  1.807396e+03  -4.683295e+01   2.320200e+01   3.436426e+01   1.536452e+02 
  1.893239e+03  -7.663878e+01   9.970927e+01   4.199081e+01   1.275467e+02 
  1.983160e+03  -5.529482e+01   2.662790e+01   3.575945e+01   1.542863e+02 
  2.077352e+03  -2.691673e+01   1.228874e+01   2.942268e+01   1.554611e+02 
  2.176017e+03  -7.203219e+01   6.805014e+01   3.992088e+01   1.366283e+02 
  2.279368e+03  -2.438151e+01   1.440223e+01   2.904111e+01   1.494295e+02 
  2.387629e+03  -3.096763e+01   2.482674e+01   3.197380e+01   1.412809e+02 
  2.501031e+03  -2.846607e+01   4.525810e+00   2.919497e+01   1.709662e+02 
  2.619819e+03  -2.566970e+01   9.145863e+00   2.870743e+01   1.603895e+02 
  2.744250e+03  -3.143927e+01  -4.428535e+00   3.003477e+01  -1.719821e+02 
  2.874590e+03  -2.304348e+01   8.137066e+00   2.776130e+01   1.605509e+02 
  3.011120e+03  -6.429543e+01  -2.370023e+01   3.671692e+01  -1.597654e+02 
  3.154136e+03  -2.854631e+01   2.278715e+00   2.913859e+01   1.754360e+02 
  3.303944e+03  -1.829169e+01   6.386046e+00   2.574457e+01   1.607547e+02 
  3.460867e+03  -1.798650e+01   5.972700e+00   2.555321e+01   1.616304e+02 
  3.625243e+03  -1.187172e+01   3.387743e+00   2.183026e+01   1.640732e+02 
  3.797427e+03  -1.442342e+01  -5.690560e-01   2.318812e+01  -1.777406e+02 
  3.977788e+03  -9.972044e+00  -2.056092e+00   2.015650e+01  -1.683497e+02 
  4.166716e+03  -1.059088e+01  -2.943369e-01   2.050199e+01  -1.784081e+02 
  4.364618e+03  -9.391844e+00   4.359622e-01   1.946437e+01   1.773423e+02 
  4.571918e+03  -7.317301e+00   6.250798e-01   1.731860e+01   1.751174e+02 
  4.789065e+03  -9.847437e+00  -1.339552e+00   1.994609e+01  -1.722536e+02 
  5.016525e+03  -8.515441e+00   4.331654e-01   1.861537e+01   1.770880e+02 
  5.254789e+03  -7.768309e+00  -2.968365e-01   1.781287e+01  -1.778117e+02 
  5.504369e+03  -5.444314e+00  -2.250721e+00   1.540408e+01  -1.575394e+02 
  5.765803e+03  -6.016529e+00  -1.075220e+00   1.572345e+01  -1.698676e+02 
  6.039654e+03  -5.848137e+00  -1.370031e+00   1.557239e+01  -1.668152e+02 
  6.326511e+03  -4.219364e+00  -1.367524e+00   1.293874e+01  -1.620421e+02 
  6.626994e+03  -4.174531e+00  -1.995558e+00   1.330595e+01  -1.544507e+02 
  6.941748e+03  -4.106015e+00  -1.410535e+00   1.275288e+01  -1.610409e+02 
  7.271451e+03  -4.181381e+00  -1.997098e+00   1.331880e+01  -1.544701e+02 
  7.616814e+03  -3.212886e+00  -1.447060e+00   1.094003e+01  -1.557536e+02 
  7.978580e+03  -3.034376e+00  -2.148786e+00   1.140656e+01  -1.446959e+02 
  8.357528e+03  -3.179615e+00  -1.773564e+00   1.122395e+01  -1.508476e+02 
  8.754476e+03  -2.738103e+00  -1.559289e+00   9.968877e+00  -1.503394e+02 
  9.170275e+03  -2.999993e+00  -1.438133e+00   1.044076e+01  -1.543879e+02 
  9.605824e+03  -2.087539e+00  -1.433424e+00   8.070290e+00  -1.455243e+02 
  1.006206e+04  -2.303629e+00  -1.564294e+00   8.895103e+00  -1.458213e+02 
  1.053996e+04  -2.225565e+00  -1.237150e+00   8.118217e+00  -1.509311e+02 
  1.104057e+04  -2.085559e+00  -1.243020e+00   7.704586e+00  -1.492045e+02 
  1.156495e+04  -1.807033e+00  -1.188323e+00   6.700122e+00  -1.466707e+02 
  1.211423e+04  -1.702463e+00  -1.343736e+00   6.724678e+00  -1.417163e+02 
  1.268961e+04  -1.611541e+00  -1.159373e+00   5.956294e+00  -1.442680e+02 
  1.329231e+04  -1.575084e+00  -9.445120e-01   5.280153e+00  -1.490506e+02 
  1.392364e+04  -1.447333e+00  -1.000877e+00   4.908750e+00  -1.453349e+02 
  1.458495e+04  -1.281850e+00  -1.059824e+00   4.419096e+00  -1.404163e+02 
  1.527767e+04  -1.262026e+00  -8.864691e-01   3.763099e+00  -1.449151e+02 
  1.600330e+04  -1.249007e+00  -8.807042e-01   3.684092e+00  -1.448114e+02 
  1.676339e+04  -1.064430e+00  -7.980097e-01   2.479319e+00  -1.431409e+02 
  1.755958e+04  -1.142986e+00  -7.699457e-01   2.785781e+00  -1.460347e+02 
  1.839358e+04  -9.627679e-01  -6.776424e-01   1.418013e+00  -1.448603e+02 
  1.926720e+04  -9.569502e-01  -6.821312e-01   1.402116e+00  -1.445180e+02 
  2.018231e+04  -8.715181e-01  -5.785655e-01   3.912920e-01  -1.464214e+02 
  2.114088e+04  -8.179778e-01  -5.470889e-01  -1.394791e-01  -1.462242e+02 
  2.214498e+04  -7.549064e-01  -5.110637e-01  -8.036252e-01  -1.459024e+02 
  2.319678e+04  -7.069851e-01  -4.728444e-01  -1.406156e+00  -1.462247e+02 
  2.429852e+04  -6.956095e-01  -4.238209e-01  -1.781612e+00  -1.486469e+02 
  2.545260e+04  -6.745646e-01  -4.107553e-01  -2.049843e+00  -1.486620e+02 
  2.666149e+04  -6.497121e-01  -3.535957e-01  -2.618890e+00  -1.514434e+02 
  2.792779e+04  -5.935168e-01  -3.182892e-01  -3.433555e+00  -1.517964e+02 
  2.925425e+04  -5.692148e-01  -2.862958e-01  -3.915053e+00  -1.532991e+02 
  3.064370e+04  -5.494104e-01  -2.543490e-01  -4.358725e+00  -1.551583e+02 
  3.209914e+04  -5.497217e-01  -2.218598e-01  -4.541788e+00  -1.580217e+02 
  3.362371e+04  -4.922062e-01  -1.884411e-01  -5.563038e+00  -1.590507e+02 
  3.522070e+04  -4.530583e-01  -1.835317e-01  -6.217007e+00  -1.579474e+02 
  3.689353e+04  -4.338177e-01  -1.585924e-01  -6.709086e+00  -1.599189e+02 
  3.864582e+04  -4.115960e-01  -1.464546e-01  -7.192846e+00  -1.604133e+02 
  4.048133e+04  -3.776846e-01  -1.288047e-01  -7.979579e+00  -1.611687e+02 
  4.240402e+04  -3.563366e-01  -1.130763e-01  -8.546108e+00  -1.623942e+02 
  4.441803e+04  -3.406036e-01  -9.439163e-02  -9.033661e+00  -1.645103e+02 
  4.652769e+04  -3.211193e-01  -8.290919e-02  -9.586408e+00  -1.655231e+02 
  4.873756e+04  -3.074789e-01  -7.275450e-02  -1.000711e+01  -1.666877e+02 
  5.105239e+04  -2.839665e-01  -5.347560e-02  -1.078331e+01  -1.693351e+02 
  5.347716e+04  -2.644005e-01  -4.072421e-02  -1.145293e+01  -1.712438e+02 
  5.601709e+04  -2.494666e-01  -2.893152e-02  -1.200173e+01  -1.733848e+02 
  5.867766e+04  -2.303385e-01  -2.069197e-02  -1.271776e+01  -1.748667e+02 
  6.146461e+04  -2.116067e-01  -8.665206e-03  -1.348213e+01  -1.776551e+02 
  6.438391e+04  -1.936464e-01   3.785736e-03  -1.425815e+01   1.788800e+02 
  6.744187e+04  -1.795524e-01   1.392169e-04  -1.491617e+01   1.799556e+02 
  7.064507e+04  -1.703825e-01  -1.081354e-03  -1.537133e+01  -1.796364e+02 
  7.400041e+04  -1.680718e-01   3.241917e-03  -1.548849e+01   1.788950e+02 
  7.751512e+04  -1.558426e-01   1.086621e-02  -1.612521e+01   1.760115e+02 
  8.119675e+04  -1.420556e-01   1.796627e-02  -1.688191e+01   1.727919e+02 
  8.505325e+04  -1.338581e-01   2.277082e-02  -1.734321e+01   1.703457e+02 
  8.909291e+04  -1.207611e-01   3.237066e-02  -1.806010e+01   1.649943e+02 
  9.332445e+04  -1.105084e-01   3.894850e-02  -1.862358e+01   1.605851e+02 
  9.775696e+04  -9.726711e-02   4.370955e-02  -1.944185e+01   1.558020e+02 
  1.024000e+05  -8.821782e-02   4.753906e-02  -1.998165e+01   1.516805e+02 
