  1.000000e+01   7.208133e-03   2.586525e-01  -1.174230e+01   8.840369e+01 
  1.097762e+01   3.568615e-02   2.439525e-01  -1.216194e+01   8.167762e+01 
  1.205081e+01   1.572322e-02   2.467433e-01  -1.213749e+01   8.635387e+01 
  1.322892e+01   6.030904e-02   2.540111e-01  -1.166478e+01   7.664375e+01 
  1.452220e+01   8.482359e-02   2.465877e-01  -1.167488e+01   7.101732e+01 
  1.594191e+01   9.377754e-02   2.375576e-01  -1.185567e+01   6.845802e+01 
  1.750042e+01   1.328572e-01   2.349477e-01  -1.137562e+01   6.051291e+01 
  1.921129e+01   1.431476e-01   2.276386e-01  -1.140798e+01   5.783680e+01 
  2.108942e+01   1.673462e-01   2.268209e-01  -1.099893e+01   5.358046e+01 
  2.315116e+01   1.808361e-01   2.127542e-01  -1.108094e+01   4.963624e+01 
  2.541446e+01   2.019742e-01   1.948839e-01  -1.103621e+01   4.397646e+01 
  2.789902e+01   2.243104e-01   1.798851e-01  -1.082632e+01   3.872776e+01 
  3.062647e+01   2.384730e-01   1.633117e-01  -1.078105e+01   3.440423e+01 
  3.362057e+01   2.452492e-01   1.556143e-01  -1.073848e+01   3.239575e+01 
  3.690737e+01   2.603349e-01   1.373093e-01  -1.062341e+01   2.780865e+01 
  4.051550e+01   2.708583e-01   1.149410e-01  -1.062604e+01   2.299434e+01 
  4.447636e+01   2.731906e-01   1.026345e-01  -1.069729e+01   2.059061e+01 
  4.882445e+01   2.802759e-01   8.266132e-02  -1.068606e+01   1.643228e+01 
  5.359761e+01   2.789986e-01   6.995404e-02  -1.082317e+01   1.407574e+01 
  5.883741e+01   2.811274e-01   5.648248e-02  -1.085007e+01   1.136029e+01 
  6.458945e+01   2.832915e-01   3.912665e-02  -1.087327e+01   7.863626e+00 
  7.090383e+01   2.815957e-01   2.774941e-02  -1.096551e+01   5.627953e+00 
  7.783551e+01   2.764767e-01   1.728509e-02  -1.114989e+01   3.577427e+00 
  8.544484e+01   2.706091e-01   9.708439e-03  -1.134757e+01   2.054676e+00 
  9.379807e+01   2.684636e-01  -7.801806e-04  -1.142226e+01  -1.665065e-01 
  1.029679e+02   2.609037e-01  -2.376136e-03  -1.167003e+01  -5.217971e-01 
  1.130343e+02   2.564343e-01  -6.480942e-03  -1.181770e+01  -1.447745e+00 
  1.240847e+02   2.496703e-01  -1.257502e-02  -1.204166e+01  -2.883352e+00 
  1.362154e+02   2.399890e-01  -1.675899e-02  -1.237505e+01  -3.994612e+00 
  1.495321e+02   2.401805e-01  -1.455362e-02  -1.237333e+01  -3.467569e+00 
  1.641506e+02   2.343997e-01  -1.612736e-02  -1.258035e+01  -3.935907e+00 
  1.801982e+02   2.284633e-01  -1.574561e-02  -1.280309e+01  -3.942571e+00 
  1.978147e+02   2.237399e-01  -1.550183e-02  -1.298433e+01  -3.963408e+00 
  2.171534e+02   2.213681e-01  -1.295466e-02  -1.308285e+01  -3.349180e+00 
  2.383827e+02   2.166791e-01  -1.333747e-02  -1.326724e+01  -3.522340e+00 
  2.616874e+02   2.174806e-01  -1.111446e-02  -1.324026e+01  -2.925585e+00 
  2.872704e+02   2.132126e-01  -1.549775e-02  -1.340086e+01  -4.157338e+00 
  3.153545e+02   2.096920e-01  -1.129624e-02  -1.355578e+01  -3.083579e+00 
  3.461841e+02   2.060156e-01  -1.207811e-02  -1.370709e+01  -3.355248e+00 
  3.800276e+02   2.028218e-01  -5.054426e-03  -1.385501e+01  -1.427545e+00 
  4.171797e+02   2.023104e-01  -6.560560e-03  -1.387507e+01  -1.857347e+00 
  4.579640e+02   2.062008e-01  -5.675023e-03  -1.371091e+01  -1.576487e+00 
  5.027353e+02   2.024799e-01  -5.879553e-03  -1.386870e+01  -1.663271e+00 
  5.518835e+02   2.044864e-01  -5.748722e-03  -1.378328e+01  -1.610331e+00 
  6.058367e+02   2.043144e-01  -3.511160e-03  -1.379274e+01  -9.845359e-01 
  6.650643e+02   2.039569e-01  -3.655889e-03  -1.380784e+01  -1.026906e+00 
  7.300821e+02   2.031220e-01  -3.569189e-03  -1.384352e+01  -1.006678e+00 
  8.014562e+02   2.061332e-01  -1.313168e-03  -1.371686e+01  -3.649968e-01 
  8.798079e+02   2.065309e-01  -3.333896e-03  -1.369917e+01  -9.248087e-01 
  9.658195e+02   2.074010e-01  -2.861213e-03  -1.366296e+01  -7.903773e-01 
  1.060240e+03   2.056185e-01  -6.056009e-04  -1.373872e+01  -1.687507e-01 
  1.163890e+03   2.067303e-01   8.688500e-05  -1.369192e+01   2.408037e-02 
  1.277674e+03   2.087974e-01   1.958572e-03  -1.360512e+01   5.374330e-01 
  1.402582e+03   2.074376e-01   1.765282e-03  -1.366194e+01   4.875721e-01 
  1.539701e+03   2.076776e-01   2.367829e-03  -1.365164e+01   6.532274e-01 
  1.690225e+03   2.083002e-01   5.664421e-03  -1.362300e+01   1.557691e+00 
  1.855464e+03   2.077583e-01   4.338909e-03  -1.364694e+01   1.196414e+00 
  2.036857e+03   2.086948e-01   7.044380e-03  -1.360482e+01   1.933254e+00 
  2.235984e+03   2.092493e-01   7.598183e-03  -1.358099e+01   2.079589e+00 
  2.454577e+03   2.077548e-01   1.017900e-02  -1.363857e+01   2.804978e+00 
  2.694541e+03   2.086985e-01   9.232613e-03  -1.360112e+01   2.533057e+00 
  2.957964e+03   2.105343e-01   9.167454e-03  -1.352532e+01   2.493299e+00 
  3.247140e+03   2.146853e-01   9.910649e-03  -1.335471e+01   2.643103e+00 
  3.564586e+03   2.174540e-01   1.095834e-02  -1.324164e+01   2.884913e+00 
  3.913066e+03   2.192035e-01   1.045435e-02  -1.317318e+01   2.730505e+00 
  4.295614e+03   2.233029e-01   9.897203e-03  -1.301359e+01   2.537796e+00 
  4.715561e+03   2.246508e-01   8.963671e-03  -1.296293e+01   2.284915e+00 
  5.176562e+03   2.272996e-01   8.311672e-03  -1.286222e+01   2.094203e+00 
  5.682631e+03   2.305166e-01   5.652770e-03  -1.274334e+01   1.404736e+00 
  6.238175e+03   2.349327e-01   2.353181e-03  -1.258069e+01   5.738785e-01 
  6.848030e+03   2.409023e-01  -2.613492e-03  -1.236267e+01  -6.215639e-01 
  7.517505e+03   2.421530e-01  -6.257603e-03  -1.231530e+01  -1.480281e+00 
  8.252429e+03   2.455974e-01  -1.242101e-02  -1.218443e+01  -2.895247e+00 
  9.059200e+03   2.486653e-01  -1.864774e-02  -1.206334e+01  -4.288659e+00 
  9.944844e+03   2.488573e-01  -2.489799e-02  -1.203773e+01  -5.713387e+00 
  1.091707e+04   2.529098e-01  -3.479435e-02  -1.185926e+01  -7.833356e+00 
  1.198434e+04   2.533828e-01  -4.072119e-02  -1.181371e+01  -9.129945e+00 
  1.315595e+04   2.517169e-01  -5.350215e-02  -1.178985e+01  -1.199958e+01 
  1.444210e+04   2.486967e-01  -6.307016e-02  -1.181590e+01  -1.423036e+01 
  1.585398e+04   2.460055e-01  -7.308207e-02  -1.181380e+01  -1.654536e+01 
  1.740389e+04   2.428486e-01  -8.285268e-02  -1.181510e+01  -1.883811e+01 
  1.910533e+04   2.329801e-01  -9.332568e-02  -1.200732e+01  -2.182973e+01 
  2.097310e+04   2.261786e-01  -1.030832e-01  -1.209132e+01  -2.450160e+01 
  2.302346e+04   2.178389e-01  -1.115467e-01  -1.222599e+01  -2.711520e+01 
  2.527428e+04   2.090474e-01  -1.218301e-01  -1.232522e+01  -3.023308e+01 
  2.774513e+04   1.965982e-01  -1.332569e-01  -1.248658e+01  -3.412995e+01 
  3.045755e+04   1.839895e-01  -1.386265e-01  -1.275156e+01  -3.699611e+01 
  3.343513e+04   1.736073e-01  -1.465713e-01  -1.287160e+01  -4.017336e+01 
  3.670380e+04   1.591740e-01  -1.504833e-01  -1.318925e+01  -4.339237e+01 
  4.029203e+04   1.460063e-01  -1.527598e-01  -1.350146e+01  -4.629493e+01 
  4.423105e+04   1.332872e-01  -1.535376e-01  -1.383637e+01  -4.903851e+01 
  4.855515e+04   1.180840e-01  -1.576601e-01  -1.411162e+01  -5.316757e+01 
  5.330199e+04   1.014052e-01  -1.593726e-01  -1.447543e+01  -5.753232e+01 
  5.851288e+04   8.263127e-02  -1.611838e-01  -1.484018e+01  -6.285794e+01 
  6.423320e+04   6.343487e-02  -1.516367e-01  -1.568352e+01  -6.729876e+01 
  7.051275e+04   5.825845e-02  -1.486613e-01  -1.593558e+01  -6.860042e+01 
  7.740620e+04   4.529812e-02  -1.481166e-01  -1.619962e+01  -7.299493e+01 
  8.497355e+04   3.238454e-02  -1.464503e-01  -1.647886e+01  -7.753084e+01 
  9.328072e+04   1.685973e-02  -1.393892e-01  -1.705234e+01  -8.310332e+01 
  1.024000e+05   3.394663e-03  -1.347923e-01  -1.740394e+01  -8.855734e+01 
