  0.000000e+00   1.054813e-05   0.000000e+00   1.054813e-05   0.000000e+00 
  1.280000e+02   5.274785e-06   0.000000e+00   5.274785e-06   0.000000e+00 
  2.560000e+02   7.401380e-08   0.000000e+00   7.401380e-08   0.000000e+00 
  3.840000e+02   1.266546e-07   0.000000e+00   1.266546e-07   0.000000e+00 
  5.120000e+02   2.591973e-07   0.000000e+00   2.591973e-07   0.000000e+00 
  6.400000e+02   3.107148e-07   0.000000e+00   3.107148e-07   0.000000e+00 
  7.680000e+02   3.972414e-07   0.000000e+00   3.972414e-07   0.000000e+00 
  8.960000e+02   5.327923e-07   0.000000e+00   5.327923e-07   0.000000e+00 
  1.024000e+03   6.791495e-07   0.000000e+00   6.791495e-07   0.000000e+00 
  1.152000e+03   8.380067e-07   0.000000e+00   8.380067e-07   0.000000e+00 
  1.280000e+03   1.022820e-06   0.000000e+00   1.022820e-06   0.000000e+00 
  1.408000e+03   1.265888e-06   0.000000e+00   1.265888e-06   0.000000e+00 
  1.536000e+03   1.500989e-06   0.000000e+00   1.500989e-06   0.000000e+00 
  1.664000e+03   1.773008e-06   0.000000e+00   1.773008e-06   0.000000e+00 
  1.792000e+03   2.095441e-06   0.000000e+00   2.095441e-06   0.000000e+00 
  1.920000e+03   2.373448e-06   0.000000e+00   2.373448e-06   0.000000e+00 
  2.048000e+03   2.666062e-06   0.000000e+00   2.666062e-06   0.000000e+00 
  2.176000e+03   3.034948e-06   0.000000e+00   3.034948e-06   0.000000e+00 
  2.304000e+03   3.386570e-06   0.000000e+00   3.386570e-06   0.000000e+00 
  2.432000e+03   3.739873e-06   0.000000e+00   3.739873e-06   0.000000e+00 
  2.560000e+03   4.149096e-06   0.000000e+00   4.149096e-06   0.000000e+00 
  2.688000e+03   4.658777e-06   0.000000e+00   4.658777e-06   0.000000e+00 
  2.816000e+03   5.201343e-06   0.000000e+00   5.201343e-06   0.000000e+00 
  2.944000e+03   5.640661e-06   0.000000e+00   5.640661e-06   0.000000e+00 
  3.072000e+03   6.198340e-06   0.000000e+00   6.198340e-06   0.000000e+00 
  3.200000e+03   6.575216e-06   0.000000e+00   6.575216e-06   0.000000e+00 
  3.328000e+03   7.072088e-06   0.000000e+00   7.072088e-06   0.000000e+00 
  3.456000e+03   7.811231e-06   0.000000e+00   7.811231e-06   0.000000e+00 
  3.584000e+03   8.399235e-06   0.000000e+00   8.399235e-06   0.000000e+00 
  3.712000e+03   8.925843e-06   0.000000e+00   8.925843e-06   0.000000e+00 
  3.840000e+03   9.626984e-06   0.000000e+00   9.626984e-06   0.000000e+00 
  3.968000e+03   1.047362e-05   0.000000e+00   1.047362e-05   0.000000e+00 
  4.096000e+03   1.103317e-05   0.000000e+00   1.103317e-05   0.000000e+00 
  4.224000e+03   1.175658e-05   0.000000e+00   1.175658e-05   0.000000e+00 
  4.352000e+03   1.276368e-05   0.000000e+00   1.276368e-05   0.000000e+00 
  4.480000e+03   1.335901e-05   0.000000e+00   1.335901e-05   0.000000e+00 
  4.608000e+03   1.420006e-05   0.000000e+00   1.420006e-05   0.000000e+00 
  4.736000e+03   1.542287e-05   0.000000e+00   1.542287e-05   0.000000e+00 
  4.864000e+03   1.632785e-05   0.000000e+00   1.632785e-05   0.000000e+00 
  4.992000e+03   1.806790e-05   0.000000e+00   1.806790e-05   0.000000e+00 
  5.120000e+03   1.998525e-05   0.000000e+00   1.998525e-05   0.000000e+00 
  5.248000e+03   2.105506e-05   0.000000e+00   2.105506e-05   0.000000e+00 
  5.376000e+03   2.070764e-05   0.000000e+00   2.070764e-05   0.000000e+00 
  5.504000e+03   2.097779e-05   0.000000e+00   2.097779e-05   0.000000e+00 
  5.632000e+03   2.169050e-05   0.000000e+00   2.169050e-05   0.000000e+00 
  5.760000e+03   2.212195e-05   0.000000e+00   2.212195e-05   0.000000e+00 
  5.888000e+03   2.313254e-05   0.000000e+00   2.313254e-05   0.000000e+00 
  6.016000e+03   2.467845e-05   0.000000e+00   2.467845e-05   0.000000e+00 
  6.144000e+03   2.597926e-05   0.000000e+00   2.597926e-05   0.000000e+00 
  6.272000e+03   2.664593e-05   0.000000e+00   2.664593e-05   0.000000e+00 
  6.400000e+03   2.736595e-05   0.000000e+00   2.736595e-05   0.000000e+00 
  6.528000e+03   2.845088e-05   0.000000e+00   2.845088e-05   0.000000e+00 
  6.656000e+03   2.983698e-05   0.000000e+00   2.983698e-05   0.000000e+00 
  6.784000e+03   3.237749e-05   0.000000e+00   3.237749e-05   0.000000e+00 
  6.912000e+03   3.377415e-05   0.000000e+00   3.377415e-05   0.000000e+00 
  7.040000e+03   3.363178e-05   0.000000e+00   3.363178e-05   0.000000e+00 
  7.168000e+03   3.365288e-05   0.000000e+00   3.365288e-05   0.000000e+00 
  7.296000e+03   3.542611e-05   0.000000e+00   3.542611e-05   0.000000e+00 
  7.424000e+03   3.667951e-05   0.000000e+00   3.667951e-05   0.000000e+00 
  7.552000e+03   3.804730e-05   0.000000e+00   3.804730e-05   0.000000e+00 
  7.680000e+03   3.951773e-05   0.000000e+00   3.951773e-05   0.000000e+00 
  7.808000e+03   4.061472e-05   0.000000e+00   4.061472e-05   0.000000e+00 
  7.936000e+03   4.128570e-05   0.000000e+00   4.128570e-05   0.000000e+00 
  8.064000e+03   4.235028e-05   0.000000e+00   4.235028e-05   0.000000e+00 
  8.192000e+03   4.225254e-05   0.000000e+00   4.225254e-05   0.000000e+00 
  8.320000e+03   4.366652e-05   0.000000e+00   4.366652e-05   0.000000e+00 
  8.448000e+03   4.431904e-05   0.000000e+00   4.431904e-05   0.000000e+00 
  8.576000e+03   4.566072e-05   0.000000e+00   4.566072e-05   0.000000e+00 
  8.704000e+03   4.613178e-05   0.000000e+00   4.613178e-05   0.000000e+00 
  8.832000e+03   4.663242e-05   0.000000e+00   4.663242e-05   0.000000e+00 
  8.960000e+03   4.904739e-05   0.000000e+00   4.904739e-05   0.000000e+00 
  9.088000e+03   4.979788e-05   0.000000e+00   4.979788e-05   0.000000e+00 
  9.216000e+03   4.905637e-05   0.000000e+00   4.905637e-05   0.000000e+00 
  9.344000e+03   5.126522e-05   0.000000e+00   5.126522e-05   0.000000e+00 
  9.472000e+03   5.344068e-05   0.000000e+00   5.344068e-05   0.000000e+00 
  9.600000e+03   5.528036e-05   0.000000e+00   5.528036e-05   0.000000e+00 
  9.728000e+03   5.526644e-05   0.000000e+00   5.526644e-05   0.000000e+00 
  9.856000e+03   5.466054e-05   0.000000e+00   5.466054e-05   0.000000e+00 
  9.984000e+03   5.420188e-05   0.000000e+00   5.420188e-05   0.000000e+00 
  1.011200e+04   5.460890e-05   0.000000e+00   5.460890e-05   0.000000e+00 
  1.024000e+04   5.862133e-05   0.000000e+00   5.862133e-05   0.000000e+00 
  1.036800e+04   5.951231e-05   0.000000e+00   5.951231e-05   0.000000e+00 
  1.049600e+04   6.045463e-05   0.000000e+00   6.045463e-05   0.000000e+00 
  1.062400e+04   5.891531e-05   0.000000e+00   5.891531e-05   0.000000e+00 
  1.075200e+04   5.966485e-05   0.000000e+00   5.966485e-05   0.000000e+00 
  1.088000e+04   5.997292e-05   0.000000e+00   5.997292e-05   0.000000e+00 
  1.100800e+04   6.109147e-05   0.000000e+00   6.109147e-05   0.000000e+00 
  1.113600e+04   6.215123e-05   0.000000e+00   6.215123e-05   0.000000e+00 
  1.126400e+04   6.435451e-05   0.000000e+00   6.435451e-05   0.000000e+00 
  1.139200e+04   6.434658e-05   0.000000e+00   6.434658e-05   0.000000e+00 
  1.152000e+04   6.323621e-05   0.000000e+00   6.323621e-05   0.000000e+00 
  1.164800e+04   5.695428e-05   0.000000e+00   5.695428e-05   0.000000e+00 
  1.177600e+04   5.418932e-05   0.000000e+00   5.418932e-05   0.000000e+00 
  1.190400e+04   5.806281e-05   0.000000e+00   5.806281e-05   0.000000e+00 
  1.203200e+04   6.488444e-05   0.000000e+00   6.488444e-05   0.000000e+00 
  1.216000e+04   6.938549e-05   0.000000e+00   6.938549e-05   0.000000e+00 
  1.228800e+04   6.833767e-05   0.000000e+00   6.833767e-05   0.000000e+00 
  1.241600e+04   6.989197e-05   0.000000e+00   6.989197e-05   0.000000e+00 
  1.254400e+04   7.195809e-05   0.000000e+00   7.195809e-05   0.000000e+00 
  1.267200e+04   7.436473e-05   0.000000e+00   7.436473e-05   0.000000e+00 
  1.280000e+04   7.597458e-05   0.000000e+00   7.597458e-05   0.000000e+00 
  1.292800e+04   7.575166e-05   0.000000e+00   7.575166e-05   0.000000e+00 
  1.305600e+04   7.780581e-05   0.000000e+00   7.780581e-05   0.000000e+00 
  1.318400e+04   8.185225e-05   0.000000e+00   8.185225e-05   0.000000e+00 
  1.331200e+04   8.748727e-05   0.000000e+00   8.748727e-05   0.000000e+00 
  1.344000e+04   9.665033e-05   0.000000e+00   9.665033e-05   0.000000e+00 
  1.356800e+04   9.059202e-05   0.000000e+00   9.059202e-05   0.000000e+00 
  1.369600e+04   7.459118e-05   0.000000e+00   7.459118e-05   0.000000e+00 
  1.382400e+04   7.685344e-05   0.000000e+00   7.685344e-05   0.000000e+00 
  1.395200e+04   8.130676e-05   0.000000e+00   8.130676e-05   0.000000e+00 
  1.408000e+04   8.167764e-05   0.000000e+00   8.167764e-05   0.000000e+00 
  1.420800e+04   8.218277e-05   0.000000e+00   8.218277e-05   0.000000e+00 
  1.433600e+04   8.384266e-05   0.000000e+00   8.384266e-05   0.000000e+00 
  1.446400e+04   8.597547e-05   0.000000e+00   8.597547e-05   0.000000e+00 
  1.459200e+04   8.664120e-05   0.000000e+00   8.664120e-05   0.000000e+00 
  1.472000e+04   8.699601e-05   0.000000e+00   8.699601e-05   0.000000e+00 
  1.484800e+04   8.905208e-05   0.000000e+00   8.905208e-05   0.000000e+00 
  1.497600e+04   8.925114e-05   0.000000e+00   8.925114e-05   0.000000e+00 
  1.510400e+04   9.050717e-05   0.000000e+00   9.050717e-05   0.000000e+00 
  1.523200e+04   9.102232e-05   0.000000e+00   9.102232e-05   0.000000e+00 
  1.536000e+04   9.504231e-05   0.000000e+00   9.504231e-05   0.000000e+00 
  1.548800e+04   1.029548e-04   0.000000e+00   1.029548e-04   0.000000e+00 
  1.561600e+04   1.030163e-04   0.000000e+00   1.030163e-04   0.000000e+00 
  1.574400e+04   1.015121e-04   0.000000e+00   1.015121e-04   0.000000e+00 
  1.587200e+04   1.050600e-04   0.000000e+00   1.050600e-04   0.000000e+00 
  1.600000e+04   1.085339e-04   0.000000e+00   1.085339e-04   0.000000e+00 
  1.612800e+04   1.125486e-04   0.000000e+00   1.125486e-04   0.000000e+00 
  1.625600e+04   1.169514e-04   0.000000e+00   1.169514e-04   0.000000e+00 
  1.638400e+04   1.235905e-04   0.000000e+00   1.235905e-04   0.000000e+00 
  1.651200e+04   1.609813e-04   0.000000e+00   1.609813e-04   0.000000e+00 
  1.664000e+04   1.673024e-04   0.000000e+00   1.673024e-04   0.000000e+00 
  1.676800e+04   1.108697e-04   0.000000e+00   1.108697e-04   0.000000e+00 
  1.689600e+04   1.018277e-04   0.000000e+00   1.018277e-04   0.000000e+00 
  1.702400e+04   1.149605e-04   0.000000e+00   1.149605e-04   0.000000e+00 
  1.715200e+04   1.280286e-04   0.000000e+00   1.280286e-04   0.000000e+00 
  1.728000e+04   1.358430e-04   0.000000e+00   1.358430e-04   0.000000e+00 
  1.740800e+04   1.414398e-04   0.000000e+00   1.414398e-04   0.000000e+00 
  1.753600e+04   1.454193e-04   0.000000e+00   1.454193e-04   0.000000e+00 
  1.766400e+04   1.529774e-04   0.000000e+00   1.529774e-04   0.000000e+00 
  1.779200e+04   1.602817e-04   0.000000e+00   1.602817e-04   0.000000e+00 
  1.792000e+04   1.634675e-04   0.000000e+00   1.634675e-04   0.000000e+00 
  1.804800e+04   1.605008e-04   0.000000e+00   1.605008e-04   0.000000e+00 
  1.817600e+04   1.601876e-04   0.000000e+00   1.601876e-04   0.000000e+00 
  1.830400e+04   1.661714e-04   0.000000e+00   1.661714e-04   0.000000e+00 
  1.843200e+04   1.673689e-04   0.000000e+00   1.673689e-04   0.000000e+00 
  1.856000e+04   1.681365e-04   0.000000e+00   1.681365e-04   0.000000e+00 
  1.868800e+04   1.737232e-04   0.000000e+00   1.737232e-04   0.000000e+00 
  1.881600e+04   1.729225e-04   0.000000e+00   1.729225e-04   0.000000e+00 
  1.894400e+04   1.694484e-04   0.000000e+00   1.694484e-04   0.000000e+00 
  1.907200e+04   1.691755e-04   0.000000e+00   1.691755e-04   0.000000e+00 
  1.920000e+04   1.693578e-04   0.000000e+00   1.693578e-04   0.000000e+00 
  1.932800e+04   1.658092e-04   0.000000e+00   1.658092e-04   0.000000e+00 
  1.945600e+04   1.673162e-04   0.000000e+00   1.673162e-04   0.000000e+00 
  1.958400e+04   1.712698e-04   0.000000e+00   1.712698e-04   0.000000e+00 
  1.971200e+04   1.655426e-04   0.000000e+00   1.655426e-04   0.000000e+00 
  1.984000e+04   1.654057e-04   0.000000e+00   1.654057e-04   0.000000e+00 
  1.996800e+04   1.658497e-04   0.000000e+00   1.658497e-04   0.000000e+00 
  2.009600e+04   1.651947e-04   0.000000e+00   1.651947e-04   0.000000e+00 
  2.022400e+04   1.651577e-04   0.000000e+00   1.651577e-04   0.000000e+00 
  2.035200e+04   1.712434e-04   0.000000e+00   1.712434e-04   0.000000e+00 
  2.048000e+04   1.761449e-04   0.000000e+00   1.761449e-04   0.000000e+00 
  2.060800e+04   1.779704e-04   0.000000e+00   1.779704e-04   0.000000e+00 
  2.073600e+04   1.753821e-04   0.000000e+00   1.753821e-04   0.000000e+00 
  2.086400e+04   1.725552e-04   0.000000e+00   1.725552e-04   0.000000e+00 
  2.099200e+04   1.670480e-04   0.000000e+00   1.670480e-04   0.000000e+00 
  2.112000e+04   1.686074e-04   0.000000e+00   1.686074e-04   0.000000e+00 
  2.124800e+04   1.706280e-04   0.000000e+00   1.706280e-04   0.000000e+00 
  2.137600e+04   1.698720e-04   0.000000e+00   1.698720e-04   0.000000e+00 
  2.150400e+04   1.715936e-04   0.000000e+00   1.715936e-04   0.000000e+00 
  2.163200e+04   1.725858e-04   0.000000e+00   1.725858e-04   0.000000e+00 
  2.176000e+04   1.796467e-04   0.000000e+00   1.796467e-04   0.000000e+00 
  2.188800e+04   1.845319e-04   0.000000e+00   1.845319e-04   0.000000e+00 
  2.201600e+04   1.843753e-04   0.000000e+00   1.843753e-04   0.000000e+00 
  2.214400e+04   1.859902e-04   0.000000e+00   1.859902e-04   0.000000e+00 
  2.227200e+04   1.891801e-04   0.000000e+00   1.891801e-04   0.000000e+00 
  2.240000e+04   1.889314e-04   0.000000e+00   1.889314e-04   0.000000e+00 
  2.252800e+04   1.916684e-04   0.000000e+00   1.916684e-04   0.000000e+00 
  2.265600e+04   1.937383e-04   0.000000e+00   1.937383e-04   0.000000e+00 
  2.278400e+04   1.979604e-04   0.000000e+00   1.979604e-04   0.000000e+00 
  2.291200e+04   2.031055e-04   0.000000e+00   2.031055e-04   0.000000e+00 
  2.304000e+04   2.060241e-04   0.000000e+00   2.060241e-04   0.000000e+00 
  2.316800e+04   2.118815e-04   0.000000e+00   2.118815e-04   0.000000e+00 
  2.329600e+04   2.190202e-04   0.000000e+00   2.190202e-04   0.000000e+00 
  2.342400e+04   2.249832e-04   0.000000e+00   2.249832e-04   0.000000e+00 
  2.355200e+04   2.352226e-04   0.000000e+00   2.352226e-04   0.000000e+00 
  2.368000e+04   2.441118e-04   0.000000e+00   2.441118e-04   0.000000e+00 
  2.380800e+04   2.551068e-04   0.000000e+00   2.551068e-04   0.000000e+00 
  2.393600e+04   2.571647e-04   0.000000e+00   2.571647e-04   0.000000e+00 
  2.406400e+04   2.527887e-04   0.000000e+00   2.527887e-04   0.000000e+00 
  2.419200e+04   2.573361e-04   0.000000e+00   2.573361e-04   0.000000e+00 
  2.432000e+04   2.617967e-04   0.000000e+00   2.617967e-04   0.000000e+00 
  2.444800e+04   2.674600e-04   0.000000e+00   2.674600e-04   0.000000e+00 
  2.457600e+04   2.799337e-04   0.000000e+00   2.799337e-04   0.000000e+00 
  2.470400e+04   2.815553e-04   0.000000e+00   2.815553e-04   0.000000e+00 
  2.483200e+04   2.735794e-04   0.000000e+00   2.735794e-04   0.000000e+00 
  2.496000e+04   2.650837e-04   0.000000e+00   2.650837e-04   0.000000e+00 
  2.508800e+04   2.632485e-04   0.000000e+00   2.632485e-04   0.000000e+00 
  2.521600e+04   2.672794e-04   0.000000e+00   2.672794e-04   0.000000e+00 
  2.534400e+04   2.779029e-04   0.000000e+00   2.779029e-04   0.000000e+00 
  2.547200e+04   2.801004e-04   0.000000e+00   2.801004e-04   0.000000e+00 
  2.560000e+04   2.801504e-04   0.000000e+00   2.801504e-04   0.000000e+00 
  2.572800e+04   2.883999e-04   0.000000e+00   2.883999e-04   0.000000e+00 
  2.585600e+04   2.977687e-04   0.000000e+00   2.977687e-04   0.000000e+00 
  2.598400e+04   3.026333e-04   0.000000e+00   3.026333e-04   0.000000e+00 
  2.611200e+04   2.988092e-04   0.000000e+00   2.988092e-04   0.000000e+00 
  2.624000e+04   3.100436e-04   0.000000e+00   3.100436e-04   0.000000e+00 
  2.636800e+04   3.102131e-04   0.000000e+00   3.102131e-04   0.000000e+00 
  2.649600e+04   3.311785e-04   0.000000e+00   3.311785e-04   0.000000e+00 
  2.662400e+04   3.580344e-04   0.000000e+00   3.580344e-04   0.000000e+00 
  2.675200e+04   3.411127e-04   0.000000e+00   3.411127e-04   0.000000e+00 
  2.688000e+04   3.029224e-04   0.000000e+00   3.029224e-04   0.000000e+00 
  2.700800e+04   3.061033e-04   0.000000e+00   3.061033e-04   0.000000e+00 
  2.713600e+04   3.084490e-04   0.000000e+00   3.084490e-04   0.000000e+00 
  2.726400e+04   3.112108e-04   0.000000e+00   3.112108e-04   0.000000e+00 
  2.739200e+04   3.273170e-04   0.000000e+00   3.273170e-04   0.000000e+00 
  2.752000e+04   3.312336e-04   0.000000e+00   3.312336e-04   0.000000e+00 
  2.764800e+04   3.104486e-04   0.000000e+00   3.104486e-04   0.000000e+00 
  2.777600e+04   3.075913e-04   0.000000e+00   3.075913e-04   0.000000e+00 
  2.790400e+04   3.202176e-04   0.000000e+00   3.202176e-04   0.000000e+00 
  2.803200e+04   3.038330e-04   0.000000e+00   3.038330e-04   0.000000e+00 
  2.816000e+04   2.919293e-04   0.000000e+00   2.919293e-04   0.000000e+00 
  2.828800e+04   3.072258e-04   0.000000e+00   3.072258e-04   0.000000e+00 
  2.841600e+04   3.134706e-04   0.000000e+00   3.134706e-04   0.000000e+00 
  2.854400e+04   3.259545e-04   0.000000e+00   3.259545e-04   0.000000e+00 
  2.867200e+04   3.716417e-04   0.000000e+00   3.716417e-04   0.000000e+00 
  2.880000e+04   3.784948e-04   0.000000e+00   3.784948e-04   0.000000e+00 
  2.892800e+04   3.463113e-04   0.000000e+00   3.463113e-04   0.000000e+00 
  2.905600e+04   3.086005e-04   0.000000e+00   3.086005e-04   0.000000e+00 
  2.918400e+04   2.983489e-04   0.000000e+00   2.983489e-04   0.000000e+00 
  2.931200e+04   3.092769e-04   0.000000e+00   3.092769e-04   0.000000e+00 
  2.944000e+04   3.044661e-04   0.000000e+00   3.044661e-04   0.000000e+00 
  2.956800e+04   2.912313e-04   0.000000e+00   2.912313e-04   0.000000e+00 
  2.969600e+04   2.903009e-04   0.000000e+00   2.903009e-04   0.000000e+00 
  2.982400e+04   3.237290e-04   0.000000e+00   3.237290e-04   0.000000e+00 
  2.995200e+04   3.415589e-04   0.000000e+00   3.415589e-04   0.000000e+00 
  3.008000e+04   3.103670e-04   0.000000e+00   3.103670e-04   0.000000e+00 
  3.020800e+04   2.984271e-04   0.000000e+00   2.984271e-04   0.000000e+00 
  3.033600e+04   2.902996e-04   0.000000e+00   2.902996e-04   0.000000e+00 
  3.046400e+04   2.708317e-04   0.000000e+00   2.708317e-04   0.000000e+00 
  3.059200e+04   2.639758e-04   0.000000e+00   2.639758e-04   0.000000e+00 
  3.072000e+04   2.487821e-04   0.000000e+00   2.487821e-04   0.000000e+00 
  3.084800e+04   2.304640e-04   0.000000e+00   2.304640e-04   0.000000e+00 
  3.097600e+04   2.338353e-04   0.000000e+00   2.338353e-04   0.000000e+00 
  3.110400e+04   2.676141e-04   0.000000e+00   2.676141e-04   0.000000e+00 
  3.123200e+04   2.257230e-04   0.000000e+00   2.257230e-04   0.000000e+00 
  3.136000e+04   2.116901e-04   0.000000e+00   2.116901e-04   0.000000e+00 
  3.148800e+04   2.105328e-04   0.000000e+00   2.105328e-04   0.000000e+00 
  3.161600e+04   2.057167e-04   0.000000e+00   2.057167e-04   0.000000e+00 
  3.174400e+04   1.954999e-04   0.000000e+00   1.954999e-04   0.000000e+00 
  3.187200e+04   2.022547e-04   0.000000e+00   2.022547e-04   0.000000e+00 
  3.200000e+04   2.094109e-04   0.000000e+00   2.094109e-04   0.000000e+00 
  3.212800e+04   2.317976e-04   0.000000e+00   2.317976e-04   0.000000e+00 
  3.225600e+04   2.213354e-04   0.000000e+00   2.213354e-04   0.000000e+00 
  3.238400e+04   1.969192e-04   0.000000e+00   1.969192e-04   0.000000e+00 
  3.251200e+04   1.757226e-04   0.000000e+00   1.757226e-04   0.000000e+00 
  3.264000e+04   1.597327e-04   0.000000e+00   1.597327e-04   0.000000e+00 
  3.276800e+04   1.507771e-04   0.000000e+00   1.507771e-04   0.000000e+00 
  3.289600e+04   1.566760e-04   0.000000e+00   1.566760e-04   0.000000e+00 
  3.302400e+04   1.521279e-04   0.000000e+00   1.521279e-04   0.000000e+00 
  3.315200e+04   1.450865e-04   0.000000e+00   1.450865e-04   0.000000e+00 
  3.328000e+04   1.490269e-04   0.000000e+00   1.490269e-04   0.000000e+00 
  3.340800e+04   1.501393e-04   0.000000e+00   1.501393e-04   0.000000e+00 
  3.353600e+04   1.444786e-04   0.000000e+00   1.444786e-04   0.000000e+00 
  3.366400e+04   1.389269e-04   0.000000e+00   1.389269e-04   0.000000e+00 
  3.379200e+04   1.374143e-04   0.000000e+00   1.374143e-04   0.000000e+00 
  3.392000e+04   1.328182e-04   0.000000e+00   1.328182e-04   0.000000e+00 
  3.404800e+04   1.266802e-04   0.000000e+00   1.266802e-04   0.000000e+00 
  3.417600e+04   1.255377e-04   0.000000e+00   1.255377e-04   0.000000e+00 
  3.430400e+04   1.211789e-04   0.000000e+00   1.211789e-04   0.000000e+00 
  3.443200e+04   1.210232e-04   0.000000e+00   1.210232e-04   0.000000e+00 
  3.456000e+04   1.210627e-04   0.000000e+00   1.210627e-04   0.000000e+00 
  3.468800e+04   1.207554e-04   0.000000e+00   1.207554e-04   0.000000e+00 
  3.481600e+04   1.185390e-04   0.000000e+00   1.185390e-04   0.000000e+00 
  3.494400e+04   1.134729e-04   0.000000e+00   1.134729e-04   0.000000e+00 
  3.507200e+04   1.178566e-04   0.000000e+00   1.178566e-04   0.000000e+00 
  3.520000e+04   1.175486e-04   0.000000e+00   1.175486e-04   0.000000e+00 
  3.532800e+04   1.160843e-04   0.000000e+00   1.160843e-04   0.000000e+00 
  3.545600e+04   1.138471e-04   0.000000e+00   1.138471e-04   0.000000e+00 
  3.558400e+04   1.137555e-04   0.000000e+00   1.137555e-04   0.000000e+00 
  3.571200e+04   1.113818e-04   0.000000e+00   1.113818e-04   0.000000e+00 
  3.584000e+04   1.102773e-04   0.000000e+00   1.102773e-04   0.000000e+00 
  3.596800e+04   1.128462e-04   0.000000e+00   1.128462e-04   0.000000e+00 
  3.609600e+04   1.178464e-04   0.000000e+00   1.178464e-04   0.000000e+00 
  3.622400e+04   1.178691e-04   0.000000e+00   1.178691e-04   0.000000e+00 
  3.635200e+04   1.096906e-04   0.000000e+00   1.096906e-04   0.000000e+00 
  3.648000e+04   1.050786e-04   0.000000e+00   1.050786e-04   0.000000e+00 
  3.660800e+04   1.050406e-04   0.000000e+00   1.050406e-04   0.000000e+00 
  3.673600e+04   1.040855e-04   0.000000e+00   1.040855e-04   0.000000e+00 
  3.686400e+04   1.030912e-04   0.000000e+00   1.030912e-04   0.000000e+00 
  3.699200e+04   1.024687e-04   0.000000e+00   1.024687e-04   0.000000e+00 
  3.712000e+04   1.059371e-04   0.000000e+00   1.059371e-04   0.000000e+00 
  3.724800e+04   1.141477e-04   0.000000e+00   1.141477e-04   0.000000e+00 
  3.737600e+04   1.184264e-04   0.000000e+00   1.184264e-04   0.000000e+00 
  3.750400e+04   1.064019e-04   0.000000e+00   1.064019e-04   0.000000e+00 
  3.763200e+04   1.027457e-04   0.000000e+00   1.027457e-04   0.000000e+00 
  3.776000e+04   1.003790e-04   0.000000e+00   1.003790e-04   0.000000e+00 
  3.788800e+04   9.615072e-05   0.000000e+00   9.615072e-05   0.000000e+00 
  3.801600e+04   9.897072e-05   0.000000e+00   9.897072e-05   0.000000e+00 
  3.814400e+04   1.025640e-04   0.000000e+00   1.025640e-04   0.000000e+00 
  3.827200e+04   1.051529e-04   0.000000e+00   1.051529e-04   0.000000e+00 
  3.840000e+04   1.145725e-04   0.000000e+00   1.145725e-04   0.000000e+00 
  3.852800e+04   1.081256e-04   0.000000e+00   1.081256e-04   0.000000e+00 
  3.865600e+04   1.035118e-04   0.000000e+00   1.035118e-04   0.000000e+00 
  3.878400e+04   1.065639e-04   0.000000e+00   1.065639e-04   0.000000e+00 
  3.891200e+04   1.119025e-04   0.000000e+00   1.119025e-04   0.000000e+00 
  3.904000e+04   1.092636e-04   0.000000e+00   1.092636e-04   0.000000e+00 
  3.916800e+04   1.062813e-04   0.000000e+00   1.062813e-04   0.000000e+00 
  3.929600e+04   1.051352e-04   0.000000e+00   1.051352e-04   0.000000e+00 
  3.942400e+04   1.020030e-04   0.000000e+00   1.020030e-04   0.000000e+00 
  3.955200e+04   1.012244e-04   0.000000e+00   1.012244e-04   0.000000e+00 
  3.968000e+04   1.035595e-04   0.000000e+00   1.035595e-04   0.000000e+00 
  3.980800e+04   1.023698e-04   0.000000e+00   1.023698e-04   0.000000e+00 
  3.993600e+04   1.039801e-04   0.000000e+00   1.039801e-04   0.000000e+00 
  4.006400e+04   1.033507e-04   0.000000e+00   1.033507e-04   0.000000e+00 
  4.019200e+04   1.018411e-04   0.000000e+00   1.018411e-04   0.000000e+00 
  4.032000e+04   1.016359e-04   0.000000e+00   1.016359e-04   0.000000e+00 
  4.044800e+04   1.042136e-04   0.000000e+00   1.042136e-04   0.000000e+00 
  4.057600e+04   1.018943e-04   0.000000e+00   1.018943e-04   0.000000e+00 
  4.070400e+04   9.689647e-05   0.000000e+00   9.689647e-05   0.000000e+00 
  4.083200e+04   9.570082e-05   0.000000e+00   9.570082e-05   0.000000e+00 
  4.096000e+04   9.579497e-05   0.000000e+00   9.579497e-05   0.000000e+00 
  4.108800e+04   9.699329e-05   0.000000e+00   9.699329e-05   0.000000e+00 
  4.121600e+04   9.773208e-05   0.000000e+00   9.773208e-05   0.000000e+00 
  4.134400e+04   9.839575e-05   0.000000e+00   9.839575e-05   0.000000e+00 
  4.147200e+04   9.725910e-05   0.000000e+00   9.725910e-05   0.000000e+00 
  4.160000e+04   9.462701e-05   0.000000e+00   9.462701e-05   0.000000e+00 
  4.172800e+04   9.463287e-05   0.000000e+00   9.463287e-05   0.000000e+00 
  4.185600e+04   9.456070e-05   0.000000e+00   9.456070e-05   0.000000e+00 
  4.198400e+04   9.415163e-05   0.000000e+00   9.415163e-05   0.000000e+00 
  4.211200e+04   9.318292e-05   0.000000e+00   9.318292e-05   0.000000e+00 
  4.224000e+04   9.363396e-05   0.000000e+00   9.363396e-05   0.000000e+00 
  4.236800e+04   9.280771e-05   0.000000e+00   9.280771e-05   0.000000e+00 
  4.249600e+04   9.333686e-05   0.000000e+00   9.333686e-05   0.000000e+00 
  4.262400e+04   9.091497e-05   0.000000e+00   9.091497e-05   0.000000e+00 
  4.275200e+04   8.952794e-05   0.000000e+00   8.952794e-05   0.000000e+00 
  4.288000e+04   9.262575e-05   0.000000e+00   9.262575e-05   0.000000e+00 
  4.300800e+04   9.169415e-05   0.000000e+00   9.169415e-05   0.000000e+00 
  4.313600e+04   9.017863e-05   0.000000e+00   9.017863e-05   0.000000e+00 
  4.326400e+04   9.219858e-05   0.000000e+00   9.219858e-05   0.000000e+00 
  4.339200e+04   9.073473e-05   0.000000e+00   9.073473e-05   0.000000e+00 
  4.352000e+04   8.911205e-05   0.000000e+00   8.911205e-05   0.000000e+00 
  4.364800e+04   8.986536e-05   0.000000e+00   8.986536e-05   0.000000e+00 
  4.377600e+04   8.683748e-05   0.000000e+00   8.683748e-05   0.000000e+00 
  4.390400e+04   8.600995e-05   0.000000e+00   8.600995e-05   0.000000e+00 
  4.403200e+04   8.632847e-05   0.000000e+00   8.632847e-05   0.000000e+00 
  4.416000e+04   8.827731e-05   0.000000e+00   8.827731e-05   0.000000e+00 
  4.428800e+04   8.795103e-05   0.000000e+00   8.795103e-05   0.000000e+00 
  4.441600e+04   8.719491e-05   0.000000e+00   8.719491e-05   0.000000e+00 
  4.454400e+04   8.644410e-05   0.000000e+00   8.644410e-05   0.000000e+00 
  4.467200e+04   8.737132e-05   0.000000e+00   8.737132e-05   0.000000e+00 
  4.480000e+04   8.603599e-05   0.000000e+00   8.603599e-05   0.000000e+00 
  4.492800e+04   8.470036e-05   0.000000e+00   8.470036e-05   0.000000e+00 
  4.505600e+04   8.376146e-05   0.000000e+00   8.376146e-05   0.000000e+00 
  4.518400e+04   8.427328e-05   0.000000e+00   8.427328e-05   0.000000e+00 
  4.531200e+04   8.541683e-05   0.000000e+00   8.541683e-05   0.000000e+00 
  4.544000e+04   8.525646e-05   0.000000e+00   8.525646e-05   0.000000e+00 
  4.556800e+04   8.387605e-05   0.000000e+00   8.387605e-05   0.000000e+00 
  4.569600e+04   8.151993e-05   0.000000e+00   8.151993e-05   0.000000e+00 
  4.582400e+04   8.225933e-05   0.000000e+00   8.225933e-05   0.000000e+00 
  4.595200e+04   8.253943e-05   0.000000e+00   8.253943e-05   0.000000e+00 
  4.608000e+04   7.899394e-05   0.000000e+00   7.899394e-05   0.000000e+00 
  4.620800e+04   7.695708e-05   0.000000e+00   7.695708e-05   0.000000e+00 
  4.633600e+04   7.703685e-05   0.000000e+00   7.703685e-05   0.000000e+00 
  4.646400e+04   7.876482e-05   0.000000e+00   7.876482e-05   0.000000e+00 
  4.659200e+04   8.133796e-05   0.000000e+00   8.133796e-05   0.000000e+00 
  4.672000e+04   8.277685e-05   0.000000e+00   8.277685e-05   0.000000e+00 
  4.684800e+04   8.214824e-05   0.000000e+00   8.214824e-05   0.000000e+00 
  4.697600e+04   8.200117e-05   0.000000e+00   8.200117e-05   0.000000e+00 
  4.710400e+04   8.132256e-05   0.000000e+00   8.132256e-05   0.000000e+00 
  4.723200e+04   8.124296e-05   0.000000e+00   8.124296e-05   0.000000e+00 
  4.736000e+04   8.244211e-05   0.000000e+00   8.244211e-05   0.000000e+00 
  4.748800e+04   8.191395e-05   0.000000e+00   8.191395e-05   0.000000e+00 
  4.761600e+04   8.177845e-05   0.000000e+00   8.177845e-05   0.000000e+00 
  4.774400e+04   8.287270e-05   0.000000e+00   8.287270e-05   0.000000e+00 
  4.787200e+04   8.358873e-05   0.000000e+00   8.358873e-05   0.000000e+00 
  4.800000e+04   8.502557e-05   0.000000e+00   8.502557e-05   0.000000e+00 
  4.812800e+04   8.842655e-05   0.000000e+00   8.842655e-05   0.000000e+00 
  4.825600e+04   8.757589e-05   0.000000e+00   8.757589e-05   0.000000e+00 
  4.838400e+04   8.629172e-05   0.000000e+00   8.629172e-05   0.000000e+00 
  4.851200e+04   8.663981e-05   0.000000e+00   8.663981e-05   0.000000e+00 
  4.864000e+04   9.065476e-05   0.000000e+00   9.065476e-05   0.000000e+00 
  4.876800e+04   9.072885e-05   0.000000e+00   9.072885e-05   0.000000e+00 
  4.889600e+04   9.076884e-05   0.000000e+00   9.076884e-05   0.000000e+00 
  4.902400e+04   9.320238e-05   0.000000e+00   9.320238e-05   0.000000e+00 
  4.915200e+04   9.234044e-05   0.000000e+00   9.234044e-05   0.000000e+00 
  4.928000e+04   9.132816e-05   0.000000e+00   9.132816e-05   0.000000e+00 
  4.940800e+04   9.257139e-05   0.000000e+00   9.257139e-05   0.000000e+00 
  4.953600e+04   9.242493e-05   0.000000e+00   9.242493e-05   0.000000e+00 
  4.966400e+04   9.532223e-05   0.000000e+00   9.532223e-05   0.000000e+00 
  4.979200e+04   1.036775e-04   0.000000e+00   1.036775e-04   0.000000e+00 
  4.992000e+04   1.004416e-04   0.000000e+00   1.004416e-04   0.000000e+00 
  5.004800e+04   9.456031e-05   0.000000e+00   9.456031e-05   0.000000e+00 
  5.017600e+04   9.347324e-05   0.000000e+00   9.347324e-05   0.000000e+00 
  5.030400e+04   9.530362e-05   0.000000e+00   9.530362e-05   0.000000e+00 
  5.043200e+04   9.493061e-05   0.000000e+00   9.493061e-05   0.000000e+00 
  5.056000e+04   9.497953e-05   0.000000e+00   9.497953e-05   0.000000e+00 
  5.068800e+04   9.399218e-05   0.000000e+00   9.399218e-05   0.000000e+00 
  5.081600e+04   9.386352e-05   0.000000e+00   9.386352e-05   0.000000e+00 
  5.094400e+04   9.246395e-05   0.000000e+00   9.246395e-05   0.000000e+00 
  5.107200e+04   9.193893e-05   0.000000e+00   9.193893e-05   0.000000e+00 
  5.120000e+04   9.586308e-05   0.000000e+00   9.586308e-05   0.000000e+00 
  5.132800e+04   9.334054e-05   0.000000e+00   9.334054e-05   0.000000e+00 
  5.145600e+04   9.201634e-05   0.000000e+00   9.201634e-05   0.000000e+00 
  5.158400e+04   9.498192e-05   0.000000e+00   9.498192e-05   0.000000e+00 
  5.171200e+04   9.946777e-05   0.000000e+00   9.946777e-05   0.000000e+00 
  5.184000e+04   8.301019e-05   0.000000e+00   8.301019e-05   0.000000e+00 
  5.196800e+04   7.789499e-05   0.000000e+00   7.789499e-05   0.000000e+00 
  5.209600e+04   7.574380e-05   0.000000e+00   7.574380e-05   0.000000e+00 
  5.222400e+04   7.417864e-05   0.000000e+00   7.417864e-05   0.000000e+00 
  5.235200e+04   7.126451e-05   0.000000e+00   7.126451e-05   0.000000e+00 
  5.248000e+04   6.962446e-05   0.000000e+00   6.962446e-05   0.000000e+00 
  5.260800e+04   6.881394e-05   0.000000e+00   6.881394e-05   0.000000e+00 
  5.273600e+04   7.024551e-05   0.000000e+00   7.024551e-05   0.000000e+00 
  5.286400e+04   1.061119e-04   0.000000e+00   1.061119e-04   0.000000e+00 
  5.299200e+04   1.029790e-04   0.000000e+00   1.029790e-04   0.000000e+00 
  5.312000e+04   6.356767e-05   0.000000e+00   6.356767e-05   0.000000e+00 
  5.324800e+04   5.402895e-05   0.000000e+00   5.402895e-05   0.000000e+00 
  5.337600e+04   5.201995e-05   0.000000e+00   5.201995e-05   0.000000e+00 
  5.350400e+04   5.099124e-05   0.000000e+00   5.099124e-05   0.000000e+00 
  5.363200e+04   5.003797e-05   0.000000e+00   5.003797e-05   0.000000e+00 
  5.376000e+04   4.933365e-05   0.000000e+00   4.933365e-05   0.000000e+00 
  5.388800e+04   4.844134e-05   0.000000e+00   4.844134e-05   0.000000e+00 
  5.401600e+04   4.698952e-05   0.000000e+00   4.698952e-05   0.000000e+00 
  5.414400e+04   4.520033e-05   0.000000e+00   4.520033e-05   0.000000e+00 
  5.427200e+04   4.545920e-05   0.000000e+00   4.545920e-05   0.000000e+00 
  5.440000e+04   4.470520e-05   0.000000e+00   4.470520e-05   0.000000e+00 
  5.452800e+04   4.392438e-05   0.000000e+00   4.392438e-05   0.000000e+00 
  5.465600e+04   4.436753e-05   0.000000e+00   4.436753e-05   0.000000e+00 
  5.478400e+04   4.325122e-05   0.000000e+00   4.325122e-05   0.000000e+00 
  5.491200e+04   4.166931e-05   0.000000e+00   4.166931e-05   0.000000e+00 
  5.504000e+04   4.119158e-05   0.000000e+00   4.119158e-05   0.000000e+00 
  5.516800e+04   4.086228e-05   0.000000e+00   4.086228e-05   0.000000e+00 
  5.529600e+04   3.954518e-05   0.000000e+00   3.954518e-05   0.000000e+00 
  5.542400e+04   3.813953e-05   0.000000e+00   3.813953e-05   0.000000e+00 
  5.555200e+04   3.773048e-05   0.000000e+00   3.773048e-05   0.000000e+00 
  5.568000e+04   3.729917e-05   0.000000e+00   3.729917e-05   0.000000e+00 
  5.580800e+04   3.730394e-05   0.000000e+00   3.730394e-05   0.000000e+00 
  5.593600e+04   3.701512e-05   0.000000e+00   3.701512e-05   0.000000e+00 
  5.606400e+04   3.698331e-05   0.000000e+00   3.698331e-05   0.000000e+00 
  5.619200e+04   3.701905e-05   0.000000e+00   3.701905e-05   0.000000e+00 
  5.632000e+04   3.651590e-05   0.000000e+00   3.651590e-05   0.000000e+00 
  5.644800e+04   3.512758e-05   0.000000e+00   3.512758e-05   0.000000e+00 
  5.657600e+04   3.443193e-05   0.000000e+00   3.443193e-05   0.000000e+00 
  5.670400e+04   3.542506e-05   0.000000e+00   3.542506e-05   0.000000e+00 
  5.683200e+04   3.519035e-05   0.000000e+00   3.519035e-05   0.000000e+00 
  5.696000e+04   3.437201e-05   0.000000e+00   3.437201e-05   0.000000e+00 
  5.708800e+04   3.351942e-05   0.000000e+00   3.351942e-05   0.000000e+00 
  5.721600e+04   3.383662e-05   0.000000e+00   3.383662e-05   0.000000e+00 
  5.734400e+04   3.381784e-05   0.000000e+00   3.381784e-05   0.000000e+00 
  5.747200e+04   3.401957e-05   0.000000e+00   3.401957e-05   0.000000e+00 
  5.760000e+04   3.280902e-05   0.000000e+00   3.280902e-05   0.000000e+00 
  5.772800e+04   3.230333e-05   0.000000e+00   3.230333e-05   0.000000e+00 
  5.785600e+04   3.155966e-05   0.000000e+00   3.155966e-05   0.000000e+00 
  5.798400e+04   3.149929e-05   0.000000e+00   3.149929e-05   0.000000e+00 
  5.811200e+04   3.180660e-05   0.000000e+00   3.180660e-05   0.000000e+00 
  5.824000e+04   3.183006e-05   0.000000e+00   3.183006e-05   0.000000e+00 
  5.836800e+04   3.123341e-05   0.000000e+00   3.123341e-05   0.000000e+00 
  5.849600e+04   3.147827e-05   0.000000e+00   3.147827e-05   0.000000e+00 
  5.862400e+04   3.065729e-05   0.000000e+00   3.065729e-05   0.000000e+00 
  5.875200e+04   3.078962e-05   0.000000e+00   3.078962e-05   0.000000e+00 
  5.888000e+04   3.112686e-05   0.000000e+00   3.112686e-05   0.000000e+00 
  5.900800e+04   3.403849e-05   0.000000e+00   3.403849e-05   0.000000e+00 
  5.913600e+04   3.244003e-05   0.000000e+00   3.244003e-05   0.000000e+00 
  5.926400e+04   3.053769e-05   0.000000e+00   3.053769e-05   0.000000e+00 
  5.939200e+04   3.039674e-05   0.000000e+00   3.039674e-05   0.000000e+00 
  5.952000e+04   3.091422e-05   0.000000e+00   3.091422e-05   0.000000e+00 
  5.964800e+04   3.150328e-05   0.000000e+00   3.150328e-05   0.000000e+00 
  5.977600e+04   3.211632e-05   0.000000e+00   3.211632e-05   0.000000e+00 
  5.990400e+04   3.491432e-05   0.000000e+00   3.491432e-05   0.000000e+00 
  6.003200e+04   3.545214e-05   0.000000e+00   3.545214e-05   0.000000e+00 
  6.016000e+04   3.246610e-05   0.000000e+00   3.246610e-05   0.000000e+00 
  6.028800e+04   3.157121e-05   0.000000e+00   3.157121e-05   0.000000e+00 
  6.041600e+04   3.163780e-05   0.000000e+00   3.163780e-05   0.000000e+00 
  6.054400e+04   3.132974e-05   0.000000e+00   3.132974e-05   0.000000e+00 
  6.067200e+04   3.160672e-05   0.000000e+00   3.160672e-05   0.000000e+00 
  6.080000e+04   3.058450e-05   0.000000e+00   3.058450e-05   0.000000e+00 
  6.092800e+04   3.001640e-05   0.000000e+00   3.001640e-05   0.000000e+00 
  6.105600e+04   3.032194e-05   0.000000e+00   3.032194e-05   0.000000e+00 
  6.118400e+04   3.066129e-05   0.000000e+00   3.066129e-05   0.000000e+00 
  6.131200e+04   3.076774e-05   0.000000e+00   3.076774e-05   0.000000e+00 
  6.144000e+04   3.179270e-05   0.000000e+00   3.179270e-05   0.000000e+00 
  6.156800e+04   3.175278e-05   0.000000e+00   3.175278e-05   0.000000e+00 
  6.169600e+04   3.051574e-05   0.000000e+00   3.051574e-05   0.000000e+00 
  6.182400e+04   3.007475e-05   0.000000e+00   3.007475e-05   0.000000e+00 
  6.195200e+04   2.947523e-05   0.000000e+00   2.947523e-05   0.000000e+00 
  6.208000e+04   2.894397e-05   0.000000e+00   2.894397e-05   0.000000e+00 
  6.220800e+04   2.910565e-05   0.000000e+00   2.910565e-05   0.000000e+00 
  6.233600e+04   2.884789e-05   0.000000e+00   2.884789e-05   0.000000e+00 
  6.246400e+04   2.946410e-05   0.000000e+00   2.946410e-05   0.000000e+00 
  6.259200e+04   3.109160e-05   0.000000e+00   3.109160e-05   0.000000e+00 
  6.272000e+04   3.050606e-05   0.000000e+00   3.050606e-05   0.000000e+00 
  6.284800e+04   2.946649e-05   0.000000e+00   2.946649e-05   0.000000e+00 
  6.297600e+04   2.911996e-05   0.000000e+00   2.911996e-05   0.000000e+00 
  6.310400e+04   2.904496e-05   0.000000e+00   2.904496e-05   0.000000e+00 
  6.323200e+04   2.873562e-05   0.000000e+00   2.873562e-05   0.000000e+00 
  6.336000e+04   2.864186e-05   0.000000e+00   2.864186e-05   0.000000e+00 
  6.348800e+04   2.832365e-05   0.000000e+00   2.832365e-05   0.000000e+00 
  6.361600e+04   2.825428e-05   0.000000e+00   2.825428e-05   0.000000e+00 
  6.374400e+04   2.870809e-05   0.000000e+00   2.870809e-05   0.000000e+00 
  6.387200e+04   2.769177e-05   0.000000e+00   2.769177e-05   0.000000e+00 
  6.400000e+04   2.786119e-05   0.000000e+00   2.786119e-05   0.000000e+00 
  6.412800e+04   2.886322e-05   0.000000e+00   2.886322e-05   0.000000e+00 
  6.425600e+04   2.929282e-05   0.000000e+00   2.929282e-05   0.000000e+00 
  6.438400e+04   2.890211e-05   0.000000e+00   2.890211e-05   0.000000e+00 
  6.451200e+04   2.807239e-05   0.000000e+00   2.807239e-05   0.000000e+00 
  6.464000e+04   2.767555e-05   0.000000e+00   2.767555e-05   0.000000e+00 
  6.476800e+04   2.725077e-05   0.000000e+00   2.725077e-05   0.000000e+00 
  6.489600e+04   2.744705e-05   0.000000e+00   2.744705e-05   0.000000e+00 
  6.502400e+04   2.769428e-05   0.000000e+00   2.769428e-05   0.000000e+00 
  6.515200e+04   2.740756e-05   0.000000e+00   2.740756e-05   0.000000e+00 
  6.528000e+04   2.754535e-05   0.000000e+00   2.754535e-05   0.000000e+00 
  6.540800e+04   2.757292e-05   0.000000e+00   2.757292e-05   0.000000e+00 
  6.553600e+04   2.724558e-05   0.000000e+00   2.724558e-05   0.000000e+00 
  6.566400e+04   2.766282e-05   0.000000e+00   2.766282e-05   0.000000e+00 
  6.579200e+04   2.750981e-05   0.000000e+00   2.750981e-05   0.000000e+00 
  6.592000e+04   2.732431e-05   0.000000e+00   2.732431e-05   0.000000e+00 
  6.604800e+04   2.711850e-05   0.000000e+00   2.711850e-05   0.000000e+00 
  6.617600e+04   2.729841e-05   0.000000e+00   2.729841e-05   0.000000e+00 
  6.630400e+04   2.793597e-05   0.000000e+00   2.793597e-05   0.000000e+00 
  6.643200e+04   2.810993e-05   0.000000e+00   2.810993e-05   0.000000e+00 
  6.656000e+04   2.733594e-05   0.000000e+00   2.733594e-05   0.000000e+00 
  6.668800e+04   2.682787e-05   0.000000e+00   2.682787e-05   0.000000e+00 
  6.681600e+04   2.691487e-05   0.000000e+00   2.691487e-05   0.000000e+00 
  6.694400e+04   2.644327e-05   0.000000e+00   2.644327e-05   0.000000e+00 
  6.707200e+04   2.669627e-05   0.000000e+00   2.669627e-05   0.000000e+00 
  6.720000e+04   2.644526e-05   0.000000e+00   2.644526e-05   0.000000e+00 
  6.732800e+04   2.600966e-05   0.000000e+00   2.600966e-05   0.000000e+00 
  6.745600e+04   2.575787e-05   0.000000e+00   2.575787e-05   0.000000e+00 
  6.758400e+04   2.572268e-05   0.000000e+00   2.572268e-05   0.000000e+00 
  6.771200e+04   2.530888e-05   0.000000e+00   2.530888e-05   0.000000e+00 
  6.784000e+04   2.514507e-05   0.000000e+00   2.514507e-05   0.000000e+00 
  6.796800e+04   2.534995e-05   0.000000e+00   2.534995e-05   0.000000e+00 
  6.809600e+04   2.498578e-05   0.000000e+00   2.498578e-05   0.000000e+00 
  6.822400e+04   2.461447e-05   0.000000e+00   2.461447e-05   0.000000e+00 
  6.835200e+04   2.501833e-05   0.000000e+00   2.501833e-05   0.000000e+00 
  6.848000e+04   2.457997e-05   0.000000e+00   2.457997e-05   0.000000e+00 
  6.860800e+04   2.506858e-05   0.000000e+00   2.506858e-05   0.000000e+00 
  6.873600e+04   2.508387e-05   0.000000e+00   2.508387e-05   0.000000e+00 
  6.886400e+04   2.564787e-05   0.000000e+00   2.564787e-05   0.000000e+00 
  6.899200e+04   2.583716e-05   0.000000e+00   2.583716e-05   0.000000e+00 
  6.912000e+04   2.549502e-05   0.000000e+00   2.549502e-05   0.000000e+00 
  6.924800e+04   2.586702e-05   0.000000e+00   2.586702e-05   0.000000e+00 
  6.937600e+04   2.670363e-05   0.000000e+00   2.670363e-05   0.000000e+00 
  6.950400e+04   2.939503e-05   0.000000e+00   2.939503e-05   0.000000e+00 
  6.963200e+04   2.683489e-05   0.000000e+00   2.683489e-05   0.000000e+00 
  6.976000e+04   2.528180e-05   0.000000e+00   2.528180e-05   0.000000e+00 
  6.988800e+04   2.534958e-05   0.000000e+00   2.534958e-05   0.000000e+00 
  7.001600e+04   2.520397e-05   0.000000e+00   2.520397e-05   0.000000e+00 
  7.014400e+04   2.572435e-05   0.000000e+00   2.572435e-05   0.000000e+00 
  7.027200e+04   2.543155e-05   0.000000e+00   2.543155e-05   0.000000e+00 
  7.040000e+04   2.487960e-05   0.000000e+00   2.487960e-05   0.000000e+00 
  7.052800e+04   2.511118e-05   0.000000e+00   2.511118e-05   0.000000e+00 
  7.065600e+04   2.543871e-05   0.000000e+00   2.543871e-05   0.000000e+00 
  7.078400e+04   2.483704e-05   0.000000e+00   2.483704e-05   0.000000e+00 
  7.091200e+04   2.457782e-05   0.000000e+00   2.457782e-05   0.000000e+00 
  7.104000e+04   2.426834e-05   0.000000e+00   2.426834e-05   0.000000e+00 
  7.116800e+04   2.480210e-05   0.000000e+00   2.480210e-05   0.000000e+00 
  7.129600e+04   2.496478e-05   0.000000e+00   2.496478e-05   0.000000e+00 
  7.142400e+04   2.492284e-05   0.000000e+00   2.492284e-05   0.000000e+00 
  7.155200e+04   2.617094e-05   0.000000e+00   2.617094e-05   0.000000e+00 
  7.168000e+04   2.615830e-05   0.000000e+00   2.615830e-05   0.000000e+00 
  7.180800e+04   2.428222e-05   0.000000e+00   2.428222e-05   0.000000e+00 
  7.193600e+04   2.404197e-05   0.000000e+00   2.404197e-05   0.000000e+00 
  7.206400e+04   2.365647e-05   0.000000e+00   2.365647e-05   0.000000e+00 
  7.219200e+04   2.443775e-05   0.000000e+00   2.443775e-05   0.000000e+00 
  7.232000e+04   2.556783e-05   0.000000e+00   2.556783e-05   0.000000e+00 
  7.244800e+04   2.498117e-05   0.000000e+00   2.498117e-05   0.000000e+00 
  7.257600e+04   2.383086e-05   0.000000e+00   2.383086e-05   0.000000e+00 
  7.270400e+04   2.362180e-05   0.000000e+00   2.362180e-05   0.000000e+00 
  7.283200e+04   2.348758e-05   0.000000e+00   2.348758e-05   0.000000e+00 
  7.296000e+04   2.376246e-05   0.000000e+00   2.376246e-05   0.000000e+00 
  7.308800e+04   2.318614e-05   0.000000e+00   2.318614e-05   0.000000e+00 
  7.321600e+04   2.259037e-05   0.000000e+00   2.259037e-05   0.000000e+00 
  7.334400e+04   2.256944e-05   0.000000e+00   2.256944e-05   0.000000e+00 
  7.347200e+04   2.875227e-05   0.000000e+00   2.875227e-05   0.000000e+00 
  7.360000e+04   2.814144e-05   0.000000e+00   2.814144e-05   0.000000e+00 
  7.372800e+04   2.212388e-05   0.000000e+00   2.212388e-05   0.000000e+00 
  7.385600e+04   2.180105e-05   0.000000e+00   2.180105e-05   0.000000e+00 
  7.398400e+04   2.156559e-05   0.000000e+00   2.156559e-05   0.000000e+00 
  7.411200e+04   2.166542e-05   0.000000e+00   2.166542e-05   0.000000e+00 
  7.424000e+04   2.184841e-05   0.000000e+00   2.184841e-05   0.000000e+00 
  7.436800e+04   2.175580e-05   0.000000e+00   2.175580e-05   0.000000e+00 
  7.449600e+04   2.283509e-05   0.000000e+00   2.283509e-05   0.000000e+00 
  7.462400e+04   2.676955e-05   0.000000e+00   2.676955e-05   0.000000e+00 
  7.475200e+04   3.119252e-05   0.000000e+00   3.119252e-05   0.000000e+00 
  7.488000e+04   2.538756e-05   0.000000e+00   2.538756e-05   0.000000e+00 
  7.500800e+04   2.127043e-05   0.000000e+00   2.127043e-05   0.000000e+00 
  7.513600e+04   2.050706e-05   0.000000e+00   2.050706e-05   0.000000e+00 
  7.526400e+04   1.998210e-05   0.000000e+00   1.998210e-05   0.000000e+00 
  7.539200e+04   1.996530e-05   0.000000e+00   1.996530e-05   0.000000e+00 
  7.552000e+04   2.017523e-05   0.000000e+00   2.017523e-05   0.000000e+00 
  7.564800e+04   2.021516e-05   0.000000e+00   2.021516e-05   0.000000e+00 
  7.577600e+04   2.042127e-05   0.000000e+00   2.042127e-05   0.000000e+00 
  7.590400e+04   1.999493e-05   0.000000e+00   1.999493e-05   0.000000e+00 
  7.603200e+04   1.974435e-05   0.000000e+00   1.974435e-05   0.000000e+00 
  7.616000e+04   2.062641e-05   0.000000e+00   2.062641e-05   0.000000e+00 
  7.628800e+04   2.235276e-05   0.000000e+00   2.235276e-05   0.000000e+00 
  7.641600e+04   2.040041e-05   0.000000e+00   2.040041e-05   0.000000e+00 
  7.654400e+04   2.067479e-05   0.000000e+00   2.067479e-05   0.000000e+00 
  7.667200e+04   1.943849e-05   0.000000e+00   1.943849e-05   0.000000e+00 
  7.680000e+04   1.915874e-05   0.000000e+00   1.915874e-05   0.000000e+00 
  7.692800e+04   1.904125e-05   0.000000e+00   1.904125e-05   0.000000e+00 
  7.705600e+04   1.888842e-05   0.000000e+00   1.888842e-05   0.000000e+00 
  7.718400e+04   1.891031e-05   0.000000e+00   1.891031e-05   0.000000e+00 
  7.731200e+04   1.853127e-05   0.000000e+00   1.853127e-05   0.000000e+00 
  7.744000e+04   1.880847e-05   0.000000e+00   1.880847e-05   0.000000e+00 
  7.756800e+04   1.873108e-05   0.000000e+00   1.873108e-05   0.000000e+00 
  7.769600e+04   1.838209e-05   0.000000e+00   1.838209e-05   0.000000e+00 
  7.782400e+04   1.828484e-05   0.000000e+00   1.828484e-05   0.000000e+00 
  7.795200e+04   1.883455e-05   0.000000e+00   1.883455e-05   0.000000e+00 
  7.808000e+04   1.867604e-05   0.000000e+00   1.867604e-05   0.000000e+00 
  7.820800e+04   1.820025e-05   0.000000e+00   1.820025e-05   0.000000e+00 
  7.833600e+04   1.886393e-05   0.000000e+00   1.886393e-05   0.000000e+00 
  7.846400e+04   1.814798e-05   0.000000e+00   1.814798e-05   0.000000e+00 
  7.859200e+04   1.764667e-05   0.000000e+00   1.764667e-05   0.000000e+00 
  7.872000e+04   1.777923e-05   0.000000e+00   1.777923e-05   0.000000e+00 
  7.884800e+04   1.808517e-05   0.000000e+00   1.808517e-05   0.000000e+00 
  7.897600e+04   1.796440e-05   0.000000e+00   1.796440e-05   0.000000e+00 
  7.910400e+04   1.780641e-05   0.000000e+00   1.780641e-05   0.000000e+00 
  7.923200e+04   1.766978e-05   0.000000e+00   1.766978e-05   0.000000e+00 
  7.936000e+04   1.759337e-05   0.000000e+00   1.759337e-05   0.000000e+00 
  7.948800e+04   1.778889e-05   0.000000e+00   1.778889e-05   0.000000e+00 
  7.961600e+04   1.781638e-05   0.000000e+00   1.781638e-05   0.000000e+00 
  7.974400e+04   1.758475e-05   0.000000e+00   1.758475e-05   0.000000e+00 
  7.987200e+04   1.767114e-05   0.000000e+00   1.767114e-05   0.000000e+00 
  8.000000e+04   1.736694e-05   0.000000e+00   1.736694e-05   0.000000e+00 
  8.012800e+04   1.711819e-05   0.000000e+00   1.711819e-05   0.000000e+00 
  8.025600e+04   1.735310e-05   0.000000e+00   1.735310e-05   0.000000e+00 
  8.038400e+04   1.726114e-05   0.000000e+00   1.726114e-05   0.000000e+00 
  8.051200e+04   1.743469e-05   0.000000e+00   1.743469e-05   0.000000e+00 
  8.064000e+04   1.773588e-05   0.000000e+00   1.773588e-05   0.000000e+00 
  8.076800e+04   1.776060e-05   0.000000e+00   1.776060e-05   0.000000e+00 
  8.089600e+04   1.794706e-05   0.000000e+00   1.794706e-05   0.000000e+00 
  8.102400e+04   1.751708e-05   0.000000e+00   1.751708e-05   0.000000e+00 
  8.115200e+04   1.710678e-05   0.000000e+00   1.710678e-05   0.000000e+00 
  8.128000e+04   1.750157e-05   0.000000e+00   1.750157e-05   0.000000e+00 
  8.140800e+04   1.831447e-05   0.000000e+00   1.831447e-05   0.000000e+00 
  8.153600e+04   1.870570e-05   0.000000e+00   1.870570e-05   0.000000e+00 
  8.166400e+04   1.845574e-05   0.000000e+00   1.845574e-05   0.000000e+00 
  8.179200e+04   1.794585e-05   0.000000e+00   1.794585e-05   0.000000e+00 
  8.192000e+04   1.758981e-05   0.000000e+00   1.758981e-05   0.000000e+00 
  8.204800e+04   1.762570e-05   0.000000e+00   1.762570e-05   0.000000e+00 
  8.217600e+04   1.769993e-05   0.000000e+00   1.769993e-05   0.000000e+00 
  8.230400e+04   1.757302e-05   0.000000e+00   1.757302e-05   0.000000e+00 
  8.243200e+04   1.730903e-05   0.000000e+00   1.730903e-05   0.000000e+00 
  8.256000e+04   1.734845e-05   0.000000e+00   1.734845e-05   0.000000e+00 
  8.268800e+04   1.756888e-05   0.000000e+00   1.756888e-05   0.000000e+00 
  8.281600e+04   1.764839e-05   0.000000e+00   1.764839e-05   0.000000e+00 
  8.294400e+04   1.765622e-05   0.000000e+00   1.765622e-05   0.000000e+00 
  8.307200e+04   1.751911e-05   0.000000e+00   1.751911e-05   0.000000e+00 
  8.320000e+04   1.765140e-05   0.000000e+00   1.765140e-05   0.000000e+00 
  8.332800e+04   1.889487e-05   0.000000e+00   1.889487e-05   0.000000e+00 
  8.345600e+04   1.765501e-05   0.000000e+00   1.765501e-05   0.000000e+00 
  8.358400e+04   1.698908e-05   0.000000e+00   1.698908e-05   0.000000e+00 
  8.371200e+04   1.702642e-05   0.000000e+00   1.702642e-05   0.000000e+00 
  8.384000e+04   1.709483e-05   0.000000e+00   1.709483e-05   0.000000e+00 
  8.396800e+04   1.699209e-05   0.000000e+00   1.699209e-05   0.000000e+00 
  8.409600e+04   1.663477e-05   0.000000e+00   1.663477e-05   0.000000e+00 
  8.422400e+04   1.649517e-05   0.000000e+00   1.649517e-05   0.000000e+00 
  8.435200e+04   1.695505e-05   0.000000e+00   1.695505e-05   0.000000e+00 
  8.448000e+04   1.678770e-05   0.000000e+00   1.678770e-05   0.000000e+00 
  8.460800e+04   1.639183e-05   0.000000e+00   1.639183e-05   0.000000e+00 
  8.473600e+04   1.633090e-05   0.000000e+00   1.633090e-05   0.000000e+00 
  8.486400e+04   1.653734e-05   0.000000e+00   1.653734e-05   0.000000e+00 
  8.499200e+04   1.801166e-05   0.000000e+00   1.801166e-05   0.000000e+00 
  8.512000e+04   1.843313e-05   0.000000e+00   1.843313e-05   0.000000e+00 
  8.524800e+04   1.639946e-05   0.000000e+00   1.639946e-05   0.000000e+00 
  8.537600e+04   1.609157e-05   0.000000e+00   1.609157e-05   0.000000e+00 
  8.550400e+04   1.620328e-05   0.000000e+00   1.620328e-05   0.000000e+00 
  8.563200e+04   1.659438e-05   0.000000e+00   1.659438e-05   0.000000e+00 
  8.576000e+04   1.692471e-05   0.000000e+00   1.692471e-05   0.000000e+00 
  8.588800e+04   1.705024e-05   0.000000e+00   1.705024e-05   0.000000e+00 
  8.601600e+04   1.922014e-05   0.000000e+00   1.922014e-05   0.000000e+00 
  8.614400e+04   2.052776e-05   0.000000e+00   2.052776e-05   0.000000e+00 
  8.627200e+04   1.734914e-05   0.000000e+00   1.734914e-05   0.000000e+00 
  8.640000e+04   1.714639e-05   0.000000e+00   1.714639e-05   0.000000e+00 
  8.652800e+04   1.688752e-05   0.000000e+00   1.688752e-05   0.000000e+00 
  8.665600e+04   1.666916e-05   0.000000e+00   1.666916e-05   0.000000e+00 
  8.678400e+04   1.739710e-05   0.000000e+00   1.739710e-05   0.000000e+00 
  8.691200e+04   1.781284e-05   0.000000e+00   1.781284e-05   0.000000e+00 
  8.704000e+04   1.794709e-05   0.000000e+00   1.794709e-05   0.000000e+00 
  8.716800e+04   1.872372e-05   0.000000e+00   1.872372e-05   0.000000e+00 
  8.729600e+04   1.879839e-05   0.000000e+00   1.879839e-05   0.000000e+00 
  8.742400e+04   1.838832e-05   0.000000e+00   1.838832e-05   0.000000e+00 
  8.755200e+04   1.855825e-05   0.000000e+00   1.855825e-05   0.000000e+00 
  8.768000e+04   1.896395e-05   0.000000e+00   1.896395e-05   0.000000e+00 
  8.780800e+04   1.931674e-05   0.000000e+00   1.931674e-05   0.000000e+00 
  8.793600e+04   1.879039e-05   0.000000e+00   1.879039e-05   0.000000e+00 
  8.806400e+04   1.862484e-05   0.000000e+00   1.862484e-05   0.000000e+00 
  8.819200e+04   1.841422e-05   0.000000e+00   1.841422e-05   0.000000e+00 
  8.832000e+04   1.841066e-05   0.000000e+00   1.841066e-05   0.000000e+00 
  8.844800e+04   1.840273e-05   0.000000e+00   1.840273e-05   0.000000e+00 
  8.857600e+04   1.800201e-05   0.000000e+00   1.800201e-05   0.000000e+00 
  8.870400e+04   1.855422e-05   0.000000e+00   1.855422e-05   0.000000e+00 
  8.883200e+04   2.291012e-05   0.000000e+00   2.291012e-05   0.000000e+00 
  8.896000e+04   2.123920e-05   0.000000e+00   2.123920e-05   0.000000e+00 
  8.908800e+04   1.776336e-05   0.000000e+00   1.776336e-05   0.000000e+00 
  8.921600e+04   1.706203e-05   0.000000e+00   1.706203e-05   0.000000e+00 
  8.934400e+04   1.718075e-05   0.000000e+00   1.718075e-05   0.000000e+00 
  8.947200e+04   1.828989e-05   0.000000e+00   1.828989e-05   0.000000e+00 
  8.960000e+04   2.201948e-05   0.000000e+00   2.201948e-05   0.000000e+00 
  8.972800e+04   1.962302e-05   0.000000e+00   1.962302e-05   0.000000e+00 
  8.985600e+04   1.870437e-05   0.000000e+00   1.870437e-05   0.000000e+00 
  8.998400e+04   1.746781e-05   0.000000e+00   1.746781e-05   0.000000e+00 
  9.011200e+04   1.755239e-05   0.000000e+00   1.755239e-05   0.000000e+00 
  9.024000e+04   1.753626e-05   0.000000e+00   1.753626e-05   0.000000e+00 
  9.036800e+04   1.806394e-05   0.000000e+00   1.806394e-05   0.000000e+00 
  9.049600e+04   1.812749e-05   0.000000e+00   1.812749e-05   0.000000e+00 
  9.062400e+04   1.783746e-05   0.000000e+00   1.783746e-05   0.000000e+00 
  9.075200e+04   1.821137e-05   0.000000e+00   1.821137e-05   0.000000e+00 
  9.088000e+04   1.815365e-05   0.000000e+00   1.815365e-05   0.000000e+00 
  9.100800e+04   1.749029e-05   0.000000e+00   1.749029e-05   0.000000e+00 
  9.113600e+04   1.744209e-05   0.000000e+00   1.744209e-05   0.000000e+00 
  9.126400e+04   1.724007e-05   0.000000e+00   1.724007e-05   0.000000e+00 
  9.139200e+04   1.689508e-05   0.000000e+00   1.689508e-05   0.000000e+00 
  9.152000e+04   1.679334e-05   0.000000e+00   1.679334e-05   0.000000e+00 
  9.164800e+04   1.676147e-05   0.000000e+00   1.676147e-05   0.000000e+00 
  9.177600e+04   1.631547e-05   0.000000e+00   1.631547e-05   0.000000e+00 
  9.190400e+04   1.638548e-05   0.000000e+00   1.638548e-05   0.000000e+00 
  9.203200e+04   1.636423e-05   0.000000e+00   1.636423e-05   0.000000e+00 
  9.216000e+04   1.599985e-05   0.000000e+00   1.599985e-05   0.000000e+00 
  9.228800e+04   1.566821e-05   0.000000e+00   1.566821e-05   0.000000e+00 
  9.241600e+04   1.556277e-05   0.000000e+00   1.556277e-05   0.000000e+00 
  9.254400e+04   1.544615e-05   0.000000e+00   1.544615e-05   0.000000e+00 
  9.267200e+04   1.514467e-05   0.000000e+00   1.514467e-05   0.000000e+00 
  9.280000e+04   1.474029e-05   0.000000e+00   1.474029e-05   0.000000e+00 
  9.292800e+04   1.466595e-05   0.000000e+00   1.466595e-05   0.000000e+00 
  9.305600e+04   1.459836e-05   0.000000e+00   1.459836e-05   0.000000e+00 
  9.318400e+04   1.469249e-05   0.000000e+00   1.469249e-05   0.000000e+00 
  9.331200e+04   1.482702e-05   0.000000e+00   1.482702e-05   0.000000e+00 
  9.344000e+04   1.483572e-05   0.000000e+00   1.483572e-05   0.000000e+00 
  9.356800e+04   1.491623e-05   0.000000e+00   1.491623e-05   0.000000e+00 
  9.369600e+04   1.471425e-05   0.000000e+00   1.471425e-05   0.000000e+00 
  9.382400e+04   1.410924e-05   0.000000e+00   1.410924e-05   0.000000e+00 
  9.395200e+04   1.392691e-05   0.000000e+00   1.392691e-05   0.000000e+00 
  9.408000e+04   1.396664e-05   0.000000e+00   1.396664e-05   0.000000e+00 
  9.420800e+04   1.417420e-05   0.000000e+00   1.417420e-05   0.000000e+00 
  9.433600e+04   1.408526e-05   0.000000e+00   1.408526e-05   0.000000e+00 
  9.446400e+04   1.419968e-05   0.000000e+00   1.419968e-05   0.000000e+00 
  9.459200e+04   1.428390e-05   0.000000e+00   1.428390e-05   0.000000e+00 
  9.472000e+04   1.398467e-05   0.000000e+00   1.398467e-05   0.000000e+00 
  9.484800e+04   1.424992e-05   0.000000e+00   1.424992e-05   0.000000e+00 
  9.497600e+04   1.455131e-05   0.000000e+00   1.455131e-05   0.000000e+00 
  9.510400e+04   1.485116e-05   0.000000e+00   1.485116e-05   0.000000e+00 
  9.523200e+04   1.617730e-05   0.000000e+00   1.617730e-05   0.000000e+00 
  9.536000e+04   1.970879e-05   0.000000e+00   1.970879e-05   0.000000e+00 
  9.548800e+04   1.608661e-05   0.000000e+00   1.608661e-05   0.000000e+00 
  9.561600e+04   1.477712e-05   0.000000e+00   1.477712e-05   0.000000e+00 
  9.574400e+04   1.489596e-05   0.000000e+00   1.489596e-05   0.000000e+00 
  9.587200e+04   1.490810e-05   0.000000e+00   1.490810e-05   0.000000e+00 
  9.600000e+04   1.491846e-05   0.000000e+00   1.491846e-05   0.000000e+00 
  9.612800e+04   1.509498e-05   0.000000e+00   1.509498e-05   0.000000e+00 
  9.625600e+04   1.525796e-05   0.000000e+00   1.525796e-05   0.000000e+00 
  9.638400e+04   1.549000e-05   0.000000e+00   1.549000e-05   0.000000e+00 
  9.651200e+04   1.584765e-05   0.000000e+00   1.584765e-05   0.000000e+00 
  9.664000e+04   1.571944e-05   0.000000e+00   1.571944e-05   0.000000e+00 
  9.676800e+04   1.545853e-05   0.000000e+00   1.545853e-05   0.000000e+00 
  9.689600e+04   1.556340e-05   0.000000e+00   1.556340e-05   0.000000e+00 
  9.702400e+04   1.557100e-05   0.000000e+00   1.557100e-05   0.000000e+00 
  9.715200e+04   1.618006e-05   0.000000e+00   1.618006e-05   0.000000e+00 
  9.728000e+04   1.636518e-05   0.000000e+00   1.636518e-05   0.000000e+00 
  9.740800e+04   1.561107e-05   0.000000e+00   1.561107e-05   0.000000e+00 
  9.753600e+04   1.528538e-05   0.000000e+00   1.528538e-05   0.000000e+00 
  9.766400e+04   1.510655e-05   0.000000e+00   1.510655e-05   0.000000e+00 
  9.779200e+04   1.500211e-05   0.000000e+00   1.500211e-05   0.000000e+00 
  9.792000e+04   1.460154e-05   0.000000e+00   1.460154e-05   0.000000e+00 
  9.804800e+04   1.445636e-05   0.000000e+00   1.445636e-05   0.000000e+00 
  9.817600e+04   1.459240e-05   0.000000e+00   1.459240e-05   0.000000e+00 
  9.830400e+04   1.517518e-05   0.000000e+00   1.517518e-05   0.000000e+00 
  9.843200e+04   1.540718e-05   0.000000e+00   1.540718e-05   0.000000e+00 
  9.856000e+04   1.455977e-05   0.000000e+00   1.455977e-05   0.000000e+00 
  9.868800e+04   1.455072e-05   0.000000e+00   1.455072e-05   0.000000e+00 
  9.881600e+04   1.481096e-05   0.000000e+00   1.481096e-05   0.000000e+00 
  9.894400e+04   1.450322e-05   0.000000e+00   1.450322e-05   0.000000e+00 
  9.907200e+04   1.436226e-05   0.000000e+00   1.436226e-05   0.000000e+00 
  9.920000e+04   1.437849e-05   0.000000e+00   1.437849e-05   0.000000e+00 
  9.932800e+04   1.423200e-05   0.000000e+00   1.423200e-05   0.000000e+00 
  9.945600e+04   1.403116e-05   0.000000e+00   1.403116e-05   0.000000e+00 
  9.958400e+04   1.451609e-05   0.000000e+00   1.451609e-05   0.000000e+00 
  9.971200e+04   1.549750e-05   0.000000e+00   1.549750e-05   0.000000e+00 
  9.984000e+04   1.634987e-05   0.000000e+00   1.634987e-05   0.000000e+00 
  9.996800e+04   1.451751e-05   0.000000e+00   1.451751e-05   0.000000e+00 
  1.000960e+05   1.400227e-05   0.000000e+00   1.400227e-05   0.000000e+00 
  1.002240e+05   1.391460e-05   0.000000e+00   1.391460e-05   0.000000e+00 
  1.003520e+05   1.374867e-05   0.000000e+00   1.374867e-05   0.000000e+00 
  1.004800e+05   1.366135e-05   0.000000e+00   1.366135e-05   0.000000e+00 
  1.006080e+05   1.374970e-05   0.000000e+00   1.374970e-05   0.000000e+00 
  1.007360e+05   1.343267e-05   0.000000e+00   1.343267e-05   0.000000e+00 
  1.008640e+05   1.379261e-05   0.000000e+00   1.379261e-05   0.000000e+00 
  1.009920e+05   1.349160e-05   0.000000e+00   1.349160e-05   0.000000e+00 
  1.011200e+05   1.336173e-05   0.000000e+00   1.336173e-05   0.000000e+00 
  1.012480e+05   1.318367e-05   0.000000e+00   1.318367e-05   0.000000e+00 
  1.013760e+05   1.330636e-05   0.000000e+00   1.330636e-05   0.000000e+00 
  1.015040e+05   1.354227e-05   0.000000e+00   1.354227e-05   0.000000e+00 
  1.016320e+05   1.345862e-05   0.000000e+00   1.345862e-05   0.000000e+00 
  1.017600e+05   1.342575e-05   0.000000e+00   1.342575e-05   0.000000e+00 
  1.018880e+05   1.399373e-05   0.000000e+00   1.399373e-05   0.000000e+00 
  1.020160e+05   1.398707e-05   0.000000e+00   1.398707e-05   0.000000e+00 
  1.021440e+05   1.371381e-05   0.000000e+00   1.371381e-05   0.000000e+00 
  1.022720e+05   1.335253e-05   0.000000e+00   1.335253e-05   0.000000e+00 
  1.024000e+05   1.348339e-05   0.000000e+00   1.348339e-05   0.000000e+00 
