  0.000000e+00   3.243698e-01   0.000000e+00   3.243698e-01   0.000000e+00 
  2.000000e+00   3.834688e-01   0.000000e+00   3.834688e-01   0.000000e+00 
  4.000000e+00   3.020550e-01   0.000000e+00   3.020550e-01   0.000000e+00 
  6.000000e+00   1.874514e-01   0.000000e+00   1.874514e-01   0.000000e+00 
  8.000000e+00   1.758934e-01   0.000000e+00   1.758934e-01   0.000000e+00 
  1.000000e+01   1.288102e-01   0.000000e+00   1.288102e-01   0.000000e+00 
  1.200000e+01   1.478263e-01   0.000000e+00   1.478263e-01   0.000000e+00 
  1.400000e+01   1.156710e-01   0.000000e+00   1.156710e-01   0.000000e+00 
  1.600000e+01   1.195794e-01   0.000000e+00   1.195794e-01   0.000000e+00 
  1.800000e+01   9.293179e-02   0.000000e+00   9.293179e-02   0.000000e+00 
  2.000000e+01   9.421930e-02   0.000000e+00   9.421930e-02   0.000000e+00 
  2.200000e+01   7.083274e-02   0.000000e+00   7.083274e-02   0.000000e+00 
  2.400000e+01   6.235561e-02   0.000000e+00   6.235561e-02   0.000000e+00 
  2.600000e+01   5.759605e-02   0.000000e+00   5.759605e-02   0.000000e+00 
  2.800000e+01   4.932528e-02   0.000000e+00   4.932528e-02   0.000000e+00 
  3.000000e+01   5.408815e-02   0.000000e+00   5.408815e-02   0.000000e+00 
  3.200000e+01   4.591098e-02   0.000000e+00   4.591098e-02   0.000000e+00 
  3.400000e+01   5.042601e-02   0.000000e+00   5.042601e-02   0.000000e+00 
  3.600000e+01   4.744081e-02   0.000000e+00   4.744081e-02   0.000000e+00 
  3.800000e+01   4.276264e-02   0.000000e+00   4.276264e-02   0.000000e+00 
  4.000000e+01   4.956686e-02   0.000000e+00   4.956686e-02   0.000000e+00 
  4.200000e+01   3.710815e-02   0.000000e+00   3.710815e-02   0.000000e+00 
  4.400000e+01   4.282136e-02   0.000000e+00   4.282136e-02   0.000000e+00 
  4.600000e+01   3.849098e-02   0.000000e+00   3.849098e-02   0.000000e+00 
  4.800000e+01   3.521811e-02   0.000000e+00   3.521811e-02   0.000000e+00 
  5.000000e+01   3.910879e-02   0.000000e+00   3.910879e-02   0.000000e+00 
  5.200000e+01   3.388035e-02   0.000000e+00   3.388035e-02   0.000000e+00 
  5.400000e+01   3.691399e-02   0.000000e+00   3.691399e-02   0.000000e+00 
  5.600000e+01   3.283883e-02   0.000000e+00   3.283883e-02   0.000000e+00 
  5.800000e+01   7.017666e-02   0.000000e+00   7.017666e-02   0.000000e+00 
  6.000000e+01   1.197402e-01   0.000000e+00   1.197402e-01   0.000000e+00 
  6.200000e+01   5.997817e-02   0.000000e+00   5.997817e-02   0.000000e+00 
  6.400000e+01   2.579434e-02   0.000000e+00   2.579434e-02   0.000000e+00 
  6.600000e+01   2.616543e-02   0.000000e+00   2.616543e-02   0.000000e+00 
  6.800000e+01   2.259004e-02   0.000000e+00   2.259004e-02   0.000000e+00 
  7.000000e+01   2.704850e-02   0.000000e+00   2.704850e-02   0.000000e+00 
  7.200000e+01   2.222021e-02   0.000000e+00   2.222021e-02   0.000000e+00 
  7.400000e+01   2.515603e-02   0.000000e+00   2.515603e-02   0.000000e+00 
  7.600000e+01   2.416134e-02   0.000000e+00   2.416134e-02   0.000000e+00 
  7.800000e+01   2.429765e-02   0.000000e+00   2.429765e-02   0.000000e+00 
  8.000000e+01   2.569625e-02   0.000000e+00   2.569625e-02   0.000000e+00 
  8.200000e+01   2.069766e-02   0.000000e+00   2.069766e-02   0.000000e+00 
  8.400000e+01   2.039092e-02   0.000000e+00   2.039092e-02   0.000000e+00 
  8.600000e+01   2.189254e-02   0.000000e+00   2.189254e-02   0.000000e+00 
  8.800000e+01   2.065445e-02   0.000000e+00   2.065445e-02   0.000000e+00 
  9.000000e+01   2.351981e-02   0.000000e+00   2.351981e-02   0.000000e+00 
  9.200000e+01   2.133394e-02   0.000000e+00   2.133394e-02   0.000000e+00 
  9.400000e+01   2.413653e-02   0.000000e+00   2.413653e-02   0.000000e+00 
  9.600000e+01   2.705488e-02   0.000000e+00   2.705488e-02   0.000000e+00 
  9.800000e+01   7.079212e-02   0.000000e+00   7.079212e-02   0.000000e+00 
  1.000000e+02   1.400449e-01   0.000000e+00   1.400449e-01   0.000000e+00 
  1.020000e+02   7.180957e-02   0.000000e+00   7.180957e-02   0.000000e+00 
  1.040000e+02   1.988516e-02   0.000000e+00   1.988516e-02   0.000000e+00 
  1.060000e+02   1.973178e-02   0.000000e+00   1.973178e-02   0.000000e+00 
  1.080000e+02   2.193133e-02   0.000000e+00   2.193133e-02   0.000000e+00 
  1.100000e+02   2.001322e-02   0.000000e+00   2.001322e-02   0.000000e+00 
  1.120000e+02   2.004216e-02   0.000000e+00   2.004216e-02   0.000000e+00 
  1.140000e+02   2.088404e-02   0.000000e+00   2.088404e-02   0.000000e+00 
  1.160000e+02   2.045877e-02   0.000000e+00   2.045877e-02   0.000000e+00 
  1.180000e+02   6.528920e-02   0.000000e+00   6.528920e-02   0.000000e+00 
  1.200000e+02   1.200809e-01   0.000000e+00   1.200809e-01   0.000000e+00 
  1.220000e+02   6.006453e-02   0.000000e+00   6.006453e-02   0.000000e+00 
  1.240000e+02   1.838706e-02   0.000000e+00   1.838706e-02   0.000000e+00 
  1.260000e+02   1.636603e-02   0.000000e+00   1.636603e-02   0.000000e+00 
  1.280000e+02   2.240207e-02   0.000000e+00   2.240207e-02   0.000000e+00 
  1.300000e+02   2.242158e-02   0.000000e+00   2.242158e-02   0.000000e+00 
  1.320000e+02   1.803732e-02   0.000000e+00   1.803732e-02   0.000000e+00 
  1.340000e+02   2.051064e-02   0.000000e+00   2.051064e-02   0.000000e+00 
  1.360000e+02   1.911392e-02   0.000000e+00   1.911392e-02   0.000000e+00 
  1.380000e+02   1.982117e-02   0.000000e+00   1.982117e-02   0.000000e+00 
  1.400000e+02   2.018074e-02   0.000000e+00   2.018074e-02   0.000000e+00 
  1.420000e+02   1.695791e-02   0.000000e+00   1.695791e-02   0.000000e+00 
  1.440000e+02   1.773195e-02   0.000000e+00   1.773195e-02   0.000000e+00 
  1.460000e+02   1.950977e-02   0.000000e+00   1.950977e-02   0.000000e+00 
  1.480000e+02   2.021271e-02   0.000000e+00   2.021271e-02   0.000000e+00 
  1.500000e+02   2.025039e-02   0.000000e+00   2.025039e-02   0.000000e+00 
  1.520000e+02   2.116719e-02   0.000000e+00   2.116719e-02   0.000000e+00 
  1.540000e+02   2.934928e-02   0.000000e+00   2.934928e-02   0.000000e+00 
  1.560000e+02   3.536614e-02   0.000000e+00   3.536614e-02   0.000000e+00 
  1.580000e+02   3.326403e-02   0.000000e+00   3.326403e-02   0.000000e+00 
  1.600000e+02   2.948883e-02   0.000000e+00   2.948883e-02   0.000000e+00 
  1.620000e+02   3.482269e-02   0.000000e+00   3.482269e-02   0.000000e+00 
  1.640000e+02   3.327816e-02   0.000000e+00   3.327816e-02   0.000000e+00 
  1.660000e+02   3.332980e-02   0.000000e+00   3.332980e-02   0.000000e+00 
  1.680000e+02   3.936964e-02   0.000000e+00   3.936964e-02   0.000000e+00 
  1.700000e+02   5.046004e-02   0.000000e+00   5.046004e-02   0.000000e+00 
  1.720000e+02   6.006044e-02   0.000000e+00   6.006044e-02   0.000000e+00 
  1.740000e+02   7.675067e-02   0.000000e+00   7.675067e-02   0.000000e+00 
  1.760000e+02   1.356257e-01   0.000000e+00   1.356257e-01   0.000000e+00 
  1.780000e+02   2.069303e-01   0.000000e+00   2.069303e-01   0.000000e+00 
  1.800000e+02   1.919951e-01   0.000000e+00   1.919951e-01   0.000000e+00 
  1.820000e+02   9.016664e-02   0.000000e+00   9.016664e-02   0.000000e+00 
  1.840000e+02   6.289414e-02   0.000000e+00   6.289414e-02   0.000000e+00 
  1.860000e+02   4.655564e-02   0.000000e+00   4.655564e-02   0.000000e+00 
  1.880000e+02   3.738064e-02   0.000000e+00   3.738064e-02   0.000000e+00 
  1.900000e+02   3.407593e-02   0.000000e+00   3.407593e-02   0.000000e+00 
  1.920000e+02   3.217167e-02   0.000000e+00   3.217167e-02   0.000000e+00 
  1.940000e+02   3.176097e-02   0.000000e+00   3.176097e-02   0.000000e+00 
  1.960000e+02   3.892967e-02   0.000000e+00   3.892967e-02   0.000000e+00 
  1.980000e+02   4.278938e-02   0.000000e+00   4.278938e-02   0.000000e+00 
  2.000000e+02   5.108409e-02   0.000000e+00   5.108409e-02   0.000000e+00 
  2.020000e+02   3.539428e-02   0.000000e+00   3.539428e-02   0.000000e+00 
  2.040000e+02   3.325351e-02   0.000000e+00   3.325351e-02   0.000000e+00 
  2.060000e+02   2.723777e-02   0.000000e+00   2.723777e-02   0.000000e+00 
  2.080000e+02   2.751593e-02   0.000000e+00   2.751593e-02   0.000000e+00 
  2.100000e+02   2.606799e-02   0.000000e+00   2.606799e-02   0.000000e+00 
  2.120000e+02   2.473826e-02   0.000000e+00   2.473826e-02   0.000000e+00 
  2.140000e+02   2.697913e-02   0.000000e+00   2.697913e-02   0.000000e+00 
  2.160000e+02   2.794046e-02   0.000000e+00   2.794046e-02   0.000000e+00 
  2.180000e+02   2.392226e-02   0.000000e+00   2.392226e-02   0.000000e+00 
  2.200000e+02   2.656586e-02   0.000000e+00   2.656586e-02   0.000000e+00 
  2.220000e+02   2.547175e-02   0.000000e+00   2.547175e-02   0.000000e+00 
  2.240000e+02   2.184635e-02   0.000000e+00   2.184635e-02   0.000000e+00 
  2.260000e+02   1.883797e-02   0.000000e+00   1.883797e-02   0.000000e+00 
  2.280000e+02   1.810945e-02   0.000000e+00   1.810945e-02   0.000000e+00 
  2.300000e+02   1.707735e-02   0.000000e+00   1.707735e-02   0.000000e+00 
  2.320000e+02   1.561231e-02   0.000000e+00   1.561231e-02   0.000000e+00 
  2.340000e+02   1.793464e-02   0.000000e+00   1.793464e-02   0.000000e+00 
  2.360000e+02   1.753950e-02   0.000000e+00   1.753950e-02   0.000000e+00 
  2.380000e+02   2.195072e-02   0.000000e+00   2.195072e-02   0.000000e+00 
  2.400000e+02   2.707066e-02   0.000000e+00   2.707066e-02   0.000000e+00 
  2.420000e+02   1.773085e-02   0.000000e+00   1.773085e-02   0.000000e+00 
  2.440000e+02   1.188376e-02   0.000000e+00   1.188376e-02   0.000000e+00 
  2.460000e+02   1.192139e-02   0.000000e+00   1.192139e-02   0.000000e+00 
  2.480000e+02   1.301398e-02   0.000000e+00   1.301398e-02   0.000000e+00 
  2.500000e+02   1.492477e-02   0.000000e+00   1.492477e-02   0.000000e+00 
  2.520000e+02   1.294076e-02   0.000000e+00   1.294076e-02   0.000000e+00 
  2.540000e+02   1.113401e-02   0.000000e+00   1.113401e-02   0.000000e+00 
  2.560000e+02   1.125498e-02   0.000000e+00   1.125498e-02   0.000000e+00 
  2.580000e+02   1.388274e-02   0.000000e+00   1.388274e-02   0.000000e+00 
  2.600000e+02   1.769092e-02   0.000000e+00   1.769092e-02   0.000000e+00 
  2.620000e+02   1.358045e-02   0.000000e+00   1.358045e-02   0.000000e+00 
  2.640000e+02   1.217806e-02   0.000000e+00   1.217806e-02   0.000000e+00 
  2.660000e+02   1.040614e-02   0.000000e+00   1.040614e-02   0.000000e+00 
  2.680000e+02   9.425523e-03   0.000000e+00   9.425523e-03   0.000000e+00 
  2.700000e+02   1.043676e-02   0.000000e+00   1.043676e-02   0.000000e+00 
  2.720000e+02   1.172929e-02   0.000000e+00   1.172929e-02   0.000000e+00 
  2.740000e+02   1.246902e-02   0.000000e+00   1.246902e-02   0.000000e+00 
  2.760000e+02   1.160369e-02   0.000000e+00   1.160369e-02   0.000000e+00 
  2.780000e+02   1.162808e-02   0.000000e+00   1.162808e-02   0.000000e+00 
  2.800000e+02   1.040672e-02   0.000000e+00   1.040672e-02   0.000000e+00 
  2.820000e+02   1.011731e-02   0.000000e+00   1.011731e-02   0.000000e+00 
  2.840000e+02   9.527521e-03   0.000000e+00   9.527521e-03   0.000000e+00 
  2.860000e+02   9.954963e-03   0.000000e+00   9.954963e-03   0.000000e+00 
  2.880000e+02   1.101161e-02   0.000000e+00   1.101161e-02   0.000000e+00 
  2.900000e+02   1.027872e-02   0.000000e+00   1.027872e-02   0.000000e+00 
  2.920000e+02   9.363962e-03   0.000000e+00   9.363962e-03   0.000000e+00 
  2.940000e+02   1.046041e-02   0.000000e+00   1.046041e-02   0.000000e+00 
  2.960000e+02   9.987906e-03   0.000000e+00   9.987906e-03   0.000000e+00 
  2.980000e+02   1.520050e-02   0.000000e+00   1.520050e-02   0.000000e+00 
  3.000000e+02   2.576975e-02   0.000000e+00   2.576975e-02   0.000000e+00 
  3.020000e+02   1.663496e-02   0.000000e+00   1.663496e-02   0.000000e+00 
  3.040000e+02   1.386906e-02   0.000000e+00   1.386906e-02   0.000000e+00 
  3.060000e+02   1.181327e-02   0.000000e+00   1.181327e-02   0.000000e+00 
  3.080000e+02   1.041595e-02   0.000000e+00   1.041595e-02   0.000000e+00 
  3.100000e+02   1.052204e-02   0.000000e+00   1.052204e-02   0.000000e+00 
  3.120000e+02   1.027646e-02   0.000000e+00   1.027646e-02   0.000000e+00 
  3.140000e+02   9.627267e-03   0.000000e+00   9.627267e-03   0.000000e+00 
  3.160000e+02   9.534795e-03   0.000000e+00   9.534795e-03   0.000000e+00 
  3.180000e+02   8.965293e-03   0.000000e+00   8.965293e-03   0.000000e+00 
  3.200000e+02   8.813864e-03   0.000000e+00   8.813864e-03   0.000000e+00 
  3.220000e+02   9.365678e-03   0.000000e+00   9.365678e-03   0.000000e+00 
  3.240000e+02   8.696011e-03   0.000000e+00   8.696011e-03   0.000000e+00 
  3.260000e+02   8.810442e-03   0.000000e+00   8.810442e-03   0.000000e+00 
  3.280000e+02   9.847161e-03   0.000000e+00   9.847161e-03   0.000000e+00 
  3.300000e+02   9.826583e-03   0.000000e+00   9.826583e-03   0.000000e+00 
  3.320000e+02   9.816725e-03   0.000000e+00   9.816725e-03   0.000000e+00 
  3.340000e+02   8.602685e-03   0.000000e+00   8.602685e-03   0.000000e+00 
  3.360000e+02   7.998149e-03   0.000000e+00   7.998149e-03   0.000000e+00 
  3.380000e+02   8.485667e-03   0.000000e+00   8.485667e-03   0.000000e+00 
  3.400000e+02   9.357042e-03   0.000000e+00   9.357042e-03   0.000000e+00 
  3.420000e+02   8.838024e-03   0.000000e+00   8.838024e-03   0.000000e+00 
  3.440000e+02   9.375719e-03   0.000000e+00   9.375719e-03   0.000000e+00 
  3.460000e+02   1.070666e-02   0.000000e+00   1.070666e-02   0.000000e+00 
  3.480000e+02   1.113116e-02   0.000000e+00   1.113116e-02   0.000000e+00 
  3.500000e+02   1.113005e-02   0.000000e+00   1.113005e-02   0.000000e+00 
  3.520000e+02   1.061084e-02   0.000000e+00   1.061084e-02   0.000000e+00 
  3.540000e+02   9.435084e-03   0.000000e+00   9.435084e-03   0.000000e+00 
  3.560000e+02   8.732202e-03   0.000000e+00   8.732202e-03   0.000000e+00 
  3.580000e+02   1.291160e-02   0.000000e+00   1.291160e-02   0.000000e+00 
  3.600000e+02   1.839650e-02   0.000000e+00   1.839650e-02   0.000000e+00 
  3.620000e+02   1.190550e-02   0.000000e+00   1.190550e-02   0.000000e+00 
  3.640000e+02   8.718852e-03   0.000000e+00   8.718852e-03   0.000000e+00 
  3.660000e+02   8.136437e-03   0.000000e+00   8.136437e-03   0.000000e+00 
  3.680000e+02   8.683376e-03   0.000000e+00   8.683376e-03   0.000000e+00 
  3.700000e+02   8.245417e-03   0.000000e+00   8.245417e-03   0.000000e+00 
  3.720000e+02   8.559255e-03   0.000000e+00   8.559255e-03   0.000000e+00 
  3.740000e+02   8.612627e-03   0.000000e+00   8.612627e-03   0.000000e+00 
  3.760000e+02   9.728627e-03   0.000000e+00   9.728627e-03   0.000000e+00 
  3.780000e+02   9.310884e-03   0.000000e+00   9.310884e-03   0.000000e+00 
  3.800000e+02   9.250245e-03   0.000000e+00   9.250245e-03   0.000000e+00 
  3.820000e+02   9.188407e-03   0.000000e+00   9.188407e-03   0.000000e+00 
  3.840000e+02   8.771920e-03   0.000000e+00   8.771920e-03   0.000000e+00 
  3.860000e+02   8.608677e-03   0.000000e+00   8.608677e-03   0.000000e+00 
  3.880000e+02   1.127426e-02   0.000000e+00   1.127426e-02   0.000000e+00 
  3.900000e+02   1.091368e-02   0.000000e+00   1.091368e-02   0.000000e+00 
  3.920000e+02   9.083467e-03   0.000000e+00   9.083467e-03   0.000000e+00 
  3.940000e+02   7.898153e-03   0.000000e+00   7.898153e-03   0.000000e+00 
  3.960000e+02   8.015927e-03   0.000000e+00   8.015927e-03   0.000000e+00 
  3.980000e+02   8.415080e-03   0.000000e+00   8.415080e-03   0.000000e+00 
  4.000000e+02   9.661695e-03   0.000000e+00   9.661695e-03   0.000000e+00 
  4.020000e+02   8.137641e-03   0.000000e+00   8.137641e-03   0.000000e+00 
  4.040000e+02   8.647966e-03   0.000000e+00   8.647966e-03   0.000000e+00 
  4.060000e+02   9.492446e-03   0.000000e+00   9.492446e-03   0.000000e+00 
  4.080000e+02   1.062977e-02   0.000000e+00   1.062977e-02   0.000000e+00 
  4.100000e+02   9.711809e-03   0.000000e+00   9.711809e-03   0.000000e+00 
  4.120000e+02   8.571169e-03   0.000000e+00   8.571169e-03   0.000000e+00 
  4.140000e+02   9.933854e-03   0.000000e+00   9.933854e-03   0.000000e+00 
  4.160000e+02   1.087135e-02   0.000000e+00   1.087135e-02   0.000000e+00 
  4.180000e+02   1.125193e-02   0.000000e+00   1.125193e-02   0.000000e+00 
  4.200000e+02   1.256437e-02   0.000000e+00   1.256437e-02   0.000000e+00 
  4.220000e+02   1.088850e-02   0.000000e+00   1.088850e-02   0.000000e+00 
  4.240000e+02   1.016000e-02   0.000000e+00   1.016000e-02   0.000000e+00 
  4.260000e+02   8.786452e-03   0.000000e+00   8.786452e-03   0.000000e+00 
  4.280000e+02   8.652340e-03   0.000000e+00   8.652340e-03   0.000000e+00 
  4.300000e+02   9.753756e-03   0.000000e+00   9.753756e-03   0.000000e+00 
  4.320000e+02   9.356892e-03   0.000000e+00   9.356892e-03   0.000000e+00 
  4.340000e+02   9.291410e-03   0.000000e+00   9.291410e-03   0.000000e+00 
  4.360000e+02   9.556634e-03   0.000000e+00   9.556634e-03   0.000000e+00 
  4.380000e+02   1.066485e-02   0.000000e+00   1.066485e-02   0.000000e+00 
  4.400000e+02   9.843323e-03   0.000000e+00   9.843323e-03   0.000000e+00 
  4.420000e+02   8.480518e-03   0.000000e+00   8.480518e-03   0.000000e+00 
  4.440000e+02   7.739052e-03   0.000000e+00   7.739052e-03   0.000000e+00 
  4.460000e+02   8.116210e-03   0.000000e+00   8.116210e-03   0.000000e+00 
  4.480000e+02   8.784337e-03   0.000000e+00   8.784337e-03   0.000000e+00 
  4.500000e+02   8.732603e-03   0.000000e+00   8.732603e-03   0.000000e+00 
  4.520000e+02   9.633634e-03   0.000000e+00   9.633634e-03   0.000000e+00 
  4.540000e+02   9.437867e-03   0.000000e+00   9.437867e-03   0.000000e+00 
  4.560000e+02   9.156354e-03   0.000000e+00   9.156354e-03   0.000000e+00 
  4.580000e+02   8.373811e-03   0.000000e+00   8.373811e-03   0.000000e+00 
  4.600000e+02   7.299860e-03   0.000000e+00   7.299860e-03   0.000000e+00 
  4.620000e+02   7.939787e-03   0.000000e+00   7.939787e-03   0.000000e+00 
  4.640000e+02   8.735269e-03   0.000000e+00   8.735269e-03   0.000000e+00 
  4.660000e+02   9.397606e-03   0.000000e+00   9.397606e-03   0.000000e+00 
  4.680000e+02   9.350813e-03   0.000000e+00   9.350813e-03   0.000000e+00 
  4.700000e+02   9.085185e-03   0.000000e+00   9.085185e-03   0.000000e+00 
  4.720000e+02   9.603475e-03   0.000000e+00   9.603475e-03   0.000000e+00 
  4.740000e+02   9.168373e-03   0.000000e+00   9.168373e-03   0.000000e+00 
  4.760000e+02   8.936192e-03   0.000000e+00   8.936192e-03   0.000000e+00 
  4.780000e+02   9.195293e-03   0.000000e+00   9.195293e-03   0.000000e+00 
  4.800000e+02   1.003854e-02   0.000000e+00   1.003854e-02   0.000000e+00 
  4.820000e+02   8.224539e-03   0.000000e+00   8.224539e-03   0.000000e+00 
  4.840000e+02   8.732694e-03   0.000000e+00   8.732694e-03   0.000000e+00 
  4.860000e+02   8.504318e-03   0.000000e+00   8.504318e-03   0.000000e+00 
  4.880000e+02   8.089818e-03   0.000000e+00   8.089818e-03   0.000000e+00 
  4.900000e+02   8.885266e-03   0.000000e+00   8.885266e-03   0.000000e+00 
  4.920000e+02   9.658063e-03   0.000000e+00   9.658063e-03   0.000000e+00 
  4.940000e+02   8.919101e-03   0.000000e+00   8.919101e-03   0.000000e+00 
  4.960000e+02   8.417948e-03   0.000000e+00   8.417948e-03   0.000000e+00 
  4.980000e+02   8.565361e-03   0.000000e+00   8.565361e-03   0.000000e+00 
  5.000000e+02   9.811613e-03   0.000000e+00   9.811613e-03   0.000000e+00 
  5.020000e+02   9.498388e-03   0.000000e+00   9.498388e-03   0.000000e+00 
  5.040000e+02   8.474368e-03   0.000000e+00   8.474368e-03   0.000000e+00 
  5.060000e+02   7.587076e-03   0.000000e+00   7.587076e-03   0.000000e+00 
  5.080000e+02   8.580812e-03   0.000000e+00   8.580812e-03   0.000000e+00 
  5.100000e+02   8.027006e-03   0.000000e+00   8.027006e-03   0.000000e+00 
  5.120000e+02   9.134112e-03   0.000000e+00   9.134112e-03   0.000000e+00 
  5.140000e+02   9.711581e-03   0.000000e+00   9.711581e-03   0.000000e+00 
  5.160000e+02   9.224926e-03   0.000000e+00   9.224926e-03   0.000000e+00 
  5.180000e+02   8.131512e-03   0.000000e+00   8.131512e-03   0.000000e+00 
  5.200000e+02   8.075981e-03   0.000000e+00   8.075981e-03   0.000000e+00 
  5.220000e+02   8.202512e-03   0.000000e+00   8.202512e-03   0.000000e+00 
  5.240000e+02   8.239863e-03   0.000000e+00   8.239863e-03   0.000000e+00 
  5.260000e+02   7.530449e-03   0.000000e+00   7.530449e-03   0.000000e+00 
  5.280000e+02   8.312368e-03   0.000000e+00   8.312368e-03   0.000000e+00 
  5.300000e+02   9.811996e-03   0.000000e+00   9.811996e-03   0.000000e+00 
  5.320000e+02   9.496345e-03   0.000000e+00   9.496345e-03   0.000000e+00 
  5.340000e+02   8.068214e-03   0.000000e+00   8.068214e-03   0.000000e+00 
  5.360000e+02   8.670381e-03   0.000000e+00   8.670381e-03   0.000000e+00 
  5.380000e+02   2.497555e-02   0.000000e+00   2.497555e-02   0.000000e+00 
  5.400000e+02   3.725062e-02   0.000000e+00   3.725062e-02   0.000000e+00 
  5.420000e+02   1.573252e-02   0.000000e+00   1.573252e-02   0.000000e+00 
  5.440000e+02   7.793785e-03   0.000000e+00   7.793785e-03   0.000000e+00 
  5.460000e+02   1.994377e-02   0.000000e+00   1.994377e-02   0.000000e+00 
  5.480000e+02   2.902926e-02   0.000000e+00   2.902926e-02   0.000000e+00 
  5.500000e+02   1.985686e-02   0.000000e+00   1.985686e-02   0.000000e+00 
  5.520000e+02   1.999025e-02   0.000000e+00   1.999025e-02   0.000000e+00 
  5.540000e+02   2.890430e-02   0.000000e+00   2.890430e-02   0.000000e+00 
  5.560000e+02   1.705093e-02   0.000000e+00   1.705093e-02   0.000000e+00 
  5.580000e+02   8.031106e-03   0.000000e+00   8.031106e-03   0.000000e+00 
  5.600000e+02   7.107308e-03   0.000000e+00   7.107308e-03   0.000000e+00 
  5.620000e+02   8.364649e-03   0.000000e+00   8.364649e-03   0.000000e+00 
  5.640000e+02   1.141467e-02   0.000000e+00   1.141467e-02   0.000000e+00 
  5.660000e+02   1.768420e-02   0.000000e+00   1.768420e-02   0.000000e+00 
  5.680000e+02   1.263850e-02   0.000000e+00   1.263850e-02   0.000000e+00 
  5.700000e+02   7.798197e-03   0.000000e+00   7.798197e-03   0.000000e+00 
  5.720000e+02   7.447565e-03   0.000000e+00   7.447565e-03   0.000000e+00 
  5.740000e+02   6.946482e-03   0.000000e+00   6.946482e-03   0.000000e+00 
  5.760000e+02   7.927312e-03   0.000000e+00   7.927312e-03   0.000000e+00 
  5.780000e+02   8.284887e-03   0.000000e+00   8.284887e-03   0.000000e+00 
  5.800000e+02   7.266385e-03   0.000000e+00   7.266385e-03   0.000000e+00 
  5.820000e+02   7.433456e-03   0.000000e+00   7.433456e-03   0.000000e+00 
  5.840000e+02   9.361960e-03   0.000000e+00   9.361960e-03   0.000000e+00 
  5.860000e+02   9.517642e-03   0.000000e+00   9.517642e-03   0.000000e+00 
  5.880000e+02   8.435957e-03   0.000000e+00   8.435957e-03   0.000000e+00 
  5.900000e+02   8.215592e-03   0.000000e+00   8.215592e-03   0.000000e+00 
  5.920000e+02   9.114981e-03   0.000000e+00   9.114981e-03   0.000000e+00 
  5.940000e+02   8.486561e-03   0.000000e+00   8.486561e-03   0.000000e+00 
  5.960000e+02   7.933425e-03   0.000000e+00   7.933425e-03   0.000000e+00 
  5.980000e+02   9.710900e-03   0.000000e+00   9.710900e-03   0.000000e+00 
  6.000000e+02   1.058912e-02   0.000000e+00   1.058912e-02   0.000000e+00 
  6.020000e+02   8.477783e-03   0.000000e+00   8.477783e-03   0.000000e+00 
  6.040000e+02   7.818863e-03   0.000000e+00   7.818863e-03   0.000000e+00 
  6.060000e+02   1.230648e-02   0.000000e+00   1.230648e-02   0.000000e+00 
  6.080000e+02   1.342851e-02   0.000000e+00   1.342851e-02   0.000000e+00 
  6.100000e+02   7.944472e-03   0.000000e+00   7.944472e-03   0.000000e+00 
  6.120000e+02   1.249992e-02   0.000000e+00   1.249992e-02   0.000000e+00 
  6.140000e+02   1.880430e-02   0.000000e+00   1.880430e-02   0.000000e+00 
  6.160000e+02   1.092137e-02   0.000000e+00   1.092137e-02   0.000000e+00 
  6.180000e+02   7.433644e-03   0.000000e+00   7.433644e-03   0.000000e+00 
  6.200000e+02   8.052109e-03   0.000000e+00   8.052109e-03   0.000000e+00 
  6.220000e+02   8.547868e-03   0.000000e+00   8.547868e-03   0.000000e+00 
  6.240000e+02   8.329849e-03   0.000000e+00   8.329849e-03   0.000000e+00 
  6.260000e+02   7.849101e-03   0.000000e+00   7.849101e-03   0.000000e+00 
  6.280000e+02   8.287022e-03   0.000000e+00   8.287022e-03   0.000000e+00 
  6.300000e+02   8.164291e-03   0.000000e+00   8.164291e-03   0.000000e+00 
  6.320000e+02   8.147382e-03   0.000000e+00   8.147382e-03   0.000000e+00 
  6.340000e+02   7.279410e-03   0.000000e+00   7.279410e-03   0.000000e+00 
  6.360000e+02   8.313394e-03   0.000000e+00   8.313394e-03   0.000000e+00 
  6.380000e+02   8.499022e-03   0.000000e+00   8.499022e-03   0.000000e+00 
  6.400000e+02   6.827893e-03   0.000000e+00   6.827893e-03   0.000000e+00 
  6.420000e+02   7.617774e-03   0.000000e+00   7.617774e-03   0.000000e+00 
  6.440000e+02   7.155957e-03   0.000000e+00   7.155957e-03   0.000000e+00 
  6.460000e+02   6.637636e-03   0.000000e+00   6.637636e-03   0.000000e+00 
  6.480000e+02   7.651674e-03   0.000000e+00   7.651674e-03   0.000000e+00 
  6.500000e+02   7.615824e-03   0.000000e+00   7.615824e-03   0.000000e+00 
  6.520000e+02   8.003825e-03   0.000000e+00   8.003825e-03   0.000000e+00 
  6.540000e+02   7.704243e-03   0.000000e+00   7.704243e-03   0.000000e+00 
  6.560000e+02   7.661196e-03   0.000000e+00   7.661196e-03   0.000000e+00 
  6.580000e+02   1.643141e-02   0.000000e+00   1.643141e-02   0.000000e+00 
  6.600000e+02   2.265538e-02   0.000000e+00   2.265538e-02   0.000000e+00 
  6.620000e+02   1.129660e-02   0.000000e+00   1.129660e-02   0.000000e+00 
  6.640000e+02   7.808211e-03   0.000000e+00   7.808211e-03   0.000000e+00 
  6.660000e+02   7.441541e-03   0.000000e+00   7.441541e-03   0.000000e+00 
  6.680000e+02   7.391059e-03   0.000000e+00   7.391059e-03   0.000000e+00 
  6.700000e+02   8.088643e-03   0.000000e+00   8.088643e-03   0.000000e+00 
  6.720000e+02   8.256542e-03   0.000000e+00   8.256542e-03   0.000000e+00 
  6.740000e+02   6.883594e-03   0.000000e+00   6.883594e-03   0.000000e+00 
  6.760000e+02   7.698803e-03   0.000000e+00   7.698803e-03   0.000000e+00 
  6.780000e+02   8.343251e-03   0.000000e+00   8.343251e-03   0.000000e+00 
  6.800000e+02   9.243282e-03   0.000000e+00   9.243282e-03   0.000000e+00 
  6.820000e+02   9.612840e-03   0.000000e+00   9.612840e-03   0.000000e+00 
  6.840000e+02   9.792586e-03   0.000000e+00   9.792586e-03   0.000000e+00 
  6.860000e+02   9.927272e-03   0.000000e+00   9.927272e-03   0.000000e+00 
  6.880000e+02   8.474626e-03   0.000000e+00   8.474626e-03   0.000000e+00 
  6.900000e+02   9.852355e-03   0.000000e+00   9.852355e-03   0.000000e+00 
  6.920000e+02   1.070479e-02   0.000000e+00   1.070479e-02   0.000000e+00 
  6.940000e+02   1.173345e-02   0.000000e+00   1.173345e-02   0.000000e+00 
  6.960000e+02   1.223630e-02   0.000000e+00   1.223630e-02   0.000000e+00 
  6.980000e+02   1.209290e-02   0.000000e+00   1.209290e-02   0.000000e+00 
  7.000000e+02   1.088670e-02   0.000000e+00   1.088670e-02   0.000000e+00 
  7.020000e+02   1.089514e-02   0.000000e+00   1.089514e-02   0.000000e+00 
  7.040000e+02   1.016543e-02   0.000000e+00   1.016543e-02   0.000000e+00 
  7.060000e+02   9.676320e-03   0.000000e+00   9.676320e-03   0.000000e+00 
  7.080000e+02   8.077978e-03   0.000000e+00   8.077978e-03   0.000000e+00 
  7.100000e+02   7.307381e-03   0.000000e+00   7.307381e-03   0.000000e+00 
  7.120000e+02   6.814368e-03   0.000000e+00   6.814368e-03   0.000000e+00 
  7.140000e+02   6.982167e-03   0.000000e+00   6.982167e-03   0.000000e+00 
  7.160000e+02   7.304917e-03   0.000000e+00   7.304917e-03   0.000000e+00 
  7.180000e+02   7.429529e-03   0.000000e+00   7.429529e-03   0.000000e+00 
  7.200000e+02   8.052968e-03   0.000000e+00   8.052968e-03   0.000000e+00 
  7.220000e+02   6.925176e-03   0.000000e+00   6.925176e-03   0.000000e+00 
  7.240000e+02   6.547322e-03   0.000000e+00   6.547322e-03   0.000000e+00 
  7.260000e+02   6.941573e-03   0.000000e+00   6.941573e-03   0.000000e+00 
  7.280000e+02   7.774099e-03   0.000000e+00   7.774099e-03   0.000000e+00 
  7.300000e+02   8.121547e-03   0.000000e+00   8.121547e-03   0.000000e+00 
  7.320000e+02   8.529994e-03   0.000000e+00   8.529994e-03   0.000000e+00 
  7.340000e+02   7.417380e-03   0.000000e+00   7.417380e-03   0.000000e+00 
  7.360000e+02   6.965538e-03   0.000000e+00   6.965538e-03   0.000000e+00 
  7.380000e+02   6.474356e-03   0.000000e+00   6.474356e-03   0.000000e+00 
  7.400000e+02   6.925444e-03   0.000000e+00   6.925444e-03   0.000000e+00 
  7.420000e+02   8.186741e-03   0.000000e+00   8.186741e-03   0.000000e+00 
  7.440000e+02   8.053384e-03   0.000000e+00   8.053384e-03   0.000000e+00 
  7.460000e+02   7.747060e-03   0.000000e+00   7.747060e-03   0.000000e+00 
  7.480000e+02   7.015390e-03   0.000000e+00   7.015390e-03   0.000000e+00 
  7.500000e+02   7.738162e-03   0.000000e+00   7.738162e-03   0.000000e+00 
  7.520000e+02   8.213860e-03   0.000000e+00   8.213860e-03   0.000000e+00 
  7.540000e+02   8.249564e-03   0.000000e+00   8.249564e-03   0.000000e+00 
  7.560000e+02   8.791618e-03   0.000000e+00   8.791618e-03   0.000000e+00 
  7.580000e+02   8.270828e-03   0.000000e+00   8.270828e-03   0.000000e+00 
  7.600000e+02   9.174909e-03   0.000000e+00   9.174909e-03   0.000000e+00 
  7.620000e+02   9.244846e-03   0.000000e+00   9.244846e-03   0.000000e+00 
  7.640000e+02   1.139357e-02   0.000000e+00   1.139357e-02   0.000000e+00 
  7.660000e+02   1.309087e-02   0.000000e+00   1.309087e-02   0.000000e+00 
  7.680000e+02   1.159507e-02   0.000000e+00   1.159507e-02   0.000000e+00 
  7.700000e+02   1.117009e-02   0.000000e+00   1.117009e-02   0.000000e+00 
  7.720000e+02   1.040265e-02   0.000000e+00   1.040265e-02   0.000000e+00 
  7.740000e+02   1.016727e-02   0.000000e+00   1.016727e-02   0.000000e+00 
  7.760000e+02   9.623742e-03   0.000000e+00   9.623742e-03   0.000000e+00 
  7.780000e+02   1.225017e-02   0.000000e+00   1.225017e-02   0.000000e+00 
  7.800000e+02   1.424776e-02   0.000000e+00   1.424776e-02   0.000000e+00 
  7.820000e+02   1.047385e-02   0.000000e+00   1.047385e-02   0.000000e+00 
  7.840000e+02   9.680538e-03   0.000000e+00   9.680538e-03   0.000000e+00 
  7.860000e+02   1.105010e-02   0.000000e+00   1.105010e-02   0.000000e+00 
  7.880000e+02   1.085413e-02   0.000000e+00   1.085413e-02   0.000000e+00 
  7.900000e+02   1.084107e-02   0.000000e+00   1.084107e-02   0.000000e+00 
  7.920000e+02   1.068520e-02   0.000000e+00   1.068520e-02   0.000000e+00 
  7.940000e+02   9.653415e-03   0.000000e+00   9.653415e-03   0.000000e+00 
  7.960000e+02   9.987501e-03   0.000000e+00   9.987501e-03   0.000000e+00 
  7.980000e+02   9.340869e-03   0.000000e+00   9.340869e-03   0.000000e+00 
  8.000000e+02   9.330016e-03   0.000000e+00   9.330016e-03   0.000000e+00 
  8.020000e+02   9.466480e-03   0.000000e+00   9.466480e-03   0.000000e+00 
  8.040000e+02   8.690644e-03   0.000000e+00   8.690644e-03   0.000000e+00 
  8.060000e+02   9.545550e-03   0.000000e+00   9.545550e-03   0.000000e+00 
  8.080000e+02   9.118298e-03   0.000000e+00   9.118298e-03   0.000000e+00 
  8.100000e+02   8.414570e-03   0.000000e+00   8.414570e-03   0.000000e+00 
  8.120000e+02   8.826580e-03   0.000000e+00   8.826580e-03   0.000000e+00 
  8.140000e+02   9.124625e-03   0.000000e+00   9.124625e-03   0.000000e+00 
  8.160000e+02   8.107086e-03   0.000000e+00   8.107086e-03   0.000000e+00 
  8.180000e+02   8.936699e-03   0.000000e+00   8.936699e-03   0.000000e+00 
  8.200000e+02   1.012844e-02   0.000000e+00   1.012844e-02   0.000000e+00 
  8.220000e+02   1.098733e-02   0.000000e+00   1.098733e-02   0.000000e+00 
  8.240000e+02   9.336676e-03   0.000000e+00   9.336676e-03   0.000000e+00 
  8.260000e+02   7.922470e-03   0.000000e+00   7.922470e-03   0.000000e+00 
  8.280000e+02   9.624779e-03   0.000000e+00   9.624779e-03   0.000000e+00 
  8.300000e+02   1.100472e-02   0.000000e+00   1.100472e-02   0.000000e+00 
  8.320000e+02   1.081457e-02   0.000000e+00   1.081457e-02   0.000000e+00 
  8.340000e+02   9.277504e-03   0.000000e+00   9.277504e-03   0.000000e+00 
  8.360000e+02   8.617112e-03   0.000000e+00   8.617112e-03   0.000000e+00 
  8.380000e+02   9.856083e-03   0.000000e+00   9.856083e-03   0.000000e+00 
  8.400000e+02   1.139881e-02   0.000000e+00   1.139881e-02   0.000000e+00 
  8.420000e+02   8.636606e-03   0.000000e+00   8.636606e-03   0.000000e+00 
  8.440000e+02   6.757913e-03   0.000000e+00   6.757913e-03   0.000000e+00 
  8.460000e+02   7.779421e-03   0.000000e+00   7.779421e-03   0.000000e+00 
  8.480000e+02   8.094730e-03   0.000000e+00   8.094730e-03   0.000000e+00 
  8.500000e+02   7.584881e-03   0.000000e+00   7.584881e-03   0.000000e+00 
  8.520000e+02   7.335355e-03   0.000000e+00   7.335355e-03   0.000000e+00 
  8.540000e+02   6.392948e-03   0.000000e+00   6.392948e-03   0.000000e+00 
  8.560000e+02   7.176088e-03   0.000000e+00   7.176088e-03   0.000000e+00 
  8.580000e+02   7.285037e-03   0.000000e+00   7.285037e-03   0.000000e+00 
  8.600000e+02   6.810574e-03   0.000000e+00   6.810574e-03   0.000000e+00 
  8.620000e+02   6.352033e-03   0.000000e+00   6.352033e-03   0.000000e+00 
  8.640000e+02   6.519842e-03   0.000000e+00   6.519842e-03   0.000000e+00 
  8.660000e+02   8.037789e-03   0.000000e+00   8.037789e-03   0.000000e+00 
  8.680000e+02   7.568803e-03   0.000000e+00   7.568803e-03   0.000000e+00 
  8.700000e+02   8.374358e-03   0.000000e+00   8.374358e-03   0.000000e+00 
  8.720000e+02   7.960407e-03   0.000000e+00   7.960407e-03   0.000000e+00 
  8.740000e+02   6.771660e-03   0.000000e+00   6.771660e-03   0.000000e+00 
  8.760000e+02   7.628362e-03   0.000000e+00   7.628362e-03   0.000000e+00 
  8.780000e+02   7.465933e-03   0.000000e+00   7.465933e-03   0.000000e+00 
  8.800000e+02   8.108650e-03   0.000000e+00   8.108650e-03   0.000000e+00 
  8.820000e+02   8.188631e-03   0.000000e+00   8.188631e-03   0.000000e+00 
  8.840000e+02   6.420709e-03   0.000000e+00   6.420709e-03   0.000000e+00 
  8.860000e+02   6.203667e-03   0.000000e+00   6.203667e-03   0.000000e+00 
  8.880000e+02   5.941007e-03   0.000000e+00   5.941007e-03   0.000000e+00 
  8.900000e+02   6.509790e-03   0.000000e+00   6.509790e-03   0.000000e+00 
  8.920000e+02   7.342894e-03   0.000000e+00   7.342894e-03   0.000000e+00 
  8.940000e+02   6.554881e-03   0.000000e+00   6.554881e-03   0.000000e+00 
  8.960000e+02   6.960351e-03   0.000000e+00   6.960351e-03   0.000000e+00 
  8.980000e+02   1.568549e-02   0.000000e+00   1.568549e-02   0.000000e+00 
  9.000000e+02   1.947742e-02   0.000000e+00   1.947742e-02   0.000000e+00 
  9.020000e+02   9.406061e-03   0.000000e+00   9.406061e-03   0.000000e+00 
  9.040000e+02   6.680964e-03   0.000000e+00   6.680964e-03   0.000000e+00 
  9.060000e+02   7.700174e-03   0.000000e+00   7.700174e-03   0.000000e+00 
  9.080000e+02   7.170699e-03   0.000000e+00   7.170699e-03   0.000000e+00 
  9.100000e+02   8.221546e-03   0.000000e+00   8.221546e-03   0.000000e+00 
  9.120000e+02   7.741045e-03   0.000000e+00   7.741045e-03   0.000000e+00 
  9.140000e+02   6.991010e-03   0.000000e+00   6.991010e-03   0.000000e+00 
  9.160000e+02   7.907228e-03   0.000000e+00   7.907228e-03   0.000000e+00 
  9.180000e+02   8.074611e-03   0.000000e+00   8.074611e-03   0.000000e+00 
  9.200000e+02   7.935169e-03   0.000000e+00   7.935169e-03   0.000000e+00 
  9.220000e+02   7.630506e-03   0.000000e+00   7.630506e-03   0.000000e+00 
  9.240000e+02   8.311330e-03   0.000000e+00   8.311330e-03   0.000000e+00 
  9.260000e+02   8.534721e-03   0.000000e+00   8.534721e-03   0.000000e+00 
  9.280000e+02   7.684781e-03   0.000000e+00   7.684781e-03   0.000000e+00 
  9.300000e+02   7.642245e-03   0.000000e+00   7.642245e-03   0.000000e+00 
  9.320000e+02   7.430088e-03   0.000000e+00   7.430088e-03   0.000000e+00 
  9.340000e+02   7.276578e-03   0.000000e+00   7.276578e-03   0.000000e+00 
  9.360000e+02   7.806459e-03   0.000000e+00   7.806459e-03   0.000000e+00 
  9.380000e+02   7.730167e-03   0.000000e+00   7.730167e-03   0.000000e+00 
  9.400000e+02   6.897924e-03   0.000000e+00   6.897924e-03   0.000000e+00 
  9.420000e+02   7.740394e-03   0.000000e+00   7.740394e-03   0.000000e+00 
  9.440000e+02   7.748660e-03   0.000000e+00   7.748660e-03   0.000000e+00 
  9.460000e+02   7.621166e-03   0.000000e+00   7.621166e-03   0.000000e+00 
  9.480000e+02   8.377017e-03   0.000000e+00   8.377017e-03   0.000000e+00 
  9.500000e+02   8.983177e-03   0.000000e+00   8.983177e-03   0.000000e+00 
  9.520000e+02   8.073771e-03   0.000000e+00   8.073771e-03   0.000000e+00 
  9.540000e+02   7.652774e-03   0.000000e+00   7.652774e-03   0.000000e+00 
  9.560000e+02   8.284038e-03   0.000000e+00   8.284038e-03   0.000000e+00 
  9.580000e+02   9.205523e-03   0.000000e+00   9.205523e-03   0.000000e+00 
  9.600000e+02   1.012223e-02   0.000000e+00   1.012223e-02   0.000000e+00 
  9.620000e+02   7.483533e-03   0.000000e+00   7.483533e-03   0.000000e+00 
  9.640000e+02   6.335088e-03   0.000000e+00   6.335088e-03   0.000000e+00 
  9.660000e+02   6.449406e-03   0.000000e+00   6.449406e-03   0.000000e+00 
  9.680000e+02   6.311737e-03   0.000000e+00   6.311737e-03   0.000000e+00 
  9.700000e+02   6.898220e-03   0.000000e+00   6.898220e-03   0.000000e+00 
  9.720000e+02   6.288115e-03   0.000000e+00   6.288115e-03   0.000000e+00 
  9.740000e+02   6.971971e-03   0.000000e+00   6.971971e-03   0.000000e+00 
  9.760000e+02   7.594394e-03   0.000000e+00   7.594394e-03   0.000000e+00 
  9.780000e+02   7.094509e-03   0.000000e+00   7.094509e-03   0.000000e+00 
  9.800000e+02   6.586663e-03   0.000000e+00   6.586663e-03   0.000000e+00 
  9.820000e+02   7.401391e-03   0.000000e+00   7.401391e-03   0.000000e+00 
  9.840000e+02   7.878771e-03   0.000000e+00   7.878771e-03   0.000000e+00 
  9.860000e+02   8.517827e-03   0.000000e+00   8.517827e-03   0.000000e+00 
  9.880000e+02   8.103104e-03   0.000000e+00   8.103104e-03   0.000000e+00 
  9.900000e+02   8.842081e-03   0.000000e+00   8.842081e-03   0.000000e+00 
  9.920000e+02   7.943479e-03   0.000000e+00   7.943479e-03   0.000000e+00 
  9.940000e+02   7.902280e-03   0.000000e+00   7.902280e-03   0.000000e+00 
  9.960000e+02   7.348654e-03   0.000000e+00   7.348654e-03   0.000000e+00 
  9.980000e+02   7.657542e-03   0.000000e+00   7.657542e-03   0.000000e+00 
  1.000000e+03   7.654668e-03   0.000000e+00   7.654668e-03   0.000000e+00 
  1.002000e+03   8.092549e-03   0.000000e+00   8.092549e-03   0.000000e+00 
  1.004000e+03   7.128988e-03   0.000000e+00   7.128988e-03   0.000000e+00 
  1.006000e+03   6.630019e-03   0.000000e+00   6.630019e-03   0.000000e+00 
  1.008000e+03   6.963198e-03   0.000000e+00   6.963198e-03   0.000000e+00 
  1.010000e+03   7.013122e-03   0.000000e+00   7.013122e-03   0.000000e+00 
  1.012000e+03   6.875551e-03   0.000000e+00   6.875551e-03   0.000000e+00 
  1.014000e+03   7.402550e-03   0.000000e+00   7.402550e-03   0.000000e+00 
  1.016000e+03   8.138302e-03   0.000000e+00   8.138302e-03   0.000000e+00 
  1.018000e+03   9.712663e-03   0.000000e+00   9.712663e-03   0.000000e+00 
  1.020000e+03   1.104532e-02   0.000000e+00   1.104532e-02   0.000000e+00 
  1.022000e+03   7.597570e-03   0.000000e+00   7.597570e-03   0.000000e+00 
  1.024000e+03   7.239898e-03   0.000000e+00   7.239898e-03   0.000000e+00 
  1.026000e+03   7.392659e-03   0.000000e+00   7.392659e-03   0.000000e+00 
  1.028000e+03   6.548275e-03   0.000000e+00   6.548275e-03   0.000000e+00 
  1.030000e+03   7.240203e-03   0.000000e+00   7.240203e-03   0.000000e+00 
  1.032000e+03   8.071385e-03   0.000000e+00   8.071385e-03   0.000000e+00 
  1.034000e+03   8.039238e-03   0.000000e+00   8.039238e-03   0.000000e+00 
  1.036000e+03   7.581324e-03   0.000000e+00   7.581324e-03   0.000000e+00 
  1.038000e+03   6.873927e-03   0.000000e+00   6.873927e-03   0.000000e+00 
  1.040000e+03   7.082313e-03   0.000000e+00   7.082313e-03   0.000000e+00 
  1.042000e+03   6.763606e-03   0.000000e+00   6.763606e-03   0.000000e+00 
  1.044000e+03   8.394166e-03   0.000000e+00   8.394166e-03   0.000000e+00 
  1.046000e+03   8.398053e-03   0.000000e+00   8.398053e-03   0.000000e+00 
  1.048000e+03   7.927852e-03   0.000000e+00   7.927852e-03   0.000000e+00 
  1.050000e+03   8.239855e-03   0.000000e+00   8.239855e-03   0.000000e+00 
  1.052000e+03   7.963187e-03   0.000000e+00   7.963187e-03   0.000000e+00 
  1.054000e+03   7.178352e-03   0.000000e+00   7.178352e-03   0.000000e+00 
  1.056000e+03   6.756278e-03   0.000000e+00   6.756278e-03   0.000000e+00 
  1.058000e+03   6.721919e-03   0.000000e+00   6.721919e-03   0.000000e+00 
  1.060000e+03   6.995270e-03   0.000000e+00   6.995270e-03   0.000000e+00 
  1.062000e+03   6.913576e-03   0.000000e+00   6.913576e-03   0.000000e+00 
  1.064000e+03   7.718362e-03   0.000000e+00   7.718362e-03   0.000000e+00 
  1.066000e+03   7.728461e-03   0.000000e+00   7.728461e-03   0.000000e+00 
  1.068000e+03   7.417710e-03   0.000000e+00   7.417710e-03   0.000000e+00 
  1.070000e+03   8.348092e-03   0.000000e+00   8.348092e-03   0.000000e+00 
  1.072000e+03   8.628351e-03   0.000000e+00   8.628351e-03   0.000000e+00 
  1.074000e+03   8.542020e-03   0.000000e+00   8.542020e-03   0.000000e+00 
  1.076000e+03   8.593651e-03   0.000000e+00   8.593651e-03   0.000000e+00 
  1.078000e+03   8.202687e-03   0.000000e+00   8.202687e-03   0.000000e+00 
  1.080000e+03   8.437352e-03   0.000000e+00   8.437352e-03   0.000000e+00 
  1.082000e+03   7.554107e-03   0.000000e+00   7.554107e-03   0.000000e+00 
  1.084000e+03   7.040940e-03   0.000000e+00   7.040940e-03   0.000000e+00 
  1.086000e+03   6.633839e-03   0.000000e+00   6.633839e-03   0.000000e+00 
  1.088000e+03   7.399828e-03   0.000000e+00   7.399828e-03   0.000000e+00 
  1.090000e+03   7.133195e-03   0.000000e+00   7.133195e-03   0.000000e+00 
  1.092000e+03   6.090168e-03   0.000000e+00   6.090168e-03   0.000000e+00 
  1.094000e+03   5.746973e-03   0.000000e+00   5.746973e-03   0.000000e+00 
  1.096000e+03   6.305701e-03   0.000000e+00   6.305701e-03   0.000000e+00 
  1.098000e+03   6.982185e-03   0.000000e+00   6.982185e-03   0.000000e+00 
  1.100000e+03   6.322515e-03   0.000000e+00   6.322515e-03   0.000000e+00 
  1.102000e+03   5.994423e-03   0.000000e+00   5.994423e-03   0.000000e+00 
  1.104000e+03   5.659676e-03   0.000000e+00   5.659676e-03   0.000000e+00 
  1.106000e+03   6.293604e-03   0.000000e+00   6.293604e-03   0.000000e+00 
  1.108000e+03   5.870955e-03   0.000000e+00   5.870955e-03   0.000000e+00 
  1.110000e+03   5.765092e-03   0.000000e+00   5.765092e-03   0.000000e+00 
  1.112000e+03   5.769748e-03   0.000000e+00   5.769748e-03   0.000000e+00 
  1.114000e+03   5.917615e-03   0.000000e+00   5.917615e-03   0.000000e+00 
  1.116000e+03   5.981883e-03   0.000000e+00   5.981883e-03   0.000000e+00 
  1.118000e+03   5.840303e-03   0.000000e+00   5.840303e-03   0.000000e+00 
  1.120000e+03   5.230754e-03   0.000000e+00   5.230754e-03   0.000000e+00 
  1.122000e+03   4.798842e-03   0.000000e+00   4.798842e-03   0.000000e+00 
  1.124000e+03   5.352535e-03   0.000000e+00   5.352535e-03   0.000000e+00 
  1.126000e+03   5.009055e-03   0.000000e+00   5.009055e-03   0.000000e+00 
  1.128000e+03   5.102382e-03   0.000000e+00   5.102382e-03   0.000000e+00 
  1.130000e+03   5.493495e-03   0.000000e+00   5.493495e-03   0.000000e+00 
  1.132000e+03   5.404861e-03   0.000000e+00   5.404861e-03   0.000000e+00 
  1.134000e+03   5.576932e-03   0.000000e+00   5.576932e-03   0.000000e+00 
  1.136000e+03   4.972962e-03   0.000000e+00   4.972962e-03   0.000000e+00 
  1.138000e+03   5.972026e-03   0.000000e+00   5.972026e-03   0.000000e+00 
  1.140000e+03   6.093045e-03   0.000000e+00   6.093045e-03   0.000000e+00 
  1.142000e+03   4.934674e-03   0.000000e+00   4.934674e-03   0.000000e+00 
  1.144000e+03   4.972527e-03   0.000000e+00   4.972527e-03   0.000000e+00 
  1.146000e+03   4.796631e-03   0.000000e+00   4.796631e-03   0.000000e+00 
  1.148000e+03   4.694798e-03   0.000000e+00   4.694798e-03   0.000000e+00 
  1.150000e+03   4.815653e-03   0.000000e+00   4.815653e-03   0.000000e+00 
  1.152000e+03   4.437770e-03   0.000000e+00   4.437770e-03   0.000000e+00 
  1.154000e+03   4.750272e-03   0.000000e+00   4.750272e-03   0.000000e+00 
  1.156000e+03   4.864682e-03   0.000000e+00   4.864682e-03   0.000000e+00 
  1.158000e+03   4.523852e-03   0.000000e+00   4.523852e-03   0.000000e+00 
  1.160000e+03   4.816401e-03   0.000000e+00   4.816401e-03   0.000000e+00 
  1.162000e+03   4.423653e-03   0.000000e+00   4.423653e-03   0.000000e+00 
  1.164000e+03   4.381715e-03   0.000000e+00   4.381715e-03   0.000000e+00 
  1.166000e+03   4.353693e-03   0.000000e+00   4.353693e-03   0.000000e+00 
  1.168000e+03   4.811722e-03   0.000000e+00   4.811722e-03   0.000000e+00 
  1.170000e+03   5.074235e-03   0.000000e+00   5.074235e-03   0.000000e+00 
  1.172000e+03   4.179895e-03   0.000000e+00   4.179895e-03   0.000000e+00 
  1.174000e+03   4.754941e-03   0.000000e+00   4.754941e-03   0.000000e+00 
  1.176000e+03   4.879668e-03   0.000000e+00   4.879668e-03   0.000000e+00 
  1.178000e+03   4.572888e-03   0.000000e+00   4.572888e-03   0.000000e+00 
  1.180000e+03   4.977748e-03   0.000000e+00   4.977748e-03   0.000000e+00 
  1.182000e+03   4.513846e-03   0.000000e+00   4.513846e-03   0.000000e+00 
  1.184000e+03   4.362660e-03   0.000000e+00   4.362660e-03   0.000000e+00 
  1.186000e+03   4.269910e-03   0.000000e+00   4.269910e-03   0.000000e+00 
  1.188000e+03   4.242198e-03   0.000000e+00   4.242198e-03   0.000000e+00 
  1.190000e+03   4.119774e-03   0.000000e+00   4.119774e-03   0.000000e+00 
  1.192000e+03   3.642821e-03   0.000000e+00   3.642821e-03   0.000000e+00 
  1.194000e+03   3.728798e-03   0.000000e+00   3.728798e-03   0.000000e+00 
  1.196000e+03   3.769976e-03   0.000000e+00   3.769976e-03   0.000000e+00 
  1.198000e+03   4.644055e-03   0.000000e+00   4.644055e-03   0.000000e+00 
  1.200000e+03   4.599661e-03   0.000000e+00   4.599661e-03   0.000000e+00 
  1.202000e+03   4.514310e-03   0.000000e+00   4.514310e-03   0.000000e+00 
  1.204000e+03   4.184378e-03   0.000000e+00   4.184378e-03   0.000000e+00 
  1.206000e+03   4.178551e-03   0.000000e+00   4.178551e-03   0.000000e+00 
  1.208000e+03   3.927795e-03   0.000000e+00   3.927795e-03   0.000000e+00 
  1.210000e+03   3.865167e-03   0.000000e+00   3.865167e-03   0.000000e+00 
  1.212000e+03   4.560139e-03   0.000000e+00   4.560139e-03   0.000000e+00 
  1.214000e+03   4.284631e-03   0.000000e+00   4.284631e-03   0.000000e+00 
  1.216000e+03   4.212716e-03   0.000000e+00   4.212716e-03   0.000000e+00 
  1.218000e+03   4.636097e-03   0.000000e+00   4.636097e-03   0.000000e+00 
  1.220000e+03   4.772746e-03   0.000000e+00   4.772746e-03   0.000000e+00 
  1.222000e+03   4.113251e-03   0.000000e+00   4.113251e-03   0.000000e+00 
  1.224000e+03   4.028449e-03   0.000000e+00   4.028449e-03   0.000000e+00 
  1.226000e+03   4.203098e-03   0.000000e+00   4.203098e-03   0.000000e+00 
  1.228000e+03   4.211436e-03   0.000000e+00   4.211436e-03   0.000000e+00 
  1.230000e+03   4.433835e-03   0.000000e+00   4.433835e-03   0.000000e+00 
  1.232000e+03   4.464863e-03   0.000000e+00   4.464863e-03   0.000000e+00 
  1.234000e+03   4.424796e-03   0.000000e+00   4.424796e-03   0.000000e+00 
  1.236000e+03   3.919050e-03   0.000000e+00   3.919050e-03   0.000000e+00 
  1.238000e+03   4.266158e-03   0.000000e+00   4.266158e-03   0.000000e+00 
  1.240000e+03   4.589143e-03   0.000000e+00   4.589143e-03   0.000000e+00 
  1.242000e+03   4.180643e-03   0.000000e+00   4.180643e-03   0.000000e+00 
  1.244000e+03   3.898676e-03   0.000000e+00   3.898676e-03   0.000000e+00 
  1.246000e+03   4.410235e-03   0.000000e+00   4.410235e-03   0.000000e+00 
  1.248000e+03   4.333575e-03   0.000000e+00   4.333575e-03   0.000000e+00 
  1.250000e+03   3.716541e-03   0.000000e+00   3.716541e-03   0.000000e+00 
  1.252000e+03   3.646469e-03   0.000000e+00   3.646469e-03   0.000000e+00 
  1.254000e+03   3.800275e-03   0.000000e+00   3.800275e-03   0.000000e+00 
  1.256000e+03   3.672853e-03   0.000000e+00   3.672853e-03   0.000000e+00 
  1.258000e+03   3.972549e-03   0.000000e+00   3.972549e-03   0.000000e+00 
  1.260000e+03   4.525007e-03   0.000000e+00   4.525007e-03   0.000000e+00 
  1.262000e+03   4.303471e-03   0.000000e+00   4.303471e-03   0.000000e+00 
  1.264000e+03   4.343200e-03   0.000000e+00   4.343200e-03   0.000000e+00 
  1.266000e+03   4.351799e-03   0.000000e+00   4.351799e-03   0.000000e+00 
  1.268000e+03   4.206075e-03   0.000000e+00   4.206075e-03   0.000000e+00 
  1.270000e+03   4.072057e-03   0.000000e+00   4.072057e-03   0.000000e+00 
  1.272000e+03   3.822756e-03   0.000000e+00   3.822756e-03   0.000000e+00 
  1.274000e+03   4.127478e-03   0.000000e+00   4.127478e-03   0.000000e+00 
  1.276000e+03   3.695160e-03   0.000000e+00   3.695160e-03   0.000000e+00 
  1.278000e+03   3.274672e-03   0.000000e+00   3.274672e-03   0.000000e+00 
  1.280000e+03   3.827153e-03   0.000000e+00   3.827153e-03   0.000000e+00 
  1.282000e+03   4.056680e-03   0.000000e+00   4.056680e-03   0.000000e+00 
  1.284000e+03   3.658774e-03   0.000000e+00   3.658774e-03   0.000000e+00 
  1.286000e+03   3.555670e-03   0.000000e+00   3.555670e-03   0.000000e+00 
  1.288000e+03   3.699009e-03   0.000000e+00   3.699009e-03   0.000000e+00 
  1.290000e+03   4.002341e-03   0.000000e+00   4.002341e-03   0.000000e+00 
  1.292000e+03   3.636688e-03   0.000000e+00   3.636688e-03   0.000000e+00 
  1.294000e+03   3.416259e-03   0.000000e+00   3.416259e-03   0.000000e+00 
  1.296000e+03   3.585857e-03   0.000000e+00   3.585857e-03   0.000000e+00 
  1.298000e+03   3.479499e-03   0.000000e+00   3.479499e-03   0.000000e+00 
  1.300000e+03   3.448643e-03   0.000000e+00   3.448643e-03   0.000000e+00 
  1.302000e+03   3.951283e-03   0.000000e+00   3.951283e-03   0.000000e+00 
  1.304000e+03   4.133165e-03   0.000000e+00   4.133165e-03   0.000000e+00 
  1.306000e+03   4.295814e-03   0.000000e+00   4.295814e-03   0.000000e+00 
  1.308000e+03   3.951972e-03   0.000000e+00   3.951972e-03   0.000000e+00 
  1.310000e+03   3.912900e-03   0.000000e+00   3.912900e-03   0.000000e+00 
  1.312000e+03   3.895078e-03   0.000000e+00   3.895078e-03   0.000000e+00 
  1.314000e+03   3.615874e-03   0.000000e+00   3.615874e-03   0.000000e+00 
  1.316000e+03   3.759378e-03   0.000000e+00   3.759378e-03   0.000000e+00 
  1.318000e+03   4.004565e-03   0.000000e+00   4.004565e-03   0.000000e+00 
  1.320000e+03   4.005602e-03   0.000000e+00   4.005602e-03   0.000000e+00 
  1.322000e+03   3.377296e-03   0.000000e+00   3.377296e-03   0.000000e+00 
  1.324000e+03   3.494510e-03   0.000000e+00   3.494510e-03   0.000000e+00 
  1.326000e+03   3.915440e-03   0.000000e+00   3.915440e-03   0.000000e+00 
  1.328000e+03   3.981032e-03   0.000000e+00   3.981032e-03   0.000000e+00 
  1.330000e+03   3.546824e-03   0.000000e+00   3.546824e-03   0.000000e+00 
  1.332000e+03   3.389784e-03   0.000000e+00   3.389784e-03   0.000000e+00 
  1.334000e+03   3.294909e-03   0.000000e+00   3.294909e-03   0.000000e+00 
  1.336000e+03   3.823936e-03   0.000000e+00   3.823936e-03   0.000000e+00 
  1.338000e+03   3.814066e-03   0.000000e+00   3.814066e-03   0.000000e+00 
  1.340000e+03   3.864372e-03   0.000000e+00   3.864372e-03   0.000000e+00 
  1.342000e+03   3.530268e-03   0.000000e+00   3.530268e-03   0.000000e+00 
  1.344000e+03   3.835118e-03   0.000000e+00   3.835118e-03   0.000000e+00 
  1.346000e+03   3.533651e-03   0.000000e+00   3.533651e-03   0.000000e+00 
  1.348000e+03   3.839526e-03   0.000000e+00   3.839526e-03   0.000000e+00 
  1.350000e+03   3.885696e-03   0.000000e+00   3.885696e-03   0.000000e+00 
  1.352000e+03   3.471214e-03   0.000000e+00   3.471214e-03   0.000000e+00 
  1.354000e+03   3.464147e-03   0.000000e+00   3.464147e-03   0.000000e+00 
  1.356000e+03   3.678712e-03   0.000000e+00   3.678712e-03   0.000000e+00 
  1.358000e+03   3.668631e-03   0.000000e+00   3.668631e-03   0.000000e+00 
  1.360000e+03   2.904367e-03   0.000000e+00   2.904367e-03   0.000000e+00 
  1.362000e+03   3.462847e-03   0.000000e+00   3.462847e-03   0.000000e+00 
  1.364000e+03   3.873668e-03   0.000000e+00   3.873668e-03   0.000000e+00 
  1.366000e+03   3.229268e-03   0.000000e+00   3.229268e-03   0.000000e+00 
  1.368000e+03   3.469226e-03   0.000000e+00   3.469226e-03   0.000000e+00 
  1.370000e+03   3.419140e-03   0.000000e+00   3.419140e-03   0.000000e+00 
  1.372000e+03   3.362753e-03   0.000000e+00   3.362753e-03   0.000000e+00 
  1.374000e+03   3.522981e-03   0.000000e+00   3.522981e-03   0.000000e+00 
  1.376000e+03   3.367723e-03   0.000000e+00   3.367723e-03   0.000000e+00 
  1.378000e+03   5.244336e-03   0.000000e+00   5.244336e-03   0.000000e+00 
  1.380000e+03   5.008641e-03   0.000000e+00   5.008641e-03   0.000000e+00 
  1.382000e+03   3.504050e-03   0.000000e+00   3.504050e-03   0.000000e+00 
  1.384000e+03   3.413411e-03   0.000000e+00   3.413411e-03   0.000000e+00 
  1.386000e+03   3.171145e-03   0.000000e+00   3.171145e-03   0.000000e+00 
  1.388000e+03   3.652286e-03   0.000000e+00   3.652286e-03   0.000000e+00 
  1.390000e+03   3.733064e-03   0.000000e+00   3.733064e-03   0.000000e+00 
  1.392000e+03   3.713321e-03   0.000000e+00   3.713321e-03   0.000000e+00 
  1.394000e+03   3.727892e-03   0.000000e+00   3.727892e-03   0.000000e+00 
  1.396000e+03   3.709255e-03   0.000000e+00   3.709255e-03   0.000000e+00 
  1.398000e+03   3.340779e-03   0.000000e+00   3.340779e-03   0.000000e+00 
  1.400000e+03   3.221458e-03   0.000000e+00   3.221458e-03   0.000000e+00 
  1.402000e+03   3.557219e-03   0.000000e+00   3.557219e-03   0.000000e+00 
  1.404000e+03   3.272521e-03   0.000000e+00   3.272521e-03   0.000000e+00 
  1.406000e+03   3.093261e-03   0.000000e+00   3.093261e-03   0.000000e+00 
  1.408000e+03   3.306702e-03   0.000000e+00   3.306702e-03   0.000000e+00 
  1.410000e+03   3.260392e-03   0.000000e+00   3.260392e-03   0.000000e+00 
  1.412000e+03   3.254339e-03   0.000000e+00   3.254339e-03   0.000000e+00 
  1.414000e+03   3.689934e-03   0.000000e+00   3.689934e-03   0.000000e+00 
  1.416000e+03   3.760285e-03   0.000000e+00   3.760285e-03   0.000000e+00 
  1.418000e+03   3.560354e-03   0.000000e+00   3.560354e-03   0.000000e+00 
  1.420000e+03   3.466768e-03   0.000000e+00   3.466768e-03   0.000000e+00 
  1.422000e+03   3.727179e-03   0.000000e+00   3.727179e-03   0.000000e+00 
  1.424000e+03   3.559415e-03   0.000000e+00   3.559415e-03   0.000000e+00 
  1.426000e+03   3.610677e-03   0.000000e+00   3.610677e-03   0.000000e+00 
  1.428000e+03   3.241081e-03   0.000000e+00   3.241081e-03   0.000000e+00 
  1.430000e+03   3.412872e-03   0.000000e+00   3.412872e-03   0.000000e+00 
  1.432000e+03   3.521283e-03   0.000000e+00   3.521283e-03   0.000000e+00 
  1.434000e+03   3.395441e-03   0.000000e+00   3.395441e-03   0.000000e+00 
  1.436000e+03   3.598556e-03   0.000000e+00   3.598556e-03   0.000000e+00 
  1.438000e+03   3.978200e-03   0.000000e+00   3.978200e-03   0.000000e+00 
  1.440000e+03   3.636460e-03   0.000000e+00   3.636460e-03   0.000000e+00 
  1.442000e+03   2.976812e-03   0.000000e+00   2.976812e-03   0.000000e+00 
  1.444000e+03   2.928141e-03   0.000000e+00   2.928141e-03   0.000000e+00 
  1.446000e+03   3.263115e-03   0.000000e+00   3.263115e-03   0.000000e+00 
  1.448000e+03   3.619933e-03   0.000000e+00   3.619933e-03   0.000000e+00 
  1.450000e+03   3.564429e-03   0.000000e+00   3.564429e-03   0.000000e+00 
  1.452000e+03   3.682035e-03   0.000000e+00   3.682035e-03   0.000000e+00 
  1.454000e+03   3.325578e-03   0.000000e+00   3.325578e-03   0.000000e+00 
  1.456000e+03   2.785275e-03   0.000000e+00   2.785275e-03   0.000000e+00 
  1.458000e+03   3.514508e-03   0.000000e+00   3.514508e-03   0.000000e+00 
  1.460000e+03   3.254848e-03   0.000000e+00   3.254848e-03   0.000000e+00 
  1.462000e+03   3.118807e-03   0.000000e+00   3.118807e-03   0.000000e+00 
  1.464000e+03   3.951135e-03   0.000000e+00   3.951135e-03   0.000000e+00 
  1.466000e+03   3.738650e-03   0.000000e+00   3.738650e-03   0.000000e+00 
  1.468000e+03   3.564717e-03   0.000000e+00   3.564717e-03   0.000000e+00 
  1.470000e+03   3.487182e-03   0.000000e+00   3.487182e-03   0.000000e+00 
  1.472000e+03   3.527040e-03   0.000000e+00   3.527040e-03   0.000000e+00 
  1.474000e+03   3.424361e-03   0.000000e+00   3.424361e-03   0.000000e+00 
  1.476000e+03   3.558896e-03   0.000000e+00   3.558896e-03   0.000000e+00 
  1.478000e+03   3.314249e-03   0.000000e+00   3.314249e-03   0.000000e+00 
  1.480000e+03   2.917167e-03   0.000000e+00   2.917167e-03   0.000000e+00 
  1.482000e+03   3.324193e-03   0.000000e+00   3.324193e-03   0.000000e+00 
  1.484000e+03   3.039108e-03   0.000000e+00   3.039108e-03   0.000000e+00 
  1.486000e+03   2.707309e-03   0.000000e+00   2.707309e-03   0.000000e+00 
  1.488000e+03   2.728994e-03   0.000000e+00   2.728994e-03   0.000000e+00 
  1.490000e+03   3.252837e-03   0.000000e+00   3.252837e-03   0.000000e+00 
  1.492000e+03   3.806064e-03   0.000000e+00   3.806064e-03   0.000000e+00 
  1.494000e+03   3.636772e-03   0.000000e+00   3.636772e-03   0.000000e+00 
  1.496000e+03   3.728382e-03   0.000000e+00   3.728382e-03   0.000000e+00 
  1.498000e+03   7.341718e-03   0.000000e+00   7.341718e-03   0.000000e+00 
  1.500000e+03   7.561478e-03   0.000000e+00   7.561478e-03   0.000000e+00 
  1.502000e+03   3.753197e-03   0.000000e+00   3.753197e-03   0.000000e+00 
  1.504000e+03   3.385745e-03   0.000000e+00   3.385745e-03   0.000000e+00 
  1.506000e+03   3.299951e-03   0.000000e+00   3.299951e-03   0.000000e+00 
  1.508000e+03   3.137544e-03   0.000000e+00   3.137544e-03   0.000000e+00 
  1.510000e+03   2.805816e-03   0.000000e+00   2.805816e-03   0.000000e+00 
  1.512000e+03   3.238421e-03   0.000000e+00   3.238421e-03   0.000000e+00 
  1.514000e+03   3.258059e-03   0.000000e+00   3.258059e-03   0.000000e+00 
  1.516000e+03   3.689174e-03   0.000000e+00   3.689174e-03   0.000000e+00 
  1.518000e+03   4.618995e-03   0.000000e+00   4.618995e-03   0.000000e+00 
  1.520000e+03   3.849133e-03   0.000000e+00   3.849133e-03   0.000000e+00 
  1.522000e+03   3.274918e-03   0.000000e+00   3.274918e-03   0.000000e+00 
  1.524000e+03   3.105422e-03   0.000000e+00   3.105422e-03   0.000000e+00 
  1.526000e+03   3.117742e-03   0.000000e+00   3.117742e-03   0.000000e+00 
  1.528000e+03   3.068163e-03   0.000000e+00   3.068163e-03   0.000000e+00 
  1.530000e+03   3.118301e-03   0.000000e+00   3.118301e-03   0.000000e+00 
  1.532000e+03   3.239835e-03   0.000000e+00   3.239835e-03   0.000000e+00 
  1.534000e+03   3.357602e-03   0.000000e+00   3.357602e-03   0.000000e+00 
  1.536000e+03   3.378277e-03   0.000000e+00   3.378277e-03   0.000000e+00 
  1.538000e+03   3.462847e-03   0.000000e+00   3.462847e-03   0.000000e+00 
  1.540000e+03   3.072458e-03   0.000000e+00   3.072458e-03   0.000000e+00 
  1.542000e+03   2.988196e-03   0.000000e+00   2.988196e-03   0.000000e+00 
  1.544000e+03   2.922814e-03   0.000000e+00   2.922814e-03   0.000000e+00 
  1.546000e+03   2.831194e-03   0.000000e+00   2.831194e-03   0.000000e+00 
  1.548000e+03   2.945446e-03   0.000000e+00   2.945446e-03   0.000000e+00 
  1.550000e+03   2.786104e-03   0.000000e+00   2.786104e-03   0.000000e+00 
  1.552000e+03   2.806896e-03   0.000000e+00   2.806896e-03   0.000000e+00 
  1.554000e+03   2.996807e-03   0.000000e+00   2.996807e-03   0.000000e+00 
  1.556000e+03   3.078823e-03   0.000000e+00   3.078823e-03   0.000000e+00 
  1.558000e+03   3.351986e-03   0.000000e+00   3.351986e-03   0.000000e+00 
  1.560000e+03   3.485638e-03   0.000000e+00   3.485638e-03   0.000000e+00 
  1.562000e+03   2.894959e-03   0.000000e+00   2.894959e-03   0.000000e+00 
  1.564000e+03   2.427755e-03   0.000000e+00   2.427755e-03   0.000000e+00 
  1.566000e+03   2.999488e-03   0.000000e+00   2.999488e-03   0.000000e+00 
  1.568000e+03   3.017708e-03   0.000000e+00   3.017708e-03   0.000000e+00 
  1.570000e+03   3.230388e-03   0.000000e+00   3.230388e-03   0.000000e+00 
  1.572000e+03   3.438333e-03   0.000000e+00   3.438333e-03   0.000000e+00 
  1.574000e+03   3.280258e-03   0.000000e+00   3.280258e-03   0.000000e+00 
  1.576000e+03   3.031255e-03   0.000000e+00   3.031255e-03   0.000000e+00 
  1.578000e+03   2.902097e-03   0.000000e+00   2.902097e-03   0.000000e+00 
  1.580000e+03   3.124705e-03   0.000000e+00   3.124705e-03   0.000000e+00 
  1.582000e+03   3.390195e-03   0.000000e+00   3.390195e-03   0.000000e+00 
  1.584000e+03   3.180266e-03   0.000000e+00   3.180266e-03   0.000000e+00 
  1.586000e+03   2.790741e-03   0.000000e+00   2.790741e-03   0.000000e+00 
  1.588000e+03   2.748884e-03   0.000000e+00   2.748884e-03   0.000000e+00 
  1.590000e+03   2.713379e-03   0.000000e+00   2.713379e-03   0.000000e+00 
  1.592000e+03   2.792965e-03   0.000000e+00   2.792965e-03   0.000000e+00 
  1.594000e+03   2.824392e-03   0.000000e+00   2.824392e-03   0.000000e+00 
  1.596000e+03   3.008407e-03   0.000000e+00   3.008407e-03   0.000000e+00 
  1.598000e+03   2.966859e-03   0.000000e+00   2.966859e-03   0.000000e+00 
  1.600000e+03   2.628675e-03   0.000000e+00   2.628675e-03   0.000000e+00 
