  1.000000e+01   2.317196e+00  -2.388400e-01   7.345150e+00  -5.884859e+00 
  1.023413e+01   2.315394e+00  -2.445706e-01   7.340687e+00  -6.029682e+00 
  1.047374e+01   2.314059e+00  -2.500007e-01   7.337884e+00  -6.166066e+00 
  1.071896e+01   2.312954e+00  -2.560565e-01   7.336244e+00  -6.317227e+00 
  1.096992e+01   2.311145e+00  -2.615478e-01   7.331812e+00  -6.456581e+00 
  1.122676e+01   2.309230e+00  -2.674268e-01   7.327201e+00  -6.605872e+00 
  1.148961e+01   2.307922e+00  -2.736888e-01   7.325070e+00  -6.762933e+00 
  1.175861e+01   2.307186e+00  -2.799664e-01   7.325133e+00  -6.918752e+00 
  1.203392e+01   2.305490e+00  -2.865970e-01   7.321865e+00  -7.086123e+00 
  1.231567e+01   2.302216e+00  -2.926003e-01   7.312514e+00  -7.243177e+00 
  1.260401e+01   2.294293e+00  -2.979875e-01   7.285628e+00  -7.400268e+00 
  1.289911e+01   2.293817e+00  -3.051035e-01   7.287337e+00  -7.576514e+00 
  1.320111e+01   2.293034e+00  -3.121779e-01   7.287967e+00  -7.752692e+00 
  1.351019e+01   2.291367e+00  -3.193601e-01   7.285446e+00  -7.934507e+00 
  1.382650e+01   2.289495e+00  -3.264539e-01   7.282205e+00  -8.114975e+00 
  1.415022e+01   2.287834e+00  -3.339914e-01   7.280076e+00  -8.305699e+00 
  1.448152e+01   2.285682e+00  -3.410333e-01   7.275939e+00  -8.486165e+00 
  1.482057e+01   2.283589e+00  -3.489887e-01   7.272624e+00  -8.688978e+00 
  1.516756e+01   2.281003e+00  -3.569051e-01   7.267561e+00  -8.892880e+00 
  1.552268e+01   2.278794e+00  -3.645638e-01   7.263855e+00  -9.089217e+00 
  1.588611e+01   2.276336e+00  -3.728676e-01   7.259718e+00  -9.302531e+00 
  1.625805e+01   2.273774e+00  -3.809162e-01   7.255152e+00  -9.510219e+00 
  1.663870e+01   2.270634e+00  -3.894953e-01   7.248888e+00  -9.733553e+00 
  1.702826e+01   2.268257e+00  -3.982822e-01   7.245723e+00  -9.959016e+00 
  1.742694e+01   2.265125e+00  -4.073210e-01   7.240055e+00  -1.019414e+01 
  1.783495e+01   2.261760e+00  -4.165138e-01   7.233768e+00  -1.043439e+01 
  1.825252e+01   2.259469e+00  -4.250364e-01   7.231153e+00  -1.065360e+01 
  1.867986e+01   2.255334e+00  -4.353384e-01   7.223090e+00  -1.092522e+01 
  1.911721e+01   2.252035e+00  -4.450215e-01   7.217864e+00  -1.117812e+01 
  1.956480e+01   2.248848e+00  -4.538022e-01   7.212542e+00  -1.140869e+01 
  2.002287e+01   2.244417e+00  -4.636145e-01   7.203535e+00  -1.167106e+01 
  2.049166e+01   2.240285e+00  -4.737186e-01   7.196038e+00  -1.193957e+01 
  2.097143e+01   2.235440e+00  -4.837647e-01   7.186031e+00  -1.221091e+01 
  2.146243e+01   2.231179e+00  -4.950836e-01   7.179423e+00  -1.251085e+01 
  2.196493e+01   2.226948e+00  -5.046577e-01   7.171693e+00  -1.276837e+01 
  2.247919e+01   2.221766e+00  -5.149693e-01   7.161232e+00  -1.304980e+01 
  2.300550e+01   2.214487e+00  -5.260403e-01   7.143859e+00  -1.336266e+01 
  2.354412e+01   2.208045e+00  -5.371859e-01   7.129890e+00  -1.367360e+01 
  2.409535e+01   2.202501e+00  -5.480049e-01   7.119187e+00  -1.397207e+01 
  2.465950e+01   2.195896e+00  -5.598782e-01   7.105761e+00  -1.430371e+01 
  2.523685e+01   2.190223e+00  -5.711938e-01   7.095532e+00  -1.461674e+01 
  2.582771e+01   2.183270e+00  -5.829030e-01   7.081187e+00  -1.494851e+01 
  2.643242e+01   2.176391e+00  -5.949992e-01   7.067778e+00  -1.529035e+01 
  2.705127e+01   2.168578e+00  -6.065776e-01   7.050653e+00  -1.562695e+01 
  2.768462e+01   2.162378e+00  -6.182386e-01   7.039871e+00  -1.595559e+01 
  2.833280e+01   2.154904e+00  -6.312298e-01   7.026083e+00  -1.632674e+01 
  2.899615e+01   2.147008e+00  -6.435149e-01   7.010286e+00  -1.668485e+01 
  2.967503e+01   2.137106e+00  -6.557648e-01   6.987310e+00  -1.705848e+01 
  3.036981e+01   2.129516e+00  -6.685538e-01   6.973866e+00  -1.742949e+01 
  3.108086e+01   2.121634e+00  -6.829638e-01   6.961617e+00  -1.784360e+01 
  3.180855e+01   2.112226e+00  -6.955870e-01   6.941961e+00  -1.822747e+01 
  3.255328e+01   2.103079e+00  -7.095537e-01   6.925304e+00  -1.864378e+01 
  3.331544e+01   2.092936e+00  -7.228878e-01   6.904572e+00  -1.905461e+01 
  3.409546e+01   2.083760e+00  -7.364612e-01   6.888140e+00  -1.946488e+01 
  3.489373e+01   2.072406e+00  -7.499403e-01   6.863928e+00  -1.989364e+01 
  3.571069e+01   2.060766e+00  -7.636402e-01   6.839382e+00  -2.033276e+01 
  3.654678e+01   2.050435e+00  -7.779430e-01   6.820979e+00  -2.077694e+01 
  3.740245e+01   2.037718e+00  -7.920617e-01   6.793965e+00  -2.124112e+01 
  3.827814e+01   2.025640e+00  -8.055680e-01   6.768906e+00  -2.168701e+01 
  3.917435e+01   2.014118e+00  -8.200201e-01   6.747789e+00  -2.215301e+01 
  4.009153e+01   2.000531e+00  -8.335254e-01   6.718102e+00  -2.261915e+01 
  4.103019e+01   1.986464e+00  -8.479770e-01   6.688614e+00  -2.311655e+01 
  4.199082e+01   1.972193e+00  -8.619269e-01   6.658121e+00  -2.360724e+01 
  4.297395e+01   1.958623e+00  -8.764825e-01   6.631754e+00  -2.410848e+01 
  4.398009e+01   1.944168e+00  -8.908018e-01   6.602313e+00  -2.461686e+01 
  4.500979e+01   1.928618e+00  -9.050664e-01   6.569327e+00  -2.513984e+01 
  4.606360e+01   1.912119e+00  -9.190166e-01   6.532888e+00  -2.567021e+01 
  4.714208e+01   1.897109e+00  -9.330492e-01   6.502691e+00  -2.618920e+01 
  4.824582e+01   1.879900e+00  -9.465322e-01   6.463987e+00  -2.672531e+01 
  4.937539e+01   1.861617e+00  -9.610006e-01   6.423794e+00  -2.730361e+01 
  5.053141e+01   1.845016e+00  -9.748629e-01   6.389325e+00  -2.785091e+01 
  5.171449e+01   1.826199e+00  -9.894633e-01   6.348844e+00  -2.844952e+01 
  5.292528e+01   1.808140e+00  -1.002183e+00   6.308081e+00  -2.899792e+01 
  5.416441e+01   1.788826e+00  -1.015401e+00   6.264365e+00  -2.958078e+01 
  5.543256e+01   1.768060e+00  -1.028489e+00   6.215734e+00  -3.018676e+01 
  5.673039e+01   1.745768e+00  -1.040379e+00   6.159598e+00  -3.079255e+01 
  5.805861e+01   1.727825e+00  -1.057606e+00   6.131979e+00  -3.147092e+01 
  5.941793e+01   1.702146e+00  -1.068043e+00   6.061680e+00  -3.210697e+01 
  6.080908e+01   1.679346e+00  -1.081648e+00   6.009908e+00  -3.278514e+01 
  6.223279e+01   1.662474e+00  -1.092620e+00   5.974361e+00  -3.331391e+01 
  6.368984e+01   1.635726e+00  -1.099495e+00   5.893338e+00  -3.390802e+01 
  6.518101e+01   1.614508e+00  -1.113140e+00   5.849772e+00  -3.458472e+01 
  6.670708e+01   1.591602e+00  -1.124658e+00   5.795612e+00  -3.524580e+01 
  6.826888e+01   1.568912e+00  -1.136241e+00   5.743239e+00  -3.591290e+01 
  6.986726e+01   1.540497e+00  -1.143136e+00   5.658349e+00  -3.657751e+01 
  7.150304e+01   1.515915e+00  -1.151902e+00   5.592932e+00  -3.723019e+01 
  7.317714e+01   1.490579e+00  -1.162546e+00   5.530740e+00  -3.795171e+01 
  7.489043e+01   1.464488e+00  -1.171218e+00   5.461079e+00  -3.865092e+01 
  7.664383e+01   1.437653e+00  -1.178665e+00   5.385859e+00  -3.934674e+01 
  7.843828e+01   1.411284e+00  -1.185764e+00   5.311926e+00  -4.003705e+01 
  8.027474e+01   1.383784e+00  -1.192595e+00   5.233745e+00  -4.075596e+01 
  8.215421e+01   1.356784e+00  -1.197906e+00   5.153230e+00  -4.144132e+01 
  8.407767e+01   1.329236e+00  -1.205530e+00   5.078788e+00  -4.220596e+01 
  8.604617e+01   1.300670e+00  -1.209992e+00   4.991127e+00  -4.293155e+01 
  8.806076e+01   1.272843e+00  -1.214139e+00   4.905571e+00  -4.364782e+01 
  9.012252e+01   1.243591e+00  -1.218103e+00   4.814848e+00  -4.440679e+01 
  9.223254e+01   1.215758e+00  -1.221173e+00   4.726584e+00  -4.512730e+01 
  9.439198e+01   1.186458e+00  -1.223240e+00   4.629967e+00  -4.587450e+01 
  9.660197e+01   1.156834e+00  -1.225091e+00   4.531823e+00  -4.664143e+01 
  9.886369e+01   1.129398e+00  -1.226898e+00   4.441724e+00  -4.736946e+01 
  1.011784e+02   1.099397e+00  -1.226510e+00   4.334496e+00  -4.812815e+01 
  1.035473e+02   1.070286e+00  -1.226809e+00   4.233395e+00  -4.889808e+01 
  1.059716e+02   1.041759e+00  -1.226037e+00   4.130364e+00  -4.964556e+01 
  1.084527e+02   1.012566e+00  -1.223200e+00   4.016604e+00  -5.038203e+01 
  1.109919e+02   9.840852e-01  -1.222417e+00   3.914162e+00  -5.116480e+01 
  1.135905e+02   9.548420e-01  -1.219645e+00   3.800770e+00  -5.194314e+01 
  1.162500e+02   9.259685e-01  -1.215870e+00   3.684278e+00  -5.270824e+01 
  1.189717e+02   8.972981e-01  -1.209952e+00   3.558589e+00  -5.343943e+01 
  1.217572e+02   8.693782e-01  -1.204996e+00   3.439666e+00  -5.419038e+01 
  1.246079e+02   8.421750e-01  -1.199401e+00   3.319980e+00  -5.492488e+01 
  1.275253e+02   8.117372e-01  -1.194200e+00   3.191124e+00  -5.579475e+01 
  1.305111e+02   7.867607e-01  -1.187560e+00   3.073444e+00  -5.647545e+01 
  1.335667e+02   7.583963e-01  -1.178937e+00   2.933755e+00  -5.724731e+01 
  1.366939e+02   7.319618e-01  -1.171336e+00   2.805320e+00  -5.799894e+01 
  1.398943e+02   7.055892e-01  -1.164236e+00   2.679460e+00  -5.878189e+01 
  1.431696e+02   6.783530e-01  -1.154022e+00   2.533212e+00  -5.955230e+01 
  1.465216e+02   6.536080e-01  -1.144596e+00   2.398756e+00  -6.027198e+01 
  1.499521e+02   6.277468e-01  -1.135688e+00   2.263040e+00  -6.106855e+01 
  1.534629e+02   6.019534e-01  -1.124732e+00   2.114864e+00  -6.184444e+01 
  1.570559e+02   5.802590e-01  -1.113612e+00   1.977856e+00  -6.247776e+01 
  1.607331e+02   5.526779e-01  -1.102159e+00   1.819029e+00  -6.336851e+01 
  1.644963e+02   5.296689e-01  -1.089345e+00   1.664958e+00  -6.406973e+01 
  1.683476e+02   5.067665e-01  -1.077668e+00   1.517318e+00  -6.481505e+01 
  1.722891e+02   4.843707e-01  -1.062885e+00   1.349224e+00  -6.550062e+01 
  1.763229e+02   4.621816e-01  -1.055611e+00   1.231741e+00  -6.635459e+01 
  1.804511e+02   4.379098e-01  -1.042604e+00   1.067984e+00  -6.721684e+01 
  1.846760e+02   4.213245e-01  -1.028632e+00   9.187755e-01  -6.772615e+01 
  1.889998e+02   3.985639e-01  -1.009631e+00   7.122207e-01  -6.845778e+01 
  1.934249e+02   3.810171e-01  -9.968289e-01   5.646345e-01  -6.908168e+01 
  1.979535e+02   3.585041e-01  -9.826111e-01   3.903704e-01  -6.995558e+01 
  2.025881e+02   3.413359e-01  -9.680781e-01   2.271094e-01  -7.057779e+01 
  2.073313e+02   3.214252e-01  -9.513092e-01   3.591233e-02  -7.133109e+01 
  2.121855e+02   3.025377e-01  -9.373075e-01  -1.319496e-01  -7.211131e+01 
  2.171534e+02   2.864455e-01  -9.220141e-01  -3.050901e-01  -7.274136e+01 
  2.222376e+02   2.693126e-01  -9.094157e-01  -4.596683e-01  -7.350397e+01 
  2.274408e+02   2.539830e-01  -8.936623e-01  -6.391895e-01  -7.413460e+01 
  2.327659e+02   2.362287e-01  -8.777480e-01  -8.289088e-01  -7.493687e+01 
  2.382156e+02   2.230113e-01  -8.594793e-01  -1.032321e+00  -7.545409e+01 
  2.437929e+02   2.067574e-01  -8.457396e-01  -1.203170e+00  -7.626237e+01 
  2.495008e+02   1.925440e-01  -8.312563e-01  -1.378327e+00  -7.695856e+01 
  2.553423e+02   1.819337e-01  -8.141074e-01  -1.574714e+00  -7.740274e+01 
  2.613206e+02   1.671023e-01  -7.966031e-01  -1.788143e+00  -7.815292e+01 
  2.674389e+02   1.559441e-01  -7.854743e-01  -1.929466e+00  -7.877080e+01 
  2.737004e+02   1.441257e-01  -7.733695e-01  -2.083987e+00  -7.944341e+01 
  2.801085e+02   1.394286e-01  -7.541794e-01  -2.304552e+00  -7.952573e+01 
  2.866667e+02   1.112645e-01  -7.315789e-01  -2.615465e+00  -8.135226e+01 
  2.933784e+02   1.129274e-01  -7.225106e-01  -2.718296e+00  -8.111662e+01 
  3.002472e+02   9.624209e-02  -7.091803e-01  -2.905611e+00  -8.227166e+01 
  3.072768e+02   8.844924e-02  -6.956410e-01  -3.082647e+00  -8.275385e+01 
  3.144711e+02   7.584048e-02  -6.777647e-01  -3.324379e+00  -8.361527e+01 
  3.218337e+02   6.902332e-02  -6.656783e-01  -3.488269e+00  -8.408022e+01 
  3.293688e+02   6.096667e-02  -6.485644e-01  -3.722731e+00  -8.462983e+01 
  3.370803e+02   4.986187e-02  -6.361755e-01  -3.901864e+00  -8.551846e+01 
  3.449723e+02   4.176815e-02  -6.207431e-01  -4.122144e+00  -8.615052e+01 
  3.530491e+02   3.631538e-02  -6.046873e-01  -4.353747e+00  -8.656314e+01 
  3.613150e+02   2.865443e-02  -5.941065e-01  -4.512623e+00  -8.723869e+01 
  3.697744e+02   1.991212e-02  -5.759772e-01  -4.786706e+00  -8.802000e+01 
  3.784319e+02   1.508799e-02  -5.624530e-01  -4.995152e+00  -8.846338e+01 
  3.872921e+02   9.639315e-03  -5.479100e-01  -5.224471e+00  -8.899210e+01 
  3.963597e+02   1.386685e-03  -5.347527e-01  -5.436911e+00  -8.985142e+01 
  4.056396e+02  -9.968872e-04  -5.250214e-01  -5.596444e+00  -9.010879e+01 
  4.151368e+02  -7.719112e-03  -5.140216e-01  -5.779394e+00  -9.086035e+01 
  4.248563e+02  -9.735255e-03  -4.953591e-01  -6.099920e+00  -9.112588e+01 
  4.348034e+02  -1.782412e-02  -4.850969e-01  -6.277570e+00  -9.210429e+01 
  4.449834e+02  -2.190609e-02  -4.721262e-01  -6.509498e+00  -9.265655e+01 
  4.554018e+02  -2.701701e-02  -4.585541e-01  -6.757140e+00  -9.337184e+01 
  4.660640e+02  -2.746526e-02  -4.477099e-01  -6.963754e+00  -9.351047e+01 
  4.769760e+02  -3.168054e-02  -4.318790e-01  -7.269452e+00  -9.419542e+01 
  4.881433e+02  -3.643905e-02  -4.221890e-01  -7.457629e+00  -9.493296e+01 
  4.995722e+02  -4.121737e-02  -4.131772e-01  -7.634268e+00  -9.569682e+01 
  5.112686e+02  -4.056018e-02  -3.932697e-01  -8.060237e+00  -9.588842e+01 
  5.232388e+02  -3.520389e-02  -3.755104e-01  -8.469558e+00  -9.535579e+01 
  5.354894e+02  -6.391659e-02  -3.840712e-01  -8.193122e+00  -9.944849e+01 
  5.480267e+02  -5.571030e-02  -3.525352e-01  -8.948826e+00  -9.898005e+01 
  5.608576e+02  -5.528048e-02  -3.533309e-01  -8.931342e+00  -9.889213e+01 
  5.739889e+02  -5.529573e-02  -3.463770e-01  -9.099727e+00  -9.907018e+01 
  5.874276e+02  -6.128230e-02  -3.366702e-01  -9.314345e+00  -1.003163e+02 
  6.011810e+02  -5.131207e-02  -3.246725e-01  -9.663946e+00  -9.898088e+01 
  6.152563e+02  -5.599716e-02  -3.152316e-01  -9.892479e+00  -1.000728e+02 
  6.296613e+02  -5.964290e-02  -3.076871e-01  -1.007762e+01  -1.009703e+02 
  6.444035e+02  -5.830538e-02  -2.931456e-01  -1.048984e+01  -1.012491e+02 
  6.594908e+02  -6.084829e-02  -2.867666e-01  -1.065817e+01  -1.019798e+02 
  6.749314e+02  -5.886706e-02  -2.796506e-01  -1.087939e+01  -1.018873e+02 
  6.907335e+02  -5.904236e-02  -2.700870e-01  -1.116719e+01  -1.023312e+02 
  7.069055e+02  -6.183609e-02  -2.616392e-01  -1.140989e+01  -1.032973e+02 
  7.234562e+02  -6.079622e-02  -2.529866e-01  -1.169422e+01  -1.035127e+02 
  7.403944e+02  -6.010386e-02  -2.445655e-01  -1.197741e+01  -1.038072e+02 
  7.577292e+02  -6.104117e-02  -2.352551e-01  -1.228626e+01  -1.045457e+02 
  7.754698e+02  -5.870556e-02  -2.284221e-01  -1.254746e+01  -1.044133e+02 
  7.936258e+02  -5.910698e-02  -2.194597e-01  -1.286878e+01  -1.050738e+02 
  8.122068e+02  -6.008320e-02  -2.170441e-01  -1.294837e+01  -1.054734e+02 
  8.312230e+02  -5.978896e-02  -2.097439e-01  -1.322692e+01  -1.059106e+02 
  8.506843e+02  -5.722676e-02  -1.958171e-01  -1.380706e+01  -1.062908e+02 
  8.706013e+02  -5.736213e-02  -1.919177e-01  -1.396609e+01  -1.066408e+02 
  8.909845e+02  -5.582715e-02  -1.861633e-01  -1.422813e+01  -1.066931e+02 
  9.118450e+02  -5.639432e-02  -1.804750e-01  -1.446705e+01  -1.073528e+02 
  9.331939e+02  -5.459872e-02  -1.740578e-01  -1.477854e+01  -1.074157e+02 
  9.550427e+02  -5.302328e-02  -1.669395e-01  -1.513141e+01  -1.076209e+02 
  9.774030e+02  -5.271849e-02  -1.615070e-01  -1.539647e+01  -1.080775e+02 
  1.000287e+03  -5.083058e-02  -1.551693e-01  -1.574119e+01  -1.081378e+02 
  1.023706e+03  -5.028822e-02  -1.510322e-01  -1.596200e+01  -1.084159e+02 
  1.047674e+03  -4.904538e-02  -1.449617e-01  -1.630425e+01  -1.086924e+02 
  1.072203e+03  -4.689790e-02  -1.405271e-01  -1.658619e+01  -1.084553e+02 
  1.097307e+03  -4.776191e-02  -1.358372e-01  -1.683339e+01  -1.093723e+02 
  1.122998e+03  -4.575771e-02  -1.311177e-01  -1.714766e+01  -1.092381e+02 
  1.149290e+03  -4.306652e-02  -1.260510e-01  -1.750958e+01  -1.088632e+02 
  1.176199e+03  -4.328781e-02  -1.217784e-01  -1.777184e+01  -1.095685e+02 
  1.203737e+03  -4.183992e-02  -1.180913e-01  -1.804207e+01  -1.095093e+02 
  1.231920e+03  -4.084215e-02  -1.133362e-01  -1.838238e+01  -1.098173e+02 
  1.260763e+03  -3.945100e-02  -1.089677e-01  -1.871913e+01  -1.099024e+02 
  1.290281e+03  -3.858704e-02  -1.057618e-01  -1.897069e+01  -1.100444e+02 
  1.320490e+03  -3.734916e-02  -1.016266e-01  -1.930964e+01  -1.101791e+02 
  1.351406e+03  -3.539651e-02  -9.889343e-02  -1.957313e+01  -1.096936e+02 
  1.383047e+03  -3.415923e-02  -9.470370e-02  -1.994149e+01  -1.098342e+02 
  1.415428e+03  -3.284820e-02  -9.181929e-02  -2.021829e+01  -1.096846e+02 
  1.448567e+03  -3.164089e-02  -8.870491e-02  -2.052091e+01  -1.096312e+02 
  1.482482e+03  -3.032182e-02  -8.556841e-02  -2.084001e+01  -1.095122e+02 
  1.517191e+03  -2.951652e-02  -8.290196e-02  -2.111037e+01  -1.095978e+02 
  1.552713e+03  -2.842219e-02  -7.930509e-02  -2.148918e+01  -1.097172e+02 
  1.589067e+03  -2.688073e-02  -7.735273e-02  -2.173535e+01  -1.091628e+02 
  1.626271e+03  -2.582721e-02  -7.437050e-02  -2.207747e+01  -1.091510e+02 
  1.664347e+03  -2.448628e-02  -7.196905e-02  -2.238138e+01  -1.087900e+02 
  1.703314e+03  -2.369549e-02  -7.039630e-02  -2.258288e+01  -1.086033e+02 
  1.743193e+03  -2.239066e-02  -6.691296e-02  -2.302885e+01  -1.085015e+02 
  1.784007e+03  -2.121049e-02  -6.482432e-02  -2.332353e+01  -1.081181e+02 
  1.825775e+03  -2.040735e-02  -6.260261e-02  -2.362956e+01  -1.080550e+02 
  1.868522e+03  -1.886811e-02  -6.048475e-02  -2.396378e+01  -1.073252e+02 
  1.912270e+03  -1.800673e-02  -5.805353e-02  -2.432450e+01  -1.072326e+02 
  1.957041e+03  -1.662887e-02  -5.668382e-02  -2.457227e+01  -1.063497e+02 
  2.002861e+03  -1.625086e-02  -5.457140e-02  -2.489170e+01  -1.065830e+02 
  2.049754e+03  -1.514401e-02  -5.306374e-02  -2.516398e+01  -1.059284e+02 
  2.097745e+03  -1.457520e-02  -5.144468e-02  -2.543787e+01  -1.058184e+02 
  2.146859e+03  -1.356447e-02  -4.974016e-02  -2.575432e+01  -1.052540e+02 
  2.197123e+03  -1.253494e-02  -4.832110e-02  -2.603443e+01  -1.045425e+02 
  2.248564e+03  -1.211449e-02  -4.654022e-02  -2.635871e+01  -1.045904e+02 
  2.301209e+03  -1.042811e-02  -4.528353e-02  -2.665678e+01  -1.029683e+02 
  2.355087e+03  -1.004034e-02  -4.405867e-02  -2.689950e+01  -1.028377e+02 
  2.410227e+03  -9.414786e-03  -4.249768e-02  -2.722462e+01  -1.024914e+02 
  2.466657e+03  -8.607224e-03  -4.079865e-02  -2.759797e+01  -1.019129e+02 
  2.524408e+03  -8.036730e-03  -3.998381e-02  -2.779031e+01  -1.013650e+02 
  2.583512e+03  -7.261625e-03  -3.867681e-02  -2.810053e+01  -1.006336e+02 
  2.644000e+03  -6.227654e-03  -3.733887e-02  -2.843761e+01  -9.946905e+01 
  2.705903e+03  -5.704673e-03  -3.636067e-02  -2.868176e+01  -9.891651e+01 
  2.769256e+03  -5.219824e-03  -3.518219e-02  -2.897898e+01  -9.843915e+01 
  2.834093e+03  -4.769176e-03  -3.446333e-02  -2.917047e+01  -9.787878e+01 
  2.900447e+03  -3.954986e-03  -3.366527e-02  -2.939683e+01  -9.670037e+01 
  2.968354e+03  -3.519680e-03  -3.232754e-02  -2.975737e+01  -9.621363e+01 
  3.037852e+03  -3.160569e-03  -3.147680e-02  -2.999662e+01  -9.573382e+01 
  3.108977e+03  -2.383902e-03  -3.034224e-02  -3.033232e+01  -9.449233e+01 
  3.181767e+03  -1.983671e-03  -2.964235e-02  -3.054234e+01  -9.382853e+01 
  3.256261e+03  -1.698690e-03  -2.848146e-02  -3.089334e+01  -9.341319e+01 
  3.332500e+03  -9.783759e-04  -2.830745e-02  -3.095680e+01  -9.197949e+01 
  3.410523e+03  -1.003474e-03  -2.730075e-02  -3.127065e+01  -9.210503e+01 
  3.490374e+03  -4.242150e-04  -2.659569e-02  -3.150267e+01  -9.091382e+01 
  3.572093e+03   1.547183e-04  -2.581726e-02  -3.176164e+01  -8.965664e+01 
  3.655726e+03   5.264599e-04  -2.508321e-02  -3.201042e+01  -8.879762e+01 
  3.741317e+03   8.506490e-04  -2.445935e-02  -3.222585e+01  -8.800816e+01 
  3.828912e+03   1.245702e-03  -2.378206e-02  -3.246311e+01  -8.700159e+01 
  3.918558e+03   1.648609e-03  -2.310291e-02  -3.270461e+01  -8.591833e+01 
  4.010303e+03   1.786479e-03  -2.265588e-02  -3.286946e+01  -8.549139e+01 
  4.104195e+03   2.528641e-03  -2.195455e-02  -3.311228e+01  -8.342983e+01 
  4.200287e+03   2.558475e-03  -2.126345e-02  -3.338490e+01  -8.313900e+01 
  4.298627e+03   2.901191e-03  -2.056688e-02  -3.365106e+01  -8.197076e+01 
  4.399271e+03   3.180611e-03  -2.025849e-02  -3.376210e+01  -8.107732e+01 
  4.502270e+03   3.390372e-03  -1.966353e-02  -3.399954e+01  -8.021729e+01 
  4.607681e+03   3.699763e-03  -1.914407e-02  -3.420006e+01  -7.906192e+01 
  4.715561e+03   4.239995e-03  -1.895275e-02  -3.423447e+01  -7.738976e+01 
  4.825965e+03   4.264942e-03  -1.837074e-02  -3.448948e+01  -7.692977e+01 
  4.938955e+03   4.364140e-03  -1.771157e-02  -3.477888e+01  -7.615802e+01 
  5.054590e+03   4.918446e-03  -1.737634e-02  -3.486612e+01  -7.419561e+01 
  5.172933e+03   4.827584e-03  -1.707306e-02  -3.501972e+01  -7.421120e+01 
  5.294046e+03   5.172430e-03  -1.654708e-02  -3.522069e+01  -7.264134e+01 
  5.417995e+03   5.512820e-03  -1.613908e-02  -3.536315e+01  -7.114075e+01 
  5.544845e+03   5.508929e-03  -1.571160e-02  -3.557203e+01  -7.067790e+01 
  5.674666e+03   5.525522e-03  -1.545340e-02  -3.569701e+01  -7.032497e+01 
  5.807526e+03   5.843699e-03  -1.509996e-02  -3.581437e+01  -6.884351e+01 
  5.943498e+03   5.809267e-03  -1.447411e-02  -3.613951e+01  -6.813166e+01 
  6.082652e+03   6.274228e-03  -1.425976e-02  -3.614918e+01  -6.625073e+01 
  6.225064e+03   6.304410e-03  -1.395898e-02  -3.629675e+01  -6.569424e+01 
  6.370811e+03   6.526765e-03  -1.366053e-02  -3.639769e+01  -6.446234e+01 
  6.519970e+03   6.649729e-03  -1.330169e-02  -3.655306e+01  -6.343879e+01 
  6.672621e+03   6.794806e-03  -1.282905e-02  -3.676225e+01  -6.209241e+01 
  6.828846e+03   6.910404e-03  -1.254151e-02  -3.688155e+01  -6.114512e+01 
  6.988729e+03   6.726830e-03  -1.237862e-02  -3.702282e+01  -6.147932e+01 
  7.152355e+03   7.007182e-03  -1.215497e-02  -3.705878e+01  -6.003712e+01 
  7.319812e+03   7.089609e-03  -1.163295e-02  -3.731450e+01  -5.864010e+01 
  7.491190e+03   7.396016e-03  -1.161313e-02  -3.722240e+01  -5.750830e+01 
  7.666581e+03   7.501311e-03  -1.116665e-02  -3.742409e+01  -5.610835e+01 
  7.846078e+03   7.384994e-03  -1.111224e-02  -3.749531e+01  -5.639270e+01 
  8.029777e+03   7.644041e-03  -1.079540e-02  -3.757031e+01  -5.469834e+01 
  8.217777e+03   7.814460e-03  -1.052967e-02  -3.764624e+01  -5.341951e+01 
  8.410179e+03   7.807273e-03  -1.013961e-02  -3.785778e+01  -5.240453e+01 
  8.607085e+03   7.597107e-03  -9.975403e-03  -3.803479e+01  -5.270768e+01 
  8.808602e+03   7.851543e-03  -9.797765e-03  -3.802325e+01  -5.129269e+01 
  9.014837e+03   8.152455e-03  -9.691669e-03  -3.794820e+01  -4.993006e+01 
  9.225900e+03   8.033941e-03  -9.350954e-03  -3.818201e+01  -4.933223e+01 
  9.441905e+03   8.025891e-03  -9.174113e-03  -3.828042e+01  -4.881923e+01 
  9.662967e+03   8.174936e-03  -8.803456e-03  -3.840642e+01  -4.712005e+01 
  9.889205e+03   8.138343e-03  -8.792277e-03  -3.843037e+01  -4.721191e+01 
  1.012074e+04   8.284200e-03  -8.622913e-03  -3.844717e+01  -4.614769e+01 
  1.035770e+04   8.169001e-03  -8.272808e-03  -3.869114e+01  -4.536174e+01 
  1.060020e+04   8.282913e-03  -8.285689e-03  -3.862458e+01  -4.500960e+01 
  1.084838e+04   8.473086e-03  -7.978646e-03  -3.868215e+01  -4.327855e+01 
  1.110237e+04   8.474576e-03  -7.818285e-03  -3.876331e+01  -4.269332e+01 
  1.136231e+04   8.437072e-03  -7.621240e-03  -3.888511e+01  -4.209162e+01 
  1.162833e+04   8.668437e-03  -7.421334e-03  -3.885329e+01  -4.056792e+01 
  1.190059e+04   8.608143e-03  -7.472147e-03  -3.886280e+01  -4.095904e+01 
  1.217921e+04   8.671832e-03  -7.155911e-03  -3.898226e+01  -3.952911e+01 
  1.246436e+04   8.666521e-03  -7.106133e-03  -3.900991e+01  -3.935011e+01 
  1.275619e+04   8.599333e-03  -6.905967e-03  -3.914920e+01  -3.876730e+01 
  1.305485e+04   8.726581e-03  -6.658385e-03  -3.919059e+01  -3.734364e+01 
  1.336050e+04   8.916873e-03  -6.640220e-03  -3.907970e+01  -3.667433e+01 
  1.367331e+04   8.749841e-03  -6.621350e-03  -3.919366e+01  -3.711623e+01 
  1.399344e+04   9.006044e-03  -6.332572e-03  -3.916460e+01  -3.511285e+01 
  1.432107e+04   9.037160e-03  -6.358811e-03  -3.913268e+01  -3.513134e+01 
  1.465637e+04   8.965602e-03  -6.143362e-03  -3.927666e+01  -3.441951e+01 
  1.499951e+04   9.154452e-03  -5.944477e-03  -3.923940e+01  -3.299783e+01 
  1.535069e+04   9.129539e-03  -5.964147e-03  -3.924747e+01  -3.315579e+01 
  1.571010e+04   9.047040e-03  -5.789613e-03  -3.937913e+01  -3.261703e+01 
  1.607792e+04   9.097207e-03  -5.692966e-03  -3.938664e+01  -3.203803e+01 
  1.645435e+04   9.103104e-03  -5.499402e-03  -3.946499e+01  -3.113717e+01 
  1.683959e+04   9.113421e-03  -5.439113e-03  -3.948314e+01  -3.082978e+01 
  1.723385e+04   9.137783e-03  -5.360450e-03  -3.949878e+01  -3.039694e+01 
  1.763735e+04   9.154506e-03  -5.265072e-03  -3.952624e+01  -2.990469e+01 
  1.805029e+04   9.141074e-03  -5.165904e-03  -3.957638e+01  -2.947213e+01 
  1.847290e+04   9.131829e-03  -5.132523e-03  -3.959662e+01  -2.933806e+01 
  1.890540e+04   9.204954e-03  -5.086329e-03  -3.956237e+01  -2.892347e+01 
  1.934803e+04   9.030416e-03  -4.967617e-03  -3.973771e+01  -2.881512e+01 
  1.980103e+04   9.014712e-03  -4.814124e-03  -3.981130e+01  -2.810354e+01 
  2.026462e+04   9.340229e-03  -4.857389e-03  -3.955326e+01  -2.747670e+01 
  2.073908e+04   9.100164e-03  -4.726797e-03  -3.978168e+01  -2.744821e+01 
  2.122464e+04   9.288692e-03  -4.568248e-03  -3.970013e+01  -2.618830e+01 
  2.172157e+04   9.314262e-03  -4.612678e-03  -3.966446e+01  -2.634587e+01 
  2.223013e+04   9.413201e-03  -4.528405e-03  -3.962116e+01  -2.569079e+01 
  2.275061e+04   9.381275e-03  -4.471460e-03  -3.966567e+01  -2.548418e+01 
  2.328326e+04   9.303259e-03  -4.210516e-03  -3.981803e+01  -2.435080e+01 
  2.382839e+04   9.398476e-03  -4.323648e-03  -3.970514e+01  -2.470419e+01 
  2.438628e+04   9.291148e-03  -4.068422e-03  -3.987680e+01  -2.364772e+01 
  2.495723e+04   9.251807e-03  -4.252999e-03  -3.984288e+01  -2.468795e+01 
  2.554155e+04   9.438495e-03  -4.093318e-03  -3.975348e+01  -2.344557e+01 
  2.613956e+04   9.315106e-03  -4.070769e-03  -3.985722e+01  -2.360567e+01 
  2.675156e+04   9.310517e-03  -3.942664e-03  -3.990420e+01  -2.295088e+01 
  2.737789e+04   9.260138e-03  -3.944228e-03  -3.994360e+01  -2.307091e+01 
  2.801888e+04   9.274009e-03  -3.865410e-03  -3.995900e+01  -2.262639e+01 
  2.867489e+04   9.453343e-03  -3.876426e-03  -3.981331e+01  -2.229651e+01 
  2.934625e+04   9.481735e-03  -3.787365e-03  -3.981935e+01  -2.177364e+01 
  3.003333e+04   9.583592e-03  -3.767047e-03  -3.974547e+01  -2.145843e+01 
  3.073650e+04   9.414427e-03  -3.853715e-03  -3.985133e+01  -2.226132e+01 
  3.145612e+04   9.277535e-03  -3.776552e-03  -3.998548e+01  -2.214948e+01 
  3.219260e+04   9.332835e-03  -3.746009e-03  -3.995101e+01  -2.186951e+01 
  3.294632e+04   9.508740e-03  -3.567691e-03  -3.986554e+01  -2.056615e+01 
  3.371769e+04   9.350707e-03  -3.474316e-03  -4.002148e+01  -2.038288e+01 
  3.450712e+04   9.388770e-03  -3.663180e-03  -3.993243e+01  -2.131405e+01 
  3.531503e+04   9.390998e-03  -3.698396e-03  -3.991958e+01  -2.149569e+01 
  3.614186e+04   9.398207e-03  -3.588998e-03  -3.994789e+01  -2.090091e+01 
  3.698804e+04   9.285757e-03  -3.481254e-03  -4.007250e+01  -2.055115e+01 
  3.785404e+04   9.424520e-03  -3.410736e-03  -3.998030e+01  -1.989520e+01 
  3.874031e+04   9.398500e-03  -3.459195e-03  -3.998708e+01  -2.020655e+01 
  3.964734e+04   9.387624e-03  -3.518393e-03  -3.997805e+01  -2.054552e+01 
  4.057559e+04   9.402302e-03  -3.434785e-03  -3.999128e+01  -2.006792e+01 
  4.152559e+04   9.642445e-03  -3.417518e-03  -3.980235e+01  -1.951557e+01 
  4.249782e+04   9.484109e-03  -3.547561e-03  -3.989134e+01  -2.050847e+01 
  4.349281e+04   9.424970e-03  -3.346025e-03  -3.999887e+01  -1.954573e+01 
  4.451111e+04   9.439252e-03  -3.306128e-03  -3.999870e+01  -1.930297e+01 
  4.555324e+04   9.529165e-03  -3.365223e-03  -3.990848e+01  -1.945066e+01 
  4.661977e+04   9.528804e-03  -3.442591e-03  -3.988643e+01  -1.986390e+01 
  4.771127e+04   9.400655e-03  -3.318485e-03  -4.002681e+01  -1.944332e+01 
  4.882833e+04   9.359773e-03  -3.524607e-03  -3.999878e+01  -2.063485e+01 
  4.997154e+04   9.572860e-03  -3.394101e-03  -3.986491e+01  -1.952219e+01 
  5.114152e+04   9.364144e-03  -3.459430e-03  -4.001501e+01  -2.027592e+01 
  5.233889e+04   9.576246e-03  -3.566952e-03  -3.981184e+01  -2.042931e+01 
  5.356430e+04   9.448621e-03  -3.359777e-03  -3.997555e+01  -1.957456e+01 
  5.481839e+04   9.354474e-03  -3.520072e-03  -4.000447e+01  -2.062123e+01 
  5.610185e+04   9.387020e-03  -3.451229e-03  -3.999882e+01  -2.018644e+01 
  5.741535e+04   9.385931e-03  -3.486327e-03  -3.998915e+01  -2.037710e+01 
  5.875961e+04   9.483666e-03  -3.555084e-03  -3.988943e+01  -2.054921e+01 
  6.013534e+04   9.470209e-03  -3.526315e-03  -3.990890e+01  -2.042325e+01 
  6.154328e+04   9.447109e-03  -3.501327e-03  -3.993503e+01  -2.033592e+01 
  6.298419e+04   9.472129e-03  -3.628895e-03  -3.987626e+01  -2.096248e+01 
  6.445883e+04   9.408376e-03  -3.608008e-03  -3.993383e+01  -2.098126e+01 
  6.596800e+04   9.492198e-03  -3.737134e-03  -3.982683e+01  -2.148985e+01 
  6.751250e+04   9.434121e-03  -3.724487e-03  -3.987693e+01  -2.154356e+01 
  6.909316e+04   9.329099e-03  -3.710723e-03  -3.996533e+01  -2.169058e+01 
  7.071083e+04   9.346564e-03  -3.808334e-03  -3.991989e+01  -2.216884e+01 
  7.236638e+04   9.480288e-03  -3.779705e-03  -3.982291e+01  -2.173672e+01 
  7.406068e+04   9.451096e-03  -3.881636e-03  -3.981340e+01  -2.232832e+01 
  7.579465e+04   9.483846e-03  -3.828160e-03  -3.980476e+01  -2.198149e+01 
  7.756922e+04   9.448630e-03  -4.027303e-03  -3.976765e+01  -2.308523e+01 
  7.938534e+04   9.464783e-03  -3.921515e-03  -3.978975e+01  -2.250555e+01 
  8.124398e+04   9.425696e-03  -3.821800e-03  -3.985270e+01  -2.207088e+01 
  8.314613e+04   9.463973e-03  -3.941314e-03  -3.978394e+01  -2.260950e+01 
  8.509283e+04   9.446236e-03  -4.178199e-03  -3.971881e+01  -2.386046e+01 
  8.708509e+04   9.423886e-03  -4.151285e-03  -3.974519e+01  -2.377381e+01 
  8.912401e+04   9.360828e-03  -4.176037e-03  -3.978545e+01  -2.404253e+01 
  9.121066e+04   9.307427e-03  -4.265170e-03  -3.979556e+01  -2.461983e+01 
  9.334616e+04   9.359096e-03  -4.359399e-03  -3.972255e+01  -2.497576e+01 
  9.553166e+04   9.421457e-03  -4.697591e-03  -3.955338e+01  -2.650110e+01 
  9.776833e+04   9.215683e-03  -4.498600e-03  -3.978124e+01  -2.601913e+01 
  1.000574e+05   9.138558e-03  -4.553429e-03  -3.981937e+01  -2.648549e+01 
  1.024000e+05   9.301407e-03  -4.563345e-03  -3.969237e+01  -2.613294e+01 
