Add reference to git repo and documentation

9 jobs for add-nessai-sampler in 19 minutes and 31 seconds (queued for 3 seconds)
Status Job ID Name Coverage
  Test
passed #1211350
authors

00:01:48

passed #1211343
basic-3.7

00:02:38

passed #1211349
containers

00:01:33

passed #1211351
precommits-py3.7

00:01:52

canceled #1211346
python-3.6

00:19:01

failed #1211348
python-3.6-samplers

00:04:44

canceled #1211344
python-3.7

00:19:14

failed #1211347
python-3.7-samplers

00:05:10

failed #1211345
python-3.8

00:10:20

 
Name Stage Failure
failed
python-3.8 Test
FAILED test/core/sampler/sampler_run_test.py::TestRunningSamplers::test_run_nessai
FAILED test/core/sampler/sampler_run_test.py::TestRunningSamplers::test_run_ultranest
FAILED test/gw/detector/interferometer_test.py::TestInterferometer::test_to_and_from_hdf5_loading
FAILED test/gw/detector/interferometer_test.py::TestInterferometer::test_to_and_from_hdf5_wrong_class
FAILED test/gw/detector/networks_test.py::TestInterferometerList::test_to_and_from_hdf5_loading
FAILED test/gw/detector/networks_test.py::TestInterferometerList::test_to_and_from_hdf5_wrong_class
=========== 8 failed, 842 passed, 265 warnings in 509.37s (0:08:29) ============
Cleaning up file based variables
ERROR: Job failed: exit code 1
failed
python-3.6-samplers Test
  /opt/conda/envs/python36/lib/python3.6/site-packages/pymultinest/run.py:208: DeprecationWarning: inspect.getargspec() is deprecated since Python 3.0, use inspect.signature() or inspect.getfullargspec()
nargs = len(inspect.getargspec(LogLikelihood).args) - inspect.ismethod(LogLikelihood)

-- Docs: https://docs.pytest.org/en/stable/warnings.html
=========================== short test summary info ============================
FAILED test/integration/sampler_run_test.py::TestRunningSamplers::test_run_ultranest
============ 1 failed, 11 passed, 71 warnings in 202.04s (0:03:22) =============
Cleaning up file based variables
ERROR: Job failed: exit code 1
failed
python-3.7-samplers Test
5.97s call     test/integration/sampler_run_test.py::TestRunningSamplers::test_run_emcee
2.13s call test/integration/sampler_run_test.py::TestRunningSamplers::test_run_dynamic_dynesty
1.76s call test/integration/sampler_run_test.py::TestRunningSamplers::test_run_ultranest
0.33s call test/integration/sampler_run_test.py::TestRunningSamplers::test_run_nestle
=========================== short test summary info ============================
FAILED test/integration/sampler_run_test.py::TestRunningSamplers::test_run_ultranest
============ 1 failed, 11 passed, 70 warnings in 216.00s (0:03:35) =============
Cleaning up file based variables
ERROR: Job failed: exit code 1