# SR785 Noise Measurement
#Title: ../data/Torrey/Squeezing Data/Data/Shot_Noise_Remeasure/1000mV_LO_
#Memo: 
#Instrument ID: Stanford_Research_Systems,SR785,s/n77740,ver220
#
#---------- Measurement Parameters ----------
#Measurement Group: FFT
#Measurements: FFT 1
#View: Log Magnitude
#Unit: Vrms
#
#---------- Input Parameters ----------
#Input Source: Analog
#Input Mode: Single ended, Single ended
#Input Grounding: Float, Float
#Input Coupling: AC, AC
#Input Range: -50.0dBVpk, 6.0dBVpk
#Auto Range: Off, On
#Auto Range Mode: Up Only, Normal
#Anti-Aliasing Filter: On, On
#
#---------- Measurement Setup ----------
#Frequency Span: 102400.000000
#Frequency Resolution: 800
#Number of Averages: 2500
#Averaging Mode: RMS
#Window function: Hanning
#
#---------- Instrument Data -----------
## Frequency(Hz) Disp1(Vrms) 
