<?xml version="1.0" encoding="UTF-8" standalone="no"?>
<!DOCTYPE svg PUBLIC "-//W3C//DTD SVG 1.1//EN" "http://www.w3.org/Graphics/SVG/1.1/DTD/svg11.dtd">
<svg version="1.1" xmlns:xl="http://www.w3.org/1999/xlink" xmlns="http://www.w3.org/2000/svg" xmlns:dc="http://purl.org/dc/elements/1.1/" viewBox="14.218358 67.33333 641.66975 282.69308" width="641.66975" height="282.69308">
  <defs>
    <linearGradient x1="0" x2="1" id="Gradient" gradientUnits="userSpaceOnUse">
      <stop offset="0" stop-color="#ff80ff"/>
      <stop offset=".7721354" stop-color="#ffc2ff"/>
      <stop offset="1" stop-color="white"/>
    </linearGradient>
    <linearGradient id="Obj_Gradient" xl:href="#Gradient" gradientTransform="translate(559.6189 146.25) rotate(180) scale(18)"/>
    <linearGradient x1="0" x2="1" id="Gradient_2" gradientUnits="userSpaceOnUse">
      <stop offset="0" stop-color="#ccc"/>
      <stop offset=".25003498" stop-color="#b17be6"/>
      <stop offset="1" stop-color="#9437ff"/>
    </linearGradient>
    <linearGradient id="Obj_Gradient_2" xl:href="#Gradient_2" gradientTransform="translate(442.1337 146.25) scale(19.828125)"/>
    <linearGradient x1="0" x2="1" id="Gradient_3" gradientUnits="userSpaceOnUse">
      <stop offset="0" stop-color="#ccc"/>
      <stop offset=".25003498" stop-color="#b17be6"/>
      <stop offset="1" stop-color="#9437ff"/>
    </linearGradient>
    <linearGradient id="Obj_Gradient_3" xl:href="#Gradient_3" gradientTransform="translate(481.79 146.25) rotate(180) scale(19.828125)"/>
    <linearGradient x1="0" x2="1" id="Gradient_4" gradientUnits="userSpaceOnUse">
      <stop offset="0" stop-color="#ff80ff"/>
      <stop offset=".9" stop-color="#ffc2ff"/>
      <stop offset="1" stop-color="white"/>
    </linearGradient>
    <linearGradient id="Obj_Gradient_4" xl:href="#Gradient_4" gradientTransform="translate(590.0392 146.72457) rotate(-1) scale(54.384455)"/>
    <linearGradient id="Obj_Gradient_5" xl:href="#Gradient_2" gradientTransform="translate(442.1337 218.25) scale(19.828125)"/>
    <linearGradient id="Obj_Gradient_6" xl:href="#Gradient_3" gradientTransform="translate(481.79 218.25) rotate(180) scale(19.828125)"/>
    <linearGradient id="Obj_Gradient_7" xl:href="#Gradient_2" gradientTransform="translate(442.1337 290.25) scale(3.375)"/>
    <linearGradient id="Obj_Gradient_8" xl:href="#Gradient_3" gradientTransform="translate(481.79 290.25) rotate(180) scale(9)"/>
    <linearGradient id="Obj_Gradient_9" xl:href="#Gradient_4" gradientTransform="translate(589.7619 218.72457) rotate(-1) scale(54.384455)"/>
    <linearGradient id="Obj_Gradient_10" xl:href="#Gradient" gradientTransform="translate(590.2273 218.25) rotate(180) scale(40.495495)"/>
    <linearGradient id="Obj_Gradient_11" xl:href="#Gradient_4" gradientTransform="translate(590.3378 290.81548) rotate(-1) scale(54.384455)"/>
    <linearGradient id="Obj_Gradient_12" xl:href="#Gradient" gradientTransform="translate(590.8032 290.3409) rotate(180) scale(40.495495)"/>
  </defs>
  <g id="Canvas_1" stroke="none" fill-opacity="1" stroke-dasharray="none" stroke-opacity="1" fill="none">
    <title>Canvas 1</title>
    <rect fill="white" x="14.218358" y="67.33333" width="641.66975" height="282.69308"/>
    <g id="Canvas_1_Layer_1">
      <title>Layer 1</title>
      <g id="Graphic_59">
        <rect x="19.125" y="67.83333" width="636.2631" height="253.91667" stroke="black" stroke-linecap="round" stroke-linejoin="round" stroke-width="1"/>
      </g>
      <g id="Graphic_29">
        <text transform="translate(251.22902 69.802374)" fill="black">
          <tspan font-family="Helvetica" font-size="18" fill="black" x="0" y="18">O2</tspan>
        </text>
      </g>
      <g id="Graphic_23">
        <text transform="translate(202.90479 102.75439)" fill="black">
          <tspan font-family="Helvetica" font-style="italic" font-size="13" fill="black" x="11.658" y="13">100 </tspan>
          <tspan font-family="Helvetica" font-style="italic" font-size="13" fill="black" x="9.5" y="29">Mpc</tspan>
        </text>
      </g>
      <g id="Graphic_28">
        <rect x="297.30546" y="79.45237" width="21.6" height="7.2" fill="#00ab86"/>
      </g>
      <g id="Graphic_27">
        <text transform="translate(325.43385 69.4857)" fill="black">
          <tspan font-family="Helvetica" font-size="18" fill="black" x="0" y="18">O3</tspan>
        </text>
      </g>
      <g id="Graphic_26">
        <rect x="443.93165" y="79.45236" width="21.6" height="7.2" fill="#9437ff"/>
      </g>
      <g id="Graphic_25">
        <text transform="translate(474.1989 69.4857)" fill="black">
          <tspan font-family="Helvetica" font-size="18" fill="black" x="0" y="18">O4</tspan>
        </text>
      </g>
      <g id="Graphic_79">
        <rect x="533.93165" y="79.45236" width="21.6" height="7.2" fill="#ff80ff"/>
      </g>
      <g id="Graphic_80">
        <text transform="translate(564.1989 69.4857)" fill="black">
          <tspan font-family="Helvetica" font-size="18" fill="black" x="0" y="18">O5</tspan>
        </text>
      </g>
      <g id="Graphic_32">
        <rect x="143.59524" y="79.51649" width="21.6" height="7.3282685" fill="#df7300"/>
      </g>
      <g id="Graphic_31">
        <text transform="translate(175.59415 69.802374)" fill="black">
          <tspan font-family="Helvetica" font-size="18" fill="black" x="0" y="18">O1</tspan>
        </text>
      </g>
      <g id="Graphic_30">
        <rect x="215.88487" y="79.51649" width="21.6" height="7.2" fill="#66c2ee"/>
      </g>
      <g id="Graphic_8">
        <text transform="translate(288.97285 102.75439)" fill="black">
          <tspan font-family="Helvetica" font-style="italic" font-size="13" fill="black" x="2.2586434" y="13">100-140 </tspan>
          <tspan font-family="Helvetica" font-style="italic" font-size="13" fill="black" x="13.107143" y="29">Mpc</tspan>
        </text>
      </g>
      <g id="Graphic_54">
        <rect x="171" y="135" width="11.25" height="22.5" fill="#df7300"/>
      </g>
      <g id="Graphic_53">
        <text transform="translate(30.16323 198)" fill="black">
          <tspan font-family="Helvetica" font-size="30" fill="black" x="0" y="29">Virgo</tspan>
        </text>
      </g>
      <g id="Graphic_35">
        <text transform="translate(30.403954 270)" fill="black">
          <tspan font-family="Helvetica" font-size="26" fill="black" x="0" y="25">KAGRA</tspan>
        </text>
      </g>
      <g id="Graphic_34">
        <rect x="237.09375" y="207" width="3.09375" height="22.5" fill="#66c2ee"/>
      </g>
      <g id="Graphic_33">
        <text transform="translate(158.29167 102.75439)" fill="black">
          <tspan font-family="Helvetica" font-style="italic" font-size="13" fill="black" x="11.272" y="13">80 </tspan>
          <tspan font-family="Helvetica" font-style="italic" font-size="13" fill="black" x="5.5" y="29">Mpc</tspan>
        </text>
      </g>
      <g id="Graphic_24">
        <rect x="210.09375" y="135" width="30.09375" height="22.5" fill="#66c2ee"/>
      </g>
      <g id="Graphic_22">
        <rect x="297" y="135" width="36" height="22.5" fill="#00ab86"/>
      </g>
      <g id="Graphic_21">
        <rect x="297" y="207" width="36" height="22.5" fill="#00ab86"/>
      </g>
      <g id="Graphic_7">
        <text transform="translate(220.1667 143.5)" fill="black">
          <tspan font-family="Helvetica" font-style="italic" font-size="13" fill="black" x="18.5" y="29"> </tspan>
          <tspan font-family="Helvetica" font-style="italic" font-size="13" fill="black" x="11.272" y="45">30 </tspan>
          <tspan font-family="Helvetica" font-style="italic" font-size="13" fill="black" x="5.5" y="61">Mpc</tspan>
        </text>
      </g>
      <g id="Graphic_6">
        <text transform="translate(297 174.75439)" fill="black">
          <tspan font-family="Helvetica" font-style="italic" font-size="13" fill="black" x="1.8795" y="13">40-50 </tspan>
          <tspan font-family="Helvetica" font-style="italic" font-size="13" fill="black" x="5.5" y="29">Mpc</tspan>
        </text>
      </g>
      <g id="Graphic_4">
        <text transform="translate(312.66082 246.1696)" fill="black">
          <tspan font-family="Helvetica" font-style="italic" font-size="13" fill="black" x="9.465" y="13">0.7</tspan>
          <tspan font-family="Helvetica" font-style="italic" font-size="13" fill="black" x="5.5" y="29">Mpc</tspan>
        </text>
      </g>
      <g id="Graphic_62">
        <text transform="translate(30.35122 126)" fill="black">
          <tspan font-family="Helvetica" font-size="26" fill="black" x="0" y="25">LIGO</tspan>
        </text>
      </g>
      <g id="Graphic_83">
        <rect x="541.6189" y="135" width="18" height="22.5" fill="url(#Obj_Gradient)"/>
      </g>
      <g id="Graphic_87">
        <text transform="translate(437.7229 102.16959)" fill="black">
          <tspan font-family="Helvetica" font-size="13" fill="black" x=".8955078" y="13">160-190 </tspan>
          <tspan font-family="Helvetica" font-size="13" fill="black" x="12.470459" y="29">Mpc</tspan>
        </text>
      </g>
      <g id="Graphic_88">
        <text transform="translate(568.7847 102.125)" fill="black">
          <tspan font-family="Helvetica" font-size="13" fill="black" x="5.395508" y="13">240-325 </tspan>
          <tspan font-family="Helvetica" font-size="13" fill="black" x="16.970459" y="29">Mpc</tspan>
        </text>
      </g>
      <g id="Graphic_96">
        <text transform="translate(568.7847 173)" fill="black">
          <tspan font-family="Helvetica" font-size="13" fill="black" x="5.395508" y="13">150-260 </tspan>
          <tspan font-family="Helvetica" font-size="13" fill="black" x="16.970459" y="29">Mpc</tspan>
        </text>
      </g>
      <g id="Group_109">
        <g id="Graphic_105">
          <rect x="442.1337" y="135" width="19.828125" height="22.5" fill="url(#Obj_Gradient_2)"/>
          <rect x="442.1337" y="135" width="19.828125" height="22.5" stroke="black" stroke-linecap="round" stroke-linejoin="round" stroke-width="0"/>
        </g>
        <g id="Graphic_108">
          <rect x="461.96185" y="135" width="19.828125" height="22.5" fill="url(#Obj_Gradient_3)"/>
          <rect x="461.96185" y="135" width="19.828125" height="22.5" stroke="black" stroke-linecap="round" stroke-linejoin="round" stroke-width="0"/>
        </g>
      </g>
      <g id="Graphic_122">
        <rect x="559.5507" y="135" width="37.144076" height="22.5" fill="#ff80ff"/>
      </g>
      <g id="Graphic_123">
        <rect x="590.2273" y="135" width="54" height="22.5" fill="url(#Obj_Gradient_4)"/>
      </g>
      <g id="Graphic_129">
        <text transform="translate(437.7229 174.1696)" fill="black">
          <tspan font-family="Helvetica" font-size="13" fill="black" x="4.989746" y="13">80-115 </tspan>
          <tspan font-family="Helvetica" font-size="13" fill="black" x="12.470459" y="29">Mpc</tspan>
        </text>
      </g>
      <g id="Group_126">
        <g id="Graphic_128">
          <rect x="442.1337" y="207" width="19.828125" height="22.5" fill="url(#Obj_Gradient_5)"/>
          <rect x="442.1337" y="207" width="19.828125" height="22.5" stroke="black" stroke-linecap="round" stroke-linejoin="round" stroke-width="0"/>
        </g>
        <g id="Graphic_127">
          <rect x="461.96185" y="207" width="19.828125" height="22.5" fill="url(#Obj_Gradient_6)"/>
          <rect x="461.96185" y="207" width="19.828125" height="22.5" stroke="black" stroke-linecap="round" stroke-linejoin="round" stroke-width="0"/>
        </g>
      </g>
      <g id="Graphic_130">
        <rect x="329.26316" y="279" width="2.25" height="22.5" fill="#00ab86"/>
      </g>
      <g id="Graphic_134">
        <text transform="translate(433.2229 245.44287)" fill="black">
          <tspan font-family="Helvetica" font-size="13" fill="black" x=".8886719" y="13">(1-3) ~ 10</tspan>
          <tspan font-family="Helvetica" font-size="13" fill="black" x="16.970459" y="29">Mpc</tspan>
        </text>
      </g>
      <g id="Group_131">
        <g id="Graphic_133">
          <rect x="442.1337" y="279" width="3.375" height="22.5" fill="url(#Obj_Gradient_7)"/>
          <rect x="442.1337" y="279" width="3.375" height="22.5" stroke="black" stroke-linecap="round" stroke-linejoin="round" stroke-width="0"/>
        </g>
        <g id="Graphic_132">
          <rect x="472.79" y="279" width="9" height="22.5" fill="url(#Obj_Gradient_8)"/>
          <rect x="472.79" y="279" width="9" height="22.5" stroke="black" stroke-linecap="round" stroke-linejoin="round" stroke-width="0"/>
        </g>
      </g>
      <g id="Graphic_139">
        <text transform="translate(567.7902 245)" fill="black">
          <tspan font-family="Helvetica" font-size="13" fill="black" x="9.010498" y="13">25-128 </tspan>
          <tspan font-family="Helvetica" font-size="13" fill="black" x="16.970459" y="29">Mpc</tspan>
        </text>
      </g>
      <g id="Group_141">
        <g id="Line_49">
          <line x1="144.56173" y1="319.04965" x2="144.65174" y2="326.24965" stroke="black" stroke-linecap="round" stroke-linejoin="round" stroke-width="1"/>
        </g>
        <g id="Line_48">
          <line x1="180.63314" y1="318.6211" x2="180.72314" y2="325.8211" stroke="black" stroke-linecap="round" stroke-linejoin="round" stroke-width="1"/>
        </g>
        <g id="Line_47">
          <line x1="216.84742" y1="318.4544" x2="216.93743" y2="325.6544" stroke="black" stroke-linecap="round" stroke-linejoin="round" stroke-width="1"/>
        </g>
        <g id="Graphic_43">
          <text transform="translate(133.93868 331.61585)" fill="black">
            <tspan font-family="Helvetica" font-size="10" fill="black" x="0" y="10">2015</tspan>
          </text>
        </g>
        <g id="Graphic_42">
          <text transform="translate(170.01008 331.61584)" fill="black">
            <tspan font-family="Helvetica" font-size="10" fill="black" x="0" y="10">2016</tspan>
          </text>
        </g>
        <g id="Graphic_41">
          <text transform="translate(206.17378 331.61583)" fill="black">
            <tspan font-family="Helvetica" font-size="10" fill="black" x="0" y="10">2017</tspan>
          </text>
        </g>
        <g id="Graphic_40">
          <text transform="translate(241.026 331.68537)" fill="black">
            <tspan font-family="Helvetica" font-size="10" fill="black" x=".8374224" y="10">2018</tspan>
          </text>
        </g>
        <g id="Line_39">
          <line x1="252.53027" y1="318.4663" x2="252.62028" y2="325.6663" stroke="black" stroke-linecap="round" stroke-linejoin="round" stroke-width="1"/>
        </g>
        <g id="Graphic_38">
          <text transform="translate(278.0897 331.723)" fill="black">
            <tspan font-family="Helvetica" font-size="10" fill="black" x="0" y="10">2019</tspan>
          </text>
        </g>
        <g id="Line_37">
          <line x1="288.63314" y1="318.6211" x2="288.72314" y2="325.8211" stroke="black" stroke-linecap="round" stroke-linejoin="round" stroke-width="1"/>
        </g>
        <g id="Graphic_36">
          <text transform="translate(314.16486 331.83012)" fill="black">
            <tspan font-family="Helvetica" font-size="10" fill="black" x="0" y="10">2020</tspan>
          </text>
        </g>
        <g id="Line_14">
          <line x1="324.16885" y1="318.3059" x2="324.25886" y2="325.5059" stroke="black" stroke-linecap="round" stroke-linejoin="round" stroke-width="1"/>
        </g>
        <g id="Line_63">
          <line x1="360.14504" y1="318.46632" x2="360.23505" y2="325.66632" stroke="black" stroke-linecap="round" stroke-linejoin="round" stroke-width="1"/>
        </g>
        <g id="Line_65">
          <line x1="468.16885" y1="318.46632" x2="468.25886" y2="325.66632" stroke="black" stroke-linecap="round" stroke-linejoin="round" stroke-width="1"/>
        </g>
        <g id="Line_66">
          <line x1="504.3593" y1="319.12734" x2="504.44933" y2="326.32734" stroke="black" stroke-linecap="round" stroke-linejoin="round" stroke-width="1"/>
        </g>
        <g id="Line_67">
          <line x1="540.19266" y1="319.06156" x2="540.28267" y2="326.26156" stroke="black" stroke-linecap="round" stroke-linejoin="round" stroke-width="1"/>
        </g>
        <g id="Graphic_68">
          <text transform="translate(349.4982 331.7587)" fill="black">
            <tspan font-family="Helvetica" font-size="10" fill="black" x="0" y="10">2021</tspan>
          </text>
        </g>
        <g id="Graphic_69">
          <text transform="translate(385.5101 331.7587)" fill="black">
            <tspan font-family="Helvetica" font-size="10" fill="black" x="0" y="10">2022</tspan>
          </text>
        </g>
        <g id="Graphic_70">
          <text transform="translate(422.7125 331.7587)" fill="black">
            <tspan font-family="Helvetica" font-size="10" fill="black" x="0" y="10">2023</tspan>
          </text>
        </g>
        <g id="Graphic_71">
          <text transform="translate(458.7244 331.7587)" fill="black">
            <tspan font-family="Helvetica" font-size="10" fill="black" x="0" y="10">2024</tspan>
          </text>
        </g>
        <g id="Graphic_72">
          <text transform="translate(494.7363 331.7587)" fill="black">
            <tspan font-family="Helvetica" font-size="10" fill="black" x="0" y="10">2025</tspan>
          </text>
        </g>
        <g id="Line_73">
          <line x1="396.12123" y1="318.4306" x2="396.21124" y2="325.6306" stroke="black" stroke-linecap="round" stroke-linejoin="round" stroke-width="1"/>
        </g>
        <g id="Line_74">
          <line x1="431.94266" y1="318.4306" x2="432.03267" y2="325.6306" stroke="black" stroke-linecap="round" stroke-linejoin="round" stroke-width="1"/>
        </g>
        <g id="Graphic_76">
          <text transform="translate(530.7363 331.7587)" fill="black">
            <tspan font-family="Helvetica" font-size="10" fill="black" x="0" y="10">2026</tspan>
          </text>
        </g>
        <g id="Line_117">
          <line x1="576.19266" y1="319.06156" x2="576.2827" y2="326.26156" stroke="black" stroke-linecap="round" stroke-linejoin="round" stroke-width="1"/>
        </g>
        <g id="Graphic_116">
          <text transform="translate(566.7363 331.7587)" fill="black">
            <tspan font-family="Helvetica" font-size="10" fill="black" x="0" y="10">2027</tspan>
          </text>
        </g>
        <g id="Line_119">
          <line x1="612.19266" y1="319.06156" x2="612.2827" y2="326.26156" stroke="black" stroke-linecap="round" stroke-linejoin="round" stroke-width="1"/>
        </g>
        <g id="Graphic_118">
          <text transform="translate(602.7363 331.7587)" fill="black">
            <tspan font-family="Helvetica" font-size="10" fill="black" x="0" y="10">2028</tspan>
          </text>
        </g>
        <g id="Graphic_140">
          <text transform="translate(19.218358 330.63384)" fill="black">
            <tspan font-family="Arial" font-size="12" fill="black" x="0" y="11">G2002127-v13</tspan>
          </text>
        </g>
      </g>
      <g id="Graphic_143">
        <text transform="translate(30.89126 72.23242)" fill="black">
          <tspan font-family="Arial" font-size="12" fill="black" x="11.34082" y="11">Updated</tspan>
          <tspan font-family="Arial" font-size="12" fill="black" x="0" y="25.392578">15 Nov 2022</tspan>
        </text>
      </g>
      <g id="Graphic_145">
        <rect x="445.4753" y="279" width="27.568182" height="22.5" fill="#999"/>
      </g>
      <g id="Graphic_146">
        <rect x="589.95" y="207" width="54" height="22.5" fill="url(#Obj_Gradient_9)"/>
      </g>
      <g id="Graphic_147">
        <rect x="549.7318" y="207" width="40.495495" height="22.5" fill="url(#Obj_Gradient_10)"/>
      </g>
      <g id="Graphic_151">
        <rect x="590.52586" y="279.0909" width="54" height="22.5" fill="url(#Obj_Gradient_11)"/>
      </g>
      <g id="Graphic_150">
        <rect x="550.3077" y="279.0909" width="40.495495" height="22.5" fill="url(#Obj_Gradient_12)"/>
      </g>
    </g>
  </g>
</svg>
