The pyseobnr package has failed to load, you will not be able to employ SEOBNRv5 approximants.
Loading dataset from outdir_GW150914/result/GW150914_data0_1126259462-4_sampling_part2.hdf5.
Loading dataset from outdir_GW150914/data/GW150914_data0_1126259462-4_generation_event_data.hdf5.
Estimating synthetic phase for 4951 samples.
Setting spin_conversion_phase = 0.0. Using this value for the phase parameter for conversion to cartesian spins.
Done. This took 107.24 s.
Setting spin_conversion_phase = 0.0. Using this value for the phase parameter for conversion to cartesian spins.
Calculating 4841 likelihoods.
Done. This took 3.94 seconds.
Number of samples: 5000
Log(evidence): -15833.668 +- 0.021
Effective samples 1593.1: (Sample efficiency = 31.86%)
Saving dataset to outdir_GW150914/result/GW150914_data0_1126259462-4_importance_sampling_part2.hdf5
