14:27 dingo_pipe INFO    : Command line arguments: Namespace(ini='outdir_GW150914/GW150914_config_complete.ini', verbose=False, calibration_model=None, spline_calibration_envelope_dict=None, spline_calibration_nodes=10, spline_calibration_curves=1000, idx=0, data_dump_file=None, event_data_file=None, proposal_samples_file=None, importance_sampling_generation=False, ignore_gwpy_data_quality_check=True, gps_tuple=None, gps_file=None, timeslide_file=None, timeslide_dict=None, trigger_time='1126259462.4', data_dict=None, data_format=None, allow_tape=True, channel_dict='{H1:GWOSC, L1:GWOSC}', frame_type_dict=None, data_find_url='https://datafind.ligo.org', data_find_urltype='osdf', detectors=['H1', 'L1'], duration=8.0, psd_dict=None, psd_fractional_overlap=0.0, post_trigger_duration=2.0, sampling_frequency=4096.0, psd_length=128, psd_maximum_duration=1024, psd_method='median', psd_start_time=None, maximum_frequency='1024.0', minimum_frequency='20.0', tukey_roll_off=0.4, resampling_method='lal', injection_dict=None, injection_file=None, accounting='dingo', accounting_user=None, label='GW150914_data0_1126259462-4_generation', local=False, local_generation=True, local_plot=False, outdir='outdir_GW150914', overwrite_outdir=False, request_disk=5.0, request_memory=8.0, request_memory_generation=8.0, request_cpus=1, request_cpus_importance_sampling=32, sampling_requirements=['TARGET.CUDAGlobalMemoryMb>40000'], extra_lines=['None'], simple_submission=False, conda_env=None, scheduler='condor', scheduler_args=None, scheduler_module=[None], scheduler_env=None, scheduler_analysis_time='7-00:00:00', submit=False, condor_job_priority=0, transfer_files=True, environment_variables=None, getenv=[None], additional_transfer_paths=[None], disable_hdf5_locking=False, log_directory=None, osg=False, desired_sites=None, analysis_executable=None, analysis_executable_parser=None, plot_data=False, plot_spectrogram=False, plot_corner=True, plot_weights=True, plot_log_probs=True, create_summary=True, email=None, notification='Never', queue=None, existing_dir=None, webdir=None, summarypages_arguments=None, result_format='hdf5', final_result=True, final_result_nsamples=20000, prior_dict=None, reference_frequency=None, waveform_approximant='IMRPhenomXPHM', model='/data/sgreen/dingo-experiments/XPHM/testing_inference/model.pt', model_init='/data/sgreen/dingo-experiments/XPHM/O1_init/model_stage_1.pt', recover_log_prob=True, device='cuda', num_gnpe_iterations=30, num_samples=50000, batch_size=50000, density_recovery_settings='ProxyRecoveryDefault', importance_sample=True, importance_sampling_settings='Default', importance_sampling_updates='{}', n_parallel=10)
14:27 dingo_pipe INFO    : Unknown command line arguments: []
14:27 dingo_pipe INFO    : PSD duration set to 1024.0s, 128x the duration 8.0s
14:27 dingo_pipe INFO    : Setting PSD for H1 from data
14:27 dingo_pipe INFO    : Using default PSD start time -1024.0 relative to start time
14:27 dingo_pipe INFO    : Getting psd-segment data for H1
14:27 dingo_pipe INFO    : Attempting to download data from GWOSC
14:27 dingo_pipe INFO    : Running: gwpy.timeseries.TimeSeries.fetch_open_data(ifo='H1', start=1126258432.4, end=1126259456.4, )
14:27 dingo_pipe INFO    : Sample rate matches data no resampling
14:27 dingo_pipe INFO    : PSD settings: window=Tukey, Tukey-alpha=0.1 roll-off=0.4, overlap=0.0, method=median
14:27 dingo_pipe INFO    : Getting analysis-segment data for H1
14:27 dingo_pipe INFO    : Attempting to download data from GWOSC
14:27 dingo_pipe INFO    : Running: gwpy.timeseries.TimeSeries.fetch_open_data(ifo='H1', start=1126259456.4, end=1126259464.4, )
14:27 dingo_pipe INFO    : Sample rate matches data no resampling
14:27 dingo_pipe INFO    : Setting PSD for L1 from data
14:27 dingo_pipe INFO    : Using default PSD start time -1024.0 relative to start time
14:27 dingo_pipe INFO    : Getting psd-segment data for L1
14:27 dingo_pipe INFO    : Attempting to download data from GWOSC
14:27 dingo_pipe INFO    : Running: gwpy.timeseries.TimeSeries.fetch_open_data(ifo='L1', start=1126258432.4, end=1126259456.4, )
14:27 dingo_pipe INFO    : Sample rate matches data no resampling
14:27 dingo_pipe INFO    : PSD settings: window=Tukey, Tukey-alpha=0.1 roll-off=0.4, overlap=0.0, method=median
14:27 dingo_pipe INFO    : Getting analysis-segment data for L1
14:27 dingo_pipe INFO    : Attempting to download data from GWOSC
14:27 dingo_pipe INFO    : Running: gwpy.timeseries.TimeSeries.fetch_open_data(ifo='L1', start=1126259456.4, end=1126259464.4, )
14:27 dingo_pipe INFO    : Sample rate matches data no resampling
14:27 dingo_pipe INFO    : Using default PSD start time -1024.0 relative to start time
14:27 dingo_pipe INFO    : Completed data generation
