000 (60718.000.000) 2024-03-27 14:43:24 Job submitted from host: <10.150.100.220:9618?addrs=10.150.100.220-9618&alias=saraswati.aei.mpg.de&noUDP&sock=schedd_3631642_ec67>
    DAG Node: GW150914_data0_1126259462-4_importance_sampling_part4_arg_0
...
001 (60718.000.000) 2024-03-27 14:43:32 Job executing on host: <10.150.6.35:9618?addrs=10.150.6.35-9618&alias=h0635.hypatia.local&noUDP&sock=startd_168892_7151>
	SlotName: slot1_1@h0635.hypatia.local
	CondorScratchDir = "/var/lib/condor/execute/dir_3194434"
	Cpus = 32
	Disk = 5405511
	GPUs = 0
	Memory = 8192
...
006 (60718.000.000) 2024-03-27 14:43:40 Image size of job updated: 412208
	403  -  MemoryUsage of job (MB)
	412208  -  ResidentSetSize of job (KB)
...
006 (60718.000.000) 2024-03-27 14:46:36 Image size of job updated: 2109124
	441  -  MemoryUsage of job (MB)
	451548  -  ResidentSetSize of job (KB)
...
005 (60718.000.000) 2024-03-27 14:46:36 Job terminated.
	(1) Normal termination (return value 0)
		Usr 0 00:57:52, Sys 0 00:00:18  -  Run Remote Usage
		Usr 0 00:00:00, Sys 0 00:00:00  -  Run Local Usage
		Usr 0 00:57:52, Sys 0 00:00:18  -  Total Remote Usage
		Usr 0 00:00:00, Sys 0 00:00:00  -  Total Local Usage
	0  -  Run Bytes Sent By Job
	0  -  Run Bytes Received By Job
	0  -  Total Bytes Sent By Job
	0  -  Total Bytes Received By Job
	Partitionable Resources :    Usage  Request Allocated 
	   Cpus                 :        0       32        32 
	   Disk (KB)            :        1  5242880   5405511 
	   GPUs                 :                           0 
	   Memory (MB)          :      441     8192      8192 
	   TimeExecute (s)      :      184                    
	   TimeSlotBusy (s)     :      185                    

	Job terminated of its own accord at 2024-03-27T13:46:36Z with exit-code 0.
...
