added dchiMinus1,2 to XLALSimInspiralWaveformParamsNonGRAreDefault()

31 jobs for testing_gr_FTA in 126 minutes and 2 seconds (queued for 5 seconds)
latest
Status Job ID Name Coverage
  .Pre
passed #700345
make-dist

00:08:17

 
  Lal
failed #700348
lal:conda:fftw

00:11:32

passed #700349
lal:conda:mkl

00:14:44

passed #700347
lal:deb

00:32:48

passed #700346
lal:rpm

00:20:53

 
  Lal Frame
skipped #700352
lalframe:conda
passed #700351
lalframe:deb

00:08:40

passed #700350
lalframe:rpm

00:09:41

 
  Lal Meta Io
skipped #700355
lalmetaio:conda
passed #700354
lalmetaio:deb

00:09:06

passed #700353
lalmetaio:rpm

00:07:37

 
  Lal Simulation
skipped #700358
lalsimulation:conda
passed #700357
lalsimulation:deb

00:19:15

passed #700356
lalsimulation:rpm

00:11:50

 
  Lal Burst
skipped #700361
lalburst:conda
passed #700360
lalburst:deb

00:17:00

passed #700359
lalburst:rpm

00:19:18

 
  Lal Inspiral
skipped #700364
lalinspiral:conda
passed #700363
lalinspiral:deb

00:18:22

failed #700362
lalinspiral:rpm

00:11:05

 
  Lal Pulsar
skipped #700367
lalpulsar:conda
passed #700366
lalpulsar:deb

00:19:19

passed #700365
lalpulsar:rpm

00:13:50

 
  Lal Inference
skipped #700370
lalinference:conda
failed #700369
lalinference:deb

00:30:13

skipped #700368
lalinference:rpm
 
  Lal Apps
skipped #700373
lalapps:conda
skipped #700372
lalapps:deb
skipped #700371
lalapps:rpm
 
  Documentation
failed #700374
documentation

00:04:45

 
  Integration Tests
failed #700375
top-level

00:19:55

 
Name Stage Failure
failed
lalinference:deb Lal Inference
lalinference*.dsc: found 1 matching files          
lalinference*.orig.*: found 1 matching files

ERROR: Uploading artifacts to coordinator... error error=couldn't execute POST against https://git.ligo.org/api/v4/jobs/700369/artifacts?artifact_format=zip&artifact_type=archive&expire_in=18h: Post https://git.ligo.org/api/v4/jobs/700369/artifacts?artifact_format=zip&artifact_type=archive&expire_in=18h: net/http: TLS handshake timeout id=700369 token=tC-rehXz
WARNING: Retrying... error=invalid argument
ERROR: Uploading artifacts to coordinator... error error=couldn't execute POST against https://git.ligo.org/api/v4/jobs/700369/artifacts?artifact_format=zip&artifact_type=archive&expire_in=18h: Post https://git.ligo.org/api/v4/jobs/700369/artifacts?artifact_format=zip&artifact_type=archive&expire_in=18h: net/http: TLS handshake timeout id=700369 token=tC-rehXz
WARNING: Retrying... error=invalid argument
ERROR: Uploading artifacts to coordinator... error error=couldn't execute POST against https://git.ligo.org/api/v4/jobs/700369/artifacts?artifact_format=zip&artifact_type=archive&expire_in=18h: Post https://git.ligo.org/api/v4/jobs/700369/artifacts?artifact_format=zip&artifact_type=archive&expire_in=18h: net/http: TLS handshake timeout id=700369 token=tC-rehXz
FATAL: invalid argument
ERROR: Job failed: exit code 1
failed
lalinspiral:rpm Lal Inspiral
make[1]: *** [check-recursive] Error 1
make[1]: Leaving directory `/builds/noah.sennett/lalsuite/rpmbuild/BUILD/lalinspiral-1.10.0'
make: *** [check] Error 2
error: Bad exit status from /var/tmp/rpm-tmp.YtekZg (%check)


RPM build errors:
Bad exit status from /var/tmp/rpm-tmp.YtekZg (%check)
ERROR: Job failed: exit code 1
failed
top-level Integration Tests
make[4]: Leaving directory `/builds/noah.sennett/lalsuite/lalsuite-6.67/_build/lalsimulation'
make[3]: *** [check] Error 2
make[3]: Leaving directory `/builds/noah.sennett/lalsuite/lalsuite-6.67/_build/lalsimulation'
make[2]: *** [check-recursive] Error 1
make[2]: Leaving directory `/builds/noah.sennett/lalsuite/lalsuite-6.67/_build'
make[1]: *** [check] Error 2
make[1]: Leaving directory `/builds/noah.sennett/lalsuite/lalsuite-6.67/_build'
make: *** [distcheck] Error 1
ERROR: Job failed: exit code 1
failed
lal:conda:fftw Lal
WARNING: conda/bld/linux-64/lal-*.conda: no matching files 
conda/bld/linux-64/lal-*.tar.bz2: found 1 matching files

WARNING: conda/bld/linux-64/python-lal-*.conda: no matching files
WARNING: conda/bld/linux-64/python-lal-*.tar.bz2: no matching files
WARNING: conda/bld/lal_*/work/test/test-suite.log: no matching files
WARNING: conda/bld/lal_*/work/test/python/test-suite.log: no matching files
WARNING: conda/bld/lal_*/work/*/*/*/test-suite.log: no matching files
Uploading artifacts to coordinator... ok
id=700348 responseStatus=201 Created token=VqGNppQy
ERROR: Job failed: exit code 1
failed
documentation Documentation
Makefile:938: recipe for target 'html-local' failed
make[2]: Leaving directory '/builds/noah.sennett/lalsuite/lalsimulation/doxygen'
make[2]: *** [html-local] Error 1
make[1]: *** [install-html-recursive] Error 1
Makefile:602: recipe for target 'install-html-recursive' failed
make[1]: Leaving directory '/builds/noah.sennett/lalsuite/lalsimulation'
Makefile:416: recipe for target 'install-html-recursive' failed
make: *** [install-html-recursive] Error 1
ERROR: Job failed: exit code 1