{
    "BNS": {
        "description": "Config file for BNS LHV_O4ExpectedPSD",
        "a": 0.00018755174973302303,
        "b": 0.00012245021617822993,
        "c": 0.00012791369312622979,
        "d": 0.00010878799753307725
    },
    "BBH": {
        "description": "Config file for BBH LHV_O4ExpectedPSD",
        "a": 9.524727886688647e-06,
        "b": 9.391103727331282e-05,
        "c": 7.5834407168360715e-06,
        "d": 6.627992756266056e-05
    },
    "NSBH": {
        "description": "Config file for NSBH LHV_O4ExpectedPSD",
        "a": 9.120853120484069e-05,
        "b": -5.180639037152758e-06,
        "c": 6.736334150105932e-05,
        "d": -4.804302720972587e-05
    },
    "BNS_EW_30": {
        "description": "BNS EW 30s, LHV O4 expected PSD",
        "a": 0.0003698483989184365,
        "b": 0.0008556161161683462,
        "c": 0.0002142295060543839,
        "d": 0.0007566325220578875
    },
    "BNS_EW_10": {
        "description": "BNS EW 30s, LHV O4 expected PSD",
        "a": 0.00023508280139721325,
        "b": 0.0005330636393590863,
        "c": 0.0001455465892298302,
        "d": 0.00035137063812415014
    }
}
