H1:LSC-DARM_ERR
104
46.7      0.006
60.0      0.10
87.4      0.05
109.82    0.05
110.01    0.05
120.0     0.15
121.97    0.05
122.12    0.07
180.0     0.2
193.94    0.01
240.0     0.2
242.07    0.3
279.24    0.2
279.94    0.2
299.27    0.2
300.0     0.3
300.73    0.2
308.8     3.0
329.51    0.015
329.585   0.02
329.77    0.02
335.08    0.02
335.82    0.02
336.55    0.02
341.95    0.02
342.675   0.015
343.28    0.02
343.41    0.05
343.93    0.03
344.06    0.05
344.52    0.03
344.68    0.02
344.71    0.03
344.83    0.05
345.45    0.01
345.56    0.01
346.442   0.01
346.532   0.01
347.04    0.03
347.17    0.04
347.27    0.04
346.54    0.004
347.577   0.005
347.68    0.04
347.72    0.04
348.45    0.02
357.18    0.3
360.0     0.4
392.365   0.005
393.1     0.006
393.835   0.005
420.0     0.3
480.0     0.3
540.0     0.4
546.048   0.005
564.066   0.004
566.099   0.004
568.046   0.005
568.098   0.004
600.0     0.4
646.38    0.01
648.835   0.007
686.91    0.05
688.02    0.04
688.28    0.05
689.13    0.03
689.43    0.02
689.51    0.04
689.74    0.045
694.025   0.025
694.275   0.04
694.58    0.04
695.205   0.02
695.41    0.03
695.47    0.03
720.0     0.4
780.0     0.5
840.0     0.5
900.0     0.5
960.0     0.6
1020.0    0.6
1030.55   0.03
1032.18   0.03
1032.575  0.04
1033.88   0.01
1034.33   0.01
1034.45   0.03
1034.794  0.045
1041.23   0.025
1041.615  0.03
1042.10   0.04
1043.02   0.015
1043.31   0.03
1043.43   0.02
1080.0    0.6
1140.0    0.7
1142.83   0.023
1143.57   0.023
1144.3    0.006
1200.0    0.7
1260.0    0.7
1320.0    0.8
1380.0    0.8
1440.0    0.9
H0:PEM-LVEA_SEISX
0
H0:PEM-LVEA_SEISY
0
H0:PEM-LVEA_SEISZ
0
H0:PEM-MX_SEISX
0
H0:PEM-MX_SEISY
0
H0:PEM-MX_SEISZ
0
H0:PEM-MY_SEISX
0
H0:PEM-MY_SEISY
0
H0:PEM-MY_SEISZ
0
H0:PEM-EX_SEISX
0
H0:PEM-EX_SEISY
0
H0:PEM-EX_SEISZ
0
H0:PEM-EY_SEISX
0
H0:PEM-EY_SEISY
0
H0:PEM-EY_SEISZ
0
H0:PEM-LVEA_WIND
0
H0:PEM-LVEA_WDIR
0
H0:PEM-MX_WIND
0
H0:PEM-MX_WDIR
0
H0:PEM-MY_WIND
0
H0:PEM-MY_WDIR
0
H0:PEM-EX_WIND
0
H0:PEM-EX_WDIR
0
H0:PEM-EY_WIND
