831475951 831475969
831488050 831488067
831488141 831488158
831488291 831488308
831488404 831488421
831488503 831488520
831554496 831554513
831571851 831571868
831571907 831571924
831578015 831578032
831578399 831578416
831578433 831578450
831578441 831578458
831578457 831578474
831578476 831578493
831578536 831578553
831583622 831583639
831583649 831583666
831583713 831583730
831583790 831583807
831583802 831583819
831583814 831583831
831583838 831583855
831583873 831583890
831584029 831584046
831584046 831584063
831584311 831584328
831584353 831584370
831584515 831584534
831584531 831584548
831584549 831584566
831585172 831585190
831585335 831585352
831585360 831585377
831585385 831585402
831586081 831586098
831586189 831586206
831586341 831586358
831586469 831586486
831586528 831586545
831586560 831586577
831586970 831586989
831587015 831587032
831587035 831587053
831587074 831587091
831587152 831587169
831587179 831587196
831587202 831587219
831587895 831587912
831588170 831588187
831588259 831588276
831588347 831588364
831588385 831588402
831588417 831588434
831589232 831589249
831589469 831589486
831589512 831589529
831589549 831589566
831589557 831589574
831589673 831589690
831590436 831590453
831649808 831649825
831649857 831649874
831649907 831649924
831670206 831670223
831670243 831670260
831670331 831670348
831670370 831670387
831670438 831670455
831670754 831670771
831671027 831671044
831671141 831671158
831671271 831671288
831671993 831672011
831672037 831672054
831672115 831672132
831672143 831672163
831672175 831672192
831672184 831672201
831672218 831672235
831672521 831672538
831672633 831672650
831672715 831672732
831672774 831672791
831673872 831673889
831673956 831673973
831673975 831673994
831674054 831674071
831674075 831674092
831674177 831674194
831674605 831674622
831674637 831674655
831674687 831674704
831674696 831674713
831674712 831674729
831674932 831674949
831674953 831674970
831725917 831725935
831756511 831756528
831756533 831756550
831756672 831756689
831756776 831756793
831756840 831756857
831756853 831756872
831756860 831756877
831757083 831757100
831757421 831757438
831757436 831757456
831757483 831757502
831757590 831757607
831757610 831757627
831757824 831757841
831757915 831757933
831757949 831757966
831757980 831757997
831758023 831758040
831758209 831758226
831758274 831758291
831758466 831758483
831758492 831758509
831758558 831758575
831758638 831758655
831759149 831759166
831759559 831759576
831759639 831759656
831766609 831766626
831933780 831933797
831933814 831933831
831933853 831933870
831984830 831984847
831984894 831984911
831990016 831990033
832071720 832071737
832158455 832158472
832247376 832247393
832418234 832418251
832480173 832480190
832521422 832521439
832531563 832531580
832534277 832534294
832536632 832536649
832536786 832536803
832678893 832678910
832678944 832678961
832714097 832714114
832859835 832859852
832936145 832936162
832936226 832936243
832936236 832936253
832962150 832962168
833021660 833021677
833108462 833108479
833162694 833162711
833280978 833280995
833285558 833285575
833285763 833285780
833287176 833287193
833288206 833288223
833303404 833303422
833306878 833306895
833312410 833312427
833312821 833312838
833317243 833317260
833317265 833317282
833317325 833317342
833318977 833318994
833326863 833326880
833337250 833337267
833337277 833337294
833337487 833337504
833338786 833338803
833339566 833339583
833339874 833339891
833339889 833339906
833339944 833339961
833340911 833340928
833340938 833340955
833340973 833340990
833341268 833341285
833341364 833341381
833341482 833341499
833341496 833341513
833341618 833341635
833341637 833341654
833341648 833341665
833342772 833342789
833342898 833342915
833342904 833342921
833342940 833342959
833342991 833343008
833343004 833343021
833343427 833343444
833343473 833343490
833368279 833368296
833378308 833378325
833378349 833378366
833379006 833379023
833379385 833379402
833379504 833379521
833379613 833379630
833379625 833379642
833379637 833379654
833379678 833379695
833379688 833379707
833379694 833379711
833379797 833379814
833381169 833381186
833381528 833381545
833381696 833381713
833381731 833381748
833381757 833381774
833381790 833381807
833381798 833381815
833381814 833381831
833381877 833381894
833383138 833383155
833386167 833386185
833561453 833561470
833562862 833562879
833566157 833566175
833571376 833571393
833627722 833627739
833634183 833634201
833634205 833634222
833634325 833634343
833636941 833636958
833637511 833637528
833637576 833637593
833638851 833638868
833673089 833673106
833806838 833806855
833806881 833806898
833886847 833886864
833886904 833886921
833886916 833886933
833920226 833920243
833920287 833920304
833921093 833921110
833953863 833953880
833954456 833954473
833954513 833954530
833964668 833964685
833964674 833964691
833967037 833967054
833967197 833967214
833972861 833972879
833993048 833993065
833993094 833993111
834046190 834046207
834072879 834072896
834140557 834140574
834167638 834167655
834169972 834169989
834180102 834180119
834181625 834181642
834181763 834181780
834181805 834181822
834181840 834181857
834189132 834189149
834190005 834190022
834193455 834193472
834236469 834236486
834275870 834275887
834318391 834318410
834337097 834337114
834341214 834341231
834341771 834341788
834355151 834355168
834404954 834404972
834435818 834435835
834441145 834441162
834441149 834441166
834441205 834441222
834494824 834494841
834494926 834494944
834495012 834495029
834496857 834496874
834499557 834499574
834500086 834500103
834500356 834500373
834506598 834506615
834507469 834507486
834508112 834508129
834508492 834508509
834520725 834520742
834521182 834521199
834619348 834619365
834752663 834752680
834761992 834762009
834762665 834762682
834763790 834763807
834764709 834764726
834766410 834766427
834767103 834767120
834779351 834779368
834785527 834785544
834786558 834786575
834786840 834786857
834786853 834786870
834787299 834787316
834846867 834846884
834848488 834848505
834848500 834848517
834848585 834848604
834848611 834848628
834849223 834849240
834849317 834849334
834849414 834849431
834870879 834870896
834870883 834870900
834911082 834911099
834911183 834911200
834911199 834911216
834925679 834925696
834926173 834926190
834926695 834926712
834927738 834927755
834945977 834945994
834946039 834946056
834950420 834950437
834950477 834950494
834950500 834950518
834950517 834950534
834955409 834955426
834956053 834956070
834957850 834957867
834959782 834959799
835082421 835082438
835082442 835082459
835096027 835096044
835112866 835112884
835112917 835112934
835124980 835124997
835126087 835126105
835129189 835129206
835135976 835135993
835184927 835184944
835233147 835233164
835272745 835272762
835277728 835277745
835299265 835299282
835357486 835357503
835357543 835357560
835359345 835359362
835360496 835360514
835366695 835366712
835368529 835368546
835370615 835370633
835370662 835370679
835371983 835372000
835374223 835374240
835374269 835374286
835374552 835374569
835381761 835381778
835383271 835383288
835383515 835383532
835392741 835392758
835393359 835393376
835446131 835446148
835489638 835489655
835539534 835539551
835546109 835546127
835546172 835546189
835547566 835547583
835557272 835557289
835560287 835560304
835560326 835560343
835614690 835614707
835614725 835614743
835614848 835614865
835614871 835614888
835614883 835614900
835614930 835614947
835614937 835614954
835614956 835614973
835614966 835614983
835614985 835615002
835615027 835615044
835615042 835615059
835623009 835623026
835629568 835629585
835629789 835629806
835632665 835632682
835641388 835641407
835641407 835641424
835693450 835693467
835712155 835712172
835712165 835712182
835712180 835712197
835719906 835719924
835722497 835722514
835731730 835731747
835735675 835735692
835743642 835743659
835796858 835796875
835802887 835802904
835812840 835812857
835966244 835966261
835966249 835966266
835966264 835966281
835972590 835972607
836029258 836029275
836073853 836073870
836073970 836073987
836073988 836074005
836128559 836128576
836137943 836137960
836138885 836138902
836141438 836141455
836159868 836159885
836163935 836163952
836167708 836167725
836177311 836177328
836202984 836203001
836219868 836219885
836225473 836225491
836230220 836230237
836242378 836242395
836245833 836245851
836245886 836245903
836247362 836247379
836253379 836253396
836255212 836255229
836293297 836293314
836323445 836323462
836323561 836323578
836325555 836325572
836329808 836329825
836341847 836341865
836341928 836341945
836410319 836410336
836515196 836515213
836515300 836515317
836515315 836515332
836515352 836515369
836516914 836516931
836565956 836565974
836565963 836565980
836577445 836577462
836652207 836652224
836661848 836661865
836664870 836664887
836748514 836748532
836750587 836750604
836752276 836752294
836755005 836755022
836755178 836755195
836756746 836756763
836756758 836756775
836759055 836759072
836770251 836770268
836841469 836841486
836863880 836863898
836920303 836920320
836925440 836925457
837014520 837014537
837014573 837014591
837086339 837086356
837206359 837206376
837256763 837256780
837364988 837365005
837365014 837365031
837394894 837394911
837399931 837399948
837407145 837407162
837409418 837409435
837410718 837410735
837415467 837415484
837426970 837426987
837448602 837448619
837457436 837457455
837458509 837458530
837460556 837460573
837460572 837460589
837464104 837464124
837465504 837465521
837465573 837465590
837466025 837466042
837467940 837467957
837518361 837518378
837522389 837522406
837522471 837522488
837532337 837532354
837533719 837533737
837538435 837538452
837539128 837539145
837539174 837539193
837539614 837539631
837544882 837544899
837546397 837546414
837548177 837548195
837550728 837550745
837550751 837550768
837613785 837613802
837617318 837617335
837620251 837620268
837620328 837620345
837626303 837626321
837629423 837629441
837629470 837629489
837631598 837631617
837632532 837632549
837632575 837632592
837633248 837633265
837635920 837635937
837636019 837636036
837788661 837788678
837945268 837945285
837955845 837955862
838035544 838035561
838044161 838044178
838044441 838044458
838236723 838236740
838387097 838387114
838387114 838387131
838391108 838391125
838391303 838391320
838396650 838396667
838404348 838404365
838404480 838404497
838404599 838404616
838414343 838414360
838415107 838415124
838502154 838502171
838502181 838502198
838506317 838506334
838506386 838506403
838596369 838596386
838599165 838599182
838646872 838646889
838657078 838657095
838657330 838657347
838694153 838694170
838725460 838725477
838731015 838731032
838746392 838746409
838753142 838753161
838754759 838754776
838812750 838812767
838832065 838832082
838984893 838984910
838984897 838984914
838998590 838998608
839000462 839000480
839001655 839001673
839015061 839015078
839015130 839015147
839019559 839019576
839019642 839019660
839023761 839023778
839023810 839023827
839070943 839070960
839078750 839078768
839100314 839100332
839105288 839105305
839106821 839106838
839158233 839158250
839158290 839158307
839162345 839162362
839163461 839163478
839168066 839168083
839171773 839171790
839178941 839178959
839186681 839186698
839190223 839190240
839228846 839228863
839229054 839229071
839247669 839247686
839252606 839252623
839258212 839258229
839259221 839259238
839268588 839268605
839268658 839268676
839340669 839340686
839340880 839340897
839341711 839341728
839356363 839356381
839356443 839356461
839358936 839358953
839364881 839364898
839366193 839366210
839385115 839385132
839426999 839427016
839428727 839428744
839431095 839431112
839431484 839431501
839433831 839433848
839433981 839433998
839434599 839434616
839436344 839436362
839436603 839436620
839436685 839436702
839438349 839438366
839441495 839441512
839441535 839441552
839441823 839441840
839442250 839442267
839442537 839442554
839442630 839442647
839442859 839442876
839487192 839487209
839507295 839507312
839595050 839595067
839595094 839595111
839595098 839595116
839595139 839595156
839603414 839603431
839606023 839606040
839613165 839613182
839613240 839613257
839617745 839617762
839681869 839681886
839681883 839681901
839730535 839730552
839785669 839785686
839785673 839785690
839785701 839785718
839789351 839789368
839800032 839800049
839847675 839847692
839873652 839873669
839876913 839876930
839884402 839884419
839884415 839884432
839919008 839919025
839942864 839942881
839943165 839943184
839943218 839943235
839943549 839943568
839943596 839943613
839946576 839946593
839948030 839948047
840025643 840025660
840029345 840029362
840221946 840221963
840222282 840222299
840452718 840452735
840471691 840471708
840539856 840539874
840539904 840539922
840539932 840539949
840540171 840540188
840568947 840568964
840570820 840570837
840573667 840573684
840573698 840573715
840576113 840576130
840643942 840643959
840648315 840648332
841049384 841049401
841057717 841057734
841057907 841057924
841100359 841100376
841102638 841102655
841104189 841104207
841110955 841110972
841111451 841111468
841112070 841112087
841112313 841112330
841112969 841112986
841113411 841113428
841113434 841113451
841113746 841113763
841114418 841114435
841114743 841114762
841114881 841114898
841115147 841115164
841128846 841128863
841129035 841129052
841129723 841129740
841130940 841130957
841132835 841132852
841134408 841134425
841139863 841139880
841181774 841181791
841182459 841182476
841182649 841182666
841182654 841182671
841183125 841183142
841185091 841185108
841185288 841185305
841186033 841186050
841186262 841186279
841186490 841186507
841186743 841186760
841186788 841186805
841187972 841187989
841188132 841188149
841188239 841188256
841188305 841188322
841190626 841190643
841190704 841190721
841191063 841191080
841191317 841191334
841191526 841191543
841191801 841191818
841191894 841191911
841192052 841192069
841193092 841193109
841193554 841193571
841194512 841194529
841194532 841194549
841194885 841194902
841197040 841197057
841200195 841200212
841201010 841201027
841201181 841201198
841202281 841202298
841203275 841203292
841205289 841205307
841206089 841206106
841206915 841206932
841207158 841207175
841208547 841208564
841209363 841209380
841211749 841211766
841213284 841213301
841220725 841220742
841224243 841224260
841224533 841224550
841224698 841224715
841232152 841232169
841232520 841232537
841280138 841280155
841282140 841282157
841283112 841283129
841286291 841286308
841286638 841286655
841289364 841289381
841289852 841289869
841365032 841365049
841553382 841553399
841638803 841638820
841672309 841672327
841681917 841681934
841698086 841698103
841703283 841703300
841719412 841719430
841766883 841766900
841766925 841766942
841784824 841784841
841811549 841811566
841849392 841849409
841877741 841877758
841881136 841881153
841881157 841881174
841881238 841881255
841881269 841881286
841881290 841881307
841881332 841881349
841881347 841881364
841881380 841881397
841881396 841881413
841881417 841881434
841881477 841881494
841881517 841881534
841881541 841881558
841881609 841881626
841881635 841881652
841881657 841881674
841881683 841881700
841881721 841881738
841881748 841881765
841881772 841881789
841881936 841881953
841881979 841881996
841882081 841882098
841882155 841882173
841882192 841882210
841882254 841882271
841882483 841882500
841882523 841882541
841882575 841882592
841882634 841882651
841882714 841882731
841882765 841882783
841882827 841882844
841882915 841882932
841883028 841883045
841883122 841883139
841883290 841883307
841883400 841883418
841883489 841883506
841883653 841883670
841883806 841883823
841883936 841883953
841884089 841884106
841884360 841884377
841884374 841884392
841905438 841905455
841905447 841905464
841905460 841905477
841910335 841910352
841910341 841910358
842002629 842002646
842011767 842011784
842020778 842020795
842023243 842023260
842035438 842035456
842051521 842051539
842053180 842053197
842061500 842061517
842061963 842061980
842063119 842063136
842065679 842065696
842066576 842066593
842069306 842069323
842069413 842069430
842073657 842073674
842096435 842096452
842102486 842102503
842102738 842102755
842188687 842188704
842188699 842188716
842188717 842188734
842198098 842198115
842208716 842208733
842217268 842217285
842224063 842224080
842234337 842234354
842252061 842252078
842260232 842260249
842261928 842261945
842261941 842261958
842266164 842266181
842269820 842269837
842303387 842303404
842304746 842304763
842325441 842325458
842329056 842329073
842331670 842331687
842334028 842334045
842340022 842340039
842340771 842340788
842349066 842349083
842353888 842353905
842364284 842364301
842371340 842371357
842371414 842371431
842375386 842375403
842521498 842521515
842521542 842521559
842521562 842521579
842521566 842521583
842537537 842537554
842560905 842560922
842613761 842613778
842618204 842618221
842630919 842630936
842630943 842630961
842638573 842638590
842650151 842650169
842653671 842653688
842671936 842671953
842694844 842694861
842710900 842710917
842772355 842772373
842772363 842772380
842772423 842772440
842772457 842772474
842772467 842772484
842772511 842772528
842772544 842772561
842776428 842776445
842780607 842780624
842780777 842780794
842780786 842780803
842780819 842780836
842780833 842780850
842780918 842780935
842780983 842781000
842781031 842781048
842781037 842781055
842781058 842781075
842781065 842781082
842781081 842781098
842781104 842781121
842781134 842781151
842781217 842781234
842781228 842781245
842781246 842781263
842788029 842788046
842788969 842788986
842789451 842789468
842789633 842789650
842790033 842790050
842790064 842790081
842790121 842790138
842790280 842790297
842790291 842790308
842790346 842790363
842790428 842790445
842790507 842790524
842790838 842790855
842791480 842791497
842791787 842791804
842791796 842791813
842791866 842791883
842791885 842791902
842791901 842791918
842793010 842793027
842793096 842793113
842793123 842793140
842793336 842793353
842793581 842793598
842793648 842793665
842793854 842793871
842793886 842793903
842794104 842794121
842794597 842794614
842794822 842794839
842795509 842795526
842796295 842796312
842796316 842796333
842796423 842796440
842797091 842797108
842797119 842797136
842797351 842797368
842798685 842798702
842798923 842798940
842799630 842799647
842800360 842800377
842800589 842800606
842800788 842800805
842800942 842800959
842801265 842801282
842801677 842801694
842801747 842801764
842801886 842801903
842802574 842802591
842802648 842802665
842803047 842803064
842803703 842803720
842804002 842804019
842804045 842804062
842804437 842804454
842804485 842804502
842805093 842805110
842805249 842805266
842805452 842805469
842805891 842805908
842807321 842807338
842810251 842810268
842810983 842811000
842812901 842812918
842813614 842813631
842813958 842813975
842814069 842814086
842814751 842814768
842815133 842815150
842816637 842816654
842817456 842817473
842817948 842817965
842820685 842820702
842820847 842820864
842821306 842821323
842824249 842824266
842824601 842824618
842824707 842824724
842825730 842825747
842827905 842827922
842853218 842853235
842853238 842853255
842856854 842856871
842856952 842856969
842856957 842856974
842856978 842856995
842857000 842857020
842878812 842878829
842879031 842879048
842879233 842879250
842879262 842879279
842879580 842879597
842881734 842881751
842881769 842881786
842881775 842881792
842888287 842888304
842888666 842888683
842890451 842890468
842890460 842890477
842890581 842890598
842890987 842891004
842895516 842895533
842896363 842896380
842897973 842897990
842898943 842898960
842900082 842900099
842900728 842900745
842901139 842901156
842902617 842902634
842902665 842902682
842902994 842903011
842903382 842903399
842903618 842903635
842903793 842903810
842904608 842904625
842904653 842904670
842904941 842904958
842905005 842905022
842905499 842905516
842905767 842905784
842905828 842905845
842906570 842906587
842906596 842906613
842909169 842909186
842909181 842909198
842909247 842909264
842909278 842909295
842909465 842909482
842910992 842911009
842914117 842914134
842918079 842918096
842931308 842931325
842931536 842931553
842932756 842932773
842934171 842934188
842935984 842936001
842936662 842936679
842944699 842944716
842945634 842945651
842946165 842946182
842948677 842948694
842953130 842953147
842954462 842954479
842955341 842955358
842955734 842955751
842957339 842957356
842960079 842960096
842960344 842960361
842961049 842961066
842961288 842961305
842961650 842961667
842963253 842963270
842963326 842963343
842963407 842963424
842963663 842963680
842964141 842964158
842964612 842964629
842964738 842964755
842964779 842964796
842964979 842964996
842965630 842965647
842966374 842966391
842966505 842966522
842966960 842966977
842967255 842967272
842967624 842967641
842967945 842967962
842969036 842969053
842969600 842969617
842969695 842969712
842969845 842969862
842970387 842970404
842970399 842970416
842970518 842970535
842970542 842970559
842970594 842970611
842970756 842970773
842971652 842971669
842971903 842971920
842971978 842971995
842972311 842972328
842972347 842972364
842972500 842972517
842972505 842972522
842972665 842972682
842972762 842972779
842972871 842972888
842972935 842972952
842973807 842973824
842974682 842974699
842974942 842974959
842975249 842975266
842975415 842975432
842975719 842975736
843004743 843004760
843006738 843006755
843007205 843007222
843008194 843008211
843008583 843008600
843016874 843016891
843018902 843018919
843019047 843019064
843040545 843040564
843040597 843040614
843041949 843041966
843048985 843049002
843050874 843050891
843051119 843051136
843051535 843051552
843051842 843051859
843052927 843052944
843052993 843053010
843052998 843053015
843053130 843053147
843055760 843055777
843056532 843056549
843057022 843057039
843058857 843058874
843059993 843060010
843060439 843060456
843065499 843065516
843065723 843065740
843068648 843068665
843070574 843070591
843104617 843104634
843121422 843121439
843121459 843121476
843141777 843141794
843141785 843141802
843141794 843141811
843141892 843141909
843141934 843141955
843193415 843193432
843194530 843194547
843195752 843195769
843195935 843195952
843196224 843196241
843196313 843196330
843196344 843196361
843196372 843196389
843196458 843196475
843196483 843196500
843213548 843213565
843213894 843213911
843213945 843213962
843214005 843214025
843214088 843214105
843214576 843214593
843214790 843214807
843214948 843214971
843215190 843215209
843215231 843215248
843215414 843215431
843215454 843215471
843215614 843215631
843215892 843215909
843216350 843216367
843217258 843217275
843217590 843217607
843217999 843218016
843218070 843218087
843218265 843218282
843218492 843218509
843218864 843218881
843219031 843219048
843219579 843219596
843219938 843219955
843220068 843220085
843220126 843220143
843220276 843220295
843220430 843220447
843220784 843220801
843220863 843220880
843220913 843220930
843221169 843221186
843222017 843222034
843222085 843222102
843222090 843222107
843222389 843222406
843222699 843222716
843223292 843223309
843223365 843223382
843223587 843223604
843223893 843223910
843224060 843224077
843224082 843224101
843224456 843224473
843224754 843224771
843224868 843224885
843224886 843224903
843224949 843224966
843225179 843225196
843225310 843225327
843225475 843225492
843225662 843225679
843225890 843225907
843225900 843225917
843226003 843226021
843227746 843227763
843227806 843227823
843227946 843227963
843228070 843228087
843228442 843228459
843229518 843229535
843229565 843229582
843229886 843229903
843230289 843230306
843230299 843230316
843230651 843230668
843230841 843230859
843230973 843230990
843231154 843231171
843231192 843231209
843231368 843231385
843231374 843231391
843245160 843245177
843250388 843250405
843252410 843252427
843254219 843254236
843304284 843304301
843372298 843372315
843372349 843372366
843372374 843372391
843372402 843372419
843379193 843379210
843379238 843379255
843379275 843379292
843379364 843379381
843379404 843379421
843385787 843385804
843390199 843390216
843390218 843390235
843412885 843412902
843412944 843412962
843414278 843414295
843419181 843419199
843419231 843419248
843419558 843419575
843420125 843420142
843420318 843420335
843420458 843420475
843421119 843421136
843422106 843422123
843423221 843423238
843423276 843423293
843430441 843430458
843456898 843456915
843476665 843476682
843480729 843480746
843481477 843481494
843482198 843482215
843487681 843487698
843488341 843488358
843488668 843488687
843498993 843499010
843500956 843500973
843501059 843501076
843501068 843501085
843552213 843552230
843570119 843570136
843570913 843570930
843579107 843579124
843579440 843579457
843579735 843579752
843580596 843580613
843582296 843582313
843586911 843586928
843587174 843587191
843594432 843594449
843596084 843596101
843617878 843617895
843627775 843627792
843631839 843631859
843635354 843635371
843666877 843666894
843758797 843758814
843783872 843783889
843817461 843817478
843828099 843828116
843828568 843828585
843829824 843829841
843830575 843830592
843830641 843830658
843832059 843832076
843855310 843855327
843856852 843856869
843857337 843857354
843981504 843981521
843997659 843997676
844005860 844005877
844006294 844006311
844006419 844006436
844011226 844011243
844011258 844011275
844011344 844011361
844011740 844011757
844012167 844012184
844012726 844012743
844012953 844012970
844013197 844013214
844013237 844013254
844017881 844017898
844028367 844028384
844031966 844031983
844032063 844032081
844044073 844044090
844065986 844066003
844066013 844066030
844087184 844087201
844087730 844087747
844100260 844100277
844103591 844103609
844107387 844107404
844112673 844112690
844113477 844113494
844113654 844113671
844191376 844191393
844263811 844263828
844268503 844268520
844269621 844269638
844273420 844273437
844273487 844273504
844274246 844274263
844274365 844274382
844325635 844325652
844325719 844325736
844349241 844349258
844352584 844352601
844372179 844372196
844372220 844372237
844425766 844425783
844425778 844425796
844425799 844425816
844425833 844425850
844444220 844444237
844462636 844462653
844463387 844463404
844509427 844509444
844518830 844518847
844519092 844519109
844519571 844519588
844519575 844519592
844519646 844519663
844519957 844519974
844599632 844599649
844599878 844599895
844618594 844618611
844695681 844695698
844696101 844696118
844776762 844776779
844777279 844777296
844777707 844777724
844777717 844777734
844780051 844780068
844780095 844780112
844780436 844780453
844780444 844780461
844781675 844781692
844931831 844931848
845007762 845007779
845279139 845279156
845392919 845392936
845401893 845401910
845403229 845403246
845481092 845481109
845539199 845539216
845583104 845583121
845583178 845583197
845654292 845654309
845655977 845655994
845730349 845730366
845816886 845816903
845816910 845816927
845912053 845912070
846081671 846081688
846088367 846088384
846089477 846089494
846089492 846089509
846090919 846090936
846092320 846092337
846092998 846093015
846095971 846095988
846095985 846096002
846096500 846096517
846249091 846249109
846249939 846249956
846279095 846279112
846279302 846279319
846279632 846279649
846331053 846331070
846336821 846336838
846422796 846422814
846426632 846426652
846428505 846428522
846428896 846428913
846431093 846431110
846438227 846438244
846456736 846456753
846538971 846538988
846556724 846556741
846582835 846582852
846594727 846594744
846594743 846594760
846595183 846595200
846606236 846606253
846689436 846689453
846786020 846786037
846860921 846860938
846865574 846865591
846878966 846878983
847032906 847032924
847209333 847209350
847209418 847209435
847216961 847216979
847304059 847304076
847354395 847354412
847354428 847354445
847354440 847354457
847355984 847356001
847356067 847356086
847356100 847356117
847356211 847356228
847356329 847356346
847356513 847356530
847382211 847382228
847393227 847393244
847414448 847414465
847414508 847414528
847414794 847414811
847415422 847415439
847429362 847429379
847429488 847429505
847429496 847429513
847429621 847429638
847433396 847433413
847434398 847434415
847482225 847482242
847510921 847510938
847510992 847511009
847511156 847511173
847511303 847511320
847511324 847511341
847511335 847511352
847511355 847511372
847511408 847511425
847511558 847511575
847543894 847543911
847544538 847544555
847858745 847858762
847858764 847858781
848052562 848052579
848060212 848060229
848072460 848072477
848072511 848072528
848187946 848187963
848188004 848188021
848213028 848213045
848214516 848214534
848214594 848214611
848214631 848214648
848214637 848214654
848214641 848214658
848214669 848214686
848214675 848214693
848214699 848214716
848214715 848214732
848214806 848214823
848214810 848214827
848247099 848247116
848363407 848363424
848365644 848365661
848442062 848442079
848451331 848451348
848453112 848453129
848493562 848493579
848500332 848500349
848502819 848502836
848591649 848591666
848600076 848600093
848609225 848609242
848665166 848665183
848671224 848671241
848686344 848686361
848701235 848701252
848757570 848757587
848757625 848757642
848757651 848757668
848914553 848914570
848951904 848951921
849086462 849086480
849097959 849097976
849098065 849098082
849098093 849098110
849197352 849197369
849389027 849389044
849474397 849474414
849540508 849540525
849541978 849541995
849547826 849547843
849624891 849624909
849631635 849631652
849631667 849631684
849633560 849633577
849669483 849669500
849669529 849669546
849732117 849732134
849735653 849735670
849890833 849890850
849891079 849891096
849891363 849891380
850051065 850051082
850051091 850051108
850122263 850122280
850146777 850146794
850147799 850147817
850158003 850158020
850226689 850226706
850230945 850230962
850231257 850231274
850231324 850231341
850232753 850232770
850417079 850417097
850449691 850449708
850593469 850593486
850678488 850678507
850839384 850839401
850846993 850847010
851260926 851260943
851342951 851342968
851347410 851347427
851347459 851347477
851349838 851349855
851356471 851356488
851356518 851356535
851384063 851384081
851441319 851441336
851453372 851453389
851457214 851457231
851457239 851457256
851666066 851666083
851686643 851686660
851686697 851686714
851686724 851686741
851686735 851686752
851686848 851686865
851759854 851759871
851759871 851759888
851766889 851766906
851801223 851801240
851804997 851805014
851805041 851805059
851805063 851805080
851809169 851809188
851871238 851871255
851886422 851886439
851950961 851950978
851960456 851960473
851963246 851963264
851997574 851997592
852007249 852007266
852087022 852087039
852134390 852134407
852134400 852134417
852143536 852143553
852239184 852239201
852257163 852257180
852266973 852266990
852273244 852273261
852281149 852281166
852281694 852281711
852284963 852284980
852286054 852286071
852288231 852288248
852289871 852289888
852322723 852322740
852327603 852327620
852340103 852340120
852341190 852341207
852346103 852346120
852356454 852356471
852358087 852358104
852367894 852367911
852369525 852369542
852371157 852371174
852371701 852371718
852373333 852373350
852377685 852377702
852378229 852378246
852379318 852379335
852380405 852380422
852382581 852382598
852421239 852421256
852422327 852422344
852429415 852429432
852433239 852433256
852433784 852433801
852437602 852437619
852440571 852440588
852443062 852443079
852443609 852443626
852444151 852444168
852445393 852445411
852454406 852454423
852455057 852455074
852467050 852467067
852472503 852472522
852502504 852502521
852504411 852504428
852504500 852504517
852513982 852513999
852519992 852520009
852521630 852521647
852522722 852522739
852527086 852527103
852530363 852530380
852530910 852530928
852531454 852531471
852546748 852546767
852551117 852551134
852552205 852552223
852554387 852554404
852555478 852555495
852556570 852556587
852560942 852560959
852561485 852561502
852568021 852568038
852572519 852572536
852572606 852572623
852575451 852575468
852577065 852577082
852577132 852577149
852580939 852580956
852581015 852581032
852584182 852584199
852599642 852599659
852599974 852599991
852612736 852612753
852614368 852614385
852614912 852614929
852617630 852617647
852621975 852621992
852640991 852641008
852642079 852642096
852642624 852642641
852646352 852646369
852646424 852646441
852657714 852657731
852658277 852658294
852658801 852658820
852659343 852659360
852665206 852665224
852733850 852733868
852733920 852733937
852891636 852891653
852908850 852908867
852921420 852921437
853064467 853064484
853074628 853074645
853084062 853084079
853252236 853252253
853677721 853677739
853857500 853857518
853857516 853857535
854474326 854474343
854478374 854478391
854479571 854479588
854490083 854490100
854546208 854546225
854647094 854647111
854737472 854737489
854742021 854742038
854925107 854925124
854925168 854925185
854982515 854982532
854982565 854982583
854982577 854982594
854982589 854982606
854997285 854997303
855003279 855003296
855061194 855061211
855072025 855072042
855154802 855154819
855162069 855162086
855163537 855163554
855177585 855177602
855326404 855326422
855337247 855337264
855351855 855351872
855418039 855418059
855445934 855445951
855558451 855558468
855698883 855698900
855699344 855699361
855699929 855699946
855702146 855702163
855702173 855702190
855702235 855702252
855707111 855707128
855718883 855718900
855718985 855719002
855720091 855720108
855721150 855721167
855721953 855721970
855723616 855723633
855729807 855729824
855730121 855730138
855730272 855730289
855731105 855731122
855731361 855731378
855731405 855731422
855732273 855732293
855732281 855732298
855732285 855732302
855732437 855732454
855732611 855732628
855733239 855733256
855733925 855733942
855733966 855733983
855734004 855734021
855734037 855734057
855734424 855734441
855734490 855734510
855735104 855735121
855735130 855735149
855735169 855735186
855735173 855735190
855735181 855735198
855743912 855743929
855744816 855744833
855744845 855744862
855744865 855744882
855744875 855744893
855744922 855744940
855745043 855745060
855745065 855745083
855745093 855745110
855746208 855746225
855746697 855746714
855747101 855747118
855747148 855747165
855749617 855749634
855749622 855749639
855749637 855749654
855749652 855749669
855749675 855749692
855749705 855749722
855749724 855749741
855749780 855749797
855749790 855749807
855749819 855749836
855749898 855749915
855749919 855749937
855749929 855749946
855750057 855750074
855750080 855750097
855750086 855750103
855750566 855750583
855750780 855750797
855751208 855751225
855752919 855752936
855753073 855753090
855753300 855753317
855754281 855754298
855754317 855754334
855754568 855754585
855754648 855754665
855755022 855755039
855755209 855755226
855755268 855755285
855755514 855755531
855756720 855756737
855756760 855756777
855764718 855764735
855770625 855770642
855774326 855774343
855774376 855774393
855783323 855783340
855783345 855783362
855790935 855790953
855791127 855791144
855841474 855841491
855848728 855848745
855860270 855860287
855939049 855939066
855952203 855952223
855958563 855958580
855958569 855958586
855958589 855958606
855959712 855959730
855969432 855969449
856012572 856012589
856016627 856016644
856021681 856021701
856023045 856023065
856105399 856105416
856124594 856124611
856124646 856124664
856143156 856143173
856194257 856194276
856194283 856194300
856194320 856194337
856296890 856296907
856296951 856296969
856296959 856296976
856297307 856297324
856299004 856299021
856306769 856306786
856307491 856307508
856374159 856374176
856378463 856378480
856380648 856380665
856380656 856380673
856399916 856399933
856553467 856553484
856553495 856553512
856559653 856559670
856689899 856689916
856722500 856722517
856729758 856729775
856780780 856780797
856810191 856810208
856810269 856810286
856821929 856821946
856822006 856822023
856865987 856866004
856887713 856887730
856900627 856900644
856907796 856907813
856908174 856908191
856968147 856968164
856970155 856970172
856971402 856971419
856982221 856982238
857062470 857062487
857090467 857090484
857141348 857141366
857142817 857142834
857147059 857147076
857147969 857147986
857153981 857153998
857163994 857164011
857164014 857164032
857166129 857166146
857169471 857169488
857169486 857169503
857224844 857224861
857227318 857227335
857227387 857227405
857227731 857227748
857248869 857248886
857248873 857248892
857250038 857250055
857250146 857250163
857306693 857306710
857306742 857306759
857310986 857311003
857314108 857314125
857318410 857318427
857318631 857318648
857322237 857322254
857336289 857336306
857337210 857337227
857400374 857400393
857401926 857401943
857420040 857420057
857420063 857420080
857422224 857422241
857422326 857422343
857427530 857427547
857492193 857492211
857497312 857497329
857504945 857504962
857574436 857574455
857574659 857574676
857667592 857667609
857675712 857675729
857731369 857731386
857731960 857731977
857757423 857757440
857767828 857767845
857819509 857819527
857819599 857819616
857824879 857824896
857919959 857919977
857919991 857920009
857924331 857924348
857924405 857924422
857924421 857924438
857926362 857926380
857926402 857926419
857926577 857926595
857927624 857927641
857927788 857927808
857927797 857927814
857941447 857941464
857941498 857941515
857941516 857941533
858011944 858011961
858014666 858014683
858014727 858014745
858093198 858093215
858093297 858093314
858093322 858093339
858097797 858097814
858104162 858104179
858104407 858104425
858168167 858168184
858178367 858178384
858268702 858268719
858283844 858283861
858294183 858294201
858296604 858296621
858296705 858296722
858296765 858296782
858296771 858296788
858296776 858296793
858302541 858302558
858306904 858306921
858306976 858306993
858307052 858307069
858307375 858307392
858311200 858311217
858311341 858311358
858311386 858311403
858311506 858311524
858311540 858311557
858346337 858346356
858346361 858346378
858346387 858346404
858346417 858346434
858346434 858346452
858353261 858353278
858360423 858360440
858432210 858432227
858451097 858451114
858451583 858451600
858451612 858451629
858451628 858451645
858451645 858451662
858522996 858523014
858531399 858531416
858536549 858536566
858539830 858539849
858602113 858602132
858620589 858620606
858620728 858620746
858620736 858620753
858621436 858621453
858621466 858621483
858628222 858628239
858633636 858633653
858684013 858684030
858686625 858686642
858687483 858687500
858690012 858690029
858690021 858690038
858710518 858710535
858714976 858714993
858717919 858717936
858809655 858809672
858810262 858810279
858879223 858879241
858883509 858883526
858962177 858962194
858966077 858966094
858968790 858968807
859032560 859032577
859065070 859065087
859065172 859065191
859065228 859065245
859071174 859071191
859122651 859122668
859132302 859132319
859133896 859133913
859137137 859137154
859156537 859156554
859214141 859214161
859230650 859230667
859230690 859230707
859235128 859235145
859287183 859287201
859299230 859299247
859299469 859299486
859299500 859299517
859299524 859299541
859312945 859312962
859312963 859312980
859312981 859312998
859320602 859320619
859321494 859321511
859321541 859321558
859321579 859321596
859323423 859323440
859323522 859323539
859330936 859330955
859330965 859330982
859403162 859403180
859425983 859426000
859567728 859567745
859569061 859569078
859572388 859572405
859572462 859572479
859740233 859740250
859756888 859756905
859756904 859756922
859756917 859756934
859828597 859828615
859902843 859902860
859993176 859993193
859993222 859993241
860001095 860001112
860011000 860011017
860172632 860172649
860173688 860173705
860181797 860181814
860181822 860181839
860185798 860185815
860187375 860187392
860245097 860245114
860245116 860245133
860245211 860245229
860245471 860245488
860337149 860337166
860352267 860352284
860354092 860354109
860427261 860427278
860497091 860497108
860497095 860497112
860522909 860522926
860523248 860523265
860537615 860537632
860585153 860585170
860585170 860585187
860585194 860585211
860761614 860761632
860767561 860767578
860776787 860776804
860776824 860776841
860776838 860776855
860776896 860776913
860776925 860776942
860903493 860903510
860941788 860941805
860952115 860952133
860958211 860958228
860963779 860963797
860979821 860979838
861037792 861037809
861050906 861050923
861114625 861114642
861115981 861115998
861123463 861123481
861123516 861123534
861123543 861123562
861140049 861140066
861361836 861361853
861368562 861368579
861370297 861370314
861372153 861372171
861372181 861372198
861375185 861375202
861375244 861375261
861376098 861376115
861387650 861387667
861388610 861388627
861391457 861391474
861391921 861391939
861457263 861457280
861521074 861521091
861533327 861533344
861533786 861533803
861553974 861553992
861562951 861562968
861597961 861597978
861602950 861602967
861616320 861616337
861642520 861642537
861647981 861647998
861658208 861658225
861717231 861717250
861992075 861992092
861995657 861995674
861995705 861995722
861995729 861995746
861995736 861995753
861995784 861995801
862000331 862000348
862000389 862000406
862002639 862002656
862056540 862056557
862057200 862057217
862061280 862061297
862063185 862063202
