847870596 847870613
848060212 848060229
848123993 848124010
848188004 848188021
848442062 848442079
848493562 848493579
848583198 848583215
848583277 848583294
848701235 848701252
848759329 848759346
848820837 848820854
849098058 849098075
849124050 849124067
849267893 849267910
849388980 849388997
849890833 849890850
850051091 850051108
850147800 850147817
850227829 850227846
850385893 850385910
850449691 850449708
850678488 850678505
850680547 850680564
850700862 850700879
850700866 850700883
851030037 851030054
851144394 851144412
851202775 851202792
851230495 851230512
851245977 851245994
851253725 851253742
851258019 851258036
851261815 851261832
851384064 851384081
851453116 851453133
851457165 851457182
851669816 851669833
851686643 851686660
851686723 851686740
851686735 851686752
851686848 851686865
851759871 851759888
851766855 851766872
851766904 851766921
851809169 851809188
851871238 851871255
851898188 851898205
851950961 851950978
852101970 852101987
852134378 852134395
852134399 852134416
852159901 852159918
852580487 852580504
852584261 852584278
852632447 852632464
852665164 852665181
852779551 852779568
853074628 853074645
853107788 853107805
853174701 853174718
853758070 853758087
853759296 853759313
853761112 853761129
853834887 853834904
853837023 853837040
853837134 853837151
853838766 853838783
853841618 853841635
853841983 853842000
853842451 853842468
853842755 853842772
853842943 853842960
853843039 853843057
853843684 853843701
853844039 853844056
853844285 853844302
853844745 853844762
853845014 853845031
853845670 853845687
853845684 853845701
853845732 853845749
853846676 853846693
853846790 853846807
853846894 853846911
853847001 853847018
853847023 853847040
853847056 853847073
853848079 853848096
853848937 853848954
853849179 853849196
853849390 853849407
853849915 853849932
853850161 853850178
853851004 853851021
853851043 853851060
853851196 853851213
853852441 853852458
853852456 853852473
853852815 853852832
853857500 853857517
853857518 853857535
853860038 853860055
853862588 853862605
854345830 854345847
854346100 854346117
854346520 854346537
854347271 854347288
854438598 854438615
854734960 854734977
854955576 854955593
854982565 854982582
855003308 855003325
855038500 855038517
855163538 855163555
855322754 855322771
855380501 855380518
855698883 855698900
855743912 855743929
855746208 855746225
855791157 855791174
855910456 855910473
855921617 855921634
855952203 855952220
855958568 855958586
856021683 856021700
856023352 856023369
856124646 856124664
856160097 856160114
856245856 856245873
856296889 856296906
856296951 856296968
856297006 856297023
856306769 856306786
856307490 856307507
856307505 856307522
856330617 856330634
856368773 856368790
856373586 856373603
856499399 856499416
856571057 856571074
856575717 856575734
856576937 856576954
856578353 856578370
856579893 856579910
856581756 856581773
856604551 856604568
856650227 856650244
856650301 856650318
856689899 856689916
856692517 856692534
856795671 856795688
856806007 856806024
856808605 856808622
856810191 856810208
856810268 856810286
857035006 857035023
857035345 857035362
857140281 857140298
857147060 857147077
857166180 857166197
857166194 857166211
857306693 857306710
857318634 857318651
857336290 857336307
857400376 857400393
857427530 857427547
857490810 857490827
857492194 857492211
857497871 857497888
857574444 857574461
857619299 857619316
857675712 857675729
857731902 857731919
857767783 857767800
857767826 857767844
857824879 857824896
857924332 857924349
857926363 857926380
857927685 857927702
857927790 857927807
857927797 857927814
857928285 857928302
857936233 857936250
857941448 857941465
857972578 857972595
857980866 857980883
858093297 858093314
858093620 858093637
858104408 858104425
858144556 858144573
858346339 858346356
858432210 858432227
858451584 858451601
858531399 858531416
858539830 858539847
858543431 858543448
858621432 858621449
858682816 858682833
858714403 858714420
858879224 858879241
858966077 858966094
858966123 858966140
858968732 858968749
859065070 859065087
859156538 859156555
859214144 859214161
859230650 859230667
859287184 859287201
859401918 859401935
859403163 859403180
859567179 859567196
859572388 859572405
859740228 859740245
859756841 859756858
859756904 859756921
860173688 860173705
860245116 860245133
860337149 860337166
860352287 860352304
860497094 860497111
860522903 860522920
860522908 860522925
860776832 860776849
860776838 860776855
860776879 860776896
860951377 860951394
860963780 860963797
861037468 861037485
861049196 861049215
861111487 861111504
861115981 861115998
861123463 861123480
861123515 861123532
861123542 861123561
861128342 861128359
861370297 861370314
861372154 861372171
861375244 861375261
861387557 861387574
861387592 861387609
861387628 861387645
861388610 861388627
861391921 861391938
861457263 861457281
861521074 861521091
861533353 861533370
861602951 861602968
861616323 861616340
861717232 861717249
861965541 861965558
861995657 861995674
861995701 861995718
861995705 861995722
861995782 861995799
862002639 862002656
862056539 862056556
862151413 862151430
862155128 862155145
862165913 862165930
862251009 862251026
862265126 862265143
862273510 862273527
862309481 862309498
862325228 862325245
862327010 862327027
862412908 862412925
862418292 862418309
862584955 862584972
862585288 862585305
862605030 862605047
862669042 862669060
862745526 862745543
862775058 862775075
862811129 862811146
862831598 862831615
862848305 862848322
862849391 862849408
862849467 862849484
862853761 862853779
862856540 862856557
862857903 862857920
862857924 862857941
862861296 862861313
862863189 862863206
862863208 862863225
862868816 862868833
862884328 862884345
862888724 862888741
862911849 862911866
862916656 862916673
862916666 862916683
862920214 862920231
862922334 862922351
862932876 862932894
862933146 862933163
862939410 862939427
863110601 863110618
863208046 863208063
863375813 863375830
863388481 863388499
863444020 863444037
863444083 863444100
863457073 863457090
863457120 863457137
863459678 863459695
863459697 863459714
863459767 863459784
863459806 863459823
863534473 863534490
863541578 863541595
863544804 863544821
863546520 863546537
863774071 863774088
863794421 863794438
863795297 863795314
863795829 863795846
863796207 863796224
863796239 863796256
863796386 863796405
863796413 863796430
863801620 863801637
863801978 863801995
863802039 863802056
863804131 863804149
863810546 863810563
863815812 863815829
863816316 863816333
863873092 863873109
863968438 863968455
863968915 863968932
863972919 863972936
863973031 863973049
863973941 863973958
863974006 863974023
863982174 863982192
864051294 864051311
864072960 864072978
864073655 864073672
864143752 864143769
864151835 864151853
864151894 864151911
864160787 864160804
864216682 864216699
864216766 864216783
864216781 864216800
864227547 864227565
864244358 864244375
864407563 864407580
864440367 864440384
864504326 864504343
864505678 864505695
864508744 864508761
864578795 864578812
864671948 864671965
864735680 864735697
864735756 864735773
864735987 864736004
864737125 864737142
864749939 864749956
864749989 864750006
864750018 864750035
864763778 864763795
864998305 864998322
865001177 865001194
865001315 865001332
865006739 865006756
865006918 865006935
865006969 865006986
865007241 865007258
865007314 865007331
865007509 865007526
865007833 865007850
865009591 865009608
865010819 865010836
865021998 865022015
865022444 865022461
865022461 865022478
865022771 865022788
865084282 865084299
865101809 865101826
865101886 865101903
865101903 865101920
865178760 865178777
865182583 865182600
865189386 865189403
865189840 865189859
865192001 865192019
865192898 865192915
865192915 865192932
865193382 865193399
865193873 865193890
865253441 865253458
865254705 865254722
865261488 865261505
865265017 865265034
865276295 865276312
865277561 865277578
865278436 865278453
865279093 865279110
865280672 865280691
865427774 865427791
865429018 865429035
865602274 865602291
865608328 865608345
865614839 865614857
865614923 865614940
865616185 865616202
865616265 865616282
865619324 865619341
865620577 865620594
865620611 865620628
865621202 865621220
865623727 865623744
865663910 865663927
865663916 865663933
865684388 865684405
865684439 865684456
865684460 865684478
865684465 865684482
865768893 865768910
865776909 865776926
865781256 865781273
865783749 865783766
865783936 865783953
865785335 865785352
865785659 865785676
865796207 865796224
865862979 865862996
865863967 865863984
865865204 865865221
865865261 865865278
865865866 865865883
865868872 865868889
865879480 865879497
865895016 865895033
866217306 866217323
866220777 866220794
866252318 866252335
866325416 866325433
866325459 866325476
866471816 866471833
866482566 866482583
866485732 866485749
866485736 866485753
866487201 866487219
866487271 866487288
866520089 866520106
866542378 866542395
866571643 866571660
866575074 866575091
866575087 866575104
866575611 866575628
866576188 866576205
866669874 866669891
866766798 866766815
866809424 866809441
866822430 866822447
866822442 866822459
866822455 866822472
866823925 866823942
866823944 866823961
866824006 866824023
866824179 866824196
866830794 866830811
866831453 866831470
866833070 866833087
866833360 866833377
866833490 866833507
866840851 866840868
866897330 866897347
866900341 866900358
866900348 866900365
866996034 866996051
866996269 866996286
866996318 866996335
866996559 866996576
866996800 866996817
866997100 866997117
866997604 866997621
866997635 866997652
866998471 866998488
867003496 867003513
867003517 867003534
867004766 867004783
867004826 867004843
867005971 867005988
867006257 867006274
867006401 867006418
867006531 867006548
867154805 867154822
867162697 867162714
867162923 867162940
867163077 867163094
867163455 867163472
867164506 867164523
867165099 867165116
867166363 867166380
867166404 867166421
867167300 867167317
867167381 867167398
867167462 867167479
867167602 867167619
867167665 867167682
867167798 867167815
867167836 867167853
867167971 867167988
867168201 867168218
867168643 867168660
867168812 867168829
867169034 867169051
867169161 867169178
867170459 867170476
867170501 867170518
867170564 867170581
867170666 867170683
867171422 867171439
867176367 867176384
867176544 867176561
867176929 867176946
867177078 867177095
867177572 867177589
867177625 867177642
867177875 867177892
867178607 867178624
867180543 867180560
867182682 867182699
867183087 867183104
867184011 867184028
867184920 867184937
867187431 867187448
867190121 867190138
867420410 867420427
867420690 867420707
867421005 867421022
867421102 867421119
867421535 867421552
867423141 867423158
867423974 867423991
867425605 867425622
867425876 867425893
867426297 867426314
867430522 867430539
867433495 867433512
867436816 867436833
867437616 867437633
867440678 867440695
867455312 867455329
867455482 867455499
867455617 867455634
867478016 867478033
867478023 867478040
867499967 867499984
867499981 867499998
867500465 867500482
867500684 867500701
867500901 867500918
867502603 867502620
867502682 867502699
867502689 867502706
867502703 867502720
867502805 867502823
867502856 867502873
867503216 867503233
867503225 867503242
867503312 867503329
867680632 867680649
867681523 867681540
867681597 867681614
867682657 867682674
867682954 867682971
867816810 867816827
867940696 867940713
867960711 867960728
868019049 868019066
868031012 868031029
868033127 868033144
868039151 868039168
868047136 868047153
868173150 868173167
868212859 868212879
868216654 868216671
868304931 868304948
868376162 868376179
868377735 868377752
868398780 868398797
868556012 868556029
868805686 868805703
868807646 868807663
868881201 868881218
868901234 868901251
868913561 868913578
868968294 868968311
868989498 868989515
868990446 868990463
869226861 869226878
869316466 869316483
869357493 869357510
869406942 869406959
869412965 869412982
869427996 869428013
869429948 869429965
869436247 869436264
869685972 869685989
869763475 869763492
869845586 869845603
869854674 869854691
869854726 869854743
869854915 869854932
869854956 869854973
869855084 869855101
869855320 869855338
870044505 870044522
870104379 870104396
870107077 870107094
870112391 870112409
870123428 870123445
870130017 870130034
870458920 870458938
870465631 870465648
870465858 870465875
870465903 870465920
870465908 870465925
870591883 870591900
870601342 870601359
870803803 870803820
870806762 870806779
870827089 870827106
870827170 870827187
870892296 870892313
871071567 871071584
871199077 871199094
871227856 871227873
871236366 871236383
871236410 871236427
871374281 871374298
871484822 871484839
871579569 871579586
871739001 871739018
871934706 871934723
871934747 871934764
871993771 871993788
871994845 871994862
872109742 872109760
872112169 872112186
872273477 872273495
872277494 872277511
872279395 872279412
872279544 872279561
872285737 872285754
872287279 872287296
872337953 872337970
872423450 872423467
872423631 872423648
872425950 872425967
872426001 872426018
872426070 872426087
872426648 872426665
872426774 872426791
872427237 872427254
872427490 872427510
872428001 872428018
872428388 872428405
872428477 872428494
872428689 872428706
872428936 872428953
872429200 872429217
872429398 872429415
872429829 872429846
872429861 872429878
872429909 872429926
872429914 872429931
872429954 872429971
872430019 872430036
872430149 872430166
872430880 872430899
872430910 872430927
872430949 872430966
872430993 872431010
872431047 872431064
872431082 872431099
872431168 872431185
872431321 872431338
872431424 872431441
872431668 872431685
872431703 872431720
872432707 872432724
872433390 872433407
872433406 872433424
872433439 872433456
872433646 872433663
872433708 872433725
872433738 872433755
872437046 872437063
872437835 872437852
872437957 872437974
872438015 872438032
872439444 872439461
872439449 872439466
872439734 872439751
872440071 872440089
872440499 872440516
872442895 872442912
872444882 872444899
872450336 872450353
872450525 872450542
872450983 872451000
872451771 872451788
872452259 872452276
872452618 872452635
872457511 872457528
872522493 872522510
872524026 872524043
872596449 872596467
872596685 872596702
872596967 872596984
872597000 872597017
872597690 872597707
872598869 872598886
872598897 872598914
872598915 872598932
872599398 872599415
872656474 872656491
872657511 872657528
872707460 872707477
872855963 872855980
873027951 873027968
873032218 873032235
873032282 873032299
873033149 873033166
873037939 873037959
873041439 873041456
873052585 873052602
873069931 873069948
873222110 873222127
873223061 873223079
873223951 873223968
873225465 873225482
873225668 873225685
873232081 873232098
873300006 873300023
873301963 873301980
873305884 873305901
873306669 873306686
873309169 873309186
873309195 873309212
873309785 873309802
873310613 873310630
873482158 873482175
873488510 873488527
873489130 873489147
873490340 873490357
873493585 873493602
873547159 873547176
873553969 873553986
873554700 873554718
873556674 873556691
873663750 873663768
873819460 873819477
873836634 873836651
873954735 873954752
874018071 874018088
874083241 874083258
874161448 874161465
874243879 874243896
874244570 874244587
874257113 874257130
874257131 874257148
874258747 874258764
874262245 874262262
874262444 874262461
874269032 874269049
874276143 874276160
874333930 874333947
874338036 874338053
874359233 874359251
874359238 874359255
874359787 874359804
874412040 874412057
874416899 874416916
874541202 874541219
874541236 874541253
874603398 874603415
874674811 874674828
874699112 874699129
874907355 874907372
874944862 874944879
874945196 874945213
874945263 874945280
875053827 875053844
875132799 875132816
875149043 875149060
875222139 875222156
