824674558 824674561
824678719 824678720
824683021 824683023
824729845 824729847
824729962 824729964
824730000 824730002
824730029 824730031
824742761 824742762
824750484 824750485
824825561 824825563
824825565 824825566
824825967 824825968
824837231 824837233
824844896 824844897
824858247 824858248
824872767 824872770
824872781 824872782
824959241 824959242
824996779 824996783
825014709 825014712
825097924 825097928
825099453 825099456
825099469 825099472
825101860 825101868
825106315 825106316
825106379 825106384
825106395 825106400
825110377 825110379
825110389 825110391
825110974 825110980
825170450 825170452
825170480 825170482
825170486 825170489
825170491 825170493
825170499 825170504
825176865 825176867
825240639 825240641
825246105 825246106
825482235 825482237
825529250 825529251
825540015 825540016
825582018 825582020
825590820 825590822
825615224 825615226
825654192 825654194
825700113 825700115
825701644 825701647
825711359 825711360
825714001 825714003
825714045 825714052
825714055 825714057
825714058 825714060
825714077 825714080
825739632 825739633
825764380 825764381
825770431 825770432
825780701 825780703
825780707 825780708
825822820 825822822
825869739 825869741
825873712 825873714
825873721 825873723
825873742 825873744
825873751 825873755
825873766 825873768
825873772 825873782
825880426 825880428
825889620 825889622
825910633 825910634
825913210 825913212
825915070 825915071
825915180 825915182
825941047 825941049
825956707 825956708
825965892 825965894
825966589 825966592
825975595 825975597
825978092 825978093
825979434 825979435
825980958 825980960
826045220 826045222
826045229 826045230
826062513 826062515
826176801 826176803
826229400 826229402
826273988 826273990
826305325 826305327
826310178 826310180
826310187 826310189
826310191 826310196
826310694 826310696
826316363 826316369
826320940 826320941
826320944 826320945
826326944 826326945
826334451 826334454
826356796 826356797
826368322 826368323
826387556 826387557
826469870 826469871
826477713 826477715
826478651 826478653
826478655 826478657
826489479 826489480
826547971 826547972
826556168 826556169
826564575 826564578
826564583 826564585
826564587 826564589
826564606 826564610
826564649 826564664
826564665 826564671
826564672 826564683
826573780 826573782
826574351 826574353
826643625 826643627
826648918 826648919
826656834 826656837
826662104 826662107
826730506 826730507
826735295 826735297
826739235 826739236
826810542 826810544
826812910 826812911
826822029 826822031
826824697 826824699
826837353 826837355
826910070 826910072
826910075 826910078
826911399 826911401
826913977 826913983
826936921 826936923
826936925 826936939
826936946 826936948
826966028 826966029
827031854 827031856
827032381 827032383
827082815 827082818
827082824 827082827
827082832 827082835
827082847 827082849
827082854 827082860
827082867 827082872
827082874 827082876
827082877 827082879
827082885 827082887
827082888 827082894
827082895 827082898
827093011 827093012
827101415 827101417
827161515 827161516
827237188 827237189
827267796 827267798
827291900 827291902
827352977 827352978
827447830 827447833
827458086 827458088
827460242 827460243
827510676 827510680
827510694 827510696
827510703 827510709
827510721 827510725
827596688 827596689
827618506 827618508
827687660 827687663
827687665 827687667
827687668 827687672
827687675 827687678
827697348 827697349
827703913 827703915
827771589 827771590
827773061 827773064
827784131 827784132
827849247 827849248
827987324 827987325
828136100 828136102
828153416 828153418
828192657 828192658
828284956 828284957
828342814 828342815
828619901 828619903
828716465 828716466
828799001 828799003
828889472 828889474
828891277 828891278
828995024 828995026
829240922 829240924
829248335 829248337
829260640 829260642
829328755 829328756
829335974 829335975
829347162 829347163
829351247 829351248
829380214 829380216
829395385 829395386
829501600 829501602
829504793 829504795
829611200 829611202
829634661 829634662
829672680 829672681
829726216 829726217
829793553 829793554
829793555 829793557
829890260 829890261
829937806 829937808
829981980 829981981
830036671 830036672
830113844 830113846
830127783 830127784
830155758 830155759
830187226 830187227
830194158 830194163
830194184 830194188
830194190 830194198
830194204 830194210
830196106 830196107
830202002 830202005
830202006 830202010
830202011 830202014
830202020 830202029
830204943 830204946
830209826 830209831
830209838 830209840
830209843 830209849
830273402 830273404
830277629 830277630
830277662 830277664
830277669 830277671
830277674 830277679
830281889 830281890
830286480 830286486
830286491 830286493
830286495 830286504
830320711 830320714
830342821 830342823
830387273 830387274
830394479 830394483
830428705 830428707
830452116 830452117
830534162 830534164
830537659 830537662
830537664 830537665
830538389 830538391
830538431 830538433
830538435 830538438
830540568 830540569
830545274 830545288
830547785 830547788
830547798 830547800
830547802 830547804
830547805 830547806
830547809 830547817
830547829 830547833
830548472 830548473
830551847 830551849
830551850 830551852
830551863 830551866
830705954 830705955
830722089 830722091
830722719 830722721
830722779 830722780
830723081 830723083
830723241 830723243
830723248 830723250
830723254 830723256
830800855 830800856
830811448 830811449
830815453 830815455
830833523 830833525
830845779 830845780
830869464 830869465
830892713 830892715
830895311 830895315
830904874 830904876
830985447 830985450
830985453 830985455
830985458 830985460
831056866 831056868
831062061 831062063
831065007 831065009
831096939 831096940
831104668 831104670
831104681 831104684
831134239 831134241
831134247 831134249
831134326 831134328
831134365 831134371
831134375 831134377
831134388 831134392
831134409 831134411
831134413 831134419
831134420 831134428
831134429 831134436
831142245 831142247
831142253 831142255
831142475 831142477
831144456 831144459
831144490 831144493
831144494 831144496
831144498 831144501
831144502 831144508
831149990 831149992
831151237 831151240
831162112 831162114
831162346 831162348
831163054 831163056
831163471 831163472
831163895 831163897
831164541 831164544
831165008 831165010
831165377 831165380
831165512 831165513
831165609 831165611
831165613 831165614
831165619 831165622
831166173 831166175
831166958 831166961
831167099 831167101
831167136 831167138
831167180 831167187
831167190 831167192
831167539 831167541
831167546 831167548
831167549 831167551
831167961 831167964
831167990 831167993
831168047 831168049
831168102 831168105
831168106 831168109
831168147 831168149
831168173 831168175
831168190 831168193
831168194 831168196
831171520 831171522
831171602 831171604
831176471 831176473
831208278 831208280
831208283 831208285
831208317 831208319
831208321 831208323
831208334 831208335
831242148 831242151
831242155 831242157
831247148 831247150
831264585 831264588
831277173 831277174
831323522 831323525
831331593 831331595
831344034 831344036
831344045 831344047
831387817 831387819
831396068 831396070
831396082 831396084
831396086 831396088
831412661 831412662
831419091 831419093
831420998 831421000
831421001 831421003
831454734 831454736
831465603 831465604
831475534 831475536
831495687 831495688
831498841 831498842
831510553 831510557
831582612 831582613
831588830 831588832
831616695 831616697
831621238 831621240
831621241 831621242
831631002 831631005
831669190 831669195
831669199 831669200
831673916 831673918
831688973 831688974
831695873 831695904
831695905 831695917
831742859 831742860
831765210 831765211
831811972 831811974
831851689 831851690
831857862 831857864
831924013 831924017
831924024 831924028
831924037 831924038
831924039 831924042
831924048 831924051
831924055 831924057
831924060 831924065
831934044 831934045
831956335 831956336
831982733 831982734
832008902 832008903
832017727 832017728
832045290 832045292
832045421 832045424
832045533 832045535
832045712 832045714
832045715 832045716
832045718 832045720
832049760 832049761
832089816 832089817
832089818 832089820
832100554 832100556
832109383 832109386
832111396 832111397
832111575 832111577
832116483 832116485
832197084 832197085
832284926 832284929
832296458 832296460
832300428 832300430
832331764 832331765
832339015 832339017
832404340 832404341
832427265 832427266
832454607 832454609
832465151 832465157
832465173 832465175
832465254 832465256
832465458 832465460
832479856 832479857
832509815 832509816
832539543 832539545
832540271 832540273
832540884 832540886
832542567 832542568
832545056 832545057
832561886 832561889
832601939 832601941
832601944 832601945
832613859 832613860
832619113 832619115
832627557 832627560
832643917 832643920
832650622 832650623
832652851 832652853
832658079 832658081
832667462 832667467
832682562 832682564
832688422 832688424
832690163 832690167
832699055 832699057
832716694 832716700
832725274 832725275
832801967 832801972
832821969 832821970
832821976 832821978
832837258 832837260
832889626 832889628
832923584 832923586
832950599 832950601
833035635 833035637
833051364 833051366
833054486 833054488
833054495 833054497
833057381 833057384
833069191 833069193
833075167 833075169
833089662 833089664
833091182 833091183
833122124 833122126
833124561 833124564
833134334 833134336
833134343 833134350
833137606 833137611
833140817 833140821
833144700 833144702
833147271 833147273
833148484 833148486
833221513 833221515
833221557 833221561
833227331 833227332
833230706 833230709
833235215 833235217
833269413 833269415
833292377 833292379
833296404 833296409
833304668 833304670
833307771 833307773
833317939 833317940
833320147 833320149
833320153 833320154
833324061 833324062
833369511 833369514
833396806 833396809
833396811 833396814
833396819 833396822
833396829 833396831
833398091 833398093
833412459 833412460
833414803 833414805
833418062 833418063
833433252 833433253
833446740 833446741
833451134 833451135
833480337 833480338
833576876 833576877
833578467 833578468
833580710 833580712
833580715 833580717
833663500 833663503
833667701 833667704
833667705 833667709
833681859 833681861
833728668 833728670
833728671 833728673
833742354 833742356
833753692 833753693
833756548 833756550
833756552 833756553
833756555 833756557
833756568 833756569
833771873 833771874
833811844 833811846
833815605 833815607
833815609 833815610
833836647 833836649
833845589 833845591
833845593 833845596
833845615 833845617
833845627 833845631
833845632 833845635
833847393 833847394
833868633 833868634
833885547 833885548
833936852 833936853
833947563 833947565
834037338 834037340
834040678 834040680
834047987 834047990
834069566 834069567
834092009 834092011
834097729 834097730
834105156 834105157
834117431 834117432
834126740 834126742
834163754 834163756
834189236 834189238
834193602 834193603
834206184 834206185
834218912 834218913
834270536 834270538
834282054 834282056
834294410 834294412
834301880 834301881
834312215 834312216
834322706 834322708
834322714 834322716
834323002 834323004
834333337 834333338
834333354 834333356
834340034 834340036
834340038 834340040
834345833 834345835
834350584 834350585
834350586 834350587
834358429 834358433
834374714 834374716
834390176 834390178
834390189 834390190
834418163 834418164
834422487 834422489
834424302 834424303
834435527 834435534
834437804 834437805
834460785 834460787
834509329 834509330
834510815 834510817
834520146 834520147
834524289 834524293
834568203 834568204
834571218 834571219
834596646 834596647
834631956 834631957
834636298 834636299
834642563 834642565
834646520 834646522
834649782 834649784
834660836 834660837
834665167 834665168
834667196 834667198
834676246 834676248
834687750 834687752
834691117 834691119
834707502 834707503
834715926 834715927
834723909 834723911
834727120 834727121
834731727 834731729
834733107 834733109
834744446 834744448
834744449 834744450
834765454 834765455
834765461 834765462
834778658 834778659
834779962 834779964
834779966 834779968
834781895 834781897
834787795 834787796
834795926 834795927
834800007 834800009
834800147 834800149
834800225 834800226
834801531 834801533
834811149 834811151
834811191 834811193
834833077 834833078
834841041 834841042
834844492 834844494
834846572 834846574
834873851 834873852
834878096 834878097
834896185 834896187
834930416 834930417
834932830 834932832
834950373 834950374
834954844 834954846
834960434 834960435
834963577 834963582
835005698 835005700
835009415 835009416
835039738 835039740
835047607 835047609
835099661 835099663
835099672 835099673
835102106 835102107
835103046 835103047
835148463 835148465
835148485 835148488
835149563 835149564
835212360 835212361
835253932 835253934
835264292 835264293
835275761 835275762
835372515 835372516
835392125 835392129
835401067 835401068
835404411 835404412
835411658 835411660
835443420 835443421
835450040 835450042
835455197 835455202
835480056 835480060
835482894 835482895
835486621 835486622
835498893 835498895
835501930 835501932
835503731 835503733
835505952 835505953
835508647 835508648
835567488 835567490
835567491 835567492
835643704 835643707
835648034 835648036
835696824 835696826
835721855 835721856
835731781 835731783
835770760 835770761
835804342 835804344
835818153 835818154
835848164 835848166
835888416 835888417
835895155 835895158
835954346 835954348
835958904 835958905
835969094 835969099
835970603 835970605
835976637 835976643
835976648 835976651
835978800 835978801
835984134 835984135
835988689 835988691
835989615 835989619
835989640 835989642
835989643 835989649
835989650 835989652
835989660 835989664
835991557 835991559
835997885 835997887
835997891 835997894
835997907 835997909
835997915 835997917
835997926 835997927
836039524 836039526
836039554 836039556
836039641 836039643
836063491 836063492
836067089 836067091
836080694 836080696
836097908 836097909
836119291 836119292
836146932 836146935
836163655 836163657
836165700 836165701
836170095 836170097
836172399 836172400
836183875 836183876
836188667 836188668
836197411 836197412
836198772 836198774
836202439 836202440
836221977 836221979
836233425 836233427
836234610 836234611
836243540 836243541
836247778 836247779
836252926 836252928
836252930 836252932
836252933 836252934
836259729 836259731
836261542 836261545
836272793 836272795
836293132 836293134
836306138 836306140
836331630 836331631
836333583 836333584
836335213 836335214
836352745 836352746
836354208 836354209
836356484 836356486
836361855 836361856
836375226 836375228
836379092 836379093
836391284 836391286
836395969 836395971
836412538 836412540
836426862 836426863
836453926 836453927
836459685 836459687
836461561 836461563
836461577 836461578
836465129 836465131
836468342 836468344
836472330 836472332
836478312 836478313
836485087 836485089
836502316 836502317
836514025 836514026
836558378 836558380
836558408 836558410
836578720 836578722
836583457 836583459
836586675 836586677
836586679 836586680
836586681 836586682
836588790 836588791
836594003 836594005
836602437 836602438
836603753 836603755
836604984 836604985
836607257 836607258
836609995 836609997
836616865 836616867
836632779 836632780
836649103 836649104
836664961 836664963
836709944 836709946
836766378 836766380
836769006 836769008
836769058 836769063
836769089 836769090
836771133 836771134
836774207 836774209
836775538 836775540
836776359 836776360
836782093 836782095
836800498 836800499
836848173 836848174
836858163 836858164
836859607 836859609
836860368 836860370
836860376 836860385
836861784 836861785
836929022 836929024
836932109 836932110
836934879 836934880
836939135 836939147
836939166 836939170
836939172 836939173
836948871 836948872
836965113 836965114
837025905 837025907
837033739 837033741
837033742 837033744
837070869 837070870
837078633 837078635
837085904 837085905
837093178 837093180
837109070 837109071
837124927 837124929
837135040 837135042
837162881 837162882
837176707 837176709
837185582 837185585
837185602 837185604
837188435 837188438
837188555 837188556
837193214 837193215
837196121 837196123
837202197 837202199
837204724 837204725
837212490 837212492
837222295 837222296
837223450 837223452
837226480 837226482
837227688 837227690
837267843 837267846
837270312 837270314
837322043 837322044
837330218 837330220
837344628 837344629
837347075 837347076
837361201 837361203
837361206 837361207
837361217 837361219
837361224 837361226
837361229 837361231
837361237 837361239
837361241 837361244
837363715 837363718
837363744 837363746
837363759 837363762
837444017 837444019
837446624 837446625
837454386 837454388
837455649 837455652
837457214 837457217
837458454 837458456
837464772 837464777
837464779 837464784
837464789 837464791
837474694 837474696
837479688 837479690
837509583 837509585
837510876 837510878
837511839 837511840
837515543 837515544
837516966 837516967
837524016 837524017
837544497 837544498
837544500 837544504
837544513 837544517
837544529 837544531
837600205 837600207
837601433 837601434
837641689 837641691
837644053 837644054
837651959 837651961
837667953 837667954
837723753 837723754
837766539 837766540
837778283 837778285
837785617 837785618
837787285 837787286
837790235 837790240
837790245 837790247
837790255 837790266
837792521 837792523
837792823 837792826
837792836 837792838
837792843 837792844
837792852 837792856
837792868 837792869
837797031 837797033
837799582 837799584
837806471 837806473
837806476 837806485
837815487 837815489
837831213 837831215
837832191 837832195
837832404 837832405
837843257 837843262
837924308 837924309
837958878 837958881
837958886 837958888
837958889 837958893
837958900 837958901
837958904 837958909
837959937 837959938
837986961 837986962
838041822 838041824
838049571 838049573
838051647 838051648
838054201 838054204
838054205 838054207
838057213 838057214
838057220 838057221
838061989 838061992
838061999 838062005
838062010 838062012
838064430 838064432
838064441 838064443
838064570 838064572
838071521 838071523
838078974 838078975
838087189 838087190
838108418 838108420
838131125 838131130
838131132 838131135
838131136 838131139
838131141 838131142
838131143 838131148
838131151 838131153
838138897 838138910
838138914 838138917
838138918 838138924
838141012 838141014
838141023 838141025
838145804 838145806
838145809 838145813
838145818 838145822
838148565 838148566
838153988 838153990
838157826 838157828
838157842 838157845
838157850 838157855
838157856 838157860
838160250 838160252
838174534 838174536
838225068 838225069
838238576 838238577
838257955 838257962
838257964 838257966
838373694 838373696
838399521 838399522
838406370 838406372
838410408 838410410
838415438 838415444
838419186 838419191
838469782 838469783
838503356 838503358
838568614 838568616
838569194 838569198
838569209 838569211
838569441 838569442
838576647 838576649
838576656 838576658
838577981 838577984
838583317 838583319
838584334 838584336
838584343 838584345
838607551 838607553
838609843 838609844
838621777 838621779
838629615 838629617
838635775 838635778
838653454 838653456
838653465 838653467
838654921 838654922
838654926 838654929
838654937 838654940
838662423 838662425
838662430 838662433
838662448 838662450
838663097 838663098
838664385 838664387
838669387 838669388
838670214 838670216
838675963 838675965
838678657 838678658
838678667 838678669
838678675 838678679
838678682 838678687
838678692 838678694
838678699 838678702
838683799 838683802
838688379 838688381
838742031 838742033
838742036 838742037
838742038 838742040
838742045 838742053
838742054 838742060
838742063 838742065
838742075 838742078
838742093 838742104
838822627 838822629
838822634 838822636
838831637 838831639
838907489 838907491
838910810 838910813
838910823 838910825
838911820 838911822
838911832 838911834
838924129 838924132
838997118 838997122
838997126 838997133
838997136 838997146
838999525 838999527
838999529 838999530
838999538 838999540
839004278 839004280
839004296 839004298
839004299 839004300
839006916 839006918
839006926 839006928
839020541 839020543
839020553 839020554
839020559 839020561
839025079 839025083
839033946 839033947
839082855 839082857
839101489 839101490
839101494 839101496
839101502 839101504
839101511 839101520
839101521 839101524
839102745 839102748
839102755 839102758
839103151 839103153
839104073 839104075
839104078 839104082
839104084 839104089
839104097 839104100
839104101 839104102
839104104 839104106
839105513 839105515
839108730 839108731
839108732 839108735
839108752 839108754
839108761 839108763
839111139 839111140
839111145 839111147
839111159 839111161
839119561 839119564
839121444 839121445
839124901 839124902
839127744 839127746
839184668 839184671
839193206 839193207
839201776 839201779
839229060 839229062
839229089 839229091
839247727 839247728
839254595 839254597
839255871 839255875
839256385 839256387
839267115 839267116
839273141 839273142
839273143 839273145
839274244 839274246
839279645 839279646
839279655 839279657
839284959 839284962
839296485 839296487
839300108 839300110
839300122 839300123
839301704 839301705
839302218 839302221
839303125 839303127
839303369 839303370
839304174 839304176
839304207 839304214
839304322 839304324
839305516 839305518
839305524 839305526
839305593 839305595
839305610 839305613
839305660 839305662
839305668 839305670
839337938 839337940
839340579 839340581
839340583 839340589
839340590 839340594
839342266 839342268
839349941 839349943
839349945 839349953
839349954 839349958
839363022 839363023
839371055 839371056
839512083 839512085
839531967 839531969
839596843 839596844
839605224 839605225
839626506 839626507
839626509 839626510
839628932 839628934
839629317 839629321
839629601 839629603
839630691 839630694
839630695 839630696
839630697 839630701
839630703 839630705
839645034 839645035
839680448 839680450
839682827 839682828
839689641 839689643
839689644 839689645
839689646 839689651
839712467 839712472
839712478 839712479
839718680 839718682
839721979 839721980
839777299 839777301
839777320 839777323
839777327 839777330
839780609 839780611
839780627 839780632
839780633 839780635
839780708 839780717
839783090 839783095
839783096 839783102
839783169 839783171
839788026 839788028
839801328 839801331
839808223 839808225
839828581 839828583
839848824 839848826
839863880 839863881
839868072 839868074
839871317 839871321
839871326 839871327
839871329 839871338
839871342 839871344
839871345 839871352
839883346 839883348
839883688 839883690
839885323 839885325
839983685 839983686
840039693 840039695
840039696 840039699
840049278 840049279
840081738 840081740
840083839 840083840
840176711 840176713
840176717 840176719
840176732 840176736
840206461 840206463
840217102 840217104
840217122 840217128
840217129 840217144
840217145 840217147
840217148 840217152
840220379 840220382
840220387 840220389
840222295 840222298
840238345 840238347
840244001 840244003
840287162 840287163
840312025 840312027
840317045 840317047
840317228 840317230
840319153 840319154
840320361 840320363
840327197 840327199
840332330 840332331
840336352 840336354
840339443 840339445
840342185 840342186
840344361 840344362
840347096 840347098
840354121 840354123
840363265 840363266
840366505 840366506
840370666 840370667
840373123 840373125
840390300 840390302
840403942 840403944
840403945 840403948
840481308 840481309
840488424 840488426
840488445 840488447
840492011 840492012
840502639 840502642
840544633 840544634
840568443 840568444
840576662 840576664
840580798 840580802
840648634 840648636
840671298 840671300
840737682 840737684
840740758 840740761
840740762 840740763
840752612 840752614
840822040 840822046
840822047 840822050
840822054 840822056
840826331 840826333
840826334 840826336
840828648 840828651
840828662 840828664
840832659 840832661
840832669 840832671
840857944 840857945
840859802 840859803
840882646 840882648
840890022 840890023
840892097 840892098
840926473 840926475
840931175 840931177
840931193 840931194
840932400 840932402
840932663 840932667
840940793 840940795
840942753 840942754
840944954 840944955
840963767 840963768
840996057 840996058
841019207 841019208
841020855 841020856
841025198 841025199
841026371 841026373
841029308 841029309
841035371 841035372
841043555 841043557
841046798 841046800
841050498 841050499
841053619 841053621
841068504 841068505
841073031 841073033
841077856 841077858
841079894 841079895
841141963 841141964
841143797 841143798
841147845 841147846
841153799 841153800
841160088 841160089
841163376 841163377
841171583 841171584
841236740 841236742
841251325 841251327
841253949 841253951
841261009 841261011
841262337 841262339
841305702 841305703
841342896 841342898
841586018 841586019
841688637 841688640
841688642 841688644
841688646 841688649
841688651 841688653
841688677 841688679
841688681 841688687
841689236 841689238
841705500 841705502
841706254 841706256
841792456 841792458
841827860 841827862
841922222 841922223
842027539 842027541
842028018 842028019
842028051 842028053
842028383 842028385
842028387 842028389
842035628 842035630
842037042 842037045
842043856 842043858
842047009 842047011
842048313 842048316
842048463 842048466
842048468 842048470
842055749 842055750
842057298 842057300
842103830 842103833
842106035 842106037
842108239 842108243
842219609 842219610
842236273 842236275
842275714 842275716
842300565 842300568
842300569 842300592
842300593 842300595
842300597 842300599
842303198 842303200
842303210 842303214
842303985 842303987
842309464 842309467
842310628 842310630
842340493 842340495
842365149 842365151
842366885 842366897
842366898 842366903
842366905 842366909
842366910 842366914
842368879 842368881
842373174 842373178
842373181 842373184
842378600 842378602
842378815 842378817
842378833 842378837
842383986 842383987
842385183 842385185
842385188 842385191
842388398 842388400
842388451 842388453
842409262 842409264
842450294 842450295
842463938 842463943
842463953 842463955
842465056 842465058
842465292 842465294
842468480 842468482
842492087 842492088
842521641 842521644
842561789 842561790
842561796 842561798
842653372 842653373
842803551 842803552
842808099 842808100
842815152 842815154
842815160 842815162
842816131 842816133
842816142 842816143
842820353 842820356
842820362 842820364
842821925 842821928
842823269 842823271
842823615 842823617
842825886 842825889
842832934 842832939
842891515 842891517
842894992 842894993
842898234 842898236
842903347 842903353
842903354 842903356
842903359 842903364
842903366 842903372
842903373 842903378
842903603 842903607
842903610 842903611
842903613 842903615
842903617 842903620
842906615 842906617
842907864 842907865
842910510 842910513
842910521 842910523
842910525 842910534
842911019 842911021
842911308 842911310
842913567 842913569
842913592 842913594
842916076 842916078
842916276 842916277
842916731 842916733
842916780 842916781
842928275 842928277
842969777 842969778
842981164 842981165
842987111 842987113
842994543 842994544
842996084 842996086
842997997 842998000
843025627 843025629
843167743 843167745
843237211 843237213
843240056 843240065
843247856 843247858
843317276 843317278
843404867 843404869
843408653 843408657
843408669 843408671
843408678 843408680
843408682 843408685
843408686 843408691
843408694 843408695
843408696 843408700
843411575 843411577
843414264 843414266
843417568 843417572
843417574 843417576
843417577 843417583
843417591 843417593
843421663 843421665
843425037 843425038
843427564 843427565
843427566 843427567
843431678 843431680
843435869 843435871
843489642 843489645
843493899 843493901
843496372 843496374
843496383 843496385
843501081 843501084
843501089 843501090
843571123 843571124
843582138 843582142
843589806 843589807
843604920 843604923
843674443 843674444
843721533 843721534
843729386 843729387
843742106 843742107
843744449 843744452
843744461 843744464
843744467 843744469
843744470 843744474
843744476 843744479
843744481 843744484
843744486 843744490
843744504 843744505
843744509 843744514
843744516 843744520
843744522 843744524
843744532 843744538
843744540 843744544
843753468 843753474
843754577 843754578
843851682 843851684
843887082 843887084
844020967 844020971
844095882 844095885
844095886 844095889
844096689 844096690
844097073 844097078
844103689 844103694
844103696 844103698
844103714 844103717
844103721 844103725
844103726 844103730
844103733 844103743
844112151 844112153
844112170 844112172
844112174 844112177
844112178 844112181
844112187 844112188
844112190 844112196
844120677 844120680
844120684 844120686
844120690 844120693
844120700 844120702
844120711 844120713
844120717 844120719
844120721 844120725
844122039 844122042
844183011 844183014
844245212 844245214
844310948 844310950
844348106 844348108
844424175 844424177
844445693 844445695
844457493 844457495
844457497 844457499
844508480 844508484
844508485 844508487
844526471 844526472
844617732 844617734
844617743 844617745
844618516 844618518
844618861 844618864
844619526 844619529
844620383 844620385
844620409 844620411
844620412 844620417
844620427 844620429
844620432 844620439
844620483 844620485
844620599 844620602
844623114 844623117
844623119 844623133
844697891 844697893
844705142 844705143
844706945 844706947
844707867 844707869
844707890 844707892
844707893 844707895
844707896 844707898
844783186 844783189
844788183 844788185
844788189 844788191
844788200 844788202
844792663 844792666
844792673 844792675
844818774 844818779
844870266 844870268
844878836 844878839
844880690 844880691
844883409 844883411
844885578 844885580
844967739 844967740
845038546 845038547
845064372 845064374
845065047 845065049
845066396 845066398
845155535 845155537
845158693 845158695
845158697 845158701
845160101 845160103
845163950 845163952
845216181 845216184
845221789 845221796
845222964 845222965
845238289 845238290
845315017 845315019
845315020 845315022
845320243 845320244
845329968 845329970
845329971 845329976
845332850 845332852
845377242 845377243
845398959 845398962
845398965 845398966
845421384 845421385
845486783 845486785
845492598 845492602
845503700 845503702
845504074 845504075
845590660 845590662
845659357 845659358
845995661 845995662
846001389 846001391
846003516 846003518
846005987 846005992
846008441 846008443
846008447 846008450
846008480 846008485
846008495 846008498
846008525 846008527
846012576 846012578
846013231 846013232
846013442 846013444
846016710 846016713
846016718 846016724
846016727 846016730
846095573 846095574
846101669 846101670
846106906 846106907
846194712 846194714
846194775 846194777
846194780 846194781
846198056 846198058
846255400 846255402
846256565 846256568
846257324 846257329
846257663 846257665
846262080 846262081
846262087 846262091
846262092 846262095
846262096 846262099
846262108 846262116
846262119 846262121
846262876 846262878
846262881 846262883
846262899 846262903
846262905 846262908
846262909 846262911
846262913 846262919
846264338 846264340
846265259 846265261
846268857 846268859
846268864 846268867
846269435 846269441
846269445 846269451
846269452 846269455
846269456 846269465
846270504 846270506
846270518 846270522
846270523 846270526
846271842 846271844
846275989 846275991
846276012 846276013
846276014 846276016
846276019 846276026
846276027 846276029
846276032 846276039
846277144 846277146
846277227 846277230
846278008 846278010
846278012 846278014
846278015 846278016
846278017 846278018
846278020 846278023
846278038 846278040
846278041 846278045
846279943 846279945
846281275 846281278
846281299 846281300
846282135 846282137
846282811 846282813
846344748 846344750
846345395 846345396
846377837 846377838
846385743 846385745
846388351 846388353
846388398 846388400
846388796 846388798
846435821 846435822
846440192 846440193
846457827 846457828
846517648 846517649
846521320 846521322
846525341 846525343
846525349 846525354
846525357 846525358
846525359 846525361
846525369 846525374
846529176 846529179
846539958 846539960
846539979 846539981
846539989 846539991
846600922 846600924
846600934 846600935
846600938 846600940
846601737 846601752
846601754 846601757
846601758 846601761
846601762 846601764
846601810 846601813
846601869 846601872
846602767 846602769
846605318 846605320
846605325 846605327
846605333 846605335
846605336 846605338
846605339 846605341
846605652 846605654
846605656 846605658
846606111 846606112
846606114 846606126
846606731 846606733
846607087 846607088
846607089 846607090
846607092 846607094
846607098 846607106
846607107 846607109
846607111 846607113
846607394 846607395
846607439 846607441
846607452 846607457
846607510 846607511
846607512 846607515
846607621 846607625
846607626 846607631
846608261 846608264
846608268 846608270
846608275 846608283
846608481 846608482
846610301 846610304
846610594 846610596
846610597 846610599
846611067 846611069
846611377 846611383
846611975 846611977
846611994 846611996
846612209 846612215
846612454 846612457
846612467 846612468
846613613 846613620
846613628 846613632
846615043 846615045
846617323 846617325
846617332 846617337
846618210 846618215
846618278 846618280
846618281 846618282
846622402 846622403
846623795 846623797
846641656 846641657
846698868 846698871
846746042 846746044
846826567 846826569
846826570 846826572
846834647 846834648
846861865 846861866
846861867 846861874
846861877 846861879
846861899 846861901
847120142 847120143
847120284 847120286
847120687 847120688
847120967 847120969
847216320 847216322
847221401 847221403
847221750 847221753
847221759 847221762
847221818 847221820
847221837 847221839
847222490 847222491
847222860 847222862
847223214 847223217
847223834 847223838
847223839 847223841
847223845 847223846
847223847 847223850
847223855 847223857
847224785 847224787
847226271 847226275
847227892 847227894
847227899 847227902
847227909 847227911
847229782 847229785
847229786 847229788
847384685 847384686
847433265 847433266
847483464 847483466
847492939 847492941
847604964 847604968
847625066 847625068
847625069 847625071
847625075 847625077
847653003 847653004
847661549 847661551
847661554 847661559
847717972 847717973
847718004 847718005
847718010 847718012
847732597 847732599
847736944 847736948
847737191 847737193
847737307 847737310
847737322 847737324
847737331 847737333
847737477 847737479
847738185 847738187
847738630 847738633
847745677 847745680
847745703 847745705
847751509 847751511
847753137 847753138
847753435 847753437
847797140 847797143
847820781 847820783
847836110 847836113
847836327 847836330
847836357 847836359
847839566 847839571
847839576 847839578
847839579 847839580
847839581 847839590
847839646 847839648
847840872 847840874
847883731 847883733
847883740 847883743
847911270 847911274
847911285 847911287
847915276 847915280
847915379 847915380
847915381 847915383
847922258 847922262
847922264 847922266
847945289 847945292
847955159 847955163
847998437 847998439
847998459 847998463
847998480 847998482
848004657 848004659
848069439 848069442
848069453 848069455
848069456 848069459
848069462 848069465
848069466 848069468
848069476 848069478
848069479 848069485
848084416 848084418
848086245 848086248
848086249 848086253
848095228 848095231
848159616 848159617
848320216 848320218
848320282 848320283
848320285 848320288
848320289 848320293
848326119 848326122
848330602 848330603
848347194 848347196
848347311 848347313
848466319 848466320
848516061 848516064
848630012 848630013
848638931 848638933
848764339 848764340
848764350 848764353
848764406 848764409
848795929 848795930
848812611 848812612
848855650 848855652
848865372 848865374
848878307 848878309
848896841 848896842
848944324 848944325
848949440 848949443
848949450 848949452
848952463 848952465
849018051 849018052
849035127 849035128
849050349 849050350
849053476 849053478
849112179 849112180
849208740 849208741
849213047 849213049
849214802 849214804
849248246 849248247
849309510 849309511
849309742 849309744
849427508 849427510
849443431 849443432
849463512 849463513
849465599 849465600
849478706 849478709
849479897 849479899
849480661 849480664
849554427 849554428
849568100 849568102
849711517 849711518
849729319 849729321
849751014 849751016
849787311 849787313
849903539 849903540
849908418 849908420
849926182 849926185
849927287 849927288
849958683 849958685
849958808 849958810
850066096 850066099
850066274 850066275
850066775 850066776
850101594 850101597
850111308 850111309
850137784 850137786
850146597 850146599
850153374 850153376
850155263 850155265
850161577 850161579
850166520 850166522
850166541 850166544
850166547 850166549
850166557 850166559
850182188 850182190
850187444 850187446
850278297 850278298
850317452 850317454
850317455 850317458
850317459 850317462
850324891 850324895
850325116 850325118
850325162 850325167
850325169 850325172
850325173 850325174
850329262 850329264
850329292 850329294
850330571 850330573
850331194 850331198
850331199 850331201
850332396 850332397
850332399 850332401
850346073 850346074
850395858 850395859
850495033 850495037
850500444 850500445
850504271 850504275
850512518 850512524
850512527 850512529
850514502 850514503
850518006 850518007
850532648 850532650
850578443 850578446
850578449 850578451
850602971 850602973
850603099 850603101
850603105 850603106
850603107 850603108
850603114 850603117
850603128 850603129
850603132 850603134
850643035 850643038
850672921 850672923
850672935 850672937
850677421 850677422
850679386 850679387
850690790 850690793
850694602 850694605
850697189 850697192
850715831 850715832
850723191 850723192
850851096 850851098
850853420 850853422
850853423 850853426
850940458 850940460
851038878 851038880
851111336 851111338
851408108 851408110
851507046 851507048
851698054 851698057
851787971 851787973
851787976 851787978
851864222 851864224
851878781 851878783
851897674 851897678
851934662 851934665
852019255 852019257
852047806 852047807
852051487 852051489
852065680 852065681
852143441 852143443
852144756 852144757
852149521 852149523
852313548 852313551
852313566 852313569
852316687 852316689
852317194 852317196
852317201 852317203
852319648 852319656
852320588 852320590
852323455 852323457
852324544 852324546
852324558 852324559
852324953 852324954
852325464 852325467
852331284 852331286
852332275 852332277
852334769 852334772
852334779 852334781
852334782 852334783
852414555 852414561
852414562 852414565
852414566 852414576
852414578 852414579
852414580 852414586
852414587 852414590
852414592 852414593
852414631 852414633
852414636 852414638
852414639 852414641
852414643 852414646
852414654 852414657
852414659 852414664
852414665 852414666
852414670 852414676
852414677 852414679
852414683 852414685
852414691 852414693
852415275 852415287
852415289 852415292
852415294 852415298
852416598 852416601
852417492 852417496
852417497 852417501
852417502 852417505
852417509 852417511
852417552 852417554
852418850 852418852
852420640 852420644
852440093 852440094
852483008 852483010
852483021 852483027
852483890 852483893
852483897 852483899
852484665 852484668
852484671 852484673
852484968 852484971
852484973 852484978
852484984 852484990
852487555 852487573
852487705 852487707
852487735 852487737
852487740 852487742
852489507 852489509
852489753 852489761
852489763 852489765
852489772 852489773
852490035 852490037
852490039 852490041
852490047 852490050
852490051 852490057
852492917 852492919
852493275 852493277
852493285 852493286
852495249 852495254
852495261 852495264
852495265 852495267
852495728 852495730
852495739 852495741
852496389 852496391
852496396 852496398
852498252 852498254
852498667 852498669
852498679 852498681
852500222 852500225
852500300 852500302
852500305 852500309
852500316 852500321
852501186 852501188
852501195 852501199
852501202 852501206
852501495 852501498
852505404 852505406
852505415 852505417
852507545 852507547
852563149 852563150
852563154 852563156
852563736 852563738
852564513 852564515
852564516 852564521
852564546 852564548
852566260 852566263
852568995 852568997
852569638 852569640
852570011 852570013
852570017 852570021
852570046 852570049
852571040 852571042
852574707 852574709
852574787 852574789
852574796 852574798
852574958 852574960
852574972 852574973
852575030 852575034
852576867 852576870
852578424 852578426
852578432 852578435
852578437 852578440
852578442 852578446
852578449 852578451
852578453 852578457
852580479 852580481
852580484 852580486
852580493 852580498
852581066 852581067
852581068 852581070
852581072 852581074
852581087 852581090
852581094 852581096
852583589 852583591
852583922 852583925
852583949 852583951
852585858 852585859
852587096 852587097
852587679 852587681
852590633 852590634
852632931 852632933
852644894 852644895
852660418 852660419
852663965 852663966
852679335 852679336
852679338 852679341
852698003 852698005
852828278 852828280
852920971 852920972
852926259 852926261
852993711 852993713
852993720 852993723
852996439 852996442
852998048 852998050
853093701 853093703
853196732 853196735
853264018 853264019
853272983 853272984
853276490 853276491
853277213 853277215
853316012 853316014
853344469 853344471
853344480 853344482
853351205 853351206
853358876 853358877
853444759 853444761
853453262 853453264
853479065 853479066
853483089 853483090
853518607 853518609
853601664 853601666
853747197 853747199
854050935 854050937
854122146 854122148
854123083 854123085
854128863 854128865
854128890 854128891
854165825 854165826
854171883 854171885
854196184 854196186
854198114 854198118
854198137 854198139
854198146 854198150
854198152 854198156
854198171 854198175
854198180 854198182
854198185 854198190
854198192 854198198
854198200 854198202
854198208 854198215
854198217 854198223
854198224 854198227
854198231 854198234
854198235 854198237
854198243 854198247
854251271 854251272
854288384 854288385
854311878 854311879
854403346 854403348
854408777 854408778
854427615 854427616
854482250 854482252
854483455 854483457
854584204 854584205
854653396 854653398
854706571 854706573
854834091 854834093
854834096 854834102
854836817 854836821
854836822 854836824
854837197 854837201
854837380 854837383
854837438 854837440
854916996 854916998
854919419 854919420
854923359 854923366
854923390 854923398
854923978 854923981
854923983 854923987
854923989 854923992
854923996 854923998
854926298 854926300
855000513 855000514
855004730 855004732
855004900 855004902
855005495 855005497
855005502 855005504
855067988 855067990
855086959 855086960
855243398 855243400
855246135 855246137
855268101 855268102
855345743 855345745
855347964 855347966
855414410 855414412
855417067 855417068
855417076 855417078
855526487 855526489
855532348 855532350
855532352 855532353
855532354 855532355
855532368 855532371
855535141 855535143
855535145 855535154
855546457 855546458
855585989 855585991
855585993 855585995
855585996 855586000
855586007 855586009
855606356 855606357
855607861 855607864
855609915 855609916
855689338 855689339
855712869 855712871
855747283 855747285
855766935 855766937
855769095 855769098
855778740 855778742
855782205 855782208
855862443 855862446
855864886 855864887
855901525 855901527
855949021 855949023
855952464 855952466
855952784 855952786
855955333 855955336
855955337 855955338
856013458 856013459
856013504 856013506
856013682 856013684
856014970 856014972
856015025 856015027
856015028 856015029
856015290 856015292
856015330 856015334
856015399 856015401
856015404 856015406
856015410 856015413
856015429 856015434
856015436 856015440
856015447 856015450
856015452 856015454
856015471 856015473
856015479 856015484
856015486 856015491
856015507 856015509
856015596 856015598
856015606 856015608
856015700 856015702
856015745 856015747
856015750 856015752
856016037 856016040
856016046 856016050
856016062 856016064
856016136 856016139
856016152 856016158
856016207 856016209
856016254 856016256
856016296 856016298
856016305 856016307
856016395 856016399
856016601 856016603
856016827 856016829
856016850 856016853
856016891 856016892
856017356 856017358
856017539 856017543
856058221 856058222
856112292 856112294
856114558 856114560
856135778 856135780
856201784 856201785
856258840 856258842
856258860 856258862
856289359 856289361
856292016 856292018
856305151 856305153
856305172 856305174
856305229 856305232
856320445 856320447
856322034 856322035
856383013 856383014
856411010 856411011
856544305 856544307
856561166 856561168
856571539 856571540
856623211 856623213
856716720 856716722
856716725 856716729
856716745 856716747
856720913 856720915
856720925 856720927
856724626 856724628
856725858 856725859
856727506 856727507
856728401 856728403
856729099 856729105
856729130 856729132
856729681 856729682
856729833 856729836
856731286 856731287
856740379 856740380
856806469 856806470
856822380 856822382
856824194 856824195
856900938 856900940
856987277 856987280
857022001 857022003
857022070 857022072
857022112 857022113
857094675 857094676
857168115 857168117
857168991 857168995
857169282 857169287
857258013 857258017
857264648 857264650
857321204 857321206
857344822 857344824
857349501 857349503
857362650 857362651
857402386 857402388
857406308 857406310
857406433 857406434
857412762 857412763
857423823 857423825
857424445 857424446
857428816 857428818
857429072 857429073
857429236 857429238
857429799 857429801
857430860 857430861
857430946 857430948
857431784 857431786
857431865 857431866
857432038 857432040
857432284 857432285
857433190 857433192
857434619 857434621
857434684 857434686
857434700 857434702
857435466 857435468
857516257 857516259
857517775 857517777
857517948 857517950
857592086 857592087
857596931 857596932
857636317 857636319
857639339 857639340
857645452 857645453
857673247 857673248
857686284 857686285
857733441 857733443
857733791 857733794
857734229 857734231
857735659 857735660
857739207 857739209
857742754 857742757
857742764 857742767
857742769 857742774
857743088 857743089
857743181 857743183
857755121 857755124
857755138 857755140
857755162 857755164
857755499 857755501
857755508 857755512
857755522 857755526
857755990 857755992
857756023 857756026
857763378 857763380
857763381 857763383
857764582 857764585
857766586 857766588
857767052 857767053
857772387 857772389
857772391 857772392
857790249 857790252
857832918 857832922
857927525 857927528
858009636 858009639
858009642 858009643
858101542 858101544
858106375 858106377
858106385 858106388
858107583 858107586
858112426 858112427
858165190 858165191
858207180 858207181
858219652 858219653
858291807 858291808
858360126 858360129
858390356 858390358
858429002 858429006
858465712 858465714
858467833 858467835
858531601 858531603
858535236 858535238
858539796 858539799
858540054 858540056
858541512 858541516
858594474 858594477
858607777 858607778
858615766 858615770
858615932 858615937
858617714 858617716
858620391 858620393
858625228 858625230
858637465 858637467
858741283 858741285
858777107 858777108
858784087 858784088
858792797 858792799
858805276 858805278
858805281 858805283
858819212 858819213
858885532 858885534
858892085 858892087
858900061 858900063
858956619 858956620
858957895 858957897
858964080 858964082
858966263 858966264
858971773 858971774
858973812 858973814
858985566 858985567
859064357 859064359
859065183 859065185
859065188 859065191
859065198 859065200
859068995 859068998
859075138 859075140
859075314 859075315
859075321 859075322
859077139 859077141
859078191 859078194
859078634 859078635
859079393 859079395
859084703 859084704
859085008 859085010
859085011 859085013
859085014 859085016
859085585 859085586
859085907 859085910
859085917 859085919
859123622 859123623
859132491 859132496
859132514 859132516
859136947 859136949
859139322 859139328
859139356 859139357
859139366 859139371
859145481 859145483
859147608 859147610
859153721 859153723
859154447 859154450
859155213 859155215
859155257 859155258
859155259 859155269
859155271 859155272
859155276 859155279
859155280 859155287
859155442 859155443
859182081 859182082
859221082 859221084
859225420 859225422
859228934 859228936
859228974 859228976
859228979 859228985
859228993 859228997
859230423 859230425
859236949 859236951
859281379 859281381
859307385 859307387
859311975 859311977
859312560 859312563
859348557 859348558
859399948 859399950
859477548 859477549
859480947 859480948
859490562 859490565
859564233 859564236
859567442 859567445
859573858 859573859
859664356 859664358
859687943 859687945
859715267 859715268
859722653 859722654
859739392 859739394
859743109 859743111
859747145 859747147
859747199 859747202
859755152 859755154
859758241 859758242
859782848 859782849
859821864 859821866
859824472 859824474
859826269 859826271
859828437 859828439
859829048 859829050
859830229 859830231
859835000 859835002
859835977 859835980
859841740 859841743
859841744 859841746
859844615 859844617
859852118 859852120
859911822 859911824
859913732 859913734
859922118 859922119
859926208 859926210
859934497 859934499
859937572 859937573
860011000 860011002
860060492 860060494
860106353 860106354
860163262 860163263
860170959 860170960
860170975 860170976
860271152 860271154
860271158 860271161
860271168 860271170
860280094 860280095
860341175 860341179
860341205 860341206
860341498 860341499
860342701 860342704
860342707 860342710
860342726 860342730
860342738 860342743
860342779 860342781
860342822 860342824
860342833 860342835
860342838 860342841
860342849 860342852
860342854 860342855
860342857 860342859
860342975 860342979
860342996 860343000
860347161 860347163
860352394 860352395
860357878 860357880
860364450 860364451
860366162 860366163
860371204 860371205
860422862 860422864
860432654 860432655
860440204 860440205
860444023 860444025
860445428 860445430
860445435 860445439
860447585 860447589
860447864 860447866
860448411 860448413
860489512 860489513
860527309 860527311
860543425 860543426
860675505 860675506
860710820 860710822
860710824 860710826
860722395 860722396
860728994 860728995
860735195 860735196
860759718 860759720
860772089 860772092
860789308 860789309
860879029 860879031
860888759 860888760
860894441 860894443
860921076 860921077
860944704 860944705
860968212 860968213
860988153 860988154
861025279 861025280
861035345 861035347
861035688 861035690
861035839 861035842
861035860 861035863
861035896 861035901
861038255 861038257
861041970 861041973
861042679 861042681
861043358 861043360
861043461 861043463
861064818 861064819
861122992 861122995
861123002 861123004
861150582 861150583
861155836 861155838
861158551 861158553
861162747 861162749
861164487 861164489
861168330 861168332
861173546 861173547
861175560 861175562
861176780 861176781
861178247 861178249
861179780 861179782
861226158 861226160
861278798 861278800
861320417 861320418
861357119 861357120
861369643 861369644
861386371 861386373
861390969 861390970
861490647 861490649
861490658 861490660
861490747 861490749
861573486 861573487
861573504 861573507
861625602 861625604
861646595 861646597
861685302 861685304
861739627 861739628
861739777 861739778
861780144 861780145
861824209 861824210
861843053 861843054
861866602 861866604
861886167 861886168
861985167 861985169
861990507 861990509
861990538 861990544
861990547 861990551
861990553 861990557
861992539 861992541
861996889 861996891
861997942 861997947
861998421 861998426
861998428 861998432
862000139 862000143
862000777 862000779
862064920 862064922
862064929 862064930
862130481 862130482
862139824 862139825
862150599 862150601
862156823 862156824
862158453 862158454
862169718 862169720
862173671 862173674
862173681 862173682
862177047 862177049
862179451 862179453
862242835 862242836
862245534 862245536
862246251 862246253
862250254 862250256
862250272 862250275
862258345 862258346
862262555 862262556
862330187 862330189
862350556 862350559
862381092 862381093
862384746 862384747
862414159 862414161
862417356 862417358
862524773 862524775
862556196 862556197
862587491 862587493
862599905 862599907
862668096 862668098
862671609 862671611
862671612 862671614
862693734 862693736
862697393 862697394
862698698 862698699
862700907 862700908
862701602 862701603
862701604 862701608
862701612 862701613
862702107 862702109
862704861 862704869
862704871 862704875
862706841 862706847
862713434 862713436
862732329 862732330
862759904 862759907
862762889 862762895
862763070 862763072
862768807 862768809
862770032 862770033
862772317 862772319
862773086 862773088
862773102 862773104
862849024 862849026
862870020 862870021
862897022 862897024
862935545 862935547
862944123 862944124
862946977 862946980
862947251 862947252
862954147 862954149
862957993 862957995
863051979 863051981
863053275 863053278
863120480 863120482
863185138 863185139
863195897 863195900
863197851 863197856
863202530 863202531
863215948 863215950
863216963 863216965
863294488 863294490
863301807 863301809
863344411 863344413
863377906 863377908
863398039 863398040
863461078 863461080
863532183 863532184
863534881 863534882
863544083 863544085
863547548 863547549
863637351 863637352
863669776 863669777
863683959 863683960
863718383 863718385
863770803 863770804
863791623 863791629
863830871 863830872
863831481 863831482
863931136 863931137
863975044 863975048
863979295 863979296
863981915 863981916
863981917 863981920
863984377 863984378
864058997 864058999
864062668 864062669
864151204 864151206
864153762 864153778
864153785 864153787
864153792 864153795
864153803 864153805
864153806 864153809
864153810 864153811
864253444 864253446
864257765 864257766
864314470 864314471
864339266 864339267
864340466 864340467
864341334 864341336
864341341 864341342
864341375 864341376
864341628 864341630
864341782 864341784
864341813 864341815
864353415 864353417
864418222 864418224
864434097 864434099
864464152 864464153
864486133 864486135
864507622 864507624
864584596 864584598
864584599 864584601
864592284 864592285
864594251 864594252
864595774 864595776
864612162 864612163
864671210 864671214
864671215 864671222
864673456 864673458
864751179 864751181
864771388 864771390
864771393 864771395
864777348 864777349
864778546 864778549
864859061 864859063
864921844 864921846
864999256 864999258
864999301 864999302
865014856 865014857
865015110 865015113
865015435 865015441
865015550 865015552
865019924 865019925
865028243 865028246
865029067 865029069
865057164 865057165
865079311 865079312
865121121 865121123
865131599 865131601
865172560 865172562
865172568 865172570
865172572 865172574
865177836 865177840
865177854 865177855
865177872 865177875
865177880 865177881
865184984 865184986
865185448 865185450
865188948 865188950
865189185 865189187
865190320 865190322
865193630 865193632
865193999 865194001
865194448 865194450
865194464 865194468
865199778 865199781
865199804 865199806
865199841 865199843
865200184 865200186
865200648 865200649
865200655 865200656
865200660 865200664
865200676 865200678
865200681 865200683
865200897 865200899
865201424 865201426
865202094 865202096
865202098 865202100
865259201 865259202
865259205 865259207
865259208 865259212
865274335 865274337
865274347 865274350
865277835 865277838
865277840 865277843
865288851 865288855
865345197 865345199
865361530 865361533
865455258 865455260
865465070 865465072
865474648 865474652
865490997 865491001
865544477 865544479
865605900 865605902
865612120 865612122
865613987 865613988
865619684 865619686
865619708 865619713
865625312 865625314
865630926 865630928
865630953 865630956
865635992 865635994
865635999 865636002
865645724 865645725
865668381 865668382
865684206 865684208
865684219 865684221
865695373 865695375
865695503 865695505
865743331 865743333
865777643 865777649
865783364 865783366
865785155 865785156
865788711 865788715
865793123 865793128
865793139 865793141
865793143 865793144
865795323 865795324
865795325 865795327
865798656 865798657
865807156 865807158
865807161 865807163
865808674 865808675
865864023 865864025
865864036 865864042
865864247 865864248
865869634 865869638
865870223 865870225
865874666 865874668
865874673 865874676
865875207 865875212
865875216 865875218
865875221 865875223
865876529 865876533
865876536 865876538
865883670 865883672
865883677 865883681
865883682 865883689
865885148 865885152
865885155 865885158
865885168 865885170
865885172 865885173
865885248 865885250
865893521 865893523
865949784 865949786
865949827 865949829
865949835 865949837
866032224 866032225
866053480 866053482
866131760 866131762
866134918 866134921
866160776 866160778
866160784 866160786
866160823 866160825
866165398 866165400
866165421 866165423
866165448 866165449
866165511 866165515
866165517 866165519
866165520 866165522
866166509 866166510
866166875 866166876
866167112 866167113
866167271 866167273
866167335 866167337
866167340 866167342
866167755 866167756
866167771 866167773
866168679 866168681
866168688 866168690
866168707 866168709
866169965 866169967
866169989 866169990
866169993 866169996
866171440 866171442
866172796 866172797
866197313 866197316
866210053 866210057
866210058 866210061
866210083 866210084
866216621 866216626
866221900 866221903
866223872 866223874
866229754 866229761
866236118 866236120
866236441 866236443
866236457 866236459
866237066 866237068
866240128 866240129
866257174 866257176
866261337 866261341
866295816 866295821
866295822 866295825
866295830 866295844
866298607 866298609
866298654 866298663
866324767 866324769
866324782 866324784
866324785 866324787
866325506 866325510
866325511 866325515
866325519 866325524
866325911 866325913
866325915 866325917
866328704 866328708
866328711 866328715
866328718 866328720
866328725 866328729
866333492 866333493
866333496 866333498
866382185 866382188
866382195 866382199
866382200 866382204
866386580 866386583
866386584 866386586
866386587 866386593
866389699 866389700
866409205 866409208
866413919 866413921
866413923 866413926
866468987 866468990
866468991 866468993
866474978 866474981
866475434 866475438
866475440 866475441
866475445 866475454
866497430 866497433
866583669 866583671
866601707 866601709
866605037 866605038
866672718 866672720
866726651 866726653
866736415 866736417
866736423 866736425
866738365 866738367
866762366 866762369
866762376 866762379
866770877 866770879
866771015 866771017
866774070 866774071
866822593 866822595
866823075 866823077
866847589 866847593
866847934 866847935
866848500 866848502
866848814 866848817
866848848 866848852
866848861 866848864
866848920 866848922
866958188 866958190
867036681 867036683
867089634 867089637
867121310 867121311
867170846 867170847
867191169 867191172
867298982 867298983
867309070 867309072
867353147 867353148
867364099 867364100
867450224 867450226
867510967 867510969
867511055 867511057
867626522 867626526
867626527 867626529
867626530 867626551
867680906 867680908
867685062 867685063
867685066 867685071
867689551 867689554
867689555 867689563
867689589 867689591
867689601 867689607
867766563 867766565
867771707 867771709
867782792 867782795
867795636 867795638
867836865 867836867
868036343 868036346
868036367 868036369
868039866 868039868
868039878 868039882
868039895 868039898
868039914 868039916
868039920 868039925
868039927 868039929
868039930 868039932
868039936 868039939
868041753 868041755
868041775 868041779
868044850 868044853
868044874 868044876
868046312 868046315
868046333 868046335
868046545 868046548
868054790 868054792
868054798 868054802
868113481 868113485
868113525 868113528
868114692 868114696
868114697 868114698
868210676 868210681
868223673 868223685
868223687 868223691
868223694 868223702
868234307 868234309
868247690 868247692
868253687 868253688
868262645 868262647
868388250 868388252
868389887 868389888
868399208 868399210
868472303 868472304
868631329 868631331
868651857 868651858
868654760 868654761
868656033 868656036
868662760 868662762
868745035 868745037
868753257 868753259
868753262 868753264
868753272 868753273
868864980 868864981
868902698 868902700
868902704 868902708
868909150 868909152
868916426 868916428
868919375 868919376
868985094 868985096
869005207 869005208
869051382 869051383
869060244 869060246
869089098 869089102
869089103 869089104
869089107 869089109
869164330 869164332
869234026 869234028
869406988 869406990
869413836 869413838
869441215 869441217
869441314 869441316
869442345 869442348
869442650 869442651
869444045 869444047
869466234 869466236
869469278 869469280
869473214 869473216
869493983 869493985
869501466 869501470
869505250 869505251
869508589 869508591
869508595 869508596
869508597 869508601
869508602 869508603
869517741 869517742
869517744 869517749
869517753 869517755
869522720 869522722
869522932 869522933
869524306 869524308
869526711 869526713
869527148 869527149
869528243 869528245
869528319 869528321
869528412 869528414
869535608 869535611
869581029 869581033
869588468 869588470
869588482 869588484
869588492 869588494
869596294 869596296
869596297 869596299
869596309 869596312
869600609 869600612
869604873 869604876
869604880 869604882
869604889 869604891
869604905 869604908
869613894 869613895
869616289 869616291
869616313 869616314
869617377 869617378
869831494 869831496
869845062 869845064
869845071 869845074
869845080 869845085
869853742 869853744
869853758 869853762
869863128 869863130
869882541 869882544
869882545 869882551
869882552 869882576
869882581 869882586
869925567 869925569
869925582 869925584
869925587 869925589
869925601 869925603
869926910 869926912
869947445 869947446
869948849 869948850
869949467 869949473
869951907 869951911
869951923 869951925
869951927 869951929
869951933 869951935
869951938 869951940
869951942 869951944
869951947 869951949
869952133 869952137
869952188 869952192
869952913 869952917
869952918 869952921
869952932 869952938
870007512 870007514
870011526 870011528
870030785 870030786
870031574 870031576
870038700 870038702
870059882 870059883
870103428 870103429
870110613 870110614
870132728 870132729
870197507 870197508
870273274 870273276
870274343 870274345
870290013 870290015
870290018 870290020
870342133 870342134
870403873 870403874
870467420 870467422
870553076 870553078
870560014 870560016
870568241 870568243
870624394 870624396
870624399 870624401
870627156 870627160
870627196 870627198
870627203 870627206
870642467 870642469
870743032 870743033
870763696 870763697
870891422 870891423
870905948 870905952
870939917 870939919
870960081 870960082
870991923 870991924
871016645 871016646
871046601 871046604
871047242 871047244
871047250 871047255
871054555 871054558
871054560 871054561
871057169 871057170
871061218 871061220
871061226 871061230
871067552 871067556
871067558 871067562
871067564 871067571
871067576 871067578
871070463 871070464
871073976 871073979
871073988 871073990
871075843 871075845
871105598 871105599
871165896 871165897
871221098 871221102
871236635 871236636
871243438 871243440
871272694 871272696
871277327 871277329
871277331 871277334
871300442 871300443
871304790 871304793
871304795 871304800
871320342 871320344
871329513 871329516
871346445 871346447
871346448 871346450
871346461 871346462
871346488 871346490
871597097 871597101
871619303 871619304
871657268 871657270
871679619 871679620
871685684 871685685
871764754 871764755
871767714 871767716
871834393 871834395
871836648 871836651
871837554 871837557
871837572 871837573
871837574 871837575
871837581 871837584
871837596 871837600
871837601 871837603
871839399 871839401
871839410 871839412
871842172 871842175
871842664 871842666
871842904 871842910
871842914 871842917
871842925 871842927
871842930 871842931
871842940 871842943
871842944 871842951
871845553 871845555
871845560 871845562
871847855 871847865
871847868 871847875
871847882 871847889
871847898 871847900
871847901 871847906
871847910 871847912
871847920 871847922
871850444 871850447
871850490 871850491
871852750 871852752
871852780 871852782
871852783 871852786
871852791 871852803
871852806 871852811
871852812 871852815
871852818 871852820
871920988 871920990
871927344 871927345
871927591 871927592
871927604 871927607
871928655 871928660
871936800 871936807
871945430 871945432
872000435 872000437
872008141 872008143
872010547 872010549
872014320 872014322
872014954 872014955
872019968 872019970
872021855 872021857
872021984 872021986
872022044 872022046
872022800 872022802
872023163 872023165
872028221 872028222
872030695 872030697
872030837 872030838
872032316 872032317
872033801 872033803
872043081 872043083
872049096 872049098
872104001 872104003
872127235 872127238
872129382 872129383
872129880 872129882
872131652 872131654
872167789 872167790
872201842 872201844
872242604 872242605
872255671 872255673
872260696 872260698
872263028 872263030
872267904 872267906
872269566 872269568
872343060 872343062
872343080 872343086
872343751 872343752
872345688 872345692
872345694 872345696
872345698 872345700
872348397 872348399
872348462 872348463
872367572 872367574
872367577 872367579
872367581 872367582
872373269 872373273
872438873 872438875
872441222 872441224
872443132 872443133
872443134 872443136
872443139 872443140
872443416 872443418
872446415 872446418
872446612 872446614
872446616 872446618
872446649 872446652
872448020 872448022
872451748 872451752
872451758 872451761
872451767 872451769
872451770 872451776
872451790 872451792
872451941 872451943
872451962 872451964
872458941 872458945
872458947 872458951
872458958 872458960
872458964 872458968
872458970 872458972
872458981 872458984
872515648 872515650
872519124 872519127
872519134 872519136
872519144 872519147
872519153 872519155
872519158 872519161
872524721 872524724
872526227 872526229
872526231 872526233
872526237 872526241
872530452 872530454
872530455 872530460
872530462 872530464
872532459 872532462
872532471 872532476
872532489 872532491
872564699 872564700
872626263 872626264
872635369 872635371
872643802 872643804
872645311 872645314
872645368 872645370
872706970 872706972
872709124 872709126
872731826 872731828
872885772 872885774
872950761 872950763
872950765 872950767
872950804 872950810
872953112 872953120
872953123 872953125
872953140 872953142
872975085 872975087
872977766 872977769
873039694 873039697
873039706 873039708
873048157 873048159
873048168 873048172
873048173 873048177
873048179 873048181
873048191 873048194
873048195 873048197
873048198 873048200
873048202 873048205
873048208 873048210
873051512 873051515
873051561 873051564
873052070 873052072
873053038 873053040
873053046 873053049
873053050 873053053
873053057 873053074
873053081 873053084
873053092 873053096
873060203 873060205
873066460 873066462
873081668 873081670
873103495 873103496
873119804 873119805
873128818 873128822
873133947 873133949
873133961 873133963
873134841 873134844
873135566 873135570
873135574 873135576
873135587 873135590
873135603 873135614
873137078 873137080
873141121 873141124
873143781 873143785
873145444 873145446
873145471 873145476
873145490 873145493
873145501 873145509
873151834 873151837
873154650 873154651
873179450 873179451
873214449 873214451
873219939 873219941
873222862 873222864
873229957 873229960
873230696 873230699
873239434 873239437
873262669 873262672
873263035 873263039
873274744 873274746
873300006 873300008
873424756 873424758
873489210 873489212
873489709 873489710
873578412 873578414
873579225 873579227
873586027 873586030
873586032 873586034
873586042 873586044
873587176 873587178
873631800 873631802
873645313 873645314
873648749 873648750
873650460 873650465
873650466 873650467
873651192 873651193
873651205 873651211
873651469 873651475
873651495 873651499
873651500 873651502
873651508 873651510
873651515 873651519
873652563 873652565
873652568 873652574
873655972 873655974
873657123 873657129
873657311 873657315
873658299 873658301
873658306 873658308
873665978 873665980
873668655 873668661
873668663 873668665
873668739 873668744
873668746 873668748
873668852 873668854
873669898 873669899
873669901 873669905
873669975 873669979
873670118 873670120
873677305 873677306
873690899 873690901
873731213 873731217
873731224 873731227
873735580 873735583
873735584 873735586
873745619 873745625
873759400 873759401
873959137 873959139
873994944 873994945
873999418 873999420
874083306 874083308
874087678 874087681
874087687 874087690
874087697 874087699
874087713 874087715
874087934 874087938
874101115 874101117
874101162 874101164
874132567 874132569
874160586 874160590
874160634 874160636
874162756 874162758
874181369 874181370
874181476 874181479
874181505 874181516
874181518 874181522
874181543 874181545
874181547 874181552
874181553 874181555
874181556 874181558
874189126 874189128
874227036 874227038
874256038 874256040
874256051 874256055
874271949 874271953
874272889 874272890
874275434 874275438
874275439 874275440
874313464 874313466
874316937 874316940
874333005 874333006
874342387 874342389
874342398 874342402
874342958 874342961
874345495 874345497
874347702 874347703
874349485 874349486
874352760 874352761
874354144 874354145
874358461 874358463
874358475 874358477
874360672 874360677
874360679 874360683
874360684 874360688
874428122 874428124
874436900 874436903
874501493 874501495
874501511 874501513
874501514 874501515
874509841 874509843
874510238 874510240
874510248 874510253
874510259 874510263
874510270 874510273
874514093 874514095
874514096 874514097
874526313 874526315
874526325 874526326
874622925 874622927
874650124 874650126
874695985 874695986
874706780 874706783
874787739 874787744
874790499 874790501
874790526 874790530
874790531 874790533
874802188 874802189
874817619 874817621
874848009 874848011
874851104 874851106
874851524 874851526
874851546 874851549
874851553 874851557
874851562 874851571
874852126 874852128
874852129 874852131
874874434 874874436
874874443 874874446
874874448 874874450
874874540 874874543
874875497 874875501
874875970 874875972
874875978 874875980
874875982 874875984
874875986 874875989
874875991 874875993
874876001 874876004
874878343 874878345
874935183 874935192
874937635 874937637
874937656 874937661
874945040 874945042
874945045 874945047
874954772 874954775
874955788 874955790
874955804 874955806
