816652224 816652241
816901162 816901179
817018545 817018562
817241680 817241697
817241703 817241720
817248963 817248980
817406224 817406241
817407521 817407538
817410968 817410985
817411793 817411810
817411814 817411831
817411842 817411859
817415486 817415503
817417288 817417305
817417407 817417424
817499410 817499427
817559278 817559295
817579817 817579834
817579841 817579858
817580054 817580071
817581828 817581845
817583643 817583660
817584659 817584676
817584973 817584990
817599413 817599430
817599504 817599521
817834168 817834185
817841630 817841647
817844149 817844166
817844245 817844262
817845217 817845234
817845283 817845300
817845375 817845392
817845390 817845407
817852059 817852076
817946200 817946217
818012151 818012168
818103001 818103018
818103067 818103084
818103121 818103138
818103146 818103163
818106738 818106755
818107708 818107725
818108222 818108239
818112374 818112391
818112397 818112414
818112423 818112440
818112455 818112472
818380519 818380536
818435634 818435651
818623957 818623974
818630249 818630266
819053223 819053240
819053336 819053353
819053441 819053458
819064763 819064780
819064803 819064820
819064807 819064824
819064834 819064851
819212562 819212579
819215447 819215464
819215995 819216012
819222711 819222728
819224864 819224881
819236565 819236582
819241765 819241782
819305430 819305447
819305900 819305917
819306555 819306572
819307311 819307328
819307329 819307346
819825076 819825093
819831016 819831033
819833783 819833800
819844910 819844927
819845993 819846010
819846006 819846023
819907002 819907019
819907055 819907072
819925231 819925248
819990528 819990545
820000437 820000454
820196434 820196451
820199046 820199063
820268466 820268483
820360548 820360565
820426240 820426257
820442877 820442894
820614721 820614738
820615455 820615472
820615563 820615580
820616054 820616071
820871216 820871233
820927045 820927062
820938983 820939000
821032705 821032722
821032816 821032833
821032933 821032950
821033560 821033577
821033701 821033718
821033722 821033739
821034329 821034346
821225748 821225765
821227028 821227046
821227180 821227197
821227189 821227206
821462672 821462689
821463938 821463955
821464145 821464162
821464440 821464458
821464915 821464932
821465172 821465189
821465494 821465511
821465955 821465972
821465982 821465999
821466077 821466094
821470637 821470654
821471100 821471117
821473086 821473103
821473148 821473165
821633798 821633815
821634593 821634610
821652894 821652911
821659603 821659620
821728821 821728838
821728947 821728964
821732164 821732181
821732195 821732212
821737550 821737567
821737584 821737602
821737600 821737617
821737924 821737941
821737960 821737977
821742699 821742716
821748018 821748035
822248977 822248994
822349288 822349305
822414676 822414693
822432944 822432961
822634125 822634142
822731084 822731101
822731413 822731430
822889733 822889750
822947644 822947661
822948643 822948660
822948671 822948688
823026790 823026807
823034613 823034630
823043766 823043783
823523105 823523122
825014701 825014718
825240631 825240648
825913202 825913219
825979425 825979442
826273980 826273997
826310184 826310201
826334443 826334460
826368316 826368333
826582966 826582983
826656827 826656844
826662097 826662114
826822021 826822038
826824689 826824706
826837345 826837362
826911391 826911408
827510714 827510731
828169965 828169982
828173175 828173192
828889464 828889481
829260632 829260649
829328746 829328763
829463731 829463748
830209835 830209852
830273394 830273411
830286490 830286507
830538428 830538445
830545276 830545293
830607518 830607535
830686755 830686772
830960212 830960229
831086639 831086656
831141258 831141275
831142245 831142262
831142467 831142484
831151229 831151246
831163886 831163904
831164534 831164551
831165370 831165387
