842820736 842820776
842829416 842829456
842836744 842836824
842901072 842901112
842906712 842906792
842910256 842910296
842911208 842911248
842911808 842911848
842912048 842912128
842912168 842912208
842912288 842912328
842912488 842912608
842912968 842913008
842913168 842913208
842916504 842916544
842967008 842967048
842978168 842978208
842983160 842983200
842984160 842984200
842985200 842985240
843167696 843167736
843366952 843366992
843427104 843427144
843741696 843741776
843752144 843752184
844121736 844121776
844310488 844310528
844445240 844445280
844462240 844462280
844696592 844696632
844903896 844903976
845038440 845038480
845158360 845158400
845218184 845218224
845237816 845237856
845329344 845329384
845333696 845333736
845503048 845503088
845664568 845664608
845723832 845723872
845725992 845726032
845729512 845729552
845733872 845733912
845802344 845802384
845803104 845803144
845804624 845804664
845805584 845805624
845810024 845810064
845810504 845810544
846016920 846016960
846106424 846106464
846190488 846190528
846191608 846191648
846194192 846194232
846194312 846194352
846194392 846194432
846323032 846323072
846456096 846456136
846470144 846470184
846696904 846696944
846824552 846824592
846853136 846853176
846853736 846853776
847120264 847120504
847120640 847120680
847205992 847206032
847206432 847206472
847213792 847213832
847213872 847213912
847214272 847214352
847215112 847215152
847215192 847215232
847216392 847216432
847216832 847216872
847217632 847217672
847217872 847217912
847218032 847218072
847218312 847218352
847219432 847219472
847219672 847219712
847220552 847220592
847220752 847220792
847220952 847220992
847221192 847221272
847221392 847221432
847221472 847221552
847221792 847221832
847222112 847222152
847222192 847222232
847222552 847222592
847223552 847223632
847224352 847224392
847225752 847225792
847226448 847226488
847226528 847226568
847226848 847226888
847227568 847227608
847227728 847227768
847228248 847228288
847228328 847228368
847229608 847229648
847230128 847230168
847230328 847230368
847230408 847230448
847235440 847235480
847235600 847235640
847265720 847265760
847266040 847266080
847267504 847267544
847268304 847268344
847269864 847269904
847272664 847272704
847274504 847274544
847277744 847277824
847281584 847281624
847296144 847296184
847304784 847304824
847306144 847306184
847308704 847308744
847310144 847310184
847310584 847310624
847310944 847310984
847312864 847312904
847313344 847313384
847313984 847314064
847315864 847315904
847316504 847316544
847316624 847316664
847316984 847317024
847318784 847318824
847319504 847319544
847319704 847319744
847320024 847320064
847320864 847320904
847321144 847321184
847321384 847321424
847323064 847323104
847324104 847324144
847324664 847324704
847327424 847327464
847327504 847327544
847327704 847327744
847329984 847330024
847333144 847333184
847348768 847348808
847349088 847349128
847350408 847350448
847351808 847351848
847352368 847352408
847355288 847355368
847356728 847356768
847358368 847358408
847360768 847360808
847362048 847362088
847362328 847362368
847362928 847362968
847364288 847364328
847364808 847364888
847365728 847365768
847366928 847366968
847370848 847370888
847370928 847371008
847371088 847371128
847371208 847371248
847371368 847371408
847371448 847371488
847373048 847373088
847373288 847373328
847373888 847373928
847374368 847374408
847376328 847376368
847377208 847377248
847377288 847377328
847377608 847377648
847379928 847379968
847380888 847380928
847381128 847381168
847381488 847381528
847382688 847382728
847383488 847383528
847384008 847384048
847395688 847395728
847395928 847395968
847397048 847397088
847401328 847401368
847402008 847402048
847406400 847406440
847406800 847406840
847408240 847408280
847408360 847408400
847409160 847409200
847409360 847409400
847409600 847409640
847409800 847409840
847410600 847410640
847410720 847410760
847410840 847410880
847411520 847411560
847411960 847412040
847412280 847412320
847412720 847412760
847412800 847412840
847412880 847412920
847413120 847413160
847413240 847413280
847413480 847413560
847414080 847414120
847414200 847414240
847414600 847414640
847415360 847415400
847415480 847415520
847415640 847415680
847415840 847415880
847415960 847416040
847416200 847416240
847416480 847416560
847416600 847416680
847416760 847416800
847416880 847416960
847417040 847417080
847425672 847425792
847425872 847425912
847426032 847426072
847426112 847426192
847426272 847426352
847426392 847426472
847426512 847426552
847426632 847426752
847426792 847426832
847426912 847426952
847427152 847427192
847427232 847427272
847427352 847427512
847427592 847427712
847427872 847427912
847427952 847427992
847428072 847428192
847428232 847428272
847428312 847428392
847428432 847428552
847428592 847428672
847428712 847428752
847428792 847428912
847428952 847429072
847429112 847429192
847429232 847429432
847429472 847429512
847429712 847429752
847429792 847429992
847430032 847430072
847430112 847430152
847430232 847430352
847430392 847430512
847430592 847430672
847430752 847430792
847430912 847430952
847430992 847431152
847431232 847431392
847431432 847431592
847431632 847431912
847431952 847432032
847432112 847432192
847432232 847432392
847432472 847432552
847432592 847432672
847432832 847432872
847433032 847433072
847433232 847433272
847473680 847473800
847474000 847474040
847474080 847474160
847474360 847474400
847475176 847475256
847475296 847475336
847475736 847475896
847476136 847476216
847477056 847477136
847477296 847477336
847477456 847477536
847477976 847478056
847478136 847478176
847478216 847478256
847478576 847478696
847478816 847478856
847478896 847478936
847479096 847479136
847479256 847479296
847479336 847479376
847479496 847479536
847479576 847479616
847479776 847479816
847479896 847479976
847480016 847480056
847480096 847480176
847480216 847480256
847480376 847480416
847480696 847480736
847480896 847480976
847481216 847481256
847481296 847481336
847481896 847481936
847481976 847482016
847482216 847482256
847482336 847482376
847482496 847482536
847483096 847483136
847483176 847483256
847483416 847483456
847483496 847483536
847483976 847484016
847484056 847484096
847484296 847484336
847484536 847484576
847484656 847484776
847484816 847484856
847485216 847485256
847485576 847485616
847486016 847486056
847486216 847486256
847486376 847486416
847486496 847486536
847486736 847486776
847486936 847487016
847487576 847487616
847487816 847487856
847488016 847488096
847488616 847488656
847489016 847489056
847489136 847489216
847489336 847489376
847489936 847489976
847490336 847490376
847490496 847490536
847490736 847490816
847490936 847490976
847491496 847491536
847491616 847491656
847491816 847491856
847492216 847492296
847492536 847492576
847492776 847492816
847493176 847493216
847493576 847493616
847493776 847493816
847493856 847493896
847494096 847494136
847494296 847494336
847494696 847494736
847494856 847494976
847495056 847495096
847495616 847495656
847496696 847496776
847497896 847497936
847498776 847498816
847499536 847499576
847500296 847500336
847500496 847500576
847501176 847501216
847501296 847501336
847502176 847502216
847503616 847503656
847504896 847504936
847505456 847505496
847515456 847515496
847604192 847604232
847640896 847640936
847641016 847641056
847642296 847642336
847643856 847643896
847644536 847644576
847645696 847645816
847645976 847646016
847646336 847646376
847646416 847646456
847646496 847646536
847647176 847647216
847647416 847647456
847647696 847647736
847647816 847647896
847647976 847648016
847648576 847648616
847648856 847648896
847649336 847649456
847649936 847649976
847650496 847650536
847650616 847650656
847650976 847651016
847651336 847651376
847651536 847651576
847651616 847651736
847651976 847652016
847652256 847652336
847652416 847652456
847652616 847652656
847652696 847652736
847652776 847652896
847653016 847653056
847653336 847653376
847653416 847653456
847654256 847654296
847654536 847654576
847654656 847654736
847654936 847655016
847655176 847655256
847655376 847655416
847655536 847655576
847655896 847656016
847656376 847656416
847656456 847656536
847656656 847656736
847656976 847657016
847657056 847657096
847657136 847657216
847657256 847657296
847657376 847657416
847657496 847657536
847657616 847657656
847657896 847657936
847658096 847658176
847658256 847658336
847658416 847658456
847658536 847658576
847658776 847658816
847658976 847659016
847659056 847659096
847659216 847659256
847659496 847659536
847659776 847659816
847659976 847660056
847660096 847660136
847660296 847660336
847660456 847660576
847660656 847660696
847660816 847660896
847660976 847661056
847661136 847661176
847661216 847661256
847661296 847661336
847702304 847702344
847702704 847702744
847702784 847702824
847702864 847702904
847702944 847702984
847703024 847703064
847703144 847703184
847703464 847703504
847703544 847703624
847704304 847704344
847704464 847704504
847704624 847704664
847705144 847705184
847705224 847705384
847705504 847705544
847705624 847705704
847705744 847705824
847705904 847705944
847705984 847706024
847706224 847706264
847706384 847706424
847706544 847706584
847706624 847706664
847706784 847706824
847707024 847707064
847707184 847707224
847707304 847707344
847707424 847707464
847707504 847707544
847707784 847707864
847708184 847708224
847708304 847708384
847708544 847708584
847708664 847708704
847708744 847708784
847709064 847709104
847709384 847709424
847709544 847709584
847710024 847710104
847710224 847710304
847710424 847710464
847710624 847710664
847710744 847710784
847710864 847710944
847711104 847711224
847711264 847711304
847711344 847711424
847711464 847711504
847711704 847711784
847712024 847712064
847712344 847712424
847712464 847712504
847712664 847712704
847712864 847712944
847713504 847713544
847714144 847714184
847714224 847714264
847714464 847714504
847714704 847714784
847714824 847714864
847714904 847714944
847715344 847715384
847716144 847716224
847716704 847716744
847716824 847716864
847716904 847716944
847717024 847717064
847717144 847717184
847717544 847717584
847717624 847717704
847717784 847717864
847718104 847718144
847718224 847718264
847718304 847718344
847718384 847718424
847718504 847718624
847718744 847718784
847719064 847719104
847719184 847719224
847719264 847719304
847719344 847719384
847719784 847719824
847719984 847720064
847720224 847720304
847720664 847720744
847721224 847721264
847721544 847721584
847721824 847721864
847722144 847722184
847722584 847722624
847722664 847722704
847722904 847722944
847723144 847723184
847723424 847723464
847723504 847723584
847724064 847724104
847724184 847724224
847725024 847725064
847725264 847725304
847725544 847725584
847726184 847726264
847726664 847726704
847727024 847727064
847727624 847727664
847727904 847727944
847728624 847728664
847729544 847729584
847729624 847729704
847730064 847730104
847730144 847730184
847730344 847730384
847730664 847730704
847730824 847730864
847730904 847730944
847731264 847731304
847731984 847732024
847732304 847732344
847732424 847732464
847732504 847732584
847732624 847732664
847732784 847732824
847736416 847736496
847736536 847736576
847736656 847736736
847736776 847736816
847736856 847736896
847737192 847737232
847737776 847737816
847737856 847737896
847737976 847738056
847738400 847738440
847738480 847738520
847738600 847738640
847738808 847738888
847739008 847739088
847739624 847739704
847739824 847739864
847739904 847739984
847740064 847740104
847740144 847740264
847740384 847740464
847740544 847740584
847740664 847740704
847740864 847740904
847741144 847741224
847741664 847741704
847742024 847742104
847743024 847743064
847743384 847743424
847743664 847743704
847743904 847743944
847744184 847744224
847744344 847744384
847744704 847744864
847744904 847745144
847745184 847745544
847745664 847745744
847745784 847745864
847745944 847746024
847746264 847746304
847746504 847746584
847746664 847746704
847746984 847747064
847747224 847747304
847747424 847747464
847747664 847747704
847748704 847748784
847749144 847749184
847749384 847749424
847749544 847749584
847751784 847751824
847752424 847752464
847757264 847757344
847757544 847757584
847758624 847758664
847812984 847813024
847819248 847819488
847819768 847820008
847820128 847820168
847820208 847820248
847820568 847820648
847820728 847820808
847843280 847843320
847848680 847848760
847905632 847905672
847990472 847990512
847996552 847996592
847999832 847999872
848002792 848002832
848010952 848010992
848018288 848018368
848021288 848021328
848023608 848023648
848039688 848039728
848051048 848051088
848069408 848069448
848086000 848086040
848308120 848308200
848311480 848311520
848316600 848316640
848317040 848317080
848319800 848319840
848330024 848330064
848346776 848346816
848619008 848619048
848619568 848619608
848620328 848620368
848621368 848621408
848625208 848625248
848627488 848627528
848628768 848628808
848636904 848636944
848637504 848637544
848637904 848637944
848637984 848638024
848644168 848644208
848648768 848648808
848651168 848651208
848651608 848651648
848652688 848652728
848655248 848655288
848655608 848655648
848656128 848656168
848658168 848658208
848660488 848660528
848665048 848665088
848666688 848666728
848673088 848673128
848683080 848683120
848707072 848707112
848854184 848854224
849053288 849053328
849121896 849121936
849214336 849214376
849426800 849426840
849442680 849442720
849449456 849449496
849556240 849556280
849591192 849591232
849630152 849630192
849635432 849635472
849739656 849739776
849740336 849740376
849742816 849742856
849742896 849742936
849745736 849745776
849746576 849746616
849746976 849747016
849748696 849748776
849748936 849748976
849749136 849749216
849750136 849750176
849750496 849750536
849750776 849750816
849750976 849751016
849753744 849753784
849753944 849753984
849754064 849754104
849754504 849754544
849754824 849754864
849754984 849755024
849756744 849756784
849757024 849757064
849757264 849757384
849758144 849758184
849759424 849759464
849759904 849759944
849760704 849760744
849760984 849761064
849761184 849761224
849761344 849761384
849761864 849761944
849762344 849762384
849762544 849762584
849762704 849762744
849762824 849762944
849763064 849763104
849763344 849763424
849763544 849763584
849763944 849763984
849764104 849764144
849764344 849764384
849764424 849764464
849764544 849764584
849764624 849764664
849764784 849764824
849764984 849765064
849765184 849765224
849765304 849765344
849765424 849765464
849765624 849765664
849765744 849765784
849765904 849765944
849766064 849766104
849766344 849766464
849766584 849766624
849766704 849766824
849766984 849767024
849767064 849767104
849767144 849767224
849767264 849767344
849767464 849767504
849767584 849767664
849767704 849767744
849767824 849767864
849768024 849768064
849768664 849768784
849769104 849769184
849769224 849769264
849769384 849769424
849769624 849769664
849769784 849769904
849769944 849770064
849770144 849770184
849770344 849770424
849770544 849770584
849770624 849770664
849770704 849770744
849770824 849770864
849771264 849771304
849771384 849771424
849771704 849771784
849771824 849771864
849772184 849772224
849772384 849772504
849772584 849772664
849772824 849772864
849772904 849772984
849773104 849773144
849773224 849773264
849773384 849773624
849773664 849773784
849773944 849773984
849774024 849774104
849774224 849774304
849774344 849774424
849774544 849774584
849774664 849774704
849774784 849774904
849775064 849775184
849775224 849775344
849775384 849775464
849775744 849775824
849775944 849776024
849776104 849776144
849776384 849776424
849776504 849776584
849776664 849776704
849776744 849776784
849776824 849776864
849776944 849776984
849777184 849777224
849777344 849777384
849777504 849777624
849777744 849777784
849777904 849777944
849777984 849778024
849778064 849778104
849778304 849778344
849778624 849778704
849778744 849778784
849778824 849778864
849778944 849779024
849779064 849779104
849779144 849779184
849779224 849779304
849779584 849779824
849779984 849780024
849780064 849780104
849780224 849780264
849780384 849780424
849780464 849780624
849780704 849780744
849780784 849780864
849780984 849781064
849781184 849781264
849781344 849781384
849781504 849781624
849781664 849781704
849781744 849781824
849782024 849782064
849782104 849782144
849782304 849782344
849782424 849782464
849782544 849782664
849782744 849782784
849782824 849782984
849783064 849783104
849783144 849783184
849783224 849783304
849783344 849783464
849783744 849783784
849784024 849784144
849784264 849784304
849784344 849784464
849784504 849784544
849784664 849784704
849784744 849784784
849784824 849784904
849784944 849784984
849785064 849785144
849785224 849785264
849785344 849785384
849785424 849785464
849785544 849785624
849785664 849785704
849785744 849785864
849785984 849786024
849786064 849786144
849786184 849786224
849786264 849786424
849786464 849786544
849786744 849786784
849786824 849786864
849786984 849787224
849787264 849787304
849794944 849794984
849795104 849795184
849795264 849795344
849795424 849795504
849795584 849795784
849795904 849796024
849796144 849796224
849796504 849796544
849796704 849796744
849796944 849797264
849797344 849797384
849797544 849797624
849797744 849797784
849797904 849797944
849798064 849798184
849798304 849798464
849798504 849798544
849798664 849798744
849798784 849798824
849798904 849799064
849799144 849799184
849799224 849799264
849799304 849799584
849799704 849799784
849799944 849799984
849800024 849800064
849800104 849800144
849800264 849800304
849800384 849800424
849800504 849800544
849800584 849800624
849800704 849800744
849800944 849801024
849801104 849801144
849801344 849801384
849801464 849801584
849801624 849801704
849801744 849801784
849801944 849802144
849802224 849802264
849802424 849802504
849802544 849802584
849802624 849802784
849802864 849802944
849802984 849803024
849803064 849803184
849803224 849803304
849803384 849803424
849803584 849803624
849803664 849803704
849803784 849803824
849803864 849803904
849803944 849803984
849804064 849804104
849804144 849804264
849804344 849804384
849804504 849804544
849804744 849804824
849804904 849804944
849804984 849805104
849805144 849805224
849805384 849805504
849805584 849805704
849805744 849805784
849805864 849805944
849806024 849806064
849806144 849806184
849806224 849806304
849806344 849806424
849806504 849806544
849806624 849806664
849806864 849806944
849807024 849807064
849807104 849807184
849807264 849807344
849807624 849807744
849807784 849807824
849807864 849807904
849807944 849808144
849808344 849808384
849808504 849808584
849808664 849808704
849809024 849809064
849809144 849809264
849809304 849809464
849809624 849809664
849809824 849809904
849809984 849810024
849810264 849810304
849810344 849810384
849810504 849810544
849810584 849810664
849810744 849810784
849810864 849810944
849810984 849811024
849811224 849811264
849811304 849811344
849811504 849811584
849811664 849811704
849811944 849811984
849812024 849812064
849812104 849812144
849812344 849812384
849812424 849812504
849812584 849812664
849812704 849812744
849812784 849812824
849812864 849812944
849813024 849813064
849813104 849813184
849813224 849813264
849813384 849813424
849813504 849813544
849813584 849813624
849813704 849813744
849813784 849813824
849813904 849813944
849814064 849814264
849814464 849814504
849814624 849814904
849814984 849815024
849815064 849815104
849815184 849815504
849815544 849815664
849815784 849815824
849815904 849815944
849816104 849816264
849816304 849816344
849816424 849816544
849816584 849816744
849816904 849816944
849816984 849817024
849817184 849817224
849817304 849817384
849817424 849817464
849817584 849817624
849817784 849817904
849817984 849818064
849818104 849818144
849818184 849818264
849818304 849818544
849818584 849818824
849818864 849818904
849818944 849818984
849819024 849819064
849819144 849819184
849819304 849819424
849819504 849819544
849819704 849819744
849819864 849819944
849819984 849820024
849820064 849820104
849820184 849820224
849820264 849820304
849820384 849820424
849820504 849820584
849820664 849820824
849820984 849821064
849821144 849821224
849821384 849821464
849821504 849821544
849821704 849821904
849821944 849821984
849822144 849822184
849822344 849822384
849822464 849822544
849822584 849822624
849822664 849822704
849822784 849822824
849822864 849822904
849823224 849823264
849823344 849823424
849823504 849823584
849828528 849828608
849828768 849828848
849828888 849828928
849828968 849829008
849829808 849829888
849829968 849830088
849830248 849830288
849830328 849830408
849830448 849830488
849830528 849830648
849830688 849830728
849830768 849830808
849830928 849830968
849831008 849831128
849831208 849831328
849831688 849831728
849831848 849831888
849831968 849832048
849832208 849832248
849832368 849832488
849832568 849832608
849832688 849832728
849832808 849832848
849833088 849833168
849833528 849833608
849833808 849833848
849834008 849834048
849834088 849834128
849834168 849834208
849834248 849834288
849834408 849834448
849834488 849834568
849834688 849834768
849835248 849835288
849835328 849835408
849835488 849835528
849835648 849835848
849835888 849835928
849836008 849836048
849836088 849836128
849836288 849836368
849836408 849836448
849836528 849836568
849836848 849836888
849836928 849837088
849837448 849837568
849837608 849837648
849837768 849837808
849837928 849838008
849838048 849838128
849838168 849838208
849838248 849838368
849838448 849838528
849838648 849838688
849838768 849838848
849839048 849839248
849839448 849839488
849839968 849840048
849840168 849840208
849840368 849840408
849840448 849840488
849840568 849840608
849840768 849840808
849841008 849841128
849841448 849841488
849841528 849841608
849841848 849841888
849842048 849842208
849842688 849842728
849842888 849842928
849843088 849843128
849843368 849843408
849843488 849843648
849843688 849843728
849843808 849843888
849843928 849844008
849844288 849844368
849844408 849844448
849844488 849844528
849844808 849844848
849845008 849845048
849845288 849845328
849845408 849845448
849845688 849845728
849845968 849846008
849846088 849846208
849846328 849846408
849846728 849846768
849846888 849846928
849847008 849847168
849847288 849847328
849847368 849847408
849847728 849847768
849847848 849847888
849848008 849848048
849848128 849848168
849848248 849848288
849848608 849848728
849848968 849849048
849849128 849849168
849849248 849849288
849849448 849849488
849849648 849849688
849849848 849849968
849850288 849850328
849850408 849850448
849850528 849850608
849850728 849850768
849850848 849850888
849851008 849851128
849851168 849851248
849851688 849851728
849851768 849851808
849853408 849853488
849853648 849853688
849853768 849853808
849854048 849854088
849854128 849854168
849854288 849854328
849854488 849854528
849854608 849854648
849854808 849854848
849854968 849855008
849855048 849855128
849855208 849855248
849855448 849855608
849855768 849855808
849855848 849855888
849855968 849856008
849856048 849856088
849856168 849856208
849856288 849856328
849856808 849856848
849857088 849857128
849857168 849857208
849857328 849857368
849857408 849857448
849857728 849857768
849857848 849857888
849858008 849858088
849858128 849858208
849858248 849858328
849858488 849858568
849858968 849859008
849859248 849859288
849859768 849859848
849859928 849859968
849860368 849860408
849860688 849860768
849860808 849860848
849861288 849861328
849861728 849861768
849861808 849861848
849861888 849861928
849861968 849862048
849862088 849862128
849862288 849862328
849862408 849862448
849862528 849862568
849862688 849862728
849862888 849862968
849863048 849863088
849863208 849863368
849864248 849864288
849864528 849864568
849865128 849865168
849865208 849865248
849865368 849865448
849865528 849865568
849865848 849865888
849866168 849866208
849866248 849866328
849866528 849866568
849866728 849866768
849866848 849866888
849867168 849867208
849867248 849867288
849867608 849867648
849867888 849867968
849868168 849868208
849868288 849868328
849868528 849868568
849868728 849868848
849869008 849869088
849869528 849869608
849869808 849869848
849870088 849870128
849872040 849872120
849872160 849872240
849872400 849872480
849872840 849872880
849873000 849873120
849873160 849873240
849873320 849873360
849873520 849873600
849873680 849873720
849874200 849874240
849874320 849874360
849874440 849874480
849874720 849874760
849874880 849874920
849875400 849875440
849875480 849875520
849875640 849875680
849875880 849875920
849876000 849876040
849876320 849876360
849876480 849876600
849876640 849876800
849876880 849876960
849877000 849877040
849877080 849877120
849877200 849877280
849877480 849877520
849877640 849877720
849878000 849878040
849878160 849878200
849878280 849878360
849878640 849878760
849878920 849878960
849879160 849879200
849879280 849879320
849879360 849879480
849879640 849879720
849879800 849879840
849879880 849879920
849879960 849880000
849880200 849880240
849880320 849880360
849880440 849880480
849880960 849881040
849881360 849881400
849882040 849882080
849882160 849882200
849882240 849882280
849882320 849882360
849882560 849882600
849882640 849882680
849883040 849883080
849883240 849883280
849883320 849883400
849883560 849883600
849883760 849883840
849883920 849883960
849884000 849884120
849884240 849884280
849884360 849884400
849884480 849884520
849884600 849884640
849884880 849884960
849885080 849885120
849885160 849885200
849885360 849885480
849885560 849885600
849885840 849885960
849886000 849886080
849886120 849886200
849886520 849886680
849886800 849886920
849887080 849887160
849887200 849887320
849887360 849887480
849887520 849887560
849887600 849887640
849887800 849888040
849888160 849888280
849888320 849888400
849888560 849888600
849888640 849888720
849888840 849889040
849889160 849889200
849889240 849889280
849889360 849889400
849889440 849889480
849889520 849889640
849889680 849889760
849889880 849890000
849890080 849890160
849890200 849890240
849890280 849890360
849890440 849890520
849890560 849890640
849890720 849890760
849890840 849890880
849891040 849891080
849891120 849891160
849891240 849891280
849891360 849891400
849891520 849891680
849891760 849891840
849891880 849891960
849892000 849892200
849892280 849892320
849892480 849892520
849892560 849892640
849892680 849892720
849892840 849892920
849892960 849893000
849893040 849893120
849893160 849893240
849893320 849893520
849893560 849893600
849893640 849893800
849893880 849893920
849893960 849894000
849894080 849894240
849894280 849894440
849894520 849894680
849894720 849894920
849894960 849895000
849895040 849895080
849895120 849895160
849895240 849895320
849896848 849896888
849896928 849897128
849897168 849897248
849897288 849897408
849897448 849897488
849897528 849897568
849897728 849898208
849898288 849898488
849898528 849898568
849898688 849898768
849898808 849898888
849898968 849899008
849899088 849899168
849899208 849899248
849899288 849899328
849899448 849899648
849899688 849899728
849899768 849899888
849899928 849899968
849900008 849900048
849900088 849900168
849900328 849900448
849900488 849900608
849900648 849900688
849900728 849901128
849901208 849901248
849901288 849901328
849901536 849901656
849901696 849902056
849902136 849902336
849902376 849902616
849902656 849902696
849902736 849902776
849902816 849902856
849902896 849903016
849903056 849903096
849903136 849903416
849903496 849903536
849907824 849908064
849908104 849908184
849908264 849908344
849909920 849910040
849910080 849910120
849910160 849910240
849910280 849910480
849910560 849910640
849910680 849910840
849910880 849911040
849911080 849911360
849911400 849911440
849911480 849911520
849911600 849911640
849925248 849925288
849925328 849925368
849925488 849925568
849925688 849925848
849925888 849925968
849926048 849926128
849926208 849926368
849926448 849926648
849926688 849926728
849926768 849926848
849926888 849926928
849926968 849927088
849927128 849927168
849927248 849927288
849930976 849931056
849931096 849931256
849931296 849931376
849931496 849931576
849931696 849931816
849931856 849931896
849931936 849932096
849932136 849932176
849932336 849932536
849932656 849932696
849932776 849932896
849932976 849933056
849933096 849933136
849933256 849933376
849933416 849933536
849933696 849933736
849933816 849933936
849934016 849934136
849934176 849934256
849934336 849934576
849934696 849934816
849934936 849935256
849935296 849935336
849935376 849935456
849935576 849935616
849935656 849935896
849936216 849936296
849936456 849936616
849936656 849937136
849937376 849937456
849937816 849937856
849937936 849937976
849938176 849938216
849938296 849938336
849938416 849938456
849938496 849938536
849938576 849938616
849938656 849938696
849938736 849938776
849938856 849938936
849939016 849939056
849939136 849939296
849939336 849939416
849939496 849939576
849939616 849939656
849939736 849939856
849939896 849939976
849940016 849940056
849940096 849940136
849940176 849940216
849940256 849940336
849940376 849940416
849940456 849940496
849940536 849940576
849940656 849940696
849940816 849940856
849940896 849940936
849941216 849941296
849941376 849941416
849941736 849941816
849941856 849941936
849942136 849942216
849942256 849942296
849942336 849942416
849942456 849942496
849942536 849942576
849942736 849942816
849942856 849942896
849943016 849943096
849943176 849943296
849943456 849943496
849943576 849943616
849943656 849943736
849943816 849943856
849943936 849943976
849944056 849944096
849944136 849944176
849944376 849944456
849944496 849944536
849944576 849944616
849944656 849944696
849944816 849944856
849944896 849944936
849945136 849945216
849945456 849945496
849945536 849945616
849945856 849945896
849946056 849946096
849946216 849946256
849946296 849946336
849946376 849946416
849946496 849946536
849946656 849946696
849946816 849946856
849946976 849947096
849947296 849947376
849947456 849947496
849947536 849947616
849947696 849947816
849947856 849947896
849948056 849948096
849948696 849948776
849948816 849948856
849948896 849948936
849949016 849949056
849949176 849949216
849949456 849949536
849949776 849949816
849950016 849950056
849950176 849950216
849950656 849950696
849950736 849950816
849950936 849950976
849951016 849951056
849951296 849951336
849951496 849951576
849951856 849951896
849952056 849952096
849952416 849952456
849952496 849952536
849952816 849952856
849952896 849952936
849952976 849953096
849953336 849953376
849953496 849953536
849953616 849953656
849954056 849954136
849954536 849954576
849954736 849954776
849954896 849954936
849955016 849955056
849955216 849955256
849955536 849955616
849955856 849955936
849956096 849956136
849956216 849956256
849956296 849956376
849956536 849956576
849956816 849956936
849956976 849957056
849957136 849957176
849957296 849957376
849957456 849957496
849957536 849957576
849957696 849957736
849958176 849958216
849958256 849958296
849958336 849958376
849958656 849958696
849959136 849959176
849959376 849959416
849960016 849960056
849960216 849960256
849960416 849960456
849960576 849960656
849960736 849960776
849961056 849961136
849961336 849961416
849961456 849961496
849962016 849962056
849962096 849962136
849962256 849962336
849962856 849962896
849963096 849963136
849963656 849963696
849963736 849963776
849963856 849963896
849964096 849964136
849964656 849964736
849964856 849964896
849965336 849965376
849965416 849965496
849965536 849965576
849966056 849966096
849966216 849966256
849966416 849966456
849966496 849966536
849966576 849966616
849966976 849967016
849967096 849967136
849967656 849967696
849967736 849967776
849967976 849968016
849968096 849968136
849968296 849968336
849968976 849969016
849969576 849969616
849969816 849969856
849970216 849970256
849970376 849970456
849970656 849970696
849971056 849971096
849971136 849971176
849971256 849971296
849971976 849972056
849972096 849972136
850005240 850005280
850007120 850007160
850008680 850008720
850011760 850011800
850013880 850013920
850018560 850018600
850020520 850020560
850021800 850021840
850024360 850024400
850027920 850027960
850029760 850029800
850030440 850030480
850032112 850032152
850032272 850032312
850032952 850033032
850033832 850033872
850034872 850034912
850035392 850035432
850035832 850035872
850035992 850036032
850036632 850036672
850036792 850036872
850037112 850037152
850038352 850038392
850038912 850038952
850039192 850039232
850039312 850039352
850040592 850040632
850040912 850040992
850041152 850041192
850041272 850041312
850043672 850043712
850044672 850044712
850044832 850044872
850044912 850044952
850045592 850045632
850045672 850045712
850046312 850046352
850046792 850046832
850047112 850047152
850047832 850047872
850050112 850050152
850050832 850050952
850051432 850051472
850051872 850051912
850051992 850052072
850052232 850052272
850052632 850052672
850053192 850053232
850053592 850053632
850053832 850053872
850054392 850054432
850054792 850054832
850054952 850054992
850055032 850055072
850055192 850055232
850055352 850055392
850055472 850055512
850055992 850056032
850056152 850056192
850056232 850056272
850056312 850056352
850056592 850056632
850056712 850056792
850057032 850057112
850057392 850057432
850058432 850058472
850058552 850058592
850059032 850059072
850059312 850059352
850059392 850059432
850059552 850059592
850059632 850059672
850059792 850059832
850059872 850059912
850060032 850060112
850060192 850060232
850060352 850060392
850060632 850060672
850060832 850060872
850060992 850061072
850061112 850061152
850061192 850061232
850061272 850061352
850061392 850061512
850061552 850061592
850061632 850061752
850061912 850061952
850061992 850062032
850062232 850062272
850062352 850062392
850062432 850062472
850062592 850062752
850062872 850062952
850063032 850063072
850063112 850063152
850063472 850063552
850063672 850063712
850063792 850063912
850063952 850064032
850064192 850064312
850064352 850064392
850064432 850064472
850064512 850064552
850064592 850064632
850064752 850064872
850065032 850065112
850065192 850065232
850065392 850065472
850065512 850066232
850066368 850066408
850066448 850066688
850101288 850101448
850101528 850101568
850101728 850101848
850101888 850102008
850102128 850102248
850102288 850102328
850102448 850102528
850102568 850102768
850102808 850103008
850103088 850103128
850103168 850103368
850103448 850103568
850103608 850103648
850103688 850103928
850104008 850104288
850104408 850104448
850104528 850104568
850104728 850105008
850105048 850105088
850105208 850105288
850105368 850105448
850105488 850105528
850105568 850105608
850105688 850105808
850105848 850106008
850106048 850106128
850106168 850106208
850106248 850106328
850106368 850106488
850106568 850106608
850106648 850106728
850106768 850106888
850106968 850107048
850107088 850107368
850107408 850107528
850107568 850107648
850107688 850107808
850107848 850108048
850108288 850108448
850108528 850108608
850108688 850108768
850108808 850108928
850108968 850109088
850109168 850109248
850109288 850109328
850109408 850109448
850109488 850109688
850109728 850110008
850110088 850110328
850110368 850110448
850110528 850110568
850110608 850110648
850110728 850111128
850111168 850111208
850111288 850111328
850111552 850111752
850111792 850111832
850111912 850111952
850112032 850112072
850112112 850112272
850117536 850117656
850117776 850117816
850118056 850118136
850118176 850118216
850118256 850118336
850118456 850118496
850118536 850118736
850118816 850118896
850119056 850119096
850119216 850119256
850119296 850119376
850119416 850119576
850119616 850119696
850119776 850120056
850120096 850120176
850120296 850120376
850120416 850120496
850120616 850120696
850120736 850120776
850120856 850121016
850121056 850121216
850121256 850121296
850121336 850121376
850121456 850121576
850121736 850121776
850121816 850121856
850121936 850121976
850122016 850122056
850122096 850122136
850122256 850122296
850122336 850122376
850122416 850122456
850122576 850122696
850122856 850122936
850123056 850123216
850123336 850123376
850123416 850123576
850123856 850123896
850123976 850124056
850124176 850124216
850124296 850124336
850124416 850124456
850124576 850124656
850124696 850124736
850124816 850124896
850124976 850125016
850125056 850125096
850125136 850125216
850125296 850125336
850125376 850125416
850125456 850125496
850125616 850125696
850125776 850125936
850126056 850126176
850126296 850126416
850126456 850126576
850126656 850126736
850126936 850127016
850127056 850127136
850127176 850127216
850127256 850127296
850127336 850127376
850127416 850127456
850127576 850127696
850127816 850127856
850127976 850128096
850128216 850128296
850128336 850128376
850128416 850128456
850128656 850128736
850128776 850128816
850128856 850128896
850128936 850129016
850129176 850129216
850129496 850129576
850129696 850129776
850129816 850129856
850129936 850129976
850130016 850130056
850130176 850130216
850130256 850130296
850130336 850130376
850130456 850130496
850130576 850130656
850130696 850130816
850130856 850130896
850130976 850131096
850131296 850131336
850131496 850131536
850131616 850131776
850131816 850131856
850131976 850132096
850132176 850132216
850132296 850132336
850132376 850132656
850132856 850132896
850132936 850133016
850133296 850133376
850133416 850133496
850133816 850133856
850133896 850133976
850134056 850134096
850134216 850134336
850134536 850134736
850134936 850134976
850135296 850135376
850135456 850135496
850135736 850135896
850136056 850136096
850136136 850136176
850136616 850136656
850136736 850136776
850136816 850136936
850137096 850137136
850137456 850137496
850137576 850137656
850137696 850137736
850140536 850140696
850140856 850140896
850141136 850141176
850141336 850141376
850141536 850141576
850141976 850142016
850142456 850142576
850142616 850142656
850142696 850142736
850142856 850142936
850143216 850143256
850143336 850143416
850143456 850143496
850143656 850143696
850143976 850144056
850144216 850144256
850144296 850144336
850144536 850144576
850144696 850144736
850144776 850144816
850144856 850144936
850144976 850145096
850145176 850145216
850145536 850145576
850145776 850145816
850145856 850145896
850146456 850146496
850146656 850146696
850146736 850146776
850147296 850147336
850147496 850147536
850147696 850147736
850147816 850147856
850147896 850147936
850148056 850148096
850148216 850148256
850148496 850148536
850148816 850148856
850149176 850149216
850149296 850149336
850149376 850149416
850149616 850149656
850150136 850150176
850150456 850150496
850150896 850150976
850151536 850151576
850151656 850151736
850152176 850152296
850152456 850152536
850152616 850152696
850153056 850153096
850153256 850153336
850153376 850153416
850154016 850154056
850154096 850154136
850154216 850154256
850154536 850154576
850154696 850154736
850155336 850155376
850155896 850155936
850155976 850156016
850156096 850156136
850156216 850156256
850156496 850156536
850156576 850156616
850156656 850156736
850156896 850156976
850157016 850157056
850157416 850157536
850157936 850158016
850158656 850158696
850159016 850159056
850159136 850159176
850159376 850159416
850159456 850159496
850159696 850159736
850159896 850159936
850160496 850160536
850160616 850160656
850160736 850160776
850160896 850160936
850161056 850161096
850161216 850161256
850161496 850161536
850162848 850162888
850162928 850162968
850163208 850163248
850163328 850163408
850163568 850163608
850163688 850163728
850164168 850164208
850165216 850165256
850165616 850165656
850165696 850165736
850166976 850167016
850167096 850167136
850167376 850167416
850167696 850167736
850167816 850167856
850168456 850168496
850168536 850168576
850168656 850168696
850168736 850168816
850169336 850169416
850169776 850169816
850170056 850170096
850170216 850170256
850170576 850170616
850170656 850170696
850170936 850170976
850171016 850171056
850171136 850171176
850171576 850171616
850171816 850171856
850171936 850171976
850172216 850172256
850172376 850172416
850172496 850172536
850172616 850172656
850172816 850172856
850172976 850173056
850173096 850173136
850173336 850173416
850173976 850174056
850174336 850174376
850174616 850174656
850174736 850174776
850174896 850174936
850174976 850175016
850175096 850175136
850175176 850175216
850175256 850175296
850175376 850175416
850175616 850175656
850175736 850175776
850175936 850175976
850176096 850176136
850176256 850176296
850176416 850176456
850176536 850176576
850176616 850176656
850176976 850177056
850177176 850177336
850177496 850177536
850177576 850177616
850177936 850178016
850178136 850178176
850178216 850178256
850178296 850178336
850178416 850178456
850178616 850178656
850178856 850178896
850179696 850179776
850179816 850179936
850179976 850180136
850180176 850180216
850180336 850180416
850180456 850180536
850180616 850180656
850180696 850180736
850180816 850180856
850180936 850180976
850181096 850181216
850181296 850181336
850181416 850181456
850181496 850181536
850181576 850181696
850181976 850182096
850182512 850182592
850182792 850182832
850182912 850182952
850182992 850183032
850183072 850183152
850183272 850183352
850183392 850183432
850183512 850183552
850183712 850183752
850183872 850183912
850183952 850184032
850184072 850184112
850184152 850184192
850184232 850184272
850184352 850184432
850184512 850184552
850184592 850184632
850184872 850184912
850184992 850185032
850185112 850185272
850185312 850185352
850185512 850185592
850185632 850185672
850185832 850185912
850185952 850186032
850186072 850186152
850186192 850186232
850186272 850186312
850186432 850186512
850186832 850186872
850187032 850187392
850240776 850240816
850240856 850240896
850240936 850241056
850241176 850241296
850241376 850241416
850266288 850266328
850266448 850266488
850266608 850266648
850266848 850266928
850267728 850267768
850267928 850268088
850268128 850268168
850268408 850268448
850268528 850268568
850268888 850268928
850269888 850269928
850270008 850270088
850270328 850270368
850271008 850271048
850271448 850271488
850271528 850271568
850271808 850271848
850272088 850272128
850272328 850272368
850274608 850274648
850275688 850275768
850276728 850276768
850276808 850276848
850277528 850277568
850277648 850277688
850278168 850278208
850281504 850281544
850281704 850281744
850284336 850284376
850294416 850294456
850297176 850297216
850297896 850297936
850297976 850298016
850316496 850316536
850316696 850316896
850324552 850324592
850394288 850394328
850400312 850400352
850425192 850425232
850449192 850449232
850477432 850477472
850484552 850484592
850490752 850490792
850492152 850492192
850492352 850492392
850493032 850493072
850493592 850493632
850493872 850493912
850494072 850494112
850494272 850494312
850495432 850495472
850496552 850496592
850497232 850497272
850497832 850497872
850497912 850497952
850500432 850500472
850501952 850501992
850503192 850503272
850503312 850503352
850503392 850503432
850503552 850503592
850503792 850503832
850504432 850504472
850504512 850504552
850506232 850506272
850506352 850506392
850506632 850506672
850507352 850507432
850507672 850507712
850508752 850508792
850509552 850509592
850509872 850509912
850509952 850509992
850510432 850510472
850510872 850510912
850511112 850511152
850511472 850511552
850511992 850512032
850513232 850513272
850513432 850513512
850513632 850513672
850515808 850515848
850515928 850515968
850517168 850517208
850517488 850517528
850519192 850519232
850519832 850519872
850520992 850521032
850522912 850522952
850523312 850523352
850523952 850523992
850525272 850525312
850528552 850528592
850530632 850530712
850531152 850531192
850531552 850531592
850539072 850539112
850550352 850550392
850555592 850555632
850557992 850558032
850561712 850561752
850563192 850563232
850563312 850563352
850563912 850563952
850564992 850565032
850565592 850565632
850566752 850566792
850571712 850571752
850572912 850572952
850572992 850573032
850573952 850573992
850574192 850574232
850574352 850574392
850575032 850575072
850575352 850575392
850577792 850577832
850578032 850578072
850608504 850608544
850615184 850615224
850616904 850616944
850617424 850617464
850625344 850625384
850625504 850625544
850630464 850630504
850630864 850630904
850631264 850631304
850633104 850633144
850633664 850633704
850634064 850634104
850634264 850634304
850634384 850634424
850634504 850634544
850634904 850634944
850635704 850635744
850636504 850636544
850637184 850637224
850637584 850637624
850637664 850637704
850638984 850639024
850639784 850639824
850640064 850640104
850640264 850640304
850642264 850642304
850642344 850642384
850642544 850642584
850642624 850642664
850644640 850644680
850644960 850645000
850645360 850645400
850645480 850645520
850645600 850645640
850645720 850645760
850645840 850645880
850646120 850646160
850646280 850646320
850646440 850646520
850646560 850646600
850646720 850646760
850646800 850646840
850647760 850647800
850648120 850648160
850648240 850648280
850648760 850648920
850648960 850649000
850650280 850650440
850650560 850650600
850650800 850650840
850650920 850650960
850651200 850651240
850651480 850651520
850652000 850652080
850652120 850652160
850652760 850652840
850653240 850653280
850653480 850653520
850653640 850653680
850653760 850653800
850654040 850654080
850654320 850654360
850654560 850654600
850654920 850655000
850655360 850655400
850655480 850655520
850655600 850655640
850655840 850655880
850656000 850656040
850656120 850656160
850656280 850656320
850656360 850656400
850657320 850657360
850657440 850657480
850657840 850657920
850658040 850658080
850658120 850658160
850658280 850658320
850658440 850658520
850658640 850658720
850659000 850659040
850659080 850659160
850659240 850659280
850659400 850659440
850659560 850659640
850660560 850660600
850660680 850660720
850660920 850660960
850661080 850661160
850661360 850661400
850661480 850661520
850661560 850661600
850661800 850661840
850661960 850662000
850662360 850662400
850662760 850662880
850663160 850663240
850663360 850663480
850664280 850664320
850664400 850664440
850664640 850664720
850665040 850665080
850665160 850665200
850665240 850665320
850665560 850665600
850665640 850665720
850665840 850665880
850666040 850666080
850666120 850666160
850666240 850666280
850666360 850666400
850666440 850666480
850666800 850666840
850667240 850667280
850668240 850668280
850668920 850668960
850669200 850669240
850669680 850669720
850670040 850670080
850670440 850670560
850670600 850670680
850670720 850670760
850671120 850671160
850671360 850671400
850671440 850671480
850671880 850671920
850672520 850672560
850672840 850672880
850672960 850673000
850673120 850673160
850673200 850673280
850674000 850674040
850674240 850674280
850674520 850674560
850675560 850675600
850675640 850675680
850675920 850675960
850676000 850676040
850676640 850676720
850676840 850676880
850680392 850680432
850680632 850680672
850680792 850680832
850680912 850680992
850681512 850681592
850681712 850681792
850681912 850681952
850681992 850682032
850682432 850682472
850682952 850682992
850683952 850683992
850684552 850684592
850684752 850684792
850684872 850684912
850685032 850685112
850685432 850685472
850685912 850685952
850686072 850686112
850686232 850686312
850686832 850686872
850687032 850687072
850687112 850687152
850687192 850687232
850687392 850687432
850687552 850687632
850687792 850687872
850687912 850688072
850688512 850688552
850688632 850688672
850688712 850688752
850689352 850689432
850689472 850689512
850689632 850689672
850690352 850690432
850690472 850690512
850690552 850690632
850690952 850690992
850691152 850691192
850691432 850691472
850691632 850691672
850691752 850691792
850692072 850692112
850694488 850694528
850696024 850696104
850696504 850696544
850696944 850696984
850697024 850697064
850698568 850698608
850698688 850698728
850698768 850698808
850699008 850699048
850699128 850699168
850699528 850699568
850700568 850700648
850700968 850701088
850701288 850701328
850701368 850701408
850701488 850701528
850701888 850701928
850702048 850702088
850702168 850702208
850702288 850702328
850702648 850702688
850702888 850702968
850703448 850703488
850703528 850703568
850703648 850703688
850704008 850704048
850704128 850704168
850704368 850704408
850704448 850704488
850704528 850704568
850705208 850705248
850705328 850705408
850705488 850705528
850705608 850705688
850705808 850705848
850705968 850706008
850706048 850706088
850706288 850706328
850706408 850706448
850706528 850706648
850706728 850706768
850706848 850706888
850707248 850707328
850707488 850707568
850707648 850707728
850707768 850707808
850707848 850707888
850707968 850708048
850708088 850708128
850708208 850708248
850708288 850708328
850708368 850708408
850708528 850708568
850708688 850708728
850708848 850708888
850709048 850709088
850709168 850709208
850709248 850709288
850709448 850709568
850709608 850709648
850709688 850709848
850709968 850710008
850710048 850710088
850710168 850710208
850710248 850710288
850710328 850710368
850710408 850710488
850710608 850710728
850710768 850710888
850710928 850711008
850711168 850711208
850711248 850711328
850711368 850711488
850711528 850711568
850711648 850711688
850711728 850711808
850711848 850711928
850712008 850712088
850712128 850712208
850712248 850712328
850712368 850712408
850712448 850712568
850712608 850712688
850712728 850712768
850712888 850712928
850713008 850713088
850713248 850713288
850713328 850713408
850713448 850713648
850713688 850713768
850713928 850714048
850714128 850714248
850714328 850714888
850714928 850715208
850715248 850715328
850715368 850715528
850715568 850715608
850715688 850715728
850715768 850715808
850722272 850722312
850722392 850722592
850722632 850722672
850722752 850723072
850723112 850723152
850785216 850785376
850785456 850785616
850785656 850785856
850785896 850785936
850786016 850786056
850786096 850786176
850786256 850786456
850786496 850786656
850786696 850786816
850787056 850787136
850787176 850787216
850787296 850787416
850787496 850787576
850787616 850787656
850787736 850787896
850787936 850787976
850788176 850788216
850788416 850788456
850788496 850788536
850788576 850788616
850788656 850788696
850788736 850788776
850788856 850788976
850789016 850789096
850789216 850789336
850789376 850789416
850789456 850789496
850789616 850789776
850789896 850790016
850790056 850790096
850790136 850790216
850790256 850790456
850790616 850790656
850790696 850790776
850790856 850791056
850791136 850791176
850791296 850791336
850791576 850791696
850791736 850791816
850791896 850792016
850792056 850792096
850792216 850792336
850792416 850792496
850792536 850792616
850792816 850792896
850793056 850793176
850793216 850793336
850793416 850793456
850793536 850793576
850793656 850793696
850793816 850793856
850793896 850793936
850793976 850794016
850794096 850794176
850794296 850794336
850794376 850794416
850794456 850794496
850794656 850794776
850794856 850794936
850794976 850795016
850795056 850795096
850795256 850795376
850795456 850795496
850795656 850795736
850795776 850795896
850796016 850796136
850796256 850796336
850796376 850796416
850796456 850796536
850796576 850796616
850796696 850796856
850796896 850796936
850797056 850797096
850797336 850797456
850797536 850797576
850797736 850797776
850797856 850797936
850797976 850798016
850798056 850798176
850798336 850798376
850798416 850798576
850798656 850798736
850798816 850798936
850799096 850799176
850799216 850799296
850799336 850799376
850799416 850799496
850799936 850799976
850800216 850800256
850800296 850800336
850800456 850800496
850800896 850800976
850801096 850801176
850801216 850801256
850801296 850801376
850801576 850801656
850801816 850801856
850801936 850801976
850802016 850802096
850802136 850802216
850802376 850802416
850802456 850802496
850802576 850802656
850802696 850802736
850802896 850803016
850803216 850803256
850803376 850803416
850803536 850803576
850803656 850803696
850803776 850803936
850804016 850804056
850804096 850804136
850804176 850804216
850804336 850804376
850804416 850804456
850804776 850804816
850805096 850805176
850805376 850805416
850805536 850805616
850805656 850805736
850805816 850805856
850806176 850806216
850806456 850806576
850806896 850806936
850807056 850807136
850807296 850807336
850807536 850807616
850807656 850807696
850807856 850807896
850807976 850808136
850808176 850808216
850808336 850808376
850808616 850808656
850808696 850808736
850808776 850808816
850808936 850808976
850809056 850809136
850809256 850809296
850809656 850809696
850810056 850810096
850810256 850810296
850810696 850810776
850810896 850810936
850811216 850811256
850811416 850811456
850811656 850811696
850811736 850811776
850811896 850811936
850812056 850812096
850812136 850812216
850812416 850812576
850812616 850812656
850812696 850812736
850812856 850812896
850813056 850813136
850813256 850813296
850813336 850813376
850813656 850813696
850816056 850816096
850816216 850816256
850816536 850816576
850816776 850816816
850816856 850816896
850817376 850817416
850817616 850817656
850818176 850818216
850818256 850818296
850818576 850818616
850819576 850819656
850819696 850819736
850820136 850820176
850820216 850820256
850820656 850820696
850821056 850821136
850821776 850821816
850822416 850822456
850824176 850824216
850824296 850824336
850824536 850824576
850824936 850824976
850825416 850825496
850826296 850826336
850826496 850826536
850827496 850827536
850827656 850827696
850828456 850828496
850828976 850829016
850832176 850832216
850832696 850832736
850833016 850833056
850833136 850833176
850834616 850834736
850834896 850834936
850835536 850835576
850836616 850836656
850837816 850837856
850838376 850838416
850838696 850838736
850839336 850839376
850839976 850840016
850840776 850840816
850841296 850841336
850841736 850841776
850842456 850842496
850844176 850844216
850844896 850844936
850846376 850846416
850846536 850846576
850847816 850847856
850848336 850848376
850851216 850851256
850851736 850851776
850851936 850851976
850861392 850861432
850862232 850862272
850862392 850862432
850869672 850869712
850870232 850870272
850872032 850872072
850873552 850873592
850874552 850874592
850875032 850875072
850875392 850875432
850876072 850876112
850876872 850876912
850877152 850877192
850877312 850877352
850877592 850877632
850877992 850878032
850878512 850878552
850879792 850879872
850880112 850880152
850881224 850881264
850881384 850881424
850881984 850882024
850882104 850882144
850882264 850882304
850882464 850882504
850882864 850882904
850883144 850883184
850883344 850883384
850883424 850883464
850883904 850883944
850884944 850884984
850885384 850885424
850885504 850885544
850886304 850886344
850886504 850886544
850886784 850886864
850886984 850887024
850887424 850887464
850887544 850887624
850887784 850887824
850888344 850888384
850888504 850888544
850889184 850889224
850889704 850889784
850890104 850890144
850890464 850890544
850890984 850891024
850891104 850891144
850891264 850891304
850891424 850891464
850892024 850892064
850892304 850892344
850892504 850892544
850892784 850892824
850892904 850892944
850893024 850893064
850893504 850893544
850893664 850893744
850893944 850893984
850894264 850894304
850894544 850894584
850895344 850895384
850895424 850895464
850896224 850896264
850897144 850897184
850897344 850897384
850897704 850897744
850897784 850897944
850898144 850898184
850898344 850898384
850898584 850898624
850898784 850898824
850899024 850899064
850899264 850899304
850899384 850899424
850899584 850899664
850900104 850900144
850900264 850900384
850900464 850900504
850900584 850900624
850900664 850900704
850900744 850900784
850900984 850901064
850901104 850901144
850901344 850901384
850901504 850901544
850902024 850902064
850902104 850902184
850902744 850902784
850903024 850903064
850903384 850903424
850903504 850903544
850903824 850903944
850904344 850904384
850904424 850904464
850904584 850904624
850904664 850904704
850904864 850904904
850904984 850905024
850905344 850905424
850905504 850905544
850905784 850905824
850905904 850905944
850906424 850906464
850906864 850906904
850907024 850907104
850907264 850907304
850907384 850907424
850907464 850907504
850907744 850907784
850907824 850907864
850907944 850908024
850908464 850908544
850908584 850908624
850908944 850908984
850909064 850909104
850909144 850909224
850909264 850909304
850909384 850909424
850909504 850909544
850909704 850909744
850909784 850909824
850909904 850910024
850910264 850910304
850910504 850910544
850910624 850910664
850910984 850911064
850911304 850911344
850911584 850911624
850912024 850912064
850912304 850912344
850912424 850912464
850912704 850912744
850912824 850912864
850912944 850912984
850913984 850914064
850914224 850914264
850914544 850914624
850914664 850914704
850914744 850914824
850914904 850914944
850915104 850915144
850915184 850915224
850915344 850915384
850915504 850915544
850915824 850915904
850916784 850916824
850917144 850917264
850917344 850917384
850917504 850917544
850917664 850917704
850917864 850917904
850917984 850918024
850918064 850918104
850918344 850918424
850919304 850919344
850919464 850919504
850919544 850919584
850919744 850919784
850919984 850920024
850920104 850920144
850920224 850920264
850920344 850920464
850920504 850920544
850921104 850921144
850921264 850921344
850921424 850921504
850921664 850921704
850921824 850921864
850921904 850921944
850922104 850922144
850922584 850922624
850922824 850922864
850923464 850923504
850923664 850923704
850923944 850923984
850924704 850924744
850924784 850924824
850925064 850925104
850926144 850926184
850926224 850926264
850926424 850926464
850926584 850926624
850926704 850926784
850927304 850927344
850927784 850927824
850927944 850928024
850928064 850928104
850928304 850928344
850929024 850929064
850929784 850929824
850930584 850930624
850930704 850930744
850930824 850930904
850931144 850931184
850931704 850931744
850932424 850932464
850932904 850932944
850933104 850933144
850934504 850934544
850934864 850934904
850935304 850935344
850935744 850935784
850936304 850936344
850936504 850936544
850937064 850937104
850937184 850937224
850937544 850937584
850937624 850937664
850937744 850937784
850938504 850938544
850938584 850938624
850939944 850940024
850941248 850941288
850941528 850941568
850944128 850944168
850944448 850944488
850944848 850944888
850945168 850945208
850946488 850946528
850946768 850946808
850948528 850948568
850948768 850948808
850949048 850949088
850949408 850949448
850950288 850950328
850951288 850951328
850952568 850952608
850953568 850953608
850954088 850954128
850954208 850954248
850954688 850954728
850956288 850956328
850957448 850957488
850959968 850960008
850960728 850960768
850960808 850960848
850961008 850961048
850961168 850961208
850961728 850961768
850963128 850963168
850963528 850963568
850975848 850975888
850981888 850981928
851007648 851007688
851009928 851009968
851011688 851011728
851012608 851012648
851013688 851013728
851014768 851014808
851014968 851015008
851015848 851015888
851016248 851016288
851016888 851016928
851017408 851017448
851018768 851018808
851020808 851020848
851020888 851020928
851023888 851023928
851026168 851026208
851026248 851026288
851026848 851026888
851033248 851033288
851034648 851034688
851034768 851034808
851037128 851037168
851042736 851042776
851042896 851042936
851043776 851043816
851045016 851045056
851045096 851045136
851046536 851046576
851047216 851047256
851047616 851047656
851047696 851047736
851048376 851048416
851049136 851049176
851049536 851049576
851052096 851052136
851052296 851052336
851052376 851052456
851052496 851052536
851052576 851052616
851052736 851052776
851053336 851053376
851053576 851053616
851053656 851053696
851053816 851053856
851053936 851053976
851054016 851054056
851054456 851054496
851054976 851055016
851055056 851055096
851055256 851055296
851056376 851056416
851057616 851057656
851057856 851057896
851058696 851058736
851058976 851059016
851059616 851059656
851059856 851059896
851060496 851060536
851060576 851060616
851061136 851061176
851061536 851061576
851062296 851062376
851063616 851063656
851064536 851064576
851064776 851064816
851065496 851065536
851066456 851066496
851066576 851066616
851067416 851067496
851067696 851067776
851067856 851067896
851068136 851068176
851068336 851068376
851068456 851068496
851068616 851068776
851068976 851069016
851069656 851069696
851069856 851069896
851069936 851070016
851070056 851070096
851070136 851070176
851070216 851070256
851070336 851070376
851070616 851070656
851070776 851070896
851071016 851071056
851072896 851072976
851073056 851073096
851073376 851073416
851073496 851073536
851073656 851073736
851073776 851073816
851073856 851073896
851074216 851074296
851074336 851074376
851074536 851074656
851074896 851074936
851075056 851075096
851075136 851075336
851075496 851075536
851075696 851075816
851075936 851075976
851076016 851076056
851076176 851076216
851076256 851076336
851076536 851076576
851076736 851076936
851077016 851077056
851077096 851077176
851077256 851077376
851077456 851077496
851077536 851077576
851077736 851077776
851077816 851077896
851078056 851078136
851078216 851078256
851078296 851078336
851078456 851078496
851078576 851078696
851078856 851078896
851078976 851079056
851079136 851079176
851079336 851079376
851079576 851079616
851079736 851079856
851079896 851079936
851080096 851080176
851080296 851080336
851080376 851080496
851080576 851080616
851080656 851080816
851080936 851080976
851081016 851081096
851081136 851081176
851081216 851081256
851081296 851081336
851081456 851081496
851081536 851081576
851081656 851081776
851081976 851082016
851082176 851082216
851082256 851082296
851082376 851082456
851082616 851082696
851083016 851083056
851085504 851085584
851085744 851085824
851085984 851086024
851086144 851086184
851086224 851086264
851086384 851086424
851086704 851086784
851086984 851087024
851087144 851087264
851087304 851087344
851087384 851087464
851087504 851087544
851087584 851087624
851087744 851087904
851088064 851088104
851088184 851088304
851088424 851088464
851088504 851088624
851088664 851088704
851088744 851088784
851088984 851089104
851089144 851089184
851089224 851089264
851089344 851089384
851089464 851089504
851089664 851089704
851089784 851089864
851089904 851089944
851090064 851090104
851090144 851090184
851090264 851090504
851090624 851090704
851090744 851090864
851090944 851091024
851091184 851091264
851091304 851091384
851091424 851091464
851091504 851091544
851091664 851091704
851091744 851091784
851091864 851092144
851092184 851092264
851092304 851092344
851092504 851092664
851092704 851092864
851092904 851093024
851093064 851093104
851093344 851093464
851093704 851093744
851093784 851093824
851093864 851093944
851093984 851094024
851094064 851094104
851094144 851094184
851094344 851094464
851094504 851094784
851094944 851095064
851095104 851095144
851095184 851095344
851095624 851095704
851095784 851095864
851096024 851096064
851096184 851096224
851096264 851096344
851096544 851096664
851096704 851096824
851096904 851096984
851097144 851097184
851097304 851097384
851097424 851097464
851097544 851097584
851097624 851097704
851097864 851097944
851098104 851098184
851098304 851098344
851098424 851098544
851098584 851098624
851098704 851098744
851098784 851098984
851099064 851099144
851099184 851099224
851099424 851099664
851099704 851099744
851099824 851099904
851099944 851100024
851100184 851100224
851100504 851100624
851100664 851100744
851100784 851100864
851100944 851101064
851101184 851101264
851101304 851101424
851101464 851101504
851101624 851101664
851101704 851101784
851101904 851102104
851102184 851102224
851102344 851102384
851102544 851102624
851102704 851102784
851102824 851102864
851102904 851102984
851103104 851103144
851103264 851103624
851103704 851103744
851103784 851103824
851103864 851103984
851104104 851104144
851104184 851104224
851104304 851104344
851104424 851104544
851104624 851104704
851104744 851104784
851104824 851104944
851105144 851105224
851105384 851105464
851105504 851105584
851105624 851105704
851105864 851105944
851105984 851106024
851106064 851106144
851106344 851106384
851106424 851106464
851106544 851106584
851106624 851106704
851106784 851106824
851106864 851106984
851107024 851107064
851107264 851107344
851107384 851107504
851107544 851107584
851107624 851107664
851107704 851107784
851107824 851107904
851107944 851107984
851108024 851108064
851108224 851108264
851108344 851108384
851108464 851108544
851108584 851108624
851108664 851108704
851108784 851108824
851108944 851109024
851109104 851109144
851109184 851109224
851109304 851109344
851109384 851109424
851109464 851109544
851109624 851109704
851109784 851109824
851110024 851110104
851110184 851110224
851110304 851110344
851110424 851110544
851110664 851110744
851110784 851110824
851111064 851111224
851111264 851111304
851112320 851112360
851112640 851113040
851113120 851113160
851113320 851113440
851113560 851113600
851113640 851113680
851113760 851113840
851114000 851114040
851114120 851114160
851114200 851114320
851114360 851114560
851114600 851114640
851114680 851114760
851114800 851114840
851114880 851114920
851114960 851115000
851115120 851115160
851115280 851115320
851115440 851115480
851115600 851115680
851115760 851115800
851115840 851115880
851115920 851115960
851116080 851116120
851116200 851116320
851116520 851116600
851116640 851116720
851116760 851116800
851116840 851116920
851116960 851117000
851117200 851117280
851117360 851117400
851117440 851117520
851117560 851117680
851117720 851117760
851117840 851117880
851117960 851118000
851118040 851118120
851118160 851118240
851118280 851118320
851118440 851118560
851118760 851118800
851118840 851118920
851119000 851119040
851119120 851119240
851119360 851119400
851119520 851119640
851119720 851119840
851120120 851120160
851120280 851120320
851120360 851120440
851120720 851120840
851120920 851120960
851121080 851121120
851121160 851121200
851121280 851121440
851121640 851121720
851121800 851121960
851122040 851122240
851122360 851122480
851122560 851122680
851122880 851122920
851122960 851123000
851123120 851123160
851123600 851123640
851123720 851123760
851124000 851124040
851124200 851124280
851124400 851124520
851124600 851124640
851124680 851124840
851124920 851125000
851125120 851125200
851125240 851125320
851125520 851125560
851125600 851125680
851125720 851125760
851125800 851125880
851125960 851126000
851126080 851126160
851126200 851126240
851126280 851126320
851126440 851126480
851126600 851126640
851126680 851126760
851127040 851127080
851127120 851127160
851127240 851127320
851127400 851127440
851127480 851127640
851127680 851127760
851127880 851127960
851128040 851128080
851128120 851128160
851128360 851128440
851128560 851128600
851128640 851128720
851128840 851128960
851129040 851129080
851129120 851129160
851129200 851129280
851129440 851129480
851129600 851129720
851129800 851129880
851129920 851130000
851130080 851130120
851130280 851130320
851130360 851130520
851130640 851130680
851130720 851130800
851131000 851131080
851131200 851131320
851131400 851131480
851131560 851131600
851131640 851131720
851131960 851132080
851132520 851132600
851132640 851132680
851132760 851132880
851132920 851133000
851133040 851133120
851133640 851133680
851133720 851133760
851133960 851134040
851134120 851134160
851134400 851134440
851134720 851134760
851134920 851135000
851135080 851135200
851135320 851135440
851135520 851135640
851135760 851135840
851135920 851135960
851136080 851136120
851136160 851136200
851136240 851136280
851136560 851136600
851136760 851136800
851136880 851136920
851136960 851137000
851137040 851137080
851137120 851137160
851137200 851137240
851137320 851137360
851137480 851137520
851137560 851137600
851138040 851138080
851138400 851138480
851138640 851138680
851138880 851138960
851139000 851139040
851139080 851139200
851139240 851139280
851139360 851139400
851139640 851139680
851139760 851139800
851140080 851140120
851140160 851140200
851140440 851140480
851140520 851140560
851140600 851140680
851141200 851141240
851141400 851141440
851141560 851141640
851141840 851141880
851141920 851142000
851142040 851142120
851142200 851142280
851142320 851142360
851142400 851142520
851142560 851142600
851142720 851142760
851142960 851143000
851143040 851143160
851143200 851143280
851143400 851143520
851143560 851143680
851406880 851406920
851407040 851407080
851407320 851407360
851407960 851408000
851409392 851409432
851409872 851409912
851410192 851410232
851410912 851410952
851413752 851413792
851413832 851413872
851415192 851415272
851417512 851417552
851418872 851418912
851419272 851419312
851420952 851420992
851421672 851421712
851422232 851422272
851422552 851422592
851422832 851422872
851423032 851423072
851423672 851423712
851423752 851423832
851424032 851424072
851425192 851425232
851425992 851426032
851426472 851426512
851426632 851426672
851426872 851426912
851427432 851427472
851427752 851427792
851427992 851428032
851428672 851428712
851428792 851428832
851429352 851429392
851430112 851430152
851430592 851430632
851430792 851430832
851431312 851431352
851431952 851431992
851433232 851433272
851433952 851433992
851434032 851434072
851434592 851434632
851434672 851434752
851434832 851434872
851435272 851435352
851435432 851435472
851435632 851435672
851435752 851435792
851435872 851435912
851436072 851436112
851436392 851436432
851436472 851436512
851436712 851436752
851436872 851436912
851437432 851437472
851438592 851438672
851438952 851438992
851439152 851439232
851439552 851439592
851439712 851439752
851440032 851440072
851440272 851440392
851440432 851440512
851440672 851440712
851440952 851440992
851441032 851441112
851441152 851441192
851441312 851441352
851441512 851441552
851441672 851441712
851441872 851441952
851441992 851442032
851442352 851442392
851442552 851442592
851443032 851443072
851443312 851443392
851443472 851443512
851443592 851443672
851443912 851443952
851444192 851444232
851444352 851444392
851444832 851444912
851445312 851445352
851445672 851445712
851445752 851445792
851445832 851445872
851446272 851446312
851446392 851446432
851446472 851446512
851446552 851446592
851446752 851446792
851447072 851447112
851447152 851447192
851447352 851447392
851447472 851447512
851447592 851447632
851447672 851447752
851448272 851448312
851448352 851448392
851448552 851448592
851448712 851448832
851448872 851448912
851449072 851449112
851449152 851449192
851449232 851449272
851449312 851449392
851449752 851449832
851449992 851450032
851450392 851450432
851450552 851450592
851450752 851450872
851450912 851450952
851451032 851451072
851451232 851451272
851451552 851451592
851451672 851451712
851451792 851451832
851452152 851452192
851452472 851452512
851452632 851452672
851452992 851453032
851453232 851453272
851453352 851453392
851453512 851453552
851453632 851453672
851453792 851453832
851453912 851453992
851454072 851454192
851454232 851454272
851454352 851454392
851454632 851454672
851454712 851454752
851455032 851455072
851455112 851455272
851455312 851455352
851455392 851455432
851455472 851455512
851455592 851455712
851455832 851455872
851455992 851456072
851456112 851456152
851456512 851456552
851456632 851456792
851456832 851456872
851456952 851456992
851457112 851457152
851457232 851457272
851457672 851457712
851458032 851458072
851458192 851458312
851458632 851458672
851458952 851459032
851459152 851459192
851459232 851459272
851459392 851459432
851459672 851459712
851459792 851459832
851460152 851460192
851460392 851460432
851460512 851460552
851460632 851460712
851460752 851460792
851460872 851460912
851460952 851461032
851461192 851461232
851461352 851461392
851461432 851461472
851461512 851461552
851461592 851461632
851461672 851461752
851461832 851461872
851461912 851461952
851462032 851462072
851462152 851462192
851462352 851462472
851462552 851462632
851462792 851462832
851462992 851463032
851463152 851463192
851463272 851463312
851463352 851463392
851463432 851463472
851463552 851463632
851463872 851464072
851464152 851464232
851467184 851467224
851467264 851467344
851467504 851467544
851467664 851467744
851467784 851467824
851468024 851468104
851468144 851468184
851468264 851468384
851468424 851468464
851468544 851468584
851468704 851468744
851468824 851468904
851469184 851469224
851469584 851469624
851469744 851469784
851469824 851470024
851470144 851470224
851470304 851470344
851470504 851470544
851470704 851470744
851470864 851470904
851471464 851471504
851471624 851471744
851471944 851471984
851472024 851472144
851472184 851472224
851472544 851472624
851472664 851472704
851472744 851472864
851472944 851472984
851473104 851473184
851473224 851473264
851473424 851473464
851473544 851473624
851473704 851473784
851473944 851473984
851474024 851474064
851474144 851474184
851474224 851474304
851474384 851474544
851474584 851474704
851474824 851474864
851474944 851474984
851475024 851475104
851475184 851475344
851475664 851475864
851476304 851476344
851476384 851476424
851476544 851476584
851476904 851476944
851476984 851477024
851477344 851477384
851477464 851477504
851477544 851477624
851477704 851477784
851477824 851477864
851478504 851478544
851478584 851478624
851478904 851478984
851479024 851479064
851479184 851479304
851479424 851479464
851479504 851479544
851479584 851479664
851479704 851479744
851479784 851479824
851479944 851479984
851480024 851480064
851480104 851480144
851480224 851480344
851480384 851480464
851480504 851480584
851480624 851480704
851480824 851480864
851480944 851480984
851481144 851481184
851481304 851481384
851481584 851481624
851481744 851481784
851482024 851482064
851482104 851482224
851482304 851482344
851482424 851482464
851482504 851482544
851482944 851482984
851483064 851483104
851483144 851483184
851483264 851483344
851483424 851483464
851483504 851483544
851483704 851483744
851483784 851483824
851483984 851484024
851484184 851484224
851484504 851484584
851484864 851484944
851484984 851485104
851485144 851485304
851485384 851485424
851485584 851485624
851485704 851485824
851485864 851485944
851485984 851486024
851486144 851486184
851486464 851486504
851486664 851486704
851486744 851486824
851486944 851486984
851487064 851487104
851487464 851487504
851487544 851487584
851487704 851487784
851488104 851488144
851488704 851488744
851488824 851488864
851489064 851489104
851489144 851489184
851489304 851489344
851489704 851489744
851489944 851489984
851490024 851490064
851490424 851490464
851490504 851490544
851490784 851490824
851490904 851490944
851491064 851491104
851491224 851491264
851491504 851491544
851491584 851491624
851492024 851492064
851492344 851492384
851492664 851492704
851492784 851492824
851492984 851493064
851493224 851493264
851493304 851493344
851493384 851493424
851493464 851493504
851493544 851493584
851493984 851494024
851494144 851494224
851494384 851494464
851494504 851494624
851494664 851494704
851494784 851494864
851495384 851495424
851495504 851495544
851495584 851495624
851495664 851495744
851495784 851495824
851495944 851495984
851496264 851496344
851496424 851496464
851496504 851496544
851496824 851496864
851497744 851497784
851497904 851497944
851497984 851498024
851498184 851498224
851498544 851498624
851498664 851498704
851499064 851499224
851499344 851499384
851500064 851500104
851500144 851500224
851500304 851500344
851500464 851500504
851500784 851500824
851501344 851501384
851501544 851501584
851501904 851501944
851501984 851502024
851502224 851502264
851502664 851502704
851502984 851503024
851503144 851503184
851503544 851503584
851503784 851503864
851504024 851504064
851504544 851504584
851504824 851504864
851504904 851504944
851505104 851505144
851505264 851505304
851505624 851505664
851506544 851506584
851506944 851507024
851507264 851507304
851507744 851507784
851508584 851508624
851508984 851509024
851509864 851509904
851510024 851510064
851510424 851510464
851510624 851510664
851511104 851511144
851511304 851511344
851511504 851511544
851511744 851511824
851512344 851512384
851512864 851512904
851512984 851513024
851513264 851513304
851513344 851513384
851518208 851518248
851518688 851518728
851519408 851519448
851520128 851520168
851521720 851521760
851523200 851523240
851523600 851523640
851524520 851524560
851525160 851525200
851525240 851525280
851525440 851525480
851527600 851527640
851529360 851529400
851530400 851530440
851532480 851532520
851532920 851532960
851533520 851533560
851535200 851535240
851535560 851535600
851536840 851536880
851537240 851537280
851537600 851537640
851537920 851537960
851538440 851538520
851539480 851539520
851539560 851539600
851544120 851544160
851544200 851544240
851544920 851544960
851546320 851546360
851546560 851546600
851548040 851548080
851551960 851552000
851552840 851552880
851554040 851554080
851554560 851554600
851555760 851555800
851559520 851559560
851561240 851561280
851561600 851561640
851561720 851561760
851562560 851562600
851563160 851563200
851565040 851565080
851567000 851567040
851573960 851574000
851576000 851576040
851577000 851577040
851578920 851578960
851579560 851579600
851581720 851581760
851582240 851582280
851584440 851584480
851585400 851585440
851590280 851590320
851590680 851590720
851592960 851593000
851594440 851594480
851600800 851600840
851613240 851613280
851616440 851616480
851806632 851806672
851816552 851816592
851852992 851853032
851873736 851873776
851876976 851877016
851877536 851877576
851879256 851879296
851879376 851879416
851888616 851888656
851890896 851890936
851894016 851894056
851896456 851896496
851897016 851897056
851899816 851899856
851911176 851911216
851933640 851933680
851938024 851938064
851951736 851951776
851956056 851956096
851956816 851956856
851958976 851959016
852008656 852008696
852048984 852049024
852051384 852051424
852058952 852058992
852059952 852059992
852060752 852060792
852063152 852063192
852066672 852066712
852067312 852067352
852067632 852067752
852100296 852100336
852100976 852101016
852101176 852101216
852101856 852101896
852102016 852102056
852139000 852139080
852139160 852139200
852139920 852140000
852140440 852140520
852140640 852140680
852140720 852140760
852140840 852140920
852140960 852141040
852141480 852141520
852141600 852141640
852141880 852142000
852142040 852142080
852142360 852142400
852142440 852142480
852142880 852142920
852142960 852143000
852143160 852143200
852143280 852143320
852143640 852143720
852144200 852144280
852144440 852144480
852144832 852144872
852145152 852145232
852145552 852145592
852145632 852145672
852146032 852146072
852146152 852146192
852146352 852146392
852146472 852146552
852147048 852147088
852147128 852147208
852147408 852147448
852147488 852147528
852147568 852147608
852147648 852147688
852147768 852147808
852147888 852147928
852148408 852148448
852148488 852148528
852148608 852148768
852149048 852149128
852149208 852149248
852155072 852155112
852155232 852155272
852155352 852155392
852155512 852155552
852155632 852155672
852155712 852155752
852155912 852155952
852156192 852156232
852156432 852156472
852156552 852156592
852156752 852156792
852157472 852157512
852157832 852157872
852158392 852158472
852158872 852158912
852159152 852159272
852159592 852159632
852159712 852159752
852159832 852159912
852160112 852160152
852160512 852160552
852160592 852160632
852160752 852160792
852161432 852161472
852161712 852161752
852161952 852161992
852162392 852162432
852163192 852163232
852163272 852163312
852163632 852163672
852164272 852164312
852164392 852164432
852164712 852164752
852164792 852164872
852165392 852165432
852166072 852166112
852166392 852166432
852166632 852166672
852166792 852166832
852167112 852167152
852167232 852167272
852167432 852167552
852168192 852168232
852168312 852168352
852168952 852169032
852170392 852170472
852170632 852170672
852170872 852170912
852171672 852171712
852171792 852171832
852171952 852171992
852172032 852172072
852172512 852172592
852172872 852172912
852173712 852173752
852174072 852174112
852175072 852175112
852175952 852175992
852176192 852176232
852176312 852176352
852177432 852177472
852178032 852178072
852178392 852178432
852179392 852179432
852180032 852180072
852180272 852180312
852180512 852180552
852181032 852181072
852181392 852181432
852183312 852183352
852183592 852183632
852185352 852185392
852186512 852186592
852187312 852187352
852187992 852188032
852189712 852189752
852190352 852190472
852193352 852193392
852197072 852197112
852198432 852198472
852199952 852199992
852200232 852200272
852200752 852200792
852202552 852202592
852205272 852205312
852206232 852206272
852206392 852206432
852206792 852206832
852208112 852208152
852208592 852208632
852208712 852208752
852208912 852208952
852210272 852210312
852210992 852211032
852211392 852211432
852211992 852212072
852212312 852212352
852247000 852247040
852247400 852247440
852247560 852247680
852248000 852248040
852248600 852248640
852248760 852248800
852248840 852248880
852248920 852248960
852249280 852249320
852249480 852249560
852249760 852249800
852250080 852250120
852250280 852250320
852250480 852250520
852250720 852250760
852250840 852250920
852251080 852251160
852251440 852251480
852251560 852251600
852251680 852251720
852252440 852252480
852253160 852253200
852253240 852253280
852253880 852253920
852254160 852254200
852254800 852254840
852255280 852255320
852255440 852255480
852255760 852255800
852255880 852255920
852256080 852256120
852256160 852256200
852256880 852256920
852257080 852257160
852257200 852257240
852257960 852258000
852258440 852258480
852258560 852258600
852258920 852258960
852259320 852259360
852259440 852259480
852259640 852259680
852260360 852260400
852260480 852260520
852260600 852260640
852260680 852260720
852260800 852260840
852260880 852260920
852261040 852261120
852261200 852261240
852261480 852261520
852261680 852261800
852261960 852262000
852262040 852262080
852262160 852262240
852262440 852262520
852262600 852262680
852262960 852263000
852263160 852263200
852263240 852263280
852263320 852263360
852263440 852263480
852263560 852263640
852263760 852263800
852264360 852264400
852264440 852264480
852264560 852264680
852264880 852264920
852265040 852265080
852265280 852265320
852265600 852265680
852265840 852265880
852265920 852265960
852266120 852266160
852266520 852266640
852266800 852266840
852266880 852266960
852267120 852267160
852267320 852267400
852267520 852267560
852267600 852267680
852267760 852267840
852268160 852268200
852268400 852268480
852268720 852268760
852268880 852268920
852268960 852269000
852269360 852269400
852270240 852270280
852270640 852270680
852271000 852271080
852271200 852271240
852271760 852271800
852272280 852272320
852272520 852272560
852272640 852272720
852272760 852272800
852272840 852272880
852273120 852273160
852273440 852273520
852273600 852273680
852274120 852274160
852274200 852274240
852274440 852274480
852274720 852274760
852274800 852274840
852274920 852274960
852275000 852275120
852275480 852275520
852276040 852276080
852276440 852276480
852276640 852276680
852276880 852277000
852277040 852277080
852277200 852277240
852277280 852277320
852277360 852277400
852277800 852277880
852277960 852278000
852278400 852278440
852278560 852278600
852278840 852278880
852279000 852279120
852279200 852279240
852279960 852280000
852280040 852280080
852280520 852280560
852280600 852280640
852280760 852280800
852280960 852281000
852281200 852281240
852281560 852281600
852281760 852281840
852281920 852281960
852282200 852282240
852282440 852282480
852282920 852282960
852283080 852283120
852283440 852283480
852283720 852283760
852283840 852283880
852284240 852284280
852284520 852284560
852284680 852284720
852285680 852285760
852286040 852286080
852286240 852286280
852286760 852286800
852287400 852287440
852287840 852287920
852288040 852288080
852288160 852288200
852288800 852288840
852289080 852289120
852289240 852289280
852289440 852289560
852289880 852289920
852290120 852290160
852290280 852290320
852290720 852290760
852290920 852290960
852291080 852291120
852291680 852291720
852291960 852292000
852292080 852292120
852292240 852292280
852292840 852292920
852294000 852294040
852294640 852294680
852294720 852294760
852295040 852295080
852295320 852295360
852295960 852296000
852296040 852296080
852296680 852296720
852297040 852297080
852297200 852297240
852297400 852297480
852297560 852297600
852298000 852298040
852298800 852298840
852298880 852298920
852301880 852301920
852302000 852302040
852302320 852302360
852302480 852302520
852302720 852302760
852303280 852303320
852303400 852303440
852303880 852303920
852304440 852304480
852304720 852304760
852305320 852305360
852305720 852305760
852305800 852305840
852307080 852307120
852308160 852308200
852309200 852309240
852310480 852310520
852310560 852310600
852310680 852310720
852311080 852311120
852311160 852311200
852312240 852312280
852312520 852312560
852312600 852312640
852312680 852312720
852313672 852313712
852314472 852314512
852316192 852316232
852316632 852316672
852319112 852319152
852319512 852319552
852320152 852320192
852320432 852320472
852321640 852321680
852321880 852321920
852322880 852322920
852323200 852323240
852329632 852329672
852331512 852331552
852392552 852392672
852426008 852426048
852426168 852426208
852426248 852426288
852435240 852435280
852474880 852474920
852475240 852475280
852475360 852475400
852479000 852479040
852480280 852480320
852482280 852482320
852486040 852486080
852486400 852486440
852527312 852527352
852565192 852565232
852573912 852573952
852579792 852579832
852579912 852579952
852583504 852583544
852595352 852595392
852677720 852677760
853343952 853343992
853376168 853376208
853382048 853382088
853427512 853427552
853432832 853432872
853438512 853438552
853447392 853447432
853449672 853449712
853449872 853449912
853452752 853452792
853457592 853457632
853476552 853476592
853482224 853482264
853501648 853501688
853505848 853505888
853507448 853507488
853509168 853509208
853509968 853510008
853510968 853511008
853514248 853514288
853514368 853514408
853518872 853518912
853519072 853519112
853522032 853522112
853522152 853522232
853522272 853522312
853522432 853522472
853522752 853522792
853522952 853522992
853573160 853573200
853573440 853573480
853574320 853574360
853574800 853574880
853575520 853575560
853577128 853577168
853577448 853577488
853579048 853579088
853579488 853579528
853580128 853580168
853580368 853580408
853581568 853581608
853581648 853581688
853581888 853581928
853583128 853583168
853583288 853583328
853585928 853585968
853586168 853586208
853588288 853588328
853589208 853589248
853590808 853590888
853591248 853591288
853591928 853591968
853592248 853592288
853592568 853592608
853593088 853593128
853597856 853597896
853599456 853599496
853600216 853600256
853600696 853600736
853837432 853837472
853948360 853948400
853949160 853949200
853949720 853949760
853949800 853949840
853952880 853952920
853953120 853953160
853955376 853955416
853956416 853956456
853959304 853959344
854171624 854171664
854197944 854197984
854287968 854288008
854291960 854292000
854305616 854305656
854311376 854311416
854478080 854478120
854481512 854481552
854915664 854915704
855086816 855086856
855711400 855711440
855751536 855751576
855860824 855860864
855951240 855951280
856058072 856058112
856122536 856122616
856133128 856133168
856304456 856304496
856382112 856382152
857020064 857020104
857169144 857169184
857365584 857365624
857405816 857405856
857405936 857405976
857406416 857406456
857515184 857515224
857614752 857614792
857631232 857631272
857684520 857684560
857730912 857730992
857731392 857731432
857731832 857731872
857731952 857731992
857732152 857732192
857732632 857732712
857733856 857733896
857753536 857753576
857762080 857762120
857763000 857763040
857773920 857773960
857800312 857800392
858107368 858107408
858162960 858163000
858437448 858437488
858606248 858606288
858614352 858614392
858775160 858775200
858781280 858781320
858781480 858781520
858783120 858783160
858971224 858971264
859068928 859068968
859074912 859074992
859075824 859075904
859077520 859077560
859077840 859077880
859080808 859080848
859140152 859140192
859154656 859154696
859280472 859280512
859347456 859347496
859549976 859550016
859749872 859749912
859756416 859756456
859779920 859779960
859849592 859849632
859934184 859934224
860098520 860098560
860106216 860106256
860115392 860115472
860165064 860165104
860167504 860167544
860167584 860167624
860208176 860208256
860252296 860252336
860363400 860363440
860541736 860541776
860549112 860549152
860561704 860561744
860740080 860740120
860891744 860891784
861037992 861038032
861172328 861172368
861318712 861318752
861625440 861625480
861777320 861777360
861943256 861943296
