815545067 815545084
815596696 815596713
815950826 815950843
816105177 816105194
816281271 816281288
816289322 816289339
817335941 817335958
818357121 818357138
818965430 818965447
819666043 819666060
819914967 819914985
819918222 819918240
819969101 819969118
820269718 820269735
820647632 820647649
820782773 820782790
823196608 823196626
826101053 826101070
826202740 826202757
826362525 826362542
826666974 826666991
826722206 826722224
826727486 826727503
827424030 827424047
827591070 827591087
828056093 828056110
828891466 828891483
828891472 828891489
828891485 828891502
828891499 828891516
829013730 829013747
829013744 829013761
829081755 829081774
829081761 829081780
829081769 829081788
829081777 829081801
829081790 829081809
829081796 829081815
829081804 829081821
829081812 829081829
829081818 829081835
829081826 829081843
829081830 829081849
829081839 829081856
829081857 829081880
829086920 829086937
829381292 829381358
829381345 829381366
829381353 829381380
829381367 829381386
829381373 829381399
830196115 830196132
830196126 830196143
830196131 830196148
830196142 830196159
830196170 830196187
830196195 830196212
830196221 830196238
830196324 830196341
