816363411 816363428
816651591 816651608
816664198 816664215
816995041 816995058
817007040 817007057
817007480 817007497
817265311 817265328
817281012 817281029
817292684 817292701
817303880 817303898
817306150 817306167
817306233 817306250
817354671 817354688
817355453 817355470
817355797 817355814
817356594 817356611
817357692 817357709
817364980 817364997
817367620 817367637
817367649 817367666
817367700 817367717
817423918 817423935
817424096 817424113
817425710 817425727
817426293 817426310
817431720 817431737
817437289 817437307
817439928 817439946
817441810 817441827
817443624 817443641
817443668 817443685
817444386 817444403
817444708 817444725
817444872 817444889
817444996 817445013
817445101 817445118
817447352 817447369
817451249 817451266
817451323 817451340
817462713 817462730
817464411 817464428
817515090 817515107
817516185 817516202
817523476 817523493
817530826 817530843
817542028 817542045
817542104 817542121
817555494 817555511
817628791 817628808
817628928 817628945
817629055 817629072
817629060 817629077
817629366 817629383
817629539 817629556
817631896 817631914
817638028 817638045
817638050 817638067
817648025 817648042
817654565 817654584
817692127 817692144
817692138 817692155
817694573 817694590
817694621 817694638
817696165 817696182
817696186 817696203
817696207 817696224
817696217 817696234
817696459 817696476
817696466 817696484
817698464 817698481
817705512 817705532
817714168 817714185
817714238 817714255
817714944 817714961
817715853 817715870
817715869 817715886
817723143 817723161
817723169 817723191
817723238 817723255
817723950 817723967
817724017 817724034
817724734 817724751
817724754 817724771
817724888 817724905
817725323 817725340
817725834 817725851
817725845 817725862
817725897 817725914
817725990 817726007
817726002 817726019
817726620 817726638
817726669 817726686
817727646 817727663
817727719 817727736
817729559 817729576
817736877 817736894
817737215 817737232
817737222 817737239
817737251 817737268
817738646 817738663
817738650 817738667
817740684 817740701
817742293 817742310
817743705 817743722
817745766 817745783
817745844 817745861
817745865 817745882
817745940 817745957
817745967 817745987
817746049 817746066
817746326 817746343
817746992 817747009
817747250 817747267
817747519 817747536
817747844 817747861
817748014 817748031
817756747 817756764
817756760 817756777
817756791 817756808
817757340 817757357
817757404 817757421
817758927 817758944
817758933 817758950
817760808 817760825
817765838 817765855
817766972 817766989
817766982 817766999
817768539 817768556
817774909 817774926
817774953 817774970
817775028 817775045
817775088 817775105
817775139 817775156
817775516 817775533
817775634 817775651
817775656 817775673
817778278 817778295
817780855 817780872
817780885 817780903
817781143 817781160
817781661 817781679
817781714 817781731
817784087 817784104
817784093 817784110
817784440 817784457
817784881 817784898
817801559 817801576
817801602 817801619
817801815 817801832
817801825 817801842
817802190 817802207
817802315 817802332
817802342 817802359
817803073 817803092
817803086 817803103
817808212 817808229
817808415 817808432
817808621 817808640
817808646 817808663
817808836 817808853
817810012 817810029
817810020 817810037
817869755 817869772
817869857 817869874
817870457 817870474
817870577 817870594
817870585 817870602
817870600 817870617
817870627 817870644
817870994 817871011
817871007 817871024
817871013 817871030
817871165 817871182
817871224 817871241
817871248 817871265
817871447 817871464
817871480 817871497
817871584 817871601
817871594 817871611
817871888 817871905
817872189 817872206
817872195 817872212
817872205 817872222
817877452 817877469
817877484 817877501
817877568 817877585
817878020 817878037
817878709 817878726
817882671 817882688
817884504 817884521
817884516 817884533
817889886 817889903
817895371 817895388
817896833 817896850
817897184 817897201
817902821 817902838
817902845 817902862
817906084 817906101
817906154 817906171
817906460 817906477
818213673 818213690
818244343 818244360
818270526 818270543
818365745 818365762
818369797 818369814
818369807 818369824
818370111 818370128
818370230 818370247
818370446 818370463
818379563 818379580
818379603 818379620
818379616 818379633
818379740 818379757
818379751 818379770
818379764 818379781
818380653 818380670
818382479 818382496
818382593 818382610
818382621 818382638
818383619 818383636
818383677 818383694
818416754 818416773
818416784 818416801
818416832 818416849
818417363 818417380
818417381 818417398
818417396 818417413
818418034 818418051
818418110 818418127
818418814 818418831
818419106 818419123
818419120 818419137
818419127 818419144
818419541 818419558
818419545 818419562
818419553 818419570
818555652 818555669
818560378 818560395
818578725 818578742
818620457 818620474
818655090 818655107
818774733 818774750
818774789 818774806
818898395 818898412
818980930 818980947
819009351 819009368
819009429 819009446
819015167 819015184
819015931 819015948
819033957 819033974
819033970 819033987
819069950 819069967
819072496 819072513
819074386 819074403
819091280 819091297
819091422 819091439
819111090 819111107
819114656 819114673
819305391 819305408
819369190 819369207
819489795 819489812
819493763 819493780
819893673 819893690
819969958 819969975
820192423 820192440
820268756 820268773
820272295 820272312
820358585 820358602
820359351 820359368
820361721 820361738
820451343 820451360
820644018 820644035
820644905 820644922
820658092 820658109
820673521 820673538
820678006 820678023
820682514 820682531
820687753 820687770
820690937 820690954
820695691 820695708
820696834 820696851
820725755 820725772
820747380 820747397
820768630 820768647
820803737 820803754
820911924 820911941
820912236 820912253
820912376 820912393
820972056 820972073
820973385 820973402
821004089 821004106
821018857 821018874
821093580 821093597
821142048 821142065
821151394 821151411
821152833 821152850
821153041 821153058
821182300 821182317
821182748 821182765
821246762 821246779
821293241 821293258
821293660 821293677
821296998 821297015
821304035 821304052
821359627 821359644
821361852 821361869
821373580 821373597
821388057 821388074
821389639 821389656
821389773 821389790
821452755 821452772
821516875 821516892
821917460 821917477
821924406 821924423
821942763 821942780
821949512 821949529
822062803 822062820
822120086 822120103
822125537 822125554
822134357 822134374
822134875 822134892
822181273 822181290
822186873 822186890
822188176 822188193
822195922 822195939
822203642 822203659
822205034 822205051
822213253 822213270
822216969 822216986
822217112 822217129
822221963 822221980
822222351 822222368
822223081 822223098
822225867 822225884
822227513 822227530
822238037 822238054
822266193 822266210
822293299 822293316
822312723 822312740
822322480 822322497
822371130 822371147
822455982 822455999
822470416 822470433
822482200 822482217
822552143 822552160
822559518 822559535
822633914 822633931
822906409 822906426
822911664 822911681
822963453 822963470
822973876 822973893
823005608 823005625
823061072 823061089
823062058 823062075
823063552 823063569
823064485 823064502
823076393 823076410
823076920 823076937
823079576 823079593
823089106 823089123
823090220 823090237
823092096 823092113
823152559 823152576
823185394 823185411
823241144 823241161
823249740 823249757
823290118 823290135
823407212 823407229
823503138 823503155
823517835 823517852
823526079 823526096
823623834 823623851
823748442 823748459
823754276 823754293
823827823 823827840
823835744 823835761
823838107 823838124
823853336 823853353
823858489 823858506
823864138 823864155
823927951 823927968
823930624 823930641
823949925 823949942
824147423 824147440
824262985 824263002
824267694 824267711
824280239 824280256
824283068 824283085
824287352 824287369
824325855 824325872
824329724 824329741
824331052 824331069
824332899 824332916
824333044 824333061
824334518 824334535
824335857 824335874
824338462 824338479
824339313 824339330
824346741 824346758
824369409 824369426
824371454 824371471
824376534 824376551
824376628 824376645
824393109 824393126
824394649 824394666
824395278 824395295
824395389 824395406
824466824 824466841
824502741 824502758
824503995 824504012
824504717 824504734
824509410 824509427
824510044 824510061
824511161 824511178
824513648 824513665
824517424 824517441
824520135 824520152
824522977 824522994
824523113 824523130
824525746 824525763
824526445 824526462
824528027 824528044
824535773 824535790
824539693 824539710
824540580 824540597
824550125 824550142
824612865 824612882
824615975 824615992
824747767 824747784
824763036 824763053
824796155 824796172
824896286 824896303
824934045 824934062
824993865 824993882
825001402 825001419
825033699 825033716
825036097 825036114
825081915 825081932
825111360 825111377
825240436 825240453
825385493 825385510
825399935 825399952
825532565 825532582
825581781 825581798
825597458 825597475
825600809 825600826
825703097 825703114
825704058 825704075
825750453 825750470
825767341 825767358
825768688 825768705
825875571 825875588
825895566 825895583
825896335 825896352
825925620 825925637
826068887 826068904
826073269 826073286
826115920 826115937
826154196 826154213
826272664 826272681
826302590 826302607
826309079 826309096
826331627 826331644
826341378 826341395
826353587 826353604
826596465 826596482
826690322 826690339
826697262 826697279
826830305 826830322
826855421 826855438
827083006 827083023
827106430 827106447
827134182 827134199
827136669 827136686
827208997 827209014
827227423 827227440
827274821 827274838
827275156 827275173
827277201 827277218
827279952 827279969
827281086 827281103
827281174 827281191
827288428 827288445
827300143 827300160
827310823 827310840
827321554 827321571
827323024 827323041
827323393 827323410
827324733 827324750
827337086 827337103
827377520 827377537
827380250 827380267
827403277 827403294
827469686 827469703
827479714 827479731
827582997 827583014
827773143 827773160
827946227 827946244
827953576 827953593
827967738 827967755
827972063 827972080
828039050 828039067
828042049 828042066
828049140 828049157
828052126 828052143
828052544 828052561
828072472 828072489
828095343 828095360
828429148 828429165
828432639 828432656
828434455 828434472
828519636 828519653
828533563 828533580
828960463 828960480
828962695 828962712
829036414 829036431
829037316 829037333
829055989 829056006
829057276 829057293
829205585 829205602
829213408 829213425
829220391 829220408
829220460 829220477
829220481 829220498
829220664 829220681
829220923 829220940
829221765 829221782
829228036 829228053
829249446 829249463
829253711 829253728
829283563 829283580
829283746 829283763
829288694 829288711
829315273 829315290
829389063 829389080
829391821 829391838
829393757 829393774
829403450 829403467
829415782 829415799
829416187 829416204
829416354 829416371
829416583 829416603
829417052 829417069
829418085 829418102
829422020 829422037
829433250 829433267
829433917 829433934
829436199 829436216
829439720 829439737
829444262 829444279
829465170 829465187
829465200 829465217
829500434 829500451
829501669 829501686
829502621 829502638
829502750 829502767
829532758 829532775
829553020 829553037
829553043 829553060
829588473 829588490
829645272 829645289
829695856 829695873
829703592 829703609
829708531 829708548
829714638 829714655
829714705 829714722
829750021 829750038
829753322 829753339
829763326 829763343
829771904 829771921
829772172 829772190
829777445 829777462
829780997 829781014
829782135 829782152
829782147 829782165
829782963 829782980
829785155 829785172
829785909 829785926
829785930 829785948
829787358 829787375
829807525 829807542
829832395 829832412
829875621 829875638
829884507 829884524
829925363 829925380
829963852 829963869
830038825 830038842
830040016 830040033
830044739 830044756
830052419 830052436
830053955 830053972
830080676 830080693
830127470 830127487
830138999 830139016
830221028 830221045
830221979 830221996
830222266 830222283
830222859 830222876
830223183 830223200
830223433 830223450
830225517 830225534
830225898 830225915
830226334 830226351
830227275 830227292
830230649 830230666
830234870 830234887
830240106 830240123
830240578 830240595
830255000 830255017
830271264 830271281
830320941 830320958
830359107 830359124
830360764 830360781
830361279 830361296
830361365 830361382
830429473 830429490
830429930 830429948
830430157 830430175
830430175 830430192
830430308 830430325
830430767 830430784
830430908 830430925
830430916 830430933
830431396 830431413
830431466 830431483
830431692 830431709
830432015 830432032
830432049 830432066
830433013 830433030
830433067 830433084
830436037 830436054
830436688 830436705
830436742 830436759
830436854 830436871
830437096 830437113
830437427 830437444
830438335 830438355
830438663 830438680
830438688 830438705
830441111 830441128
830441279 830441296
830441440 830441457
830442578 830442595
830442683 830442700
830443091 830443108
830443254 830443271
830443328 830443345
830446598 830446615
830447099 830447117
830447331 830447348
830447601 830447618
830447792 830447812
830447825 830447843
830447879 830447896
830448143 830448160
830458310 830458327
830459799 830459817
830484157 830484174
830484471 830484488
