862088640 862088700
862091940 862092000
862092660 862092780
862112820 862112880
862139820 862139880
862153020 862153080
862156740 862156860
862161000 862161060
862170000 862170060
862172220 862172280
862178640 862178760
862180560 862180680
862182840 862182900
862183800 862183920
862187520 862187580
862205580 862205640
862239360 862239420
862241520 862241580
862247100 862247160
862249980 862250040
862251180 862251300
862253700 862253760
862255500 862255560
862257480 862257540
862263780 862263840
862265280 862265460
862276500 862276560
862278780 862278840
862326300 862326360
862328580 862328640
862330500 862330560
862331760 862331820
862334520 862334580
862339680 862339800
862345980 862346100
862349820 862349880
862355760 862355820
862369080 862369140
862412640 862412700
862414140 862414200
862581960 862582020
862585560 862585620
862585800 862585860
862592520 862592580
862595460 862595580
862611060 862611120
862614960 862615080
862623840 862623900
862623960 862624020
862651440 862651500
862660740 862660800
862697580 862697640
862700400 862700460
862701240 862701300
862749780 862749840
862751340 862751400
862756800 862756860
862760640 862760760
862764960 862765020
862767240 862767300
862775580 862775640
862777620 862777680
862806180 862806240
862824120 862824180
862827540 862827600
862838340 862838460
862844220 862844280
862847940 862848000
862848480 862848540
862849080 862849140
862854780 862854900
862863420 862863480
862866180 862866240
862867380 862867440
862875840 862875900
862895160 862895280
862897500 862897560
862920960 862921020
862925880 862925940
862932720 862932840
862938180 862938240
862948740 862948800
862948860 862948980
862949220 862949280
862950720 862950780
862950840 862950960
862986660 862986720
863043720 863043780
863058420 863058480
863110020 863110140
863172240 863172300
863187660 863187720
863187900 863187960
863190300 863190360
863191560 863191620
863192700 863192820
863192880 863192940
863195460 863195580
863197440 863197500
863197560 863197620
863197680 863197920
863199960 863200020
863201160 863201220
863204100 863204220
863205960 863206020
863208480 863208540
863214780 863214840
863216460 863216520
863229960 863230080
863259300 863259420
863261640 863261760
863262900 863262960
863269260 863269380
863275680 863275740
863294400 863294460
863303160 863303220
863322300 863322360
863325960 863326020
863352360 863352420
863353200 863353260
863359860 863360040
863363760 863363820
863363880 863364000
863365440 863365500
863366940 863367000
863367780 863367840
863367960 863368020
863369520 863369580
863374500 863374560
863376900 863376960
863378820 863378880
863379480 863379540
863381460 863381520
863382840 863382960
863383380 863383440
863384520 863384580
863386560 863386620
863391900 863391960
863395560 863395620
863395980 863396100
863397420 863397480
863397540 863397600
863403240 863403300
863422860 863422920
863444220 863444280
863450640 863450700
863451720 863451780
863459700 863459760
863462100 863462160
863465880 863465940
863466120 863466240
863470560 863470620
863471220 863471460
863475360 863475420
863476260 863476320
863477820 863477880
863481900 863481960
863487900 863487960
863498640 863498700
863524620 863524680
863525700 863525820
863527260 863527320
863528880 863528940
863531040 863531100
863532180 863532240
863534880 863534940
863540100 863540160
863542200 863542260
863546760 863546820
863613780 863613840
863620800 863620860
863624700 863624760
863626800 863626860
863635140 863635200
863635740 863635800
863640420 863640540
863777820 863777880
863785500 863785560
863788860 863788920
863791080 863791140
863798760 863798820
863799120 863799180
863803200 863803260
863804880 863805000
863807040 863807220
863809980 863810040
863811480 863811540
863820060 863820180
863822940 863823000
863829180 863829240
863829420 863829540
863831100 863831220
863863980 863864040
863864400 863864460
863901420 863901540
863903340 863903400
863904000 863904060
863914680 863914800
863930880 863930940
863933340 863933400
863949300 863949360
863961060 863961180
863963520 863963580
863971920 863971980
863973060 863973120
863977680 863977800
863981220 863981340
863988060 863988120
863992440 863992500
864044220 864044280
864052200 864052320
864057360 864057480
864069000 864069060
864069180 864069240
864075780 864075840
864079920 864079980
864080040 864080100
864082920 864082980
864084060 864084120
864090480 864090540
864126300 864126360
864130860 864130920
864136020 864136080
864139140 864139200
864140040 864140100
864141480 864141540
864160320 864160380
864164820 864164880
864172380 864172440
864215640 864215700
864506220 864506280
864506340 864506400
864508260 864508320
864512520 864512580
864514380 864514440
864520620 864520680
864531060 864531120
864555960 864556020
864559860 864559920
864565560 864565620
864565860 864565920
864569160 864569280
864570780 864570840
864575100 864575160
864581940 864582000
864582300 864582360
864589500 864589620
864590040 864590160
864592260 864592320
864594180 864594240
864597900 864597960
864598200 864598260
864598980 864599040
864600660 864600780
864602640 864602700
864640380 864640440
864652440 864652560
864655200 864655260
864655680 864655740
864658380 864658440
864659580 864659640
864665100 864665160
864666960 864667020
864669780 864669840
864675120 864675180
864677580 864677700
864677820 864677880
864678300 864678360
864683820 864683880
864684960 864685020
864688800 864688860
864691560 864691620
864727620 864727680
864734280 864734340
864743220 864743280
864746160 864746220
864747180 864747240
864748740 864748800
864750060 864750120
864753540 864753600
864754140 864754200
864756600 864756720
864757620 864757740
864757980 864758100
864758940 864759000
864760980 864761100
864764280 864764340
864764520 864764640
864773940 864774000
864779880 864779940
864788700 864788760
864790080 864790140
864833820 864833940
864836520 864836580
864837480 864837540
864920160 864920220
864921780 864921900
864936900 864936960
864995160 864995220
864998700 864998760
864999060 864999120
865003680 865003860
865005660 865005720
865006320 865006380
865009200 865009260
865012140 865012200
865013640 865013700
865016340 865016400
865019220 865019280
865021260 865021320
865021800 865021920
865024500 865024560
865025640 865025760
865026300 865026360
865027740 865027860
865028820 865028880
865032120 865032180
865119240 865119300
865133040 865133100
865140060 865140120
865167000 865167060
865175220 865175280
865179300 865179360
865181580 865181640
865182060 865182120
865182660 865182780
865193400 865193520
865194060 865194120
865194360 865194420
865194720 865194780
865195740 865195800
865196040 865196160
865198500 865198560
865227180 865227240
865256880 865256940
865263240 865263300
865272300 865272420
865275660 865275780
865276080 865276200
865278780 865278840
865279200 865279260
865282920 865283040
865289400 865289520
865297500 865297560
865305000 865305060
865308540 865308660
865360680 865360740
865431120 865431180
865601880 865601940
865610640 865610700
865610880 865610940
865617000 865617060
865617120 865617180
865623120 865623180
865625040 865625100
865626600 865626660
865626840 865626900
865628820 865628880
865629000 865629060
865629240 865629300
865629360 865629420
865630680 865630800
865633440 865633500
865633860 865633920
865641720 865641840
865647300 865647360
865692480 865692540
865693080 865693140
865695000 865695060
865721460 865721520
865729680 865729800
865732980 865733100
865745220 865745280
865769460 865769520
865771440 865771500
865776000 865776060
865777500 865777620
865778100 865778160
865778340 865778400
865780920 865781040
865789860 865789980
865791120 865791180
865794900 865794960
865804260 865804500
865806060 865806120
865806900 865806960
865812000 865812120
865832460 865832520
865849980 865850040
865856340 865856460
865867980 865868040
865869000 865869060
865869300 865869360
865874640 865874820
865878000 865878060
865882200 865882260
865884780 865884900
865889220 865889340
865889520 865889580
865890180 865890240
865892100 865892160
865898460 865898520
865901100 865901160
865906440 865906500
865907700 865907760
865909020 865909080
865918020 865918080
865919160 865919220
865922220 865922280
865932600 865932660
865944960 865945140
865945620 865945680
865948800 865948860
865950480 865950540
865957860 865957920
865976880 865976940
865979880 865979940
865981140 865981260
865984440 865984560
865987200 865987260
866005800 866005860
866044980 866045100
866050020 866050080
866084520 866084580
866140560 866140620
866146080 866146200
866153040 866153100
866178900 866178960
866193480 866193540
866199360 866199420
866208120 866208180
866208660 866208720
866210100 866210220
866213820 866213880
866215020 866215140
866218320 866218440
866220120 866220180
866221080 866221140
866221740 866221800
866229360 866229420
866229540 866229600
866229660 866229720
866230200 866230260
866231940 866232000
866235540 866235600
866238480 866238540
866239260 866239380
866282460 866282520
866292660 866292720
866293740 866293800
866295180 866295240
866323740 866323800
866323860 866323920
866327280 866327400
866330940 866331060
866334840 866334900
866356200 866356320
866356560 866356620
866376900 866376960
866381700 866381760
866383020 866383080
866383380 866383440
866383800 866383860
866385120 866385240
866389440 866389500
866393520 866393580
866406900 866406960
866408160 866408280
866408940 866409000
866411520 866411580
866423760 866423820
866424120 866424180
866427960 866428020
866430180 866430240
866436840 866436900
866436960 866437020
866455260 866455320
866459880 866459940
866468280 866468340
866472660 866472720
866473080 866473140
866473740 866473920
866491920 866491980
866492400 866492460
866493420 866493600
866494080 866494200
866511000 866511120
866511360 866511420
866547660 866547720
866549580 866549640
866552880 866552940
866557380 866557500
866558100 866558160
866563500 866563620
866564760 866564820
866565120 866565180
866565540 866565660
866566380 866566440
866567100 866567160
866570580 866570640
866574420 866574540
866575440 866575500
866575680 866575740
866576820 866576880
866581560 866581800
866583360 866583480
866587920 866587980
866588040 866588100
866588520 866588580
866590140 866590200
866594340 866594400
866600340 866600460
866600520 866600700
866601240 866601300
866603400 866603460
866627880 866627940
866643600 866643660
866650080 866650140
866650380 866650500
866670180 866670240
866739900 866739960
866748120 866748180
866811960 866812020
866813880 866814000
866816880 866816940
866829240 866829360
866829420 866829480
866830560 866830620
866831820 866831880
866864460 866864520
866869320 866869380
866886900 866886960
866887020 866887140
866896200 866896260
866901480 866901540
866901600 866901660
866952660 866952720
866982960 866983020
866983200 866983260
866987100 866987160
866989440 866989500
866990220 866990280
866995380 866995440
866995560 866995620
867010320 867010380
867014580 867014640
867043320 867043380
867055380 867055500
867069720 867069840
867076020 867076080
867078300 867078360
867078540 867078600
867078780 867078900
867081840 867081900
867082380 867082440
867085440 867085500
867086280 867086340
867087240 867087300
867089160 867089220
867111420 867111480
867125160 867125220
867161700 867161760
867162840 867162900
867164040 867164100
867164880 867164940
867170400 867170460
867181560 867181620
867184260 867184320
867187140 867187200
867206040 867206100
867416640 867416760
867419880 867419940
867420660 867420780
867422040 867422100
867428640 867428760
867430620 867430680
867432240 867432300
867439440 867439560
867442080 867442140
867444420 867444480
867445620 867445740
867446340 867446460
867448440 867448500
867449280 867449460
867459600 867459660
867489540 867489600
867504600 867504660
867507360 867507420
867510360 867510420
867592380 867592440
867637500 867637560
867676560 867676680
867680820 867680880
867682020 867682200
867683400 867683520
867686160 867686220
867688920 867689040
867689100 867689220
867738120 867738180
867762720 867762900
867777840 867777900
867792660 867792720
867797100 867797160
867797520 867797580
867798180 867798240
867804420 867804480
867806280 867806340
867807960 867808020
867867720 867867840
867883680 867883740
867892440 867892500
867941280 867941340
868014480 868014600
868021020 868021140
868022400 868022460
868022760 868022820
868024740 868024860
868027140 868027200
868027920 868027980
868028760 868028820
868030860 868030920
868034940 868035060
868038720 868038780
868038840 868038900
868042620 868042740
868043100 868043160
868044120 868044240
868044840 868044900
868046340 868046400
868046760 868046880
868048140 868048200
868048380 868048440
868048680 868048800
868050840 868050900
868052040 868052100
868056540 868056600
868061820 868061880
868064580 868064640
868065300 868065360
868067640 868067700
868069920 868069980
868072560 868072620
868079640 868079700
868096380 868096500
868109220 868109280
868109580 868109640
868110540 868110600
868111260 868111320
868112100 868112160
868113960 868114020
868141920 868141980
868142880 868142940
868148460 868148520
868153620 868153680
868186260 868186320
868187340 868187400
868192080 868192200
868192800 868192920
868192980 868193040
868198800 868198920
868199460 868199520
868206900 868206960
868209960 868210020
868211340 868211400
868215900 868215960
868223100 868223160
868229400 868229460
868231380 868231500
868237080 868237140
868239120 868239180
868252140 868252200
868278060 868278120
868279680 868279860
868283820 868283880
868288200 868288320
868292280 868292340
868294680 868294860
868295280 868295340
868296780 868296840
868297140 868297260
868298100 868298220
868300080 868300200
868302360 868302420
868303560 868303620
868303680 868303800
868304580 868304640
868304760 868304820
868307940 868308000
868308120 868308180
868310820 868310880
868312320 868312440
868313460 868313520
868320120 868320180
868321320 868321380
868322100 868322160
868325220 868325280
868327560 868327620
868334580 868334640
868337940 868338000
868363620 868363680
868363980 868364040
868365420 868365540
868373400 868373460
868373700 868373760
868374120 868374180
868381380 868381500
868381920 868382040
868382820 868382880
868385460 868385520
868387440 868387500
868388820 868388880
868389720 868389780
868390080 868390200
868390740 868390860
868397940 868398000
868398420 868398480
868398660 868398720
868414080 868414140
868471260 868471320
868478700 868478820
868496220 868496280
868520220 868520280
868627080 868627140
868630560 868630680
868631220 868631340
868638060 868638120
868638300 868638360
868639740 868639860
868641600 868641660
868643040 868643100
868648800 868648920
868649160 868649220
868649280 868649340
868651620 868651680
868659480 868659600
868662480 868662540
868665600 868665660
868667640 868667700
868673460 868673640
868675920 868675980
868692300 868692360
868709820 868709880
868715280 868715340
868717680 868717800
868718640 868718700
868719120 868719240
868738380 868738440
868739160 868739280
868742040 868742100
868747380 868747440
868748340 868748400
868751340 868751400
868768080 868768140
868792980 868793040
868857780 868857840
868870620 868870680
868871880 868871940
868877520 868877580
868878300 868878420
868882260 868882320
868891620 868891740
868893060 868893180
868894440 868894500
868898880 868898940
868899840 868899960
868900380 868900440
868900800 868900860
868901220 868901280
868902900 868902960
868903440 868903500
868907340 868907400
868911180 868911240
868911300 868911360
868913640 868913700
868913820 868913940
868915980 868916040
868917240 868917300
868917420 868917600
868970760 868970820
868976400 868976460
868977180 868977240
868978680 868978740
868979880 868979940
868980660 868980720
868982880 868983000
868985100 868985220
868986540 868986600
868990020 868990080
868992360 868992420
868992780 868992840
868995720 868995840
868997280 868997340
868998300 868998360
868998780 868998840
868999080 868999140
868999260 868999320
868999920 868999980
869000160 869000340
869002620 869002680
869005080 869005140
869006100 869006160
869006280 869006400
869006880 869007000
869009520 869009580
869010600 869010660
869012040 869012100
869013120 869013180
869014920 869014980
869019000 869019120
869062980 869063040
869064420 869064480
869067360 869067420
869079720 869079780
869089020 869089080
869089740 869089800
869166000 869166060
869175840 869175900
869178240 869178300
869232840 869232960
869236620 869236680
869237160 869237280
869238720 869238780
869241240 869241300
869243340 869243400
869243880 869244000
869245620 869245680
869257380 869257440
869261700 869261760
869262000 869262120
869265780 869265840
869267580 869267640
869268420 869268480
869277960 869278020
869278620 869278740
869279340 869279460
869310240 869310360
869320080 869320140
869321400 869321520
869324400 869324460
869350020 869350080
869352780 869352900
869361420 869361480
869366040 869366100
869402160 869402280
869405580 869405640
869410380 869410440
869411940 869412000
869412240 869412300
869439600 869439660
869444340 869444400
869447340 869447400
869455080 869455140
869484540 869484600
869493540 869493660
869496300 869496360
869500260 869500320
869500740 869500800
869501820 869501880
869506140 869506200
869509620 869509680
869516700 869516760
869517540 869517660
869519280 869519340
869522640 869522700
869522820 869522880
869523780 869523840
869524020 869524200
869526180 869526240
869544060 869544180
869546460 869546520
869562240 869562300
869568420 869568480
869571180 869571240
869572980 869573100
869576880 869577000
869579820 869579940
869580120 869580180
869580540 869580600
869581500 869581560
869583600 869583660
869584980 869585040
869586540 869586780
869586960 869587020
869593800 869593920
869596800 869596860
869598600 869598660
869599200 869599260
869603040 869603160
869606280 869606400
869608380 869608560
869609100 869609220
869613840 869613900
869621640 869621700
869625060 869625120
869662500 869662560
869665320 869665380
869672700 869672760
869682060 869682120
869706600 869706660
869753220 869753280
869766000 869766060
869838000 869838120
869840520 869840640
869841660 869841720
869842320 869842440
869845260 869845320
869846580 869846640
869847300 869847360
869848500 869848560
869852160 869852280
869856300 869856420
869857380 869857440
869860620 869860740
869862120 869862180
869863620 869863680
869864880 869864940
869866620 869866680
869867520 869867580
869880960 869881020
869883660 869883720
869918100 869918160
869918760 869918880
869919480 869919540
869920080 869920260
869922600 869922660
869923380 869923440
869924700 869924760
869926920 869926980
869927460 869927520
869928900 869928960
869946900 869947020
869948940 869949060
869949900 869949960
869950980 869951160
869952600 869952720
869953080 869953140
869955960 869956080
869958240 869958360
869958600 869958660
869958900 869958960
869961180 869961240
869961540 869961600
869964180 869964300
869966880 869966940
869973660 869973720
869995980 869996040
870002400 870002460
870009600 870009660
870010500 870010560
870012360 870012420
870012900 870013020
870016140 870016260
870018420 870018480
870019800 870019860
870020700 870020820
870021660 870021720
870030780 870030840
870033180 870033240
870045180 870045240
870050220 870050280
870051360 870051420
870059340 870059400
870081720 870081780
870097920 870097980
870102000 870102060
870102720 870102780
870106080 870106140
870108060 870108180
870108240 870108360
870110280 870110400
870113280 870113340
870113460 870113520
870115380 870115500
870119340 870119400
870124620 870124680
870126240 870126300
870128460 870128520
870129900 870130020
870130140 870130200
870135060 870135120
870136740 870136800
870138180 870138240
870139560 870139740
870140880 870140940
870179880 870179940
870183780 870183840
870192240 870192300
870194520 870194580
870199200 870199260
870199500 870199560
870200340 870200400
870201360 870201480
870207240 870207300
870209100 870209220
870210360 870210420
870213240 870213300
870214020 870214080
870214980 870215040
870218520 870218640
870231600 870231660
870269640 870269700
870271440 870271500
870281520 870281580
870286800 870286860
870293640 870293700
870299220 870299280
870300780 870300840
870378600 870378660
870433860 870433920
870442680 870442740
870443220 870443280
870446280 870446340
870449400 870449520
870455940 870456000
870456420 870456480
870457500 870457680
870460620 870460680
870461700 870461760
870466320 870466440
870466620 870466680
870468360 870468480
870469560 870469620
870474240 870474300
870477360 870477420
870480600 870480660
870520140 870520200
870520560 870520620
870526440 870526500
870529080 870529140
870533460 870533520
870553260 870553320
870554340 870554400
870566820 870566880
870611580 870611700
870615180 870615240
870621120 870621180
870623340 870623400
870637620 870637680
870637740 870637800
870638160 870638220
870644400 870644460
870645540 870645600
870646500 870646560
870646740 870646800
870648720 870648780
870685500 870685560
870696000 870696060
870697560 870697680
870697860 870697920
870704760 870704820
870706980 870707040
870710280 870710340
870713640 870713700
870716280 870716400
870720180 870720240
870724500 870724560
870727080 870727140
870731640 870731700
870734040 870734100
870734580 870734640
870734700 870734760
870740760 870740880
870741360 870741420
870751320 870751380
870787560 870787620
870794100 870794160
870798180 870798300
870798900 870798960
870799080 870799200
870800580 870800640
870801660 870801780
870802320 870802440
870807720 870807780
870808740 870808800
870809280 870809340
870809700 870809880
870811680 870811740
870813120 870813180
870814800 870814860
870818340 870818400
870820620 870820680
870820740 870820860
870822780 870822840
871039980 871040100
871044420 871044540
871048500 871048680
871049100 871049160
871050720 871050840
871051500 871051560
871052040 871052100
871055520 871055580
871057080 871057140
871059420 871059540
871059600 871059720
871064340 871064400
871065180 871065240
871070700 871070760
871077960 871078080
871079880 871079940
871080240 871080360
871080540 871081080
871081500 871081620
871084500 871084560
871100340 871100460
871106880 871106940
871136040 871136100
871156980 871157040
871161600 871161660
871164240 871164300
871168380 871168440
871169460 871169520
871171200 871171320
871174320 871174380
871204140 871204200
871207800 871207860
871212780 871212840
871223040 871223100
871232700 871232760
871236240 871236420
871238040 871238100
871241760 871241820
871242240 871242300
871253100 871253160
871277100 871277160
871299000 871299060
871308600 871308660
871311120 871311180
871311480 871311540
871317900 871317960
871318800 871318920
871320540 871320600
871322880 871322940
871325940 871326000
871326300 871326360
871326900 871326960
871327200 871327260
871330860 871330920
871389120 871389180
871391760 871391820
871401780 871401840
871403460 871403520
871406400 871406460
871406640 871406760
871407540 871407600
871408500 871408560
871412040 871412160
871412220 871412280
871413960 871414020
871414080 871414140
871419180 871419240
871420440 871420560
871420740 871420800
871431420 871431540
871433520 871433580
871437660 871437720
871458720 871458780
871483620 871483740
871491240 871491360
871612080 871612140
871641600 871641720
871651140 871651200
871651500 871651620
871663920 871663980
871682760 871682820
871702680 871702740
871707000 871707060
871734540 871734600
871736700 871736760
871740300 871740360
871742160 871742220
871764420 871764480
871767060 871767120
871780500 871780560
871780680 871780740
871791540 871791660
871796400 871796460
871818780 871818840
871831620 871831740
871831800 871831920
871833960 871834020
871836300 871836360
871839480 871839540
871847460 871847520
871850580 871850640
871859880 871859940
871867140 871867260
871868520 871868580
871870560 871870620
871904280 871904340
871907580 871907640
871916940 871917000
871925700 871925820
871927680 871927740
871928640 871928760
871931400 871931460
871933860 871933920
871936440 871936500
871938000 871938060
871939440 871939560
871944480 871944600
871948560 871948620
871950960 871951020
871984560 871984620
871992660 871992720
872006280 872006400
872017740 872017800
872020680 872020740
872020860 872020920
872023800 872023860
872026500 872026620
872028000 872028180
872033640 872033700
872038440 872038500
872067780 872067840
872077800 872077860
872083020 872083080
872091300 872091360
872094420 872094480
872099400 872099460
872110080 872110140
872110560 872110620
872114700 872114760
872122020 872122140
872213700 872213760
872251620 872251680
872255460 872255520
872256120 872256360
872260920 872260980
872262540 872262600
872266380 872266440
872267100 872267160
872274780 872274840
872275800 872275860
872276100 872276160
872279940 872280060
872281080 872281140
872283060 872283180
872283540 872283660
872285160 872285220
872286540 872286600
872289360 872289420
872290920 872290980
872293860 872293920
872297400 872297520
872302680 872302740
872306580 872306700
872313060 872313120
872317440 872317500
872342220 872342280
872345340 872345460
872345880 872345940
872368500 872368560
872369820 872369880
872370720 872370780
872371920 872371980
872372100 872372160
872379720 872379840
872384580 872384640
872393340 872393400
872421780 872421840
872425080 872425140
872434800 872434920
872437860 872437920
872443140 872443200
872443260 872443380
872444160 872444220
872444880 872445000
872445660 872445780
872449200 872449380
872450640 872450820
872456580 872456700
872457060 872457120
872458260 872458380
872460000 872460060
872462160 872462220
872462700 872462820
872465520 872465580
872466720 872466780
872511780 872511840
872520720 872520780
872525100 872525160
872526000 872526060
872533860 872533920
872541420 872541480
872544360 872544420
872556240 872556300
872563080 872563140
872566680 872566800
872577000 872577060
872581440 872581500
872591040 872591100
872595240 872595360
872604180 872604240
872610540 872610600
872615280 872615340
872616000 872616060
872617620 872617680
872619360 872619480
872622840 872622900
872623680 872623740
872625780 872625900
872629980 872630040
872633220 872633280
872634540 872634600
872634720 872634840
872635140 872635200
872639460 872639520
872642460 872642580
872659560 872659620
872693520 872693580
872719500 872719560
872771100 872771160
872773080 872773140
872776020 872776140
872797860 872797920
872877720 872877780
872885040 872885100
872893260 872893320
872948520 872948640
872949660 872949720
872952180 872952240
872972880 872972940
872974140 872974200
872981760 872981880
872987520 872987640
873003840 873003900
873008640 873008700
873027360 873027540
873038220 873038280
873038880 873039000
873046920 873046980
873052140 873052200
873052440 873052500
873065400 873065460
873071460 873071520
873074880 873074940
873078480 873078540
873090420 873090480
873116280 873116340
873124020 873124080
873126840 873126900
873128160 873128280
873128700 873128820
873134640 873134700
873135840 873135960
873143160 873143220
873144360 873144420
873145320 873145440
873146760 873146820
873163200 873163260
873163440 873163500
873167940 873168000
873168600 873168660
873177660 873177720
873206760 873206820
873207000 873207060
873214380 873214440
873219420 873219480
873224580 873224640
873225660 873225720
873227100 873227160
873230580 873230640
873231000 873231060
873231240 873231300
873231540 873231600
873232680 873232740
873235560 873235620
873237660 873237780
873239220 873239280
873240300 873240420
873242580 873242640
873244020 873244080
873245160 873245220
873250440 873250500
873262200 873262260
873285120 873285180
873289800 873289860
873295080 873295140
873449400 873449460
873452460 873452520
873465540 873465660
873471120 873471180
873471600 873471660
873472980 873473040
873473760 873473820
873473880 873473940
873478080 873478200
873479460 873479520
873481200 873481260
873482040 873482100
873485040 873485160
873487440 873487560
873489420 873489480
873490500 873490740
873491640 873491700
873492360 873492420
873493680 873493800
873495720 873495780
873496860 873496920
873497580 873497640
873502200 873502260
873514440 873514500
873548880 873548940
873555000 873555060
873557460 873557520
873576840 873576900
873577260 873577380
873577680 873577740
873577980 873578040
873578820 873578880
873580080 873580140
873582660 873582720
873584160 873584220
873585480 873585540
873586320 873586440
873586740 873586800
873591180 873591240
873595680 873595740
873597600 873597660
873616260 873616320
873647580 873647640
873647700 873647760
873651120 873651180
873653040 873653160
873653340 873653400
873657240 873657360
873658200 873658260
873658800 873658860
873664620 873664680
873665100 873665160
873665820 873665880
873668040 873668100
873668760 873668820
873668880 873669000
873675720 873675780
873699300 873699360
873709560 873709620
873712860 873712920
873728160 873728220
873730440 873730500
873731820 873731940
873732120 873732180
873732900 873732960
873734160 873734280
873738780 873738900
873739080 873739260
873740340 873740400
873740520 873740580
873741600 873741660
873743460 873743580
873747300 873747360
873748500 873748560
873748860 873748920
873750660 873750780
873756300 873756420
873756480 873756540
873813540 873813660
873819420 873819480
873825720 873825780
873831660 873831780
873832380 873832500
873833340 873833400
873834360 873834540
873837300 873837360
873838440 873838500
873838860 873838920
873839040 873839280
873839520 873839580
873840060 873840120
873842820 873842880
873843000 873843060
873843420 873843480
873843840 873843900
873845040 873845100
873846960 873847020
873847080 873847140
873847560 873847620
873848040 873848100
873852900 873852960
873860340 873860400
873904500 873904560
873906780 873906900
874067520 874067580
874068420 874068480
874071900 874071960
874082580 874082640
874084800 874084860
874086060 874086120
874091760 874091880
874091940 874092000
874092060 874092120
874095000 874095180
874097340 874097460
874098060 874098180
874103520 874103580
874103760 874103820
874104120 874104180
874113240 874113360
874113420 874113540
874126080 874126140
874128540 874128600
874145760 874145880
874150320 874150380
874159440 874159500
874161360 874161420
874183080 874183140
874186740 874186860
874187040 874187160
874190340 874190460
874191240 874191300
874192080 874192200
874196940 874197000
874197900 874197960
874204920 874204980
874207020 874207080
874207260 874207320
874221240 874221300
874230540 874230600
874232100 874232220
874245960 874246020
874246080 874246140
874247580 874247640
874251480 874251540
874253760 874253820
874255200 874255260
874255980 874256100
874256700 874256760
874258560 874258620
874259160 874259220
874260180 874260480
874261380 874261500
874262520 874262580
874269900 874269960
874270500 874270560
874277220 874277280
874279200 874279320
874279740 874279800
874281360 874281420
874286100 874286160
874288740 874288860
874295820 874295880
874299120 874299180
874336380 874336440
874337520 874337580
874337700 874337760
874338000 874338060
874342800 874342920
874343640 874343700
874345560 874345680
874347480 874347540
874350540 874350600
874350840 874350960
874351200 874351260
874353840 874353900
874355940 874356000
874356900 874356960
874357020 874357080
874358580 874358640
874358880 874358940
874362660 874362720
874363800 874363860
874365480 874365540
874366560 874366620
874368000 874368060
874369200 874369260
874374120 874374180
874374660 874374720
874377660 874377720
874412700 874412760
874415160 874415220
874419960 874420020
874426980 874427100
874429800 874429920
874430040 874430100
874434480 874434600
874440300 874440360
874443540 874443600
874443780 874443840
874447500 874447560
874448280 874448400
874450680 874450740
874455840 874455960
874459980 874460100
874462980 874463040
874511160 874511280
874515180 874515240
874515660 874515720
874515960 874516080
874517280 874517340
874519800 874519920
874520220 874520280
874521000 874521120
874524420 874524480
874528080 874528200
874530900 874530960
874540560 874540620
874545900 874545960
874546020 874546080
874551900 874551960
874604520 874604580
874605120 874605180
874608480 874608540
874609800 874609860
874612740 874612800
874617360 874617420
874617840 874617900
874619940 874620060
874638060 874638180
874644000 874644060
874674000 874674060
874680060 874680180
874683480 874683540
874685880 874685940
874688220 874688340
874688760 874688820
874690020 874690080
874690980 874691040
874691280 874691400
874691820 874691880
874695660 874695780
874697220 874697280
874698180 874698360
874699860 874700040
874700520 874700580
874703040 874703100
874703160 874703220
874704480 874704540
874705500 874705560
874706520 874706580
874708320 874708380
874713600 874713660
874713780 874713900
874713960 874714020
874714260 874714320
874720680 874720740
874732620 874732680
874750200 874750320
874756860 874756980
874758720 874758780
874760640 874760700
874788120 874788300
874789500 874789620
874794480 874794600
874794780 874794840
874796640 874796700
874797000 874797060
874797900 874797960
874799220 874799340
874807440 874807560
874834980 874835040
874836000 874836060
874841160 874841280
874852140 874852260
874853160 874853220
874855380 874855500
874856220 874856280
874869780 874869840
874870140 874870200
874870620 874870680
874871340 874871400
874873260 874873320
874874700 874874760
874875420 874875480
874877640 874877760
874877820 874877940
874880400 874880460
874881240 874881300
874882260 874882380
874885140 874885200
874886880 874886940
874889880 874889940
874890240 874890300
874896720 874896780
874903860 874903920
874923720 874923780
874936980 874937040
874939080 874939140
874941720 874941840
874942740 874942800
874943160 874943220
874953540 874953600
874953960 874954080
874955940 874956060
874957080 874957140
874957260 874957320
874957500 874957560
874957980 874958100
874958580 874958700
874960200 874960320
874960380 874960440
874961040 874961100
874961760 874961820
874964760 874964820
874965120 874965420
874965480 874965540
874966020 874966140
874968120 874968240
874968660 874968720
874969860 874969920
874971540 874971600
874972680 874972800
874973340 874973400
874975260 874975320
874977720 874977780
874996680 874996740
875005380 875005440
875014800 875014860
875017140 875017200
875031480 875031540
875033280 875033400
875035080 875035140
875038500 875038560
875039220 875039280
875039460 875039520
875041560 875041620
875043780 875043840
875044200 875044260
875047440 875047500
875049120 875049180
875053200 875053260
875054700 875054760
875061240 875061300
875061960 875062020
875062920 875062980
875064240 875064300
875124420 875124480
875132640 875132700
875133420 875133480
875135700 875135760
875138220 875138280
875141520 875141640
875142360 875142420
875146200 875146260
875149020 875149080
875149140 875149200
875206680 875206740
875226900 875226960
