815580748 815580749
815586555 815586556
815798537 815798538
815890422 815890425
815890632 815890635
815890662 815890663
815913216 815913217
815927381 815927384
815962841 815962842
816092016 816092020
816183174 816183177
816183194 816183195
816209619 816209620
816214256 816214257
816280915 816280918
816280920 816280925
816280929 816280932
816291558 816291559
816353546 816353549
816353624 816353625
816360251 816360254
816369029 816369030
816430825 816430828
816457126 816457130
816457648 816457649
816534980 816534983
816535115 816535116
816952168 816952169
817077861 817077862
817232025 817232026
817431059 817431078
817440419 817440467
817448819 817448851
817457459 817457465
817940320 817940321
818093543 818093544
818096087 818096088
818346866 818346867
818439003 818439004
818454116 818454117
818493659 818493699
818635045 818635046
818636580 818636581
818723648 818723649
818780219 818780247
818878586 818878587
818945605 818945606
819028049 819028050
819030088 819030089
819185292 819185293
819316039 819316042
819424103 819424104
819480761 819480762
819579926 819579927
819687419 819687464
819729092 819729093
819825403 819825404
819828899 819828918
819977551 819977552
820002955 820002956
820052975 820052976
820172006 820172007
820528762 820528763
820626138 820626139
820635250 820635251
820695681 820695682
820716196 820716197
820756090 820756091
821037924 821037927
821128352 821128353
821287450 821287451
821344190 821344191
821388576 821388577
821480155 821480156
821483398 821483399
821536061 821536062
821725822 821725823
822084266 822084267
822092530 822092531
822435585 822435586
822438539 822438540
822567104 822567105
822737941 822737942
822920423 822920424
823336862 823336863
824217448 824217449
824454266 824454270
824502081 824502082
824596596 824596600
824674558 824674559
824678717 824678720
824750483 824750484
824809674 824809677
824809681 824809684
824825967 824825968
824872766 824872769
824959241 824959242
825448431 825448434
825473714 825473717
825485220 825485223
825582016 825582019
825590819 825590820
825711357 825711360
825822820 825822821
825880425 825880428
825889620 825889621
826229400 826229401
826380838 826380841
826920659 826920662
827041464 827041467
827093000 827093003
827093011 827093012
827101433 827101437
827101449 827101452
827101490 827101494
827161514 827161515
827267789 827267793
827291900 827291901
827364356 827364359
827378611 827378614
827526015 827526018
827528719 827528727
827588647 827588655
827618503 827618506
827786474 827786478
827847300 827847303
827849246 827849247
827876395 827876399
827876840 827876844
827921803 827921808
828153410 828153417
828619901 828619902
828839862 828839865
829248327 829248331
829248334 829248335
829290903 829290912
829290923 829290929
829290936 829290949
829290962 829290968
829505279 829505305
829516019 829516028
829653752 829653755
829653759 829653760
829669561 829669564
829685244 829685247
829842587 829842591
829937799 829937802
829948717 829948718
829981978 829981979
830036670 830036671
830044430 830044431
830096742 830096745
830113840 830113843
830210487 830210490
830210530 830210533
830342821 830342822
830365588 830365589
830460623 830460626
830460630 830460634
830460639 830460644
830460682 830460685
830460700 830460703
830490891 830490892
830510560 830510569
830705954 830705955
830815453 830815454
830833523 830833524
830895313 830895314
830904874 830904875
831134434 831134435
831168101 831168105
831171602 831171603
831264583 831264587
831412661 831412662
831419091 831419092
831465603 831465604
831495686 831495687
831498841 831498842
831616695 831616696
831631001 831631005
831669189 831669194
831695884 831695888
831695890 831695896
831695898 831695903
831695905 831695909
831695912 831695917
831765210 831765211
831767879 831767924
831811971 831811974
831934042 831934045
832017724 832017728
832109384 832109385
832111394 832111397
832284928 832284929
832296458 832296459
832300429 832300430
832479855 832479856
832801963 832801970
833137609 833137610
833140815 833140820
833147271 833147272
833227331 833227332
833235216 833235217
833269411 833269415
833320152 833320153
833369510 833369515
833389840 833389844
833425454 833425457
833446738 833446741
833576875 833576876
833578466 833578467
833580716 833580717
833731311 833731312
833742354 833742355
833868612 833868618
833885544 833885548
834189236 834189237
834282054 834282055
834294408 834294412
834323002 834323003
834518377 834518381
834524291 834524292
834691115 834691118
834731727 834731728
834833072 834833077
834873850 834873851
835009413 835009416
835039738 835039739
835130703 835130706
835392125 835392129
835410092 835410095
835411656 835411660
835443418 835443422
835443450 835443453
835443491 835443495
835449052 835449058
835480057 835480058
835567487 835567492
835643706 835643707
835732419 835732424
835818153 835818154
835848164 835848165
835895155 835895156
835954346 835954347
835984133 835984134
836080693 836080694
836247777 836247778
836259729 836259730
836293132 836293133
836343985 836343989
836352742 836352745
836356484 836356485
836375225 836375228
836395969 836395970
836412539 836412540
836426862 836426863
836459676 836459680
836461560 836461563
836485086 836485087
836626346 836626350
836769089 836769090
836776359 836776360
836782093 836782094
836858163 836858164
837025905 837025906
837033741 837033742
837078632 837078635
837226540 837226544
837322042 837322043
837369550 837369551
837456779 837456838
837600205 837600206
837641690 837641691
837642959 837643020
837723753 837723754
837740813 837740816
837801667 837801671
837843259 837843260
837865956 837865960
838064571 838064572
838071521 838071522
838078974 838078975
838174531 838174536
838238576 838238577
838242179 838242186
838242719 838242751
838257954 838257963
838373694 838373695
838399520 838399521
838406370 838406371
838413239 838413281
838415438 838415441
838415443 838415444
838569441 838569442
838629616 838629617
838664385 838664386
838713257 838713260
838831636 838831639
838844168 838844169
838894799 838894818
839229059 839229063
839256385 839256386
839267115 839267116
839284958 839284962
839301715 839301718
839337938 839337939
839342239 839342244
839371055 839371056
839626509 839626510
839628931 839628937
839630704 839630705
839680448 839680449
839718681 839718682
839721979 839721980
839801327 839801331
839808223 839808224
839828582 839828583
839848823 839848824
839863878 839863881
840039698 840039699
840083139 840083143
840176710 840176713
840176729 840176733
840238345 840238346
840336352 840336353
840373123 840373124
840403940 840403943
840492002 840492005
840492008 840492011
840502639 840502640
840533225 840533230
840533595 840533599
840740762 840740763
840857944 840857945
840932662 840932667
840996056 840996057
841046798 841046799
841141963 841141964
841143796 841143797
841147844 841147845
841236741 841236742
841554531 841554532
841586018 841586019
841856690 841856693
841922222 841922223
842046998 842047001
842103830 842103831
842219609 842219610
842303986 842303987
842385189 842385190
842468481 842468482
842586797 842586798
842803551 842803552
842821924 842821928
842903618 842903619
842928276 842928277
842987111 842987112
842994532 842994535
842997999 842998000
843167743 843167744
843431677 843431678
843460465 843460466
843604919 843604923
843674440 843674443
843744542 843744543
843753472 843753473
844020966 844020971
844027643 844027646
844119278 844119282
844119296 844119300
844245213 844245214
844310948 844310949
844348106 844348107
844870266 844870267
844967737 844967740
845065047 845065048
845158698 845158701
845238289 845238290
845503697 845503702
845504070 845504075
845590661 845590662
846013231 846013232
846095573 846095574
846106905 846106906
846195102 846195105
846195125 846195128
846198056 846198057
846324334 846324335
846421079 846421100
846751166 846751169
846826570 846826571
847402652 847402655
847431328 847431331
847483463 847483466
847604963 847604966
847625064 847625075
847661549 847661552
847661556 847661557
847718002 847718005
847753434 847753435
847797139 847797144
847836326 847836330
847915375 847915381
847922258 847922261
847945287 847945290
847955160 847955161
847998428 847998432
847998458 847998468
847998479 847998482
847999495 847999499
848069438 848069443
848069454 848069459
848069475 848069479
848086244 848086247
848086249 848086253
848095228 848095229
848330601 848330602
848347193 848347196
848673458 848673459
848701453 848701456
848922364 848922368
848924292 848924295
849050349 849050350
849213047 849213048
849214802 849214803
849470627 849470628
849554423 849554426
849564293 849564294
849711516 849711517
849898985 849898988
849903538 849903539
849908418 849908419
849926181 849926185
849958807 849958810
850066274 850066275
850066775 850066776
850108777 850108780
850137783 850137786
850161576 850161579
850184666 850184670
850187437 850187440
850187444 850187445
850518006 850518007
850694604 850694605
850715830 850715831
851038878 851038879
851111331 851111335
851114763 851114766
851506516 851506522
851507034 851507038
851507044 851507051
851764705 851764708
852047772 852047776
852047778 852047782
852069992 852069995
852323455 852323456
852325461 852325467
852414692 852414693
852440093 852440094
852566261 852566262
852679340 852679341
852698002 852698003
852715735 852715738
853196730 853196733
853272983 853272984
853344468 853344471
853344473 853344479
853414966 853414967
853444760 853444761
853479065 853479066
853838696 853838700
854050935 854050936
854171883 854171884
854198113 854198116
854198145 854198149
854198170 854198174
854198209 854198214
854198218 854198221
854251267 854251271
854288258 854288261
854288319 854288322
854288365 854288371
854408775 854408778
854584204 854584205
854658322 854658325
854706552 854706557
854706570 854706573
854926297 854926300
855243397 855243400
855312452 855312458
855414410 855414411
855778740 855778741
855870421 855870424
855954978 855954979
855955333 855955336
856135778 856135779
856201784 856201785
856258898 856258899
856294330 856294333
856320446 856320447
856322025 856322032
856383013 856383014
856411010 856411011
856436370 856436371
856451149 856451152
856527717 856527718
856544305 856544306
856571537 856571540
856731285 856731288
856778897 856778898
857094675 857094676
857169285 857169286
857258012 857258017
857362650 857362651
857412760 857412763
857424445 857424446
857435213 857435216
857502336 857502340
857592086 857592087
857632802 857632805
857673247 857673248
857733440 857733443
857733791 857733794
857733899 857733902
857734228 857734232
857735148 857735151
857735657 857735661
857739197 857739201
857764582 857764585
857766127 857766128
857767051 857767052
857790245 857790248
857790249 857790250
857945261 857945262
858031505 858031508
858107585 858107586
858165188 858165191
858182897 858182898
858185008 858185009
858207178 858207181
858219649 858219652
858390355 858390358
858467833 858467834
858594476 858594477
858724960 858724963
858724969 858724970
858741282 858741285
858783263 858783266
858784087 858784088
858799573 858799574
858819210 858819213
858961269 858961272
858973812 858973813
858985565 858985566
859068995 859068996
859075136 859075139
859078191 859078194
859085182 859085183
859127653 859127654
859155441 859155442
859182081 859182082
859281379 859281380
859312560 859312563
859399948 859399949
859781287 859781290
859782847 859782848
859852118 859852119
859934497 859934498
860010999 860011002
860163262 860163263
860280094 860280095
860342998 860342999
860364237 860364238
860366161 860366162
860367297 860367298
860527308 860527311
860543421 860543425
860710824 860710825
860921076 860921077
861038254 861038257
861155837 861155838
861158551 861158552
861175559 861175562
861489565 861489568
861641360 861641363
861650108 861650109
861843051 861843054
861886166 861886167
862139824 862139825
862177047 862177048
862258344 862258345
862262555 862262556
862381092 862381093
862384746 862384747
862524772 862524776
862533391 862533394
862533399 862533400
862668096 862668097
862697391 862697394
862732329 862732330
862768808 862768809
862870020 862870021
862897021 862897024
862944121 862944124
862947250 862947251
862954146 862954149
863053275 863053276
863216963 863216964
863301806 863301809
863457776 863457777
863637351 863637352
863770803 863770804
863982949 863982952
863982954 863982955
863984377 863984378
864151203 864151206
864325515 864325518
864328183 864328186
864339266 864339267
864340466 864340467
864418221 864418224
864464152 864464153
864507621 864507624
864592283 864592284
864594249 864594250
864612162 864612163
864673457 864673458
864751178 864751181
864859062 864859063
864963367 864963370
865019924 865019925
865079311 865079312
865288850 865288854
865345194 865345198
865465054 865465059
865465071 865465072
865490998 865490999
865613985 865613988
865668379 865668380
865798654 865798657
865829036 865829037
865864238 865864241
866166074 866166077
866166134 866166137
866168707 866168708
866169994 866169995
866172794 866172797
866223871 866223872
866333490 866333494
866413923 866413924
866774070 866774071
867191169 867191170
867766563 867766564
867782791 867782795
867795636 867795637
868054788 868054791
868054800 868054801
868216397 868216398
868247691 868247692
868253687 868253688
868262644 868262647
868399209 868399210
868631329 868631330
868745035 868745036
868753255 868753264
868903670 868903671
868919367 868919372
868919373 868919376
869060245 869060246
869068029 869068030
869234026 869234027
869413834 869413837
869442644 869442648
869442650 869442651
869505250 869505251
869535606 869535611
869583608 869583612
869613894 869613895
869617377 869617378
870024120 870024128
870038701 870038702
870068012 870068015
870103420 870103426
870103428 870103429
870273274 870273275
870290012 870290016
870342132 870342133
870467420 870467421
870629025 870629026
870815199 870815200
870891414 870891418
870905947 870905951
870991921 870991924
871075843 871075844
871105598 871105599
871158599 871158630
871228549 871228552
871243438 871243439
871272693 871272694
871291472 871291476
871291496 871291502
871291519 871291520
871300048 871300051
871392599 871392602
871409403 871409406
871432679 871432718
871441450 871441457
871446179 871446239
871456499 871456509
871468139 871468146
871478039 871478060
871515839 871515898
871522461 871522465
871539479 871539537
871551179 871551210
871560179 871560197
871566359 871566370
871597096 871597099
871601519 871601531
871629359 871629389
871639919 871639933
871679617 871679620
871685683 871685684
871920986 871920990
872104000 872104001
872129881 872129882
872167785 872167791
872201840 872201844
872515648 872515649
872635369 872635370
872645311 872645314
872645693 872645696
872706969 872706973
872739247 872739251
872871904 872871905
872885772 872885773
873060204 873060205
873137077 873137080
873141122 873141123
873147576 873147577
873222863 873222864
873419411 873419414
873424751 873424756
873648747 873648750
873665977 873665980
873670113 873670118
873670119 873670120
873677305 873677306
874227035 874227038
874272889 874272890
874275438 874275439
874316935 874316938
874347699 874347702
874354142 874354145
874360687 874360688
874436900 874436901
874501510 874501513
874514092 874514096
874525284 874525288
874622918 874622921
874695985 874695986
874706780 874706781
874802185 874802189
874817619 874817620
874846228 874846231
874979370 874979375
875022651 875022654
875041718 875041725
875104060 875104061
875166836 875166841
