816070267 816070284
816071387 816071404
816071677 816071694
816075873 816075890
816087850 816087867
816089450 816089467
816090101 816090118
816230770 816230787
816235523 816235540
816235533 816235550
816261753 816261770
816274818 816274835
816313347 816313364
816313444 816313461
816316246 816316263
816316256 816316273
816316485 816316502
816317350 816317367
816317456 816317473
816317490 816317507
816322298 816322315
816332816 816332833
816336890 816336907
816340114 816340131
816346626 816346643
816347245 816347262
816352901 816352918
816354685 816354702
816354771 816354788
816354786 816354803
816355251 816355268
816358699 816358716
816413423 816413440
816417472 816417489
816417822 816417839
816434774 816434791
816436123 816436140
816436377 816436395
816443379 816443396
816443837 816443854
816445588 816445605
816445818 816445835
816445879 816445896
816461218 816461236
816466783 816466800
816467006 816467023
816476776 816476793
816479496 816479513
816495401 816495418
816500566 816500583
816525537 816525554
816549503 816549520
816572391 816572408
816582360 816582377
816590495 816590512
816593475 816593492
816593617 816593634
816651500 816651517
816651591 816651608
816654401 816654418
816656618 816656635
816657982 816657999
816664198 816664215
816664525 816664542
816665206 816665223
816672894 816672911
816677268 816677285
816683032 816683049
816690470 816690487
816690758 816690775
816690815 816690832
816690899 816690916
816690949 816690966
816690954 816690971
816691766 816691783
816691781 816691798
816691795 816691812
816693366 816693383
816693387 816693404
816738406 816738423
816744008 816744025
816744043 816744060
816744096 816744113
816744146 816744163
816744187 816744204
816744214 816744231
816747502 816747519
816747613 816747630
816748039 816748056
816761177 816761194
816761185 816761202
816761375 816761393
816761847 816761864
816761951 816761968
816762209 816762226
816762213 816762230
816762233 816762250
816762381 816762398
816762647 816762664
816762812 816762829
816763343 816763360
816764088 816764105
816780539 816780556
816780820 816780837
816782898 816782915
816783058 816783075
816827363 816827380
816827397 816827414
816827451 816827468
816827487 816827504
816827539 816827556
816827652 816827669
816828252 816828269
816828509 816828526
816828601 816828618
816828606 816828623
816828653 816828670
816828776 816828793
816828985 816829002
816828995 816829012
816829018 816829035
816829046 816829063
816829076 816829093
816829446 816829463
816829453 816829470
816829530 816829547
816829939 816829956
816830087 816830104
816840897 816840914
816842195 816842212
816842231 816842248
816842244 816842261
816844565 816844582
816844611 816844628
816844784 816844803
816845101 816845118
816846048 816846065
816846160 816846177
816846616 816846633
816846621 816846638
816847685 816847702
816847703 816847720
816847760 816847780
816847785 816847802
816847798 816847815
816847857 816847875
816847962 816847979
816847976 816847993
816847981 816847998
816848052 816848069
816848567 816848584
816848584 816848601
816848852 816848869
816849384 816849401
816850565 816850582
816850788 816850805
816851279 816851299
816851318 816851335
816851385 816851402
816851407 816851424
816852747 816852764
816852753 816852770
816852787 816852804
816852820 816852837
816853015 816853032
816853174 816853191
816853194 816853211
816853373 816853390
816853464 816853481
816853502 816853519
816853691 816853708
816853697 816853714
816853739 816853756
816853830 816853847
816853910 816853927
816853939 816853956
816856416 816856435
816856467 816856484
816858388 816858405
816859083 816859100
816859517 816859534
816859691 816859708
816859844 816859861
816859998 816860015
816860375 816860392
816861122 816861139
816862071 816862088
816910783 816910800
816924735 816924752
816926179 816926196
816927950 816927967
816930001 816930018
816937968 816937985
816945541 816945558
816951544 816951561
816959228 816959245
816960320 816960337
816961530 816961549
816972141 816972158
816975532 816975549
816975551 816975568
816981286 816981303
816981355 816981374
816981438 816981455
816981659 816981676
816985430 816985447
816985439 816985456
816987350 816987367
816987753 816987770
816990260 816990277
816990999 816991016
816991069 816991086
816992420 816992437
817003077 817003094
817009756 817009773
817014550 817014567
817017258 817017275
817017295 817017312
817017316 817017333
817018873 817018890
817019543 817019560
817020836 817020853
817020870 817020887
817020889 817020906
817020981 817020998
817021456 817021473
817021695 817021712
817022552 817022569
817022609 817022626
817022635 817022652
817022760 817022777
817022778 817022795
817022803 817022820
817023083 817023100
817023404 817023421
817023437 817023454
817023452 817023469
817023555 817023572
817023563 817023580
817023602 817023619
817023625 817023642
817024634 817024651
817025636 817025653
817025707 817025724
817025886 817025903
817026732 817026749
817026856 817026873
817027088 817027105
817027146 817027163
817030509 817030526
817031549 817031566
817031567 817031584
817031600 817031617
817031695 817031712
817031773 817031790
817033076 817033093
817049552 817049569
817050266 817050283
817050709 817050726
817061239 817061256
817061305 817061322
817061423 817061440
817137166 817137183
817137505 817137522
817141276 817141293
817141296 817141313
817142240 817142257
817162995 817163012
817164217 817164234
817199116 817199133
817203417 817203434
817217121 817217138
817243544 817243561
817243899 817243916
817253655 817253672
817260903 817260921
817260949 817260966
817260962 817260979
817260970 817260987
817261117 817261134
817261126 817261143
817261231 817261248
817261257 817261274
817261305 817261322
817261332 817261349
817261709 817261726
817262346 817262363
817262507 817262524
817262603 817262620
817262687 817262704
817263416 817263433
817263420 817263437
817263621 817263638
817263962 817263979
817265311 817265328
817267714 817267731
817268282 817268299
817270142 817270159
817270240 817270257
817270336 817270353
817271714 817271731
817271819 817271836
817271954 817271971
817272932 817272949
817272936 817272953
817272952 817272969
817273004 817273021
817276626 817276643
817276636 817276653
817277204 817277221
817277224 817277241
817277274 817277291
817277286 817277303
817277359 817277376
817277783 817277800
817278461 817278478
817278960 817278977
817278970 817278987
817279438 817279455
817280987 817281004
817281011 817281029
817281484 817281501
817282703 817282720
817283091 817283108
817283229 817283246
817284651 817284668
817284716 817284733
817284831 817284848
817290470 817290487
817290545 817290562
817290620 817290637
817290891 817290908
817291309 817291326
817291386 817291403
817291536 817291553
817291990 817292007
817292013 817292030
817292019 817292036
817292036 817292053
817292148 817292165
817292206 817292223
817292237 817292254
817292256 817292273
817292303 817292320
817292373 817292393
817292435 817292452
817292481 817292498
817292488 817292505
817292500 817292517
817292504 817292521
817292538 817292555
817292556 817292573
817292592 817292609
817292615 817292632
817292627 817292644
817292639 817292656
817292667 817292684
817292684 817292701
817292713 817292730
817292747 817292764
817292863 817292880
817292885 817292902
817293032 817293049
817293365 817293382
817293599 817293616
817293616 817293633
817293906 817293923
817293985 817294002
817294035 817294052
817294102 817294119
817294195 817294212
817294635 817294652
817294722 817294739
817294736 817294753
817294819 817294838
817294826 817294843
817303643 817303660
817303777 817303794
817303881 817303898
817304549 817304566
817304806 817304823
817304816 817304833
817305647 817305664
817306003 817306020
817306150 817306167
817306233 817306250
817306782 817306799
817306900 817306917
817306940 817306957
817306968 817306985
817307086 817307103
817307199 817307216
817307556 817307573
817353457 817353474
817354440 817354457
817354462 817354479
817354528 817354545
817354905 817354922
817355811 817355828
817358232 817358249
817359405 817359422
817359654 817359671
817361036 817361053
817366695 817366712
817370654 817370671
817371707 817371724
817373548 817373565
817374059 817374076
817374517 817374534
817376549 817376566
817382048 817382065
817392788 817392805
817392978 817392995
817394644 817394661
817417182 817417199
817420368 817420385
817421707 817421724
817422076 817422093
817423400 817423417
817425771 817425788
817425807 817425824
817425830 817425847
817426166 817426183
817426203 817426222
817426232 817426249
817426243 817426260
817430693 817430710
817431720 817431737
817439928 817439945
817443176 817443195
817443186 817443203
817443227 817443244
817443611 817443628
817443668 817443685
817443680 817443697
817443694 817443711
817443878 817443895
817444253 817444270
817444386 817444403
817444448 817444465
817444514 817444531
817444553 817444570
817444572 817444589
817444678 817444695
817444708 817444725
817444745 817444762
817444872 817444889
817444996 817445013
817445004 817445021
817445084 817445101
817445101 817445118
817447218 817447235
817447352 817447369
817447497 817447514
817451364 817451381
817453276 817453293
817453287 817453304
817453347 817453364
817453377 817453394
817460487 817460504
817464589 817464606
817466827 817466844
817466848 817466865
817466909 817466926
817472082 817472099
817472573 817472590
817472971 817472988
817516637 817516654
817539249 817539266
817539264 817539281
817539923 817539940
817540420 817540437
817549599 817549616
817558230 817558247
817583592 817583609
817584150 817584167
817584258 817584275
817584717 817584734
817585688 817585705
817592292 817592309
817601660 817601677
817607445 817607462
817607633 817607650
817608278 817608295
817615284 817615301
817621692 817621709
817628649 817628666
817649579 817649596
817649723 817649740
817653618 817653635
817653807 817653824
817661101 817661118
817698169 817698186
817711000 817711019
817722350 817722367
817731571 817731588
817731584 817731601
817740790 817740807
817744618 817744635
817744770 817744787
817745170 817745187
817745283 817745300
817760217 817760234
817763847 817763864
817764477 817764494
817764702 817764719
817765430 817765447
817765479 817765498
817765515 817765532
817765577 817765594
817765667 817765684
817766498 817766515
817766689 817766706
817766823 817766840
817767358 817767375
817767582 817767599
817773835 817773852
817774861 817774878
817775447 817775464
817775639 817775656
817776769 817776786
817778591 817778608
817785305 817785322
817786249 817786266
817787336 817787353
817787510 817787527
817796035 817796052
817796386 817796403
817796969 817796986
817797342 817797359
817798004 817798021
817799369 817799386
817799378 817799395
817799385 817799402
817800259 817800276
817800274 817800291
817800698 817800715
817800801 817800818
817802026 817802043
817802544 817802561
817802555 817802572
817802575 817802592
817802909 817802927
817805233 817805250
817805611 817805628
817805631 817805648
817807177 817807194
817807218 817807235
817810124 817810141
817810384 817810401
817811463 817811480
817811480 817811497
817812301 817812318
817812824 817812841
817812998 817813015
817813036 817813053
817813040 817813057
817813068 817813085
817813327 817813344
817813545 817813562
817813693 817813711
817813709 817813726
817813741 817813758
817813831 817813848
817813847 817813864
817813890 817813907
817815782 817815799
817860171 817860188
817861899 817861916
817862285 817862302
817862386 817862403
817863029 817863048
817863044 817863061
817863048 817863065
817864285 817864302
817865031 817865048
817865150 817865167
817865170 817865187
817865184 817865201
817865212 817865229
817865228 817865245
817865265 817865284
817865315 817865332
817865601 817865618
817865875 817865892
817870056 817870073
817873053 817873071
817873182 817873199
817877147 817877164
817877218 817877235
817877387 817877404
817877414 817877431
817877425 817877442
817877452 817877469
817877484 817877501
817878010 817878027
817878020 817878037
817878064 817878082
817878141 817878159
817878169 817878186
817878291 817878308
817878301 817878318
817878355 817878372
817878373 817878390
817878676 817878693
817878709 817878730
817878733 817878750
817878815 817878833
817878914 817878931
817878918 817878936
817884459 817884476
817886733 817886750
817888561 817888578
817888630 817888647
817888804 817888821
817888966 817888983
817889097 817889114
817889330 817889347
817889343 817889360
817890195 817890212
817890239 817890256
817890246 817890263
817890393 817890410
817890419 817890436
817890517 817890534
817890794 817890811
817893096 817893113
817894946 817894963
817895136 817895153
817895222 817895241
817895792 817895809
817895801 817895818
817895855 817895872
817895868 817895885
817895887 817895904
817896559 817896576
817897173 817897190
817897184 817897201
817897327 817897344
817897718 817897737
817897740 817897757
817897778 817897795
817898370 817898387
817898765 817898782
817982192 817982209
817984373 817984390
817987021 817987038
817988906 817988923
817988992 817989009
817990285 817990302
817992118 817992135
818049862 818049879
818051903 818051920
818052404 818052421
818053133 818053150
818053724 818053741
818054155 818054172
818062556 818062573
818063495 818063512
818063872 818063889
818064875 818064892
818067801 818067818
818068693 818068710
818070637 818070654
818167684 818167701
818244343 818244360
818253717 818253734
818302993 818303010
818386180 818386197
818554554 818554571
818556618 818556635
818557027 818557044
818560211 818560228
818561863 818561880
818573593 818573610
818582265 818582282
818589007 818589024
818608836 818608853
818658583 818658600
818812096 818812113
818812788 818812805
818814132 818814149
818814945 818814962
818815813 818815830
818817540 818817557
818817610 818817627
818818011 818818028
818821975 818821992
818823239 818823256
818830404 818830421
818842222 818842239
818843177 818843194
818906102 818906119
818914300 818914317
818915768 818915785
818923791 818923808
818983246 818983263
819069483 819069500
819069499 819069516
819069619 819069636
819069798 819069815
819069885 819069902
819069917 819069934
819069950 819069967
819070106 819070123
819070259 819070276
819070356 819070373
819070634 819070651
819070684 819070701
819070716 819070733
819070820 819070837
819070898 819070915
819071265 819071282
819071404 819071421
819071864 819071881
819072150 819072167
819072312 819072329
819072655 819072672
819072765 819072782
819072951 819072968
819073032 819073049
819073069 819073086
819073337 819073354
819073386 819073403
819073651 819073668
819074415 819074432
819083035 819083052
819083562 819083579
819084080 819084097
819085219 819085236
819086112 819086129
819086709 819086726
819088621 819088638
819088732 819088749
819091125 819091142
819091216 819091233
819092215 819092232
819095823 819095840
819095957 819095974
819104067 819104084
819105005 819105022
819108720 819108737
819111395 819111412
819112393 819112410
819112583 819112600
819114172 819114189
819116779 819116796
819196253 819196270
819196301 819196318
819196327 819196344
819196896 819196913
819196907 819196924
819197107 819197124
819197173 819197190
819197187 819197204
819197391 819197408
819197511 819197528
819197784 819197801
819197809 819197826
819197913 819197930
819198332 819198349
819198428 819198445
819198767 819198784
819198925 819198942
819199124 819199141
819199140 819199157
819199172 819199189
819199238 819199255
819200173 819200190
819200541 819200558
819200558 819200575
819200767 819200784
819201175 819201192
819201331 819201348
819201642 819201659
819201756 819201773
819201843 819201860
819202710 819202727
819202875 819202892
819202950 819202967
819203892 819203909
819204264 819204281
819204428 819204445
819204663 819204680
819204927 819204944
819204994 819205011
819205294 819205311
819246687 819246704
819246721 819246738
819246810 819246827
819246823 819246840
819246905 819246922
819246930 819246947
819246939 819246956
819246954 819246971
819247043 819247060
819247133 819247150
819247145 819247162
819247209 819247226
819247270 819247287
819247322 819247339
819247527 819247544
819247580 819247597
819247606 819247623
819247621 819247638
819247792 819247809
819247819 819247836
819247839 819247856
819247882 819247899
819247903 819247920
819247925 819247942
819248036 819248053
819248065 819248082
819248076 819248093
819248102 819248119
819248130 819248147
819248153 819248170
819248184 819248201
819248242 819248259
819248323 819248340
819248482 819248499
819248490 819248507
819248504 819248521
819248546 819248563
819248614 819248631
819248700 819248717
819248729 819248746
819248835 819248852
819249126 819249143
819249312 819249329
819249327 819249344
819249475 819249492
819249530 819249547
819249673 819249690
819253722 819253739
819253900 819253917
819253920 819253937
819254666 819254683
819255366 819255383
819256076 819256093
819256285 819256302
819256322 819256339
819257007 819257024
819257334 819257351
819257923 819257940
819257962 819257979
819257969 819257986
819259095 819259112
819259558 819259575
819259708 819259725
819260277 819260294
819261804 819261821
819262311 819262328
819262846 819262863
819264028 819264045
819264801 819264818
819266756 819266773
819267704 819267721
819267929 819267946
819268239 819268256
819269923 819269940
819270313 819270330
819270843 819270860
819273578 819273595
819274831 819274848
819284756 819284773
819284996 819285013
819285143 819285160
819315295 819315312
819364055 819364072
819369190 819369207
819423467 819423484
819430457 819430475
819438708 819438725
819440929 819440946
819553769 819553786
819697999 819698016
819705820 819705837
819722395 819722412
819804879 819804896
819878418 819878435
820046843 820046860
820210318 820210335
820300523 820300540
820308848 820308865
820316532 820316549
820318011 820318028
820358517 820358534
820358606 820358623
820358664 820358681
820358668 820358685
820358696 820358713
820358716 820358733
820358765 820358782
820358818 820358835
820358871 820358888
820358956 820358973
820358971 820358988
820359114 820359131
820359169 820359186
820359270 820359287
820359292 820359309
820359315 820359332
820359333 820359350
820359351 820359368
820359375 820359392
820359533 820359550
820359600 820359619
820359672 820359689
820359708 820359725
820359759 820359776
820359800 820359817
820359928 820359945
820359987 820360004
820360074 820360091
820360110 820360127
820360407 820360424
820360435 820360452
820360518 820360535
820360536 820360553
820360801 820360818
820361077 820361094
820361180 820361197
820361192 820361209
820361473 820361490
820361560 820361577
820361595 820361612
820362283 820362300
820362956 820362973
820363026 820363043
820363122 820363139
820363554 820363571
820363785 820363802
820363989 820364006
820364435 820364452
820365000 820365017
820366000 820366017
820366292 820366309
820368714 820368731
820368780 820368797
820369292 820369309
820369631 820369648
820369898 820369915
820370220 820370237
820370419 820370437
820370562 820370579
820371674 820371691
820377455 820377472
820379337 820379354
820384423 820384440
820395535 820395552
820449559 820449576
820480734 820480751
820480935 820480952
820482140 820482157
820487551 820487568
820496796 820496813
820543961 820543978
820576775 820576792
820578406 820578423
820625813 820625830
820665052 820665069
820671953 820671970
820674930 820674947
820676205 820676222
820676541 820676558
820695371 820695388
820695916 820695933
820699454 820699471
820710730 820710747
820711978 820711995
820729299 820729316
820768630 820768647
820972056 820972073
820977101 820977118
820977793 820977810
820982244 820982261
820984844 820984861
820985425 820985442
820991271 820991288
820994499 820994516
820994930 820994947
821002113 821002130
821246762 821246779
821348834 821348851
821408210 821408227
821917460 821917477
821924406 821924423
821949512 821949529
821974264 821974281
821978205 821978222
822195922 822195939
822206933 822206950
822220728 822220745
822221047 822221064
822223929 822223946
822271086 822271103
822390578 822390595
822416101 822416118
822449719 822449736
822516582 822516599
822564531 822564548
822643683 822643700
822973876 822973893
823005608 823005625
823023426 823023443
823076796 823076813
823077700 823077717
823088744 823088761
823095418 823095435
823126004 823126021
823152559 823152576
823156733 823156750
823254071 823254088
823342873 823342890
823399800 823399817
823402947 823402964
823421012 823421029
823428228 823428245
823434477 823434494
823483017 823483034
823602862 823602879
823610251 823610268
823748442 823748459
823768722 823768739
823770993 823771010
823827823 823827840
823829690 823829707
823851270 823851287
823867967 823867984
823872926 823872943
823929448 823929465
824009706 824009723
824145440 824145457
824179170 824179187
824182977 824182994
824186806 824186823
824300568 824300585
824301055 824301072
824327765 824327782
824346575 824346592
824350787 824350804
824357557 824357574
824364687 824364704
824367262 824367279
824383522 824383539
824385319 824385336
824452519 824452536
824452976 824452993
824461570 824461587
824463841 824463858
824472918 824472935
824501701 824501718
824501974 824501991
824508019 824508036
824514829 824514846
824522107 824522124
824522819 824522836
824524105 824524122
824547490 824547507
824601421 824601438
824601584 824601601
824602113 824602130
824602488 824602505
824602530 824602547
824603329 824603346
824603437 824603454
824603878 824603895
824604001 824604018
824604409 824604426
824604517 824604534
824604526 824604543
824604713 824604730
824604946 824604963
824605766 824605783
824609134 824609151
824609289 824609306
824609432 824609449
824610103 824610120
824610551 824610568
824610591 824610608
824611156 824611173
824612220 824612237
824612253 824612270
824613512 824613529
824614670 824614687
824614727 824614744
824616650 824616667
824617749 824617766
824619467 824619484
824623716 824623733
824624016 824624033
824624111 824624128
824630729 824630746
824630750 824630767
824631714 824631731
824634262 824634279
824637009 824637026
824642079 824642096
824643848 824643865
824755199 824755216
824796571 824796588
824802977 824802994
824849360 824849377
824881547 824881564
824889855 824889872
824894115 824894132
824905336 824905353
824929175 824929192
825036097 825036114
825080211 825080228
825081915 825081932
825249036 825249053
825316353 825316370
825321507 825321524
825324954 825324971
825330244 825330261
825331144 825331161
825395601 825395618
825399935 825399952
825461045 825461062
825482165 825482182
825489566 825489583
825505057 825505074
825523327 825523344
825528265 825528282
825530472 825530489
825554417 825554434
825557094 825557111
825558871 825558888
825598289 825598306
825603090 825603107
825608277 825608294
825609454 825609471
825609505 825609522
825613846 825613863
825615194 825615211
825615735 825615752
825615875 825615892
825617686 825617703
825619053 825619070
825622392 825622409
825627180 825627197
825638567 825638584
825640582 825640599
825651545 825651562
825653948 825653965
825657055 825657072
825660446 825660463
825665107 825665124
825668411 825668428
825673720 825673737
825676436 825676453
825677520 825677537
825717688 825717705
825865362 825865379
825865559 825865576
825869692 825869709
825872319 825872336
825875122 825875139
825875488 825875505
825895130 825895147
825895277 825895294
825895512 825895529
825896159 825896176
825896958 825896975
825902731 825902748
825903245 825903262
825904015 825904032
825904039 825904056
825904239 825904256
825905242 825905259
825905514 825905531
825907090 825907107
825907250 825907267
825907343 825907360
825911905 825911922
825919492 825919509
826002264 826002281
826151646 826151663
826199034 826199051
826202810 826202827
826238645 826238662
826260977 826260994
826268808 826268825
826287703 826287720
826350578 826350595
826351092 826351109
826351181 826351198
826351242 826351259
826351422 826351441
826351453 826351470
826424440 826424457
826442382 826442399
826444786 826444803
826446779 826446796
826451448 826451465
826456985 826457002
826467382 826467399
826479551 826479568
826504334 826504351
826504594 826504611
826525247 826525264
826548356 826548373
826596465 826596482
826678719 826678736
826690322 826690339
826690384 826690401
826693175 826693192
826695748 826695765
826829059 826829076
826858907 826858924
826867440 826867457
826868307 826868324
826915527 826915544
827013929 827013946
827018505 827018522
827023834 827023851
827036070 827036087
827037844 827037861
827086544 827086561
827116160 827116177
827147114 827147131
827165443 827165460
827188951 827188968
827200615 827200632
827206932 827206949
827207392 827207409
827210798 827210815
827211895 827211912
827212130 827212147
827214033 827214050
827214353 827214370
827220363 827220380
827220385 827220402
827220925 827220942
827221074 827221091
827221395 827221412
827223140 827223157
827225315 827225332
827225764 827225781
827225817 827225834
827225828 827225845
827225846 827225863
827225853 827225870
827226537 827226554
827309130 827309147
827329507 827329524
827332328 827332345
827337099 827337116
827341221 827341238
827375934 827375951
827385160 827385177
827388088 827388105
827388881 827388898
827398960 827398977
827402018 827402035
827409427 827409444
827435643 827435660
827513090 827513107
827516029 827516046
827542865 827542882
827544604 827544624
827545245 827545262
827545268 827545285
827545309 827545326
827636097 827636114
827644674 827644691
827645663 827645680
827660904 827660921
827661050 827661067
827661202 827661219
827662665 827662682
827663303 827663320
827668175 827668192
827668230 827668247
827668237 827668254
827669080 827669097
827674517 827674534
827710301 827710318
827714894 827714911
827728908 827728925
827798451 827798468
827798795 827798812
827799163 827799180
827803919 827803936
827804015 827804032
827804618 827804635
827804700 827804717
827821300 827821317
827821601 827821618
827827020 827827037
827837184 827837201
827838300 827838317
827916636 827916653
827916856 827916873
827917153 827917170
827917307 827917324
827918321 827918338
827918472 827918489
827918491 827918508
827920636 827920653
827920973 827920990
827921493 827921510
827922146 827922163
827931727 827931744
827931957 827931974
827932051 827932068
827932353 827932370
827932687 827932704
827932871 827932888
827934947 827934964
827936169 827936186
827942567 827942584
827945156 827945173
827946124 827946141
827946723 827946740
827946803 827946820
827946941 827946958
827949104 827949121
827949303 827949320
827949316 827949333
827949609 827949626
827949618 827949635
827950484 827950501
827950558 827950575
827952363 827952380
827953576 827953593
827955089 827955106
827968800 827968817
827978369 827978386
827979279 827979296
827983904 827983921
828003869 828003886
828009439 828009456
828010137 828010154
828024747 828024764
828033125 828033142
828040155 828040172
828046781 828046798
828049468 828049485
828053051 828053068
828053406 828053423
828054829 828054846
828064343 828064360
828064676 828064693
828064699 828064716
828064712 828064729
828064722 828064739
828066712 828066729
828074000 828074017
828077113 828077130
828079931 828079948
828080262 828080279
828082031 828082048
828090478 828090496
828090724 828090741
828091571 828091588
828091649 828091666
828091690 828091707
828091696 828091713
828091867 828091884
828427223 828427240
828433907 828433924
828434578 828434595
828434582 828434599
828434674 828434691
828434686 828434703
828519535 828519552
828519610 828519627
828521564 828521581
828521576 828521593
828521906 828521923
828527520 828527537
828527599 828527616
828528129 828528146
828528185 828528202
828528190 828528207
828528438 828528456
828962695 828962712
828973597 828973614
829037351 829037368
829038263 829038280
829042583 829042600
829056310 829056327
829056359 829056376
829154868 829154885
829168142 829168159
829168160 829168177
829174314 829174331
829233020 829233037
829233368 829233385
829309257 829309274
829310260 829310277
829327927 829327944
829329666 829329683
829337893 829337910
829340705 829340722
829363950 829363967
829364020 829364037
829364059 829364076
829368179 829368196
829368969 829368986
829370186 829370203
829370393 829370410
829371079 829371096
829371451 829371468
829389063 829389080
829393983 829394000
829399329 829399346
829401341 829401358
829415767 829415784
829415782 829415799
829415830 829415847
829415873 829415890
829415889 829415906
829415990 829416007
829416002 829416019
829416147 829416164
829416187 829416204
829416343 829416360
829416354 829416371
829416371 829416388
829416394 829416411
829416423 829416440
829416583 829416603
829416605 829416622
829416661 829416678
829416855 829416872
829416953 829416970
829417034 829417051
829417127 829417144
829417166 829417183
829417260 829417277
829417562 829417579
829417597 829417614
829417709 829417726
829417776 829417793
829418071 829418088
829418112 829418129
829418177 829418194
829418291 829418308
829418509 829418526
829418540 829418557
829418571 829418588
829418688 829418705
829418823 829418840
829419053 829419070
829419210 829419227
829419432 829419449
829419522 829419539
829419875 829419892
829419931 829419948
829420004 829420021
829420165 829420182
829420191 829420208
829420233 829420250
829420269 829420286
829420318 829420335
829420386 829420403
829420723 829420740
829420809 829420826
829421164 829421181
829421230 829421247
829421279 829421296
829421399 829421416
829421455 829421472
829421628 829421645
829421934 829421951
829422275 829422292
829427508 829427525
829427583 829427600
829427667 829427684
829428396 829428413
829428418 829428435
829428821 829428838
829429241 829429258
829429307 829429324
829429415 829429432
829431114 829431131
829431495 829431512
829431588 829431605
829431648 829431665
829431715 829431732
829431782 829431799
829431804 829431821
829431869 829431886
829431997 829432014
829432894 829432911
829433030 829433047
829433037 829433054
829433204 829433221
829433727 829433744
829433872 829433889
829433891 829433908
829433926 829433943
829433932 829433949
829434073 829434090
829434802 829434819
829435041 829435058
829435406 829435423
829436145 829436162
829437256 829437273
829438032 829438049
829438118 829438135
829438970 829438987
829439254 829439271
829439388 829439405
829440528 829440545
829442377 829442394
829442412 829442429
829451359 829451376
829453689 829453706
829458836 829458853
829459281 829459298
829460187 829460204
829461509 829461526
829461957 829461974
829469767 829469784
829477645 829477662
829492865 829492882
829494088 829494105
829494123 829494140
829494134 829494154
829494168 829494185
829494306 829494323
829494984 829495001
829495948 829495965
829496663 829496680
829498949 829498966
829498954 829498971
829499479 829499496
829499806 829499823
829501524 829501541
829534585 829534602
829558863 829558880
829560232 829560249
829560243 829560260
829560321 829560338
829560428 829560445
829560510 829560527
829561167 829561187
829561934 829561951
829562203 829562220
829562308 829562325
829562322 829562339
829563585 829563603
829563591 829563608
829563622 829563640
829565389 829565406
829565489 829565506
829565502 829565519
829565521 829565538
829565534 829565551
829565549 829565566
829565638 829565655
829565657 829565674
829565666 829565683
829565698 829565717
829565744 829565761
829565778 829565795
829565919 829565936
829565926 829565943
829565972 829565989
829566007 829566024
829566057 829566074
829566069 829566086
829566101 829566118
829569048 829569065
829569185 829569202
829569477 829569494
829569572 829569589
829569678 829569695
829570168 829570185
829577103 829577120
829586528 829586545
829586629 829586646
829586682 829586699
829586697 829586715
829586711 829586728
829586728 829586745
829586734 829586754
829586746 829586763
829586906 829586923
829588594 829588611
829588735 829588752
829589186 829589203
829589405 829589425
829589682 829589699
829597662 829597679
829598936 829598953
829599003 829599020
829599015 829599032
829599032 829599049
829599122 829599139
829599772 829599789
829600836 829600853
829600845 829600862
829600905 829600922
829600917 829600934
829600927 829600944
829600952 829600972
829600959 829600976
829601004 829601021
829601008 829601025
829601039 829601056
829601061 829601078
829601079 829601096
829601088 829601105
829601122 829601139
829601136 829601153
829601215 829601232
829601239 829601256
829601255 829601272
829601268 829601287
829601661 829601678
829601986 829602003
829602895 829602912
829602928 829602945
829603509 829603526
829603671 829603688
829603815 829603832
829603900 829603917
829603908 829603925
829603930 829603947
829603995 829604012
829603999 829604016
829604020 829604037
829645272 829645289
829645475 829645492
829646093 829646110
829646118 829646135
829646133 829646150
829646370 829646387
829646715 829646732
829647669 829647686
829647824 829647841
829648366 829648383
829671705 829671722
829672072 829672089
829672147 829672164
829672477 829672494
829672834 829672851
829672842 829672860
829672948 829672965
829673014 829673032
829674608 829674626
829674855 829674872
829674868 829674885
829675082 829675099
829675104 829675121
829675709 829675726
829675817 829675834
829684790 829684807
829685695 829685712
829689484 829689501
829690969 829690986
829691121 829691138
829691309 829691326
829691832 829691849
829691853 829691870
829692733 829692750
829692740 829692757
829692758 829692775
829692794 829692811
829695856 829695873
829702244 829702261
829704375 829704395
829704387 829704404
829704423 829704440
829704479 829704496
829704512 829704529
829705009 829705026
829705024 829705041
829705058 829705075
829705097 829705114
829705310 829705327
829705553 829705572
829705580 829705597
829705663 829705680
829705795 829705812
829706623 829706640
829706652 829706669
829706660 829706677
829706773 829706790
829706831 829706848
829706835 829706852
829706945 829706962
829707111 829707128
829707123 829707140
829707144 829707161
829707161 829707178
829707195 829707212
829707248 829707268
829707281 829707298
829707286 829707303
829707298 829707315
829707307 829707324
829707327 829707345
829707333 829707350
829707345 829707362
829707532 829707549
829707558 829707575
829707564 829707581
829707601 829707618
829707886 829707903
829708178 829708195
829708191 829708208
829708336 829708353
829708583 829708600
829708858 829708875
829708879 829708896
829708965 829708982
829709000 829709017
829709391 829709408
829709453 829709470
829709458 829709475
829709514 829709531
829709609 829709626
829709636 829709653
829709685 829709702
829709780 829709797
829710081 829710098
829711096 829711113
829711180 829711197
829711734 829711751
829711815 829711832
829712051 829712068
829714257 829714274
829714262 829714279
829714333 829714350
829714369 829714386
829714879 829714896
829716289 829716306
829716368 829716385
829716391 829716408
829716480 829716498
829716508 829716525
829716842 829716859
829716860 829716877
829716884 829716901
829718129 829718146
829718141 829718158
829718450 829718469
829718781 829718798
829720822 829720839
829720952 829720969
829772983 829773000
829777323 829777340
829777351 829777368
829777509 829777526
829777525 829777542
829777643 829777660
829777664 829777683
829777677 829777694
829778041 829778058
829778424 829778441
829778439 829778456
829778589 829778606
829778673 829778691
829779030 829779047
829779043 829779060
829779284 829779301
829779499 829779516
829779760 829779777
829780192 829780209
829780203 829780220
829780214 829780231
829780230 829780247
829780238 829780255
829780286 829780306
829780323 829780342
829780382 829780399
829780418 829780435
829780960 829780977
829781036 829781055
829781055 829781072
829781127 829781144
829781133 829781150
829781144 829781161
829781159 829781176
829781164 829781181
829782452 829782469
829782855 829782872
829782948 829782965
829782954 829782973
829782973 829782990
829783090 829783107
829783228 829783245
829783810 829783827
829783953 829783970
829788575 829788592
829788639 829788656
829788670 829788687
829788973 829788992
829789245 829789262
829789731 829789748
829789991 829790008
829790080 829790097
829790881 829790898
829791280 829791297
829791761 829791778
829791774 829791791
829791778 829791795
829792014 829792031
829793025 829793042
829793081 829793098
829793091 829793108
829793686 829793703
829793899 829793916
829794030 829794047
829794945 829794963
829795084 829795102
829800056 829800073
829800137 829800154
829800163 829800181
829800448 829800465
829800454 829800471
829800463 829800480
829802262 829802279
829802292 829802309
829802305 829802322
829802322 829802339
829802712 829802729
829803024 829803041
829803100 829803117
829803184 829803201
829803194 829803211
829803242 829803259
829805823 829805840
829805848 829805865
829805899 829805916
829805918 829805935
829805937 829805954
829806200 829806217
829806205 829806222
829806270 829806287
829806294 829806311
829806298 829806315
829806315 829806332
829806523 829806540
829806541 829806558
829806564 829806581
829807072 829807089
829807088 829807105
829807093 829807110
829807135 829807152
829807186 829807204
829808102 829808119
829809251 829809268
829817782 829817799
829819360 829819377
829819369 829819386
829819799 829819816
829819966 829819983
829820040 829820057
829820187 829820204
829820255 829820272
829820480 829820497
829821854 829821871
829821874 829821891
829822485 829822503
829822657 829822674
829822691 829822708
829822711 829822728
829822771 829822790
829822817 829822834
829822961 829822978
829823036 829823053
829823189 829823206
829823450 829823467
829823479 829823496
829823556 829823573
829823598 829823615
829823633 829823650
829823865 829823882
829824437 829824454
829829192 829829209
829829198 829829215
829829216 829829233
829829315 829829332
829829331 829829348
829829476 829829493
829829494 829829511
829830106 829830123
829830122 829830139
829830713 829830731
829831234 829831251
829831423 829831440
829831678 829831695
829832432 829832450
829832990 829833007
829832997 829833014
829833312 829833329
829833434 829833451
829835047 829835064
829835053 829835070
829835198 829835215
829838500 829838517
829838521 829838538
829838619 829838636
829838686 829838703
829838747 829838764
829839115 829839133
829839157 829839174
829839165 829839182
829839329 829839346
829839335 829839352
829839342 829839359
829839387 829839404
829839409 829839426
829839432 829839449
829839469 829839486
829839495 829839512
829839570 829839587
829840586 829840603
829840938 829840955
829840942 829840962
829841698 829841715
829841709 829841726
829841719 829841736
829841743 829841760
829841787 829841805
829841986 829842003
829842039 829842056
829842048 829842065
829842060 829842077
829842196 829842213
829843296 829843313
829843302 829843319
829843454 829843471
829843594 829843611
829843629 829843646
829843684 829843701
829843742 829843759
829843771 829843789
829844025 829844042
829844087 829844104
829844097 829844114
829844490 829844508
829844791 829844809
829844802 829844819
829845315 829845334
829845683 829845700
829845688 829845705
829845990 829846007
829846011 829846028
829846077 829846094
829846386 829846403
829846817 829846834
829847127 829847144
829847416 829847433
829847666 829847683
829847915 829847932
829847966 829847983
829848011 829848028
829848147 829848164
829848283 829848300
829848289 829848306
829848356 829848373
829848375 829848394
829848486 829848503
829848948 829848965
829849303 829849320
829849333 829849350
829849643 829849660
829850140 829850157
829852583 829852600
829854139 829854156
829854143 829854160
829854317 829854334
829854334 829854351
829854363 829854380
829854370 829854387
829854446 829854463
829854474 829854491
829854557 829854574
829854595 829854612
829854615 829854635
829854622 829854639
829854811 829854828
829855596 829855613
829855660 829855677
829858823 829858840
829860265 829860282
829860286 829860303
829860319 829860336
829860351 829860368
829860987 829861004
829862192 829862209
829862210 829862227
829862223 829862240
829862234 829862260
829862256 829862276
829862282 829862299
829862289 829862307
829862305 829862322
829862315 829862334
829862348 829862365
829862352 829862369
829862376 829862393
829862390 829862407
829862399 829862417
829862430 829862447
829862437 829862454
829864519 829864536
829864524 829864541
829864554 829864571
829864624 829864641
829864720 829864740
829864727 829864744
829864756 829864773
829864768 829864785
829864973 829864990
829865190 829865207
829865233 829865250
829865275 829865292
829871198 829871215
829873337 829873354
829877086 829877103
829878666 829878683
829879179 829879197
829879547 829879564
829879601 829879618
829879608 829879625
829879726 829879743
829879747 829879764
829880243 829880260
829881562 829881579
829884548 829884565
829890044 829890061
829890842 829890859
829891100 829891117
829891138 829891155
829891392 829891409
829891857 829891874
829893752 829893770
829898738 829898755
829899494 829899511
829903284 829903301
829906816 829906833
829907845 829907862
829909400 829909417
829909554 829909571
829915542 829915559
829918590 829918607
829921903 829921920
829922570 829922587
829925363 829925380
829931245 829931262
829932010 829932027
829932481 829932498
829932570 829932587
829932587 829932604
829932616 829932633
829935766 829935783
829935770 829935787
829936430 829936447
829936480 829936497
829937753 829937770
829938485 829938505
829938496 829938513
829938513 829938530
829938903 829938920
829957719 829957736
829957982 829957999
829963004 829963021
829969776 829969793
829973795 829973812
829973816 829973833
829978145 829978162
829986778 829986795
829986962 829986979
829987339 829987356
829987416 829987433
829987434 829987451
829987671 829987688
829987679 829987696
829987778 829987795
829987805 829987822
829987822 829987839
829987864 829987881
829987878 829987895
829987907 829987924
829987958 829987975
829987995 829988012
829988065 829988082
829988136 829988153
829988205 829988222
829989856 829989873
829991930 829991948
829992525 829992542
829992561 829992578
829992617 829992634
829992652 829992669
829992782 829992799
829992804 829992821
829992865 829992882
829992945 829992962
829992962 829992979
829994986 829995003
830038825 830038842
830040016 830040033
830040064 830040081
830042217 830042234
830043437 830043454
830043677 830043694
830044679 830044696
830044739 830044756
830045006 830045023
830045144 830045163
830045160 830045178
830045564 830045581
830045658 830045675
830045663 830045680
830047709 830047726
830052419 830052436
830053699 830053716
830054719 830054736
830054901 830054918
830054921 830054938
830054995 830055012
830055172 830055189
830055305 830055324
830055322 830055339
830055326 830055344
830055420 830055437
830059444 830059461
830061013 830061030
830063770 830063787
830063952 830063969
830064274 830064291
830069332 830069349
830069794 830069811
830070064 830070081
830070337 830070354
830071539 830071556
830071702 830071719
830075260 830075277
830075526 830075543
830079289 830079306
830087586 830087604
830093522 830093539
830093530 830093547
830094101 830094118
830099097 830099114
830100444 830100461
830100461 830100478
830100569 830100586
830101462 830101479
830104113 830104130
830122136 830122154
830122154 830122171
830125378 830125395
830125464 830125481
830125596 830125613
830125672 830125691
830125713 830125730
830125763 830125780
830125835 830125852
830125899 830125916
830125928 830125947
830125951 830125968
830125966 830125983
830125992 830126009
830138220 830138237
830142044 830142061
830142109 830142127
830144602 830144619
830145031 830145048
830146312 830146329
830146418 830146435
830146455 830146472
830146615 830146632
830146622 830146639
830146639 830146656
830146656 830146673
830148137 830148154
830148206 830148223
830152632 830152649
830160689 830160706
830216733 830216750
830219044 830219061
830222859 830222876
830238301 830238318
830238424 830238441
830238584 830238601
830238632 830238649
830238674 830238691
830238689 830238706
830238727 830238744
830238784 830238801
830238811 830238828
830244974 830244995
830245675 830245692
830245683 830245700
830247388 830247405
830247394 830247411
830247445 830247462
830247611 830247628
830247634 830247651
830247669 830247686
830247676 830247693
830248909 830248926
830248938 830248955
830248974 830248992
830254666 830254683
830257000 830257017
830257005 830257022
830257462 830257479
830257512 830257529
830258437 830258454
830258460 830258477
830258480 830258497
830264268 830264285
830264310 830264327
830264337 830264354
830264485 830264502
830264598 830264615
830264614 830264631
830264619 830264637
830265148 830265165
830265379 830265396
830266271 830266288
830268276 830268293
830269800 830269817
830269807 830269824
830270753 830270770
830270814 830270832
830270824 830270841
830270910 830270928
830270924 830270942
830270945 830270962
830270951 830270968
830270969 830270986
830270991 830271012
830271102 830271119
830271143 830271160
830275981 830275998
830276087 830276104
830276098 830276115
830276137 830276154
830276153 830276170
830276180 830276197
830276340 830276357
830277736 830277753
830277887 830277904
830278045 830278062
830278075 830278092
830278117 830278134
830278150 830278167
830278246 830278263
830278292 830278312
830278366 830278383
830278437 830278454
830278503 830278520
830278688 830278706
830278916 830278933
830279127 830279144
830279211 830279228
830279485 830279502
830279512 830279529
830279614 830279631
830279743 830279760
830279751 830279768
830280028 830280046
830280033 830280050
830280091 830280108
830280110 830280130
830280197 830280214
830280210 830280227
830280346 830280363
830280365 830280383
830281772 830281789
830282101 830282118
830282118 830282135
830294992 830295009
830304633 830304650
830308529 830308546
830309982 830309999
830321020 830321037
830321054 830321073
830321083 830321100
830321308 830321325
830321350 830321367
830321712 830321729
830321747 830321764
830321838 830321855
830321872 830321889
830324087 830324104
830324704 830324721
830326280 830326297
830326368 830326385
830326489 830326506
830326693 830326710
830326701 830326724
830326728 830326746
830326737 830326754
830327438 830327455
830334164 830334181
830334219 830334236
830334261 830334281
830334294 830334311
830338595 830338612
830338617 830338634
830358288 830358305
830358396 830358413
830359294 830359311
830360808 830360825
830559750 830559767
830561422 830561439
830564982 830564999
830576874 830576891
830585219 830585236
830597267 830597284
830598749 830598766
830598813 830598830
831176764 831176781
831177493 831177510
831177503 831177520
831178304 831178321
831179803 831179820
831185123 831185140
831185594 831185611
831186858 831186875
831187093 831187110
831187663 831187680
831187733 831187750
831188256 831188273
831188407 831188424
831189120 831189137
831189194 831189212
831189536 831189553
831196000 831196017
831196951 831196968
831197255 831197272
831198159 831198176
831198398 831198416
831198419 831198436
831198424 831198441
831198440 831198459
831199337 831199354
831199657 831199674
831199722 831199739
831200008 831200025
831203963 831203980
831209171 831209188
831209455 831209472
831209461 831209478
831209529 831209546
831281518 831281535
831281541 831281558
831281706 831281723
831283106 831283123
831283111 831283128
831283133 831283150
831283148 831283165
831283241 831283258
831283577 831283594
831283618 831283635
831283624 831283641
831285693 831285710
831288675 831288692
831288896 831288913
831288953 831288970
831289005 831289022
831289526 831289543
831289759 831289776
831289829 831289846
831289846 831289863
831290091 831290109
831290154 831290171
831290170 831290187
831290209 831290226
831290220 831290237
831290231 831290248
831290250 831290269
831290287 831290306
831290326 831290343
831290401 831290418
831290709 831290726
831290779 831290796
831290806 831290823
831294176 831294194
831295355 831295372
831295381 831295398
831295477 831295497
831295486 831295503
831295912 831295929
831295926 831295943
831299416 831299433
831300121 831300138
831300323 831300340
831300357 831300374
831300433 831300450
831300453 831300470
831300502 831300519
831300520 831300537
831300528 831300545
831300564 831300582
831300582 831300599
831300625 831300642
831300635 831300652
831300659 831300676
831300674 831300691
831300679 831300696
831300719 831300736
831300772 831300789
831300802 831300819
831300855 831300872
831300867 831300884
831300883 831300900
831301669 831301688
831301680 831301697
831301686 831301703
831301746 831301763
831301761 831301778
831301898 831301915
831301910 831301927
831301983 831302000
831302005 831302023
831302023 831302040
831302045 831302062
831302065 831302082
831302085 831302103
831302111 831302128
831302158 831302175
831302167 831302184
831302550 831302567
831302572 831302589
831302613 831302630
831302622 831302639
831302685 831302702
831302700 831302718
831302741 831302758
831302756 831302773
831303131 831303148
831303336 831303353
831303358 831303375
831303366 831303383
831303407 831303424
831303433 831303450
831303514 831303531
831303537 831303554
831303548 831303565
831303559 831303576
831303837 831303854
831303841 831303858
831303895 831303912
831303940 831303957
831304039 831304056
831304421 831304438
831304595 831304612
831304623 831304640
831304779 831304796
831305016 831305033
831305125 831305142
831305237 831305254
831305362 831305379
831305408 831305425
831305453 831305470
831305519 831305536
831305528 831305545
831305681 831305698
831305771 831305788
831305801 831305818
831305807 831305824
831305855 831305872
831305877 831305894
831305924 831305941
831305941 831305960
831305992 831306009
831306020 831306040
831306033 831306050
831306049 831306066
831306066 831306083
831306083 831306100
831306091 831306108
831306101 831306118
831306105 831306122
831306141 831306158
831306183 831306200
831306198 831306215
831306251 831306268
831306273 831306290
831306325 831306342
831306434 831306451
831306445 831306462
831306497 831306514
831306505 831306522
831321643 831321660
831321647 831321664
831321721 831321738
831321781 831321798
831321788 831321805
831321944 831321961
831322407 831322424
831327381 831327398
831328452 831328469
831339466 831339483
831339610 831339627
831339729 831339749
831339756 831339773
831339779 831339796
831339880 831339897
831339932 831339949
831340026 831340043
831340058 831340075
831340072 831340089
831340080 831340097
831340095 831340114
831340141 831340158
831340157 831340174
831340470 831340487
831340525 831340542
831340567 831340584
831340588 831340605
831340608 831340625
831340863 831340880
831341576 831341593
831343191 831343208
831343462 831343479
831343790 831343807
831343856 831343873
831345472 831345489
831346672 831346689
831347076 831347093
831347495 831347512
831347517 831347534
831347621 831347638
831347681 831347698
831352487 831352504
831353398 831353415
831353447 831353464
831353673 831353690
831354029 831354046
831354257 831354274
831354606 831354623
831354698 831354715
831355254 831355271
