%!PS-Adobe-3.0 EPSF-3.0
%%Creator: MATLAB, The Mathworks, Inc. Version 7.4.0.336 (R2007a). Operating System: Linux 2.6.17-1.2143_FC4smp #1 SMP Sat Jul 15 16:21:47 EDT 2006 i686.
%%Title: ./S5_SNRhisto.eps
%%CreationDate: 03/11/2009  14:10:42
%%DocumentNeededFonts: Helvetica-Bold
%%+ Helvetica
%%DocumentProcessColors: Cyan Magenta Yellow Black
%%LanguageLevel: 2
%%Pages: 1
%%BoundingBox:    24   187   548   613
%%EndComments

%%BeginProlog
% MathWorks dictionary
/MathWorks 160 dict begin
% definition operators
/bdef {bind def} bind def
/ldef {load def} bind def
/xdef {exch def} bdef
/xstore {exch store} bdef
% operator abbreviations
/c  /clip ldef
/cc /concat ldef
/cp /closepath ldef
/gr /grestore ldef
/gs /gsave ldef
/mt /moveto ldef
/np /newpath ldef
/cm /currentmatrix ldef
/sm /setmatrix ldef
/rm /rmoveto ldef
/rl /rlineto ldef
/s {show newpath} bdef
/sc {setcmykcolor} bdef
/sr /setrgbcolor ldef
/sg /setgray ldef
/w /setlinewidth ldef
/j /setlinejoin ldef
/cap /setlinecap ldef
/rc {rectclip} bdef
/rf {rectfill} bdef
% page state control
/pgsv () def
/bpage {/pgsv save def} bdef
/epage {pgsv restore} bdef
/bplot /gsave ldef
/eplot {stroke grestore} bdef
% orientation switch
/portraitMode 0 def /landscapeMode 1 def /rotateMode 2 def
% coordinate system mappings
/dpi2point 0 def
% font control
/FontSize 0 def
/FMS {/FontSize xstore findfont [FontSize 0 0 FontSize neg 0 0]
  makefont setfont} bdef
/reencode {exch dup where {pop load} {pop StandardEncoding} ifelse
  exch dup 3 1 roll findfont dup length dict begin
  { 1 index /FID ne {def}{pop pop} ifelse } forall
  /Encoding exch def currentdict end definefont pop} bdef
/isroman {findfont /CharStrings get /Agrave known} bdef
/FMSR {3 1 roll 1 index dup isroman {reencode} {pop pop} ifelse
  exch FMS} bdef
/csm {1 dpi2point div -1 dpi2point div scale neg translate
 dup landscapeMode eq {pop -90 rotate}
  {rotateMode eq {90 rotate} if} ifelse} bdef
% line types: solid, dotted, dashed, dotdash
/SO { [] 0 setdash } bdef
/DO { [.5 dpi2point mul 4 dpi2point mul] 0 setdash } bdef
/DA { [6 dpi2point mul] 0 setdash } bdef
/DD { [.5 dpi2point mul 4 dpi2point mul 6 dpi2point mul 4
  dpi2point mul] 0 setdash } bdef
% macros for lines and objects
/L {lineto stroke} bdef
/MP {3 1 roll moveto 1 sub {rlineto} repeat} bdef
/AP {{rlineto} repeat} bdef
/PDlw -1 def
/W {/PDlw currentlinewidth def setlinewidth} def
/PP {closepath eofill} bdef
/DP {closepath stroke} bdef
/MR {4 -2 roll moveto dup  0 exch rlineto exch 0 rlineto
  neg 0 exch rlineto closepath} bdef
/FR {MR stroke} bdef
/PR {MR fill} bdef
/L1i {{currentfile picstr readhexstring pop} image} bdef
/tMatrix matrix def
/MakeOval {newpath tMatrix currentmatrix pop translate scale
0 0 1 0 360 arc tMatrix setmatrix} bdef
/FO {MakeOval stroke} bdef
/PO {MakeOval fill} bdef
/PD {currentlinewidth 2 div 0 360 arc fill
   PDlw -1 eq not {PDlw w /PDlw -1 def} if} def
/FA {newpath tMatrix currentmatrix pop translate scale
  0 0 1 5 -2 roll arc tMatrix setmatrix stroke} bdef
/PA {newpath tMatrix currentmatrix pop	translate 0 0 moveto scale
  0 0 1 5 -2 roll arc closepath tMatrix setmatrix fill} bdef
/FAn {newpath tMatrix currentmatrix pop translate scale
  0 0 1 5 -2 roll arcn tMatrix setmatrix stroke} bdef
/PAn {newpath tMatrix currentmatrix pop translate 0 0 moveto scale
  0 0 1 5 -2 roll arcn closepath tMatrix setmatrix fill} bdef
/vradius 0 def /hradius 0 def /lry 0 def
/lrx 0 def /uly 0 def /ulx 0 def /rad 0 def
/MRR {/vradius xdef /hradius xdef /lry xdef /lrx xdef /uly xdef
  /ulx xdef newpath tMatrix currentmatrix pop ulx hradius add uly
  vradius add translate hradius vradius scale 0 0 1 180 270 arc 
  tMatrix setmatrix lrx hradius sub uly vradius add translate
  hradius vradius scale 0 0 1 270 360 arc tMatrix setmatrix
  lrx hradius sub lry vradius sub translate hradius vradius scale
  0 0 1 0 90 arc tMatrix setmatrix ulx hradius add lry vradius sub
  translate hradius vradius scale 0 0 1 90 180 arc tMatrix setmatrix
  closepath} bdef
/FRR {MRR stroke } bdef
/PRR {MRR fill } bdef
/MlrRR {/lry xdef /lrx xdef /uly xdef /ulx xdef /rad lry uly sub 2 div def
  newpath tMatrix currentmatrix pop ulx rad add uly rad add translate
  rad rad scale 0 0 1 90 270 arc tMatrix setmatrix lrx rad sub lry rad
  sub translate rad rad scale 0 0 1 270 90 arc tMatrix setmatrix
  closepath} bdef
/FlrRR {MlrRR stroke } bdef
/PlrRR {MlrRR fill } bdef
/MtbRR {/lry xdef /lrx xdef /uly xdef /ulx xdef /rad lrx ulx sub 2 div def
  newpath tMatrix currentmatrix pop ulx rad add uly rad add translate
  rad rad scale 0 0 1 180 360 arc tMatrix setmatrix lrx rad sub lry rad
  sub translate rad rad scale 0 0 1 0 180 arc tMatrix setmatrix
  closepath} bdef
/FtbRR {MtbRR stroke } bdef
/PtbRR {MtbRR fill } bdef
/stri 6 array def /dtri 6 array def
/smat 6 array def /dmat 6 array def
/tmat1 6 array def /tmat2 6 array def /dif 3 array def
/asub {/ind2 exch def /ind1 exch def dup dup
  ind1 get exch ind2 get sub exch } bdef
/tri_to_matrix {
  2 0 asub 3 1 asub 4 0 asub 5 1 asub
  dup 0 get exch 1 get 7 -1 roll astore } bdef
/compute_transform {
  dmat dtri tri_to_matrix tmat1 invertmatrix 
  smat stri tri_to_matrix tmat2 concatmatrix } bdef
/ds {stri astore pop} bdef
/dt {dtri astore pop} bdef
/db {2 copy /cols xdef /rows xdef mul dup 3 mul string
  currentfile 
  3 index 0 eq {/ASCIIHexDecode filter}
  {/ASCII85Decode filter 3 index 2 eq {/RunLengthDecode filter} if }
  ifelse exch readstring pop
  dup 0 3 index getinterval /rbmap xdef
  dup 2 index dup getinterval /gbmap xdef
  1 index dup 2 mul exch getinterval /bbmap xdef pop pop}bdef
/it {gs np dtri aload pop moveto lineto lineto cp c
  cols rows 8 compute_transform 
  rbmap gbmap bbmap true 3 colorimage gr}bdef
/il {newpath moveto lineto stroke}bdef
currentdict end def
%%EndProlog

%%BeginSetup
MathWorks begin

0 cap

end
%%EndSetup

%%Page: 1 1
%%BeginPageSetup
%%PageBoundingBox:    24   187   548   613
MathWorks begin
bpage
%%EndPageSetup

%%BeginObject: obj1
bplot

/dpi2point 12 def
portraitMode 0216 7344 csm

   80   -23  6282  5123 rc
86 dict begin %Colortable dictionary
/c0 { 0.000000 0.000000 0.000000 sr} bdef
/c1 { 1.000000 1.000000 1.000000 sr} bdef
/c2 { 0.900000 0.000000 0.000000 sr} bdef
/c3 { 0.000000 0.820000 0.000000 sr} bdef
/c4 { 0.000000 0.000000 0.800000 sr} bdef
/c5 { 0.910000 0.820000 0.320000 sr} bdef
/c6 { 1.000000 0.260000 0.820000 sr} bdef
/c7 { 0.000000 0.820000 0.820000 sr} bdef
c0
1 j
1 sg
   0    0 6916 5190 rf
24 w
0 4229 5359 0 0 -4229 899 4618 4 MP
PP
-5359 0 0 4229 5359 0 0 -4229 899 4618 5 MP stroke
16 w
DA
0 sg
 899 4618 mt  899  389 L
 899  389 mt  899  389 L
3578 4618 mt 3578  389 L
3578  389 mt 3578  389 L
6258 4618 mt 6258  389 L
6258  389 mt 6258  389 L
 899 4618 mt 6258 4618 L
6258 4618 mt 6258 4618 L
 899 4136 mt 6258 4136 L
6258 4136 mt 6258 4136 L
 899 3655 mt 6258 3655 L
6258 3655 mt 6258 3655 L
 899 3173 mt 6258 3173 L
6258 3173 mt 6258 3173 L
 899 2692 mt 6258 2692 L
6258 2692 mt 6258 2692 L
 899 2210 mt 6258 2210 L
6258 2210 mt 6258 2210 L
 899 1729 mt 6258 1729 L
6258 1729 mt 6258 1729 L
 899 1248 mt 6258 1248 L
6258 1248 mt 6258 1248 L
 899  766 mt 6258  766 L
6258  766 mt 6258  766 L
SO
24 w
 899 4618 mt 6258 4618 L
 899  389 mt 6258  389 L
 899 4618 mt  899  389 L
6258 4618 mt 6258  389 L
 899 4618 mt 6258 4618 L
 899 4618 mt  899  389 L
 899 4618 mt  899 4564 L
 899  389 mt  899  442 L
%%IncludeResource: font Helvetica-Bold
/Helvetica-Bold /ISOLatin1Encoding 192 FMSR

 734 4836 mt 
(-5) s
3578 4618 mt 3578 4564 L
3578  389 mt 3578  442 L
3525 4836 mt 
(0) s
6258 4618 mt 6258 4564 L
6258  389 mt 6258  442 L
6205 4836 mt 
(5) s
 899 4618 mt  952 4618 L
6258 4618 mt 6204 4618 L
 758 4691 mt 
(0) s
 899 4136 mt  952 4136 L
6258 4136 mt 6204 4136 L
 437 4209 mt 
(1000) s
 899 3655 mt  952 3655 L
6258 3655 mt 6204 3655 L
 437 3728 mt 
(2000) s
 899 3173 mt  952 3173 L
6258 3173 mt 6204 3173 L
 437 3246 mt 
(3000) s
 899 2692 mt  952 2692 L
6258 2692 mt 6204 2692 L
 437 2765 mt 
(4000) s
 899 2210 mt  952 2210 L
6258 2210 mt 6204 2210 L
 437 2283 mt 
(5000) s
 899 1729 mt  952 1729 L
6258 1729 mt 6204 1729 L
 437 1802 mt 
(6000) s
 899 1248 mt  952 1248 L
6258 1248 mt 6204 1248 L
 437 1321 mt 
(7000) s
 899  766 mt  952  766 L
6258  766 mt 6204  766 L
 437  839 mt 
(8000) s
 899 4618 mt 6258 4618 L
 899  389 mt 6258  389 L
 899 4618 mt  899  389 L
6258 4618 mt 6258  389 L
gs 899 389 5360 4230 rc
/c8 { 0.000000 0.000000 0.562500 sr} bdef
c8
0 0 215 0 0 0 791 4618 4 MP
PP
6 w
0 sg
-215 0 0 0 215 0 0 0 791 4618 5 MP stroke
c8
0 0 215 0 0 0 1059 4618 4 MP
PP
0 sg
-215 0 0 0 215 0 0 0 1059 4618 5 MP stroke
c8
0 0 215 0 0 0 1327 4618 4 MP
PP
0 sg
-215 0 0 0 215 0 0 0 1327 4618 5 MP stroke
c8
0 0 215 0 0 0 1595 4618 4 MP
PP
0 sg
-215 0 0 0 215 0 0 0 1595 4618 5 MP stroke
c8
0 115 214 0 0 -115 1863 4618 4 MP
PP
0 sg
-214 0 0 115 214 0 0 -115 1863 4618 5 MP stroke
c8
0 410 214 0 0 -410 2131 4618 4 MP
PP
0 sg
-214 0 0 410 214 0 0 -410 2131 4618 5 MP stroke
c8
0 867 214 0 0 -867 2399 4618 4 MP
PP
0 sg
-214 0 0 867 214 0 0 -867 2399 4618 5 MP stroke
c8
0 1670 214 0 0 -1670 2667 4618 4 MP
PP
0 sg
-214 0 0 1670 214 0 0 -1670 2667 4618 5 MP stroke
c8
0 2855 214 0 0 -2855 2935 4618 4 MP
PP
0 sg
-214 0 0 2855 214 0 0 -2855 2935 4618 5 MP stroke
c8
0 3193 214 0 0 -3193 3203 4618 4 MP
PP
0 sg
-214 0 0 3193 214 0 0 -3193 3203 4618 5 MP stroke
c8
0 3254 214 0 0 -3254 3471 4618 4 MP
PP
0 sg
-214 0 0 3254 214 0 0 -3254 3471 4618 5 MP stroke
c8
0 2780 214 0 0 -2780 3739 4618 4 MP
PP
0 sg
-214 0 0 2780 214 0 0 -2780 3739 4618 5 MP stroke
c8
0 2060 214 0 0 -2060 4007 4618 4 MP
PP
0 sg
-214 0 0 2060 214 0 0 -2060 4007 4618 5 MP stroke
c8
0 1345 214 0 0 -1345 4275 4618 4 MP
PP
0 sg
-214 0 0 1345 214 0 0 -1345 4275 4618 5 MP stroke
c8
0 857 214 0 0 -857 4543 4618 4 MP
PP
0 sg
-214 0 0 857 214 0 0 -857 4543 4618 5 MP stroke
c8
0 398 214 0 0 -398 4811 4618 4 MP
PP
0 sg
-214 0 0 398 214 0 0 -398 4811 4618 5 MP stroke
c8
0 61 214 0 0 -61 5079 4618 4 MP
PP
0 sg
-214 0 0 61 214 0 0 -61 5079 4618 5 MP stroke
c8
0 0 215 0 0 0 5346 4618 4 MP
PP
0 sg
-215 0 0 0 215 0 0 0 5346 4618 5 MP stroke
c8
0 0 215 0 0 0 5614 4618 4 MP
PP
0 sg
-215 0 0 0 215 0 0 0 5614 4618 5 MP stroke
c8
0 0 215 0 0 0 5882 4618 4 MP
PP
0 sg
-215 0 0 0 215 0 0 0 5882 4618 5 MP stroke
c8
0 0 215 0 0 0 6150 4618 4 MP
PP
0 sg
-215 0 0 0 215 0 0 0 6150 4618 5 MP stroke
24 w
5359 0 899 4618 2 MP stroke
/c9 { 1.000000 0.000000 0.000000 sr} bdef
c9
27 0 27 0 27 0 27 0 26 0 27 0 27 0 27 0 
27 0 26 0 27 0 27 0 27 0 27 0 26 0 27 0 
27 0 27 0 27 1 26 0 27 0 27 0 27 1 27 0 
26 1 27 1 27 1 27 1 27 1 26 1 27 2 27 2 
27 2 27 3 26 3 27 3 27 4 27 5 27 6 26 6 
27 7 27 8 27 9 26 11 27 11 27 14 27 14 27 17 
26 19 27 21 27 23 27 25 27 28 26 31 27 34 27 38 
27 40 27 45 26 48 27 52 27 56 27 60 27 64 26 69 
27 73 27 78 27 82 27 86 26 91 27 95 27 99 27 102 
27 107 26 110 27 112 27 115 27 118 27 119 26 120 27 121 
27 120 27 120 26 119 27 117 27 114 27 111 27 107 26 103 
27 97 27 91 27 84 27 78 26 69 27 62 27 52 27 44 
27 34 26 25 27 15 27 5 27 -5 27 -15 26 -25 27 -34 
27 -44 27 -52 27 -62 26 -69 27 -78 27 -84 27 -91 27 -97 
26 -103 27 -107 27 -111 27 -114 27 -117 26 -119 27 -120 27 -120 
27 -121 26 -120 27 -119 27 -118 27 -115 27 -112 26 -110 27 -107 
27 -102 27 -99 27 -95 26 -91 27 -86 27 -82 27 -78 27 -73 
26 -69 27 -64 27 -60 27 -56 27 -52 26 -48 27 -45 27 -40 
27 -38 27 -34 26 -31 27 -28 27 -25 27 -23 27 -21 26 -19 
27 -17 27 -14 27 -14 27 -11 26 -11 27 -9 27 -8 27 -7 
26 -6 27 -6 27 -5 27 -4 27 -3 26 -3 27 -3 27 -2 
27 -2 27 -2 26 -1 27 -1 27 -1 27 -1 27 -1 26 -1 
27 0 27 -1 27 0 27 0 26 0 27 -1 27 0 27 0 
27 0 26 0 27 0 27 0 27 0 27 0 26 0 27 0 
27 0 27 0 27 0 26 0 27 0 27 0 27 0 26 0 
899 4617 201 MP stroke
/c10 { 0.000000 1.000000 0.000000 sr} bdef
c10
27 0 27 0 27 0 27 0 26 0 27 0 27 0 27 0 
27 1 26 0 27 0 27 0 27 1 27 0 26 1 27 0 
27 1 27 0 27 1 26 1 27 1 27 2 27 1 27 2 
26 2 27 2 27 2 27 3 27 3 26 4 27 4 27 4 
27 5 27 6 26 6 27 7 27 8 27 9 27 10 26 10 
27 12 27 13 27 15 26 16 27 17 27 19 27 20 27 23 
26 24 27 26 27 29 27 30 27 33 26 36 27 38 27 40 
27 43 27 46 26 48 27 52 27 54 27 57 27 60 26 63 
27 66 27 68 27 71 27 74 26 76 27 79 27 81 27 83 
27 85 26 86 27 88 27 88 27 90 27 90 26 90 27 91 
27 89 27 89 26 88 27 86 27 84 27 81 27 79 26 76 
27 72 27 69 27 64 27 60 26 54 27 50 27 44 27 39 
27 33 26 26 27 21 27 14 27 8 27 1 26 -5 27 -12 
27 -17 27 -24 27 -31 26 -36 27 -42 27 -47 27 -53 27 -57 
26 -63 27 -66 27 -71 27 -74 27 -78 26 -80 27 -84 27 -85 
27 -87 26 -88 27 -89 27 -90 27 -91 27 -90 26 -90 27 -89 
27 -88 27 -87 27 -86 26 -83 27 -82 27 -80 27 -77 27 -75 
26 -72 27 -70 27 -67 27 -64 27 -61 26 -58 27 -56 27 -52 
27 -50 27 -47 26 -44 27 -42 27 -39 27 -36 27 -34 26 -32 
27 -29 27 -27 27 -25 27 -23 26 -22 27 -19 27 -18 27 -17 
26 -15 27 -13 27 -13 27 -11 27 -10 26 -9 27 -8 27 -8 
27 -7 27 -5 26 -6 27 -5 27 -4 27 -3 27 -4 26 -3 
27 -2 27 -3 27 -2 27 -1 26 -2 27 -1 27 -1 27 -1 
27 -1 26 -1 27 -1 27 0 27 -1 27 0 26 -1 27 0 
27 0 27 0 27 0 26 -1 27 0 27 0 27 0 26 0 
899 4617 201 MP stroke
DD
c9
3 -6 268 -1172 268 -1256 268 -915 268 -506 268 -229 268 -91 268 -34 
268 -13 267 -4 899 4615 11 MP stroke
268 5 268 13 268 34 268 91 268 229 268 506 268 915 268 1256 
268 1172 3 6 3843 389 11 MP stroke
261 228 268 584 268 944 268 960 268 415 268 -415 268 -960 268 -944 
268 -584 261 -228 2245 4619 11 MP stroke
gr

c9
DD
0 sg
3374 5032 mt 
(SNR) s
 339 3466 mt  -90 rotate
(area in the sky \(deg) s
90 rotate
%%IncludeResource: font Helvetica-Bold
/Helvetica-Bold /ISOLatin1Encoding 144 FMSR

 243 1674 mt  -90 rotate
(2) s
90 rotate
%%IncludeResource: font Helvetica-Bold
/Helvetica-Bold /ISOLatin1Encoding 192 FMSR

 339 1594 mt  -90 rotate
(\)) s
90 rotate
3076  234 mt 
(sigma map) s
SO

end %%Color Dict

eplot
%%EndObject

epage
end

showpage

%%Trailer
%%EOF
