847644854 847644871
847651127 847651144
847654570 847654587
847654914 847654931
847658566 847658583
847659746 847659763
847725350 847725367
847827107 847827124
847881994 847882011
847985212 847985229
847998008 847998025
847998119 847998136
848007189 848007206
848011273 848011290
848091446 848091463
848139104 848139121
848229728 848229745
848251103 848251120
848252421 848252438
848336760 848336777
848337151 848337168
848345294 848345311
848345319 848345337
848387594 848387611
848387787 848387804
848594192 848594209
848812603 848812620
848823118 848823135
849018042 849018059
849465591 849465608
849898137 849898154
849904456 849904473
849918587 849918604
850099089 850099106
850104259 850104276
850165881 850165898
850437870 850437887
850735610 850735627
850738802 850738819
850738933 850738950
850748389 850748406
850751886 850751903
850915509 850915526
851280652 851280669
851291738 851291755
851295649 851295666
851825074 851825091
851924665 851924682
852064714 852064731
853349305 853349322
853497019 853497036
853518599 853518616
853668649 853668666
854245632 854245649
855152160 855152177
856393215 856393232
856498240 856498257
856548202 856548219
856562375 856562392
856822398 856822415
856845781 856845798
857678225 857678242
857729558 857729575
857735179 857735196
857746748 857746765
857746914 857746931
858369133 858369150
858372388 858372405
858373318 858373335
858436196 858436213
858541506 858541523
858849811 858849828
859102733 859102750
859215234 859215251
859252353 859252370
859317298 859317315
859759387 859759404
859821856 859821873
859926072 859926089
859926200 859926217
860071413 860071430
860340947 860340964
860359114 860359131
860367292 860367309
860968204 860968221
861035831 861035848
861035853 861035870
861708058 861708075
862002603 862002620
862018803 862018820
