817018545 817018562
817138130 817138147
817978563 817978580
818459628 818459645
820364405 820364422
820368430 820368447
821168261 821168278
823012275 823012292
826273980 826273997
828169965 828169982
828173175 828173192
828706377 828706394
828854048 828854065
828906209 828906226
828994902 828994919
829030172 829030189
829035109 829035126
829035930 829035947
829035949 829035966
829035968 829035985
829048906 829048923
829354887 829354904
829360996 829361013
829361062 829361079
829361186 829361203
829361372 829361389
829361508 829361525
829406046 829406064
829463731 829463748
829717210 829717227
829720965 829720982
829912714 829912731
829914069 829914086
829981181 829981198
830033958 830033975
830042346 830042363
830057311 830057328
830057470 830057487
830057517 830057534
830084077 830084094
830102970 830102987
830146294 830146311
830163700 830163717
830163853 830163870
830191125 830191142
830197804 830197821
830295620 830295637
830326645 830326662
830326827 830326844
830328658 830328675
830330256 830330273
830331289 830331306
830335915 830335932
830338188 830338205
830338501 830338518
830404314 830404331
830410407 830410424
830455050 830455067
830532001 830532018
830536126 830536143
830576835 830576852
830606541 830606558
830607518 830607535
830762926 830762943
830776106 830776123
830800503 830800520
830803492 830803509
830909991 830910008
830917345 830917362
830935607 830935624
830954369 830954386
830960212 830960229
830965008 830965025
830971314 830971331
831019608 831019625
831063918 831063935
831094479 831094496
831094701 831094718
831164390 831164407
831251641 831251658
831273723 831273740
