862129480 862129497
862133718 862133735
862136175 862136193
862140581 862140598
862213087 862213104
862221997 862222014
862229019 862229036
862231489 862231506
862245824 862245841
862246185 862246202
862246348 862246365
862246426 862246443
862246464 862246481
862246549 862246566
862246857 862246874
862247026 862247043
862247034 862247051
862247058 862247075
862247096 862247113
862247198 862247215
862247245 862247262
862247253 862247270
862247303 862247320
862247342 862247359
862247404 862247421
862247424 862247441
862247435 862247452
862247447 862247464
862247459 862247476
862247481 862247498
862247521 862247538
862247533 862247550
862247556 862247573
862247571 862247588
862247589 862247606
862247606 862247623
862247631 862247648
862247649 862247666
862247653 862247670
862247670 862247687
862247681 862247698
862247690 862247707
862247703 862247720
862247724 862247741
862247738 862247755
862247757 862247774
862247767 862247784
862247782 862247801
862247809 862247826
862247854 862247871
862247890 862247909
862247928 862247945
862247961 862247979
862247979 862247996
862247997 862248014
862248047 862248064
862248057 862248074
862248075 862248092
862248088 862248105
862248106 862248123
862248119 862248138
862248139 862248156
862248144 862248161
862248172 862248189
862248184 862248202
862248194 862248211
862248214 862248234
862248235 862248252
862248257 862248274
862248265 862248282
862248281 862248298
862248307 862248324
862248311 862248328
862248324 862248341
862248328 862248345
862248345 862248362
862248375 862248393
862248389 862248406
862248404 862248421
862248416 862248433
862248437 862248454
862248452 862248469
862248463 862248480
862248486 862248503
862248504 862248521
862248521 862248538
862248536 862248553
862248549 862248566
862248565 862248585
862248588 862248605
862248625 862248642
862248643 862248660
862248664 862248681
862248689 862248706
862248708 862248725
862248733 862248750
862248759 862248776
862248770 862248787
862248778 862248795
862248797 862248814
862249775 862249792
862249792 862249809
862249816 862249833
862249848 862249865
862249982 862249999
862250098 862250115
862250440 862250457
862250906 862250923
862264941 862264958
862265351 862265368
862265424 862265442
862265485 862265502
862265639 862265656
862284687 862284704
862285456 862285473
862286361 862286378
862286499 862286516
862286804 862286821
862287106 862287123
862287188 862287205
862287258 862287275
862287385 862287402
862287400 862287417
862287440 862287457
862287509 862287526
862293874 862293891
862293994 862294011
862294256 862294273
862294365 862294382
862294376 862294393
862294428 862294445
862294922 862294939
862295077 862295094
862295328 862295345
862295590 862295607
862295692 862295709
862296878 862296895
862304453 862304470
862304705 862304722
862306084 862306101
862306786 862306803
862306813 862306830
862306933 862306950
862306995 862307012
862307033 862307050
862307067 862307084
862307082 862307099
862307148 862307165
862307257 862307274
862307363 862307380
862307494 862307511
862307529 862307546
862307559 862307576
862307603 862307620
862307644 862307661
862307684 862307701
862307755 862307772
862307883 862307900
862308005 862308022
862308123 862308140
862308251 862308268
862308453 862308470
862308586 862308603
862308921 862308938
862309433 862309450
862324004 862324021
862324076 862324093
862324099 862324116
862324128 862324145
862324160 862324177
862324168 862324185
862324199 862324216
862324240 862324257
862324272 862324289
862324318 862324335
862324364 862324381
862324377 862324394
862324486 862324503
862324502 862324519
862324614 862324631
862324643 862324660
862324735 862324752
862324899 862324916
862325152 862325169
862325446 862325463
862325750 862325767
862325793 862325810
862325833 862325850
862325912 862325929
862326097 862326114
862326155 862326172
862326572 862326589
862326824 862326841
862326920 862326937
862326996 862327013
862327081 862327098
862327309 862327326
862327387 862327404
862327473 862327490
862327495 862327512
862327575 862327592
862327657 862327674
862327687 862327706
862327761 862327778
862327797 862327814
862327862 862327880
862327922 862327939
862327999 862328016
862328043 862328060
862328077 862328094
862328123 862328140
862328153 862328170
862328168 862328185
862328228 862328245
862328250 862328267
862328286 862328304
862328403 862328420
862328410 862328427
862328478 862328495
862328517 862328534
862328686 862328703
862328696 862328713
862328707 862328724
862328735 862328752
862328764 862328781
862328786 862328804
862328805 862328822
862328844 862328861
862328909 862328926
862328954 862328971
862328975 862328992
862329012 862329029
862329047 862329064
862335038 862335056
862335098 862335115
862335116 862335134
862335144 862335161
862335201 862335218
862335213 862335230
862335235 862335252
862335257 862335274
862335309 862335326
862335324 862335342
862335372 862335390
862335400 862335417
862335442 862335459
862335452 862335469
862335519 862335536
862335534 862335551
862335562 862335579
862335597 862335614
862335626 862335643
862335658 862335675
862335717 862335736
862335733 862335750
862335774 862335791
862335829 862335847
862335900 862335917
862335939 862335956
862335977 862335994
862336009 862336026
862336019 862336036
862336037 862336054
862336092 862336110
862336139 862336156
862336163 862336181
862336201 862336219
862336269 862336288
862336311 862336328
862336376 862336394
862336438 862336455
862336507 862336524
862336593 862336610
862336664 862336681
862336812 862336829
862337157 862337174
862337192 862337209
862337231 862337248
862337629 862337646
862337815 862337832
862339814 862339831
862351290 862351307
862351376 862351393
862357643 862357660
862379137 862379154
862379288 862379305
862527791 862527808
862571610 862571627
862648324 862648341
862650813 862650830
862657569 862657586
862660087 862660104
862713511 862713528
862716650 862716667
862719171 862719188
862721649 862721666
862724107 862724124
862726557 862726574
862728749 862728766
862730893 862730910
862733096 862733113
862737401 862737418
862739614 862739631
862741787 862741804
862743833 862743850
862745974 862745991
862748157 862748174
862750349 862750366
862752811 862752828
862809580 862809597
862812059 862812076
862816426 862816443
862818646 862818664
862823022 862823039
862825214 862825231
862829649 862829666
862834381 862834398
862836909 862836926
862888446 862888463
862891891 862891908
862894679 862894696
862897158 862897175
862904654 862904671
862909295 862909312
862911507 862911524
862913680 862913697
862916129 862916146
862918332 862918349
862920516 862920533
862963906 862963923
862964420 862964437
862965800 862965817
862977098 862977115
862980308 862980326
862983727 862983744
862986186 862986203
862991204 862991221
862993760 862993777
862996179 862996196
862998660 862998677
863001078 863001095
863003262 863003279
863005473 863005490
863007697 863007714
863010205 863010222
863014589 863014606
863065968 863065985
863069098 863069115
863072498 863072515
863075826 863075843
863078393 863078410
863080940 863080957
863083402 863083419
863086008 863086025
863088468 863088485
863090976 863090993
863093446 863093463
863154206 863154223
863157891 863157908
863164716 863164733
863167254 863167271
863170129 863170146
863172547 863172564
863175136 863175153
863177674 863177691
863180172 863180189
863209620 863209637
863209685 863209702
863209964 863209981
863210983 863211000
863211140 863211160
863211180 863211197
863211237 863211254
863211256 863211273
863211294 863211312
863211304 863211321
863232789 863232806
863235209 863235226
863237383 863237400
863239663 863239680
863241837 863241854
863244117 863244134
863246291 863246308
863250846 863250863
863253165 863253182
863255377 863255394
863257639 863257656
863259834 863259851
863262144 863262161
863264396 863264413
863268859 863268876
863271121 863271138
863296326 863296343
863299021 863299038
863299063 863299080
863299159 863299176
863299251 863299268
863299312 863299329
863299789 863299806
863302515 863302532
863303965 863303982
863303979 863303996
863304239 863304256
863304597 863304614
863304699 863304716
863304750 863304767
863304795 863304812
863307703 863307720
863307919 863307936
863308076 863308093
863309422 863309439
863311683 863311700
863313857 863313874
863316178 863316195
863318479 863318496
863320653 863320670
863322814 863322831
863324989 863325006
863327160 863327177
863329324 863329341
863331496 863331513
863333708 863333725
863335893 863335910
863338083 863338100
863340277 863340294
863342489 863342506
863344691 863344708
863351260 863351277
863353481 863353498
863355694 863355711
863357936 863357953
863360257 863360274
863362619 863362636
863365056 863365073
863367763 863367780
863368189 863368206
863369263 863369280
863369300 863369317
863369415 863369432
863369511 863369528
863369536 863369553
863372438 863372455
863372515 863372532
863372627 863372644
863372746 863372763
863373138 863373155
863373314 863373331
863375597 863375614
863378054 863378071
863384049 863384066
863384630 863384647
863384711 863384728
863384857 863384874
863385173 863385190
863385809 863385826
863385950 863385967
863386414 863386431
863386466 863386483
863386502 863386519
863386535 863386552
863386636 863386653
863386743 863386760
863386805 863386822
863386841 863386858
863386925 863386942
863386978 863386995
863388191 863388208
863388232 863388249
863388290 863388307
863388338 863388355
863388543 863388560
863388633 863388650
863388735 863388752
863388843 863388860
863389144 863389161
863389166 863389183
863389265 863389282
863389397 863389414
863389598 863389615
863390166 863390183
863390359 863390376
863390678 863390695
863390851 863390868
863391565 863391582
863393996 863394013
863396376 863396393
863398766 863398783
863401128 863401145
863403487 863403504
863405650 863405667
863407834 863407851
863410015 863410032
863412178 863412195
863414382 863414399
863416554 863416571
863418785 863418802
863420950 863420967
863423252 863423269
863425453 863425470
863427696 863427713
863429926 863429943
863432071 863432088
863434312 863434329
863438778 863438795
863440969 863440986
863443241 863443258
863445433 863445450
863447675 863447692
863452140 863452157
863454352 863454369
863456624 863456641
863458827 863458844
863465769 863465786
863467991 863468008
863470353 863470370
863479389 863479407
863481542 863481559
863483884 863483901
863485937 863485954
863488062 863488079
863490225 863490242
863492317 863492334
863494541 863494558
863496713 863496730
863498887 863498904
863501089 863501106
863503282 863503299
863505414 863505431
863507745 863507762
863510045 863510062
863512386 863512403
863514747 863514764
863517001 863517018
863519292 863519309
863521622 863521639
863523963 863523980
863526332 863526349
863528595 863528612
863530787 863530804
863532980 863532997
863535221 863535238
863537375 863537392
863539628 863539645
863541246 863541263
863541790 863541807
863544042 863544059
863546185 863546202
863548399 863548416
863566382 863566399
863568556 863568573
863570710 863570727
863572832 863572849
863575016 863575033
863577080 863577097
863579212 863579229
863581397 863581414
863583539 863583556
863585682 863585699
863587993 863588010
863590244 863590261
863592506 863592523
863597100 863597117
863599501 863599518
863601880 863601897
863604251 863604268
863606600 863606617
863608862 863608879
863611223 863611240
863613613 863613630
863615805 863615822
863618018 863618035
863620239 863620256
863622531 863622548
863624754 863624771
863627025 863627042
863629189 863629206
863633623 863633640
863635945 863635962
863638227 863638244
863640566 863640583
863645297 863645314
863647934 863647951
863650285 863650302
863652537 863652554
863654740 863654757
863656823 863656840
863658956 863658973
863661069 863661086
863663145 863663162
863665327 863665344
863667391 863667408
863669556 863669573
863671726 863671743
863673841 863673858
863676044 863676061
863678255 863678272
863680527 863680544
863682868 863682885
863685148 863685165
863687530 863687547
863689901 863689918
863692272 863692289
863693216 863693233
863694661 863694678
863697052 863697069
863699422 863699439
863701702 863701719
863703924 863703941
863708400 863708417
863712922 863712939
863715203 863715220
863717475 863717492
863719885 863719902
863722317 863722334
863724844 863724861
863727314 863727331
863729999 863730016
863732448 863732465
863735145 863735162
863737584 863737601
863739935 863739952
863742327 863742344
863744607 863744624
863746781 863746798
863748913 863748930
863751048 863751065
863753169 863753186
863755273 863755290
863757475 863757492
863759579 863759596
863761743 863761760
863763945 863763962
863768331 863768348
863770544 863770561
863772705 863772722
863774957 863774974
863777200 863777217
863781606 863781623
863783846 863783863
863786079 863786096
863788281 863788298
863790523 863790540
863795047 863795064
863797338 863797355
863799747 863799764
863802188 863802205
863804636 863804653
863807106 863807123
863809755 863809772
863824281 863824298
863826890 863826907
863829675 863829692
863831936 863831953
863834110 863834127
863836242 863836259
863838426 863838443
863840580 863840597
863842770 863842787
863844934 863844951
863847047 863847064
863849260 863849277
863851422 863851439
863853636 863853653
863855839 863855856
863858030 863858047
863860263 863860280
863862455 863862472
863864649 863864666
863866869 863866886
863869054 863869071
863871264 863871281
863873486 863873503
863906851 863906868
863911790 863911807
863912112 863912129
863916589 863916606
863918941 863918958
863921281 863921298
863923582 863923599
863925893 863925910
863928125 863928142
863930406 863930423
863936994 863937011
863939197 863939214
863943601 863943618
863945805 863945822
863948008 863948025
863950209 863950226
863952402 863952419
863954586 863954603
863956786 863956803
863958970 863958987
863962821 863962838
863967898 863967915
863970251 863970268
863972994 863973011
863975681 863975698
863981311 863981328
864032362 864032379
864034557 864034574
864036778 864036795
864038991 864039008
864041204 864041221
864045618 864045635
864052424 864052441
864062864 864062881
864072503 864072520
864113381 864113398
864115574 864115591
864117778 864117795
864119958 864119975
864122201 864122218
864124354 864124371
864126577 864126594
864142440 864142457
864153045 864153062
864157026 864157043
864163712 864163729
864201184 864201201
864203397 864203414
864205571 864205588
864207793 864207810
864209976 864209993
864212196 864212213
864214400 864214417
864216593 864216610
864218797 864218814
864221007 864221024
864223270 864223287
864225610 864225627
864228009 864228026
864230480 864230497
864232947 864232964
864235793 864235810
864239151 864239168
864242538 864242555
864248761 864248778
864252188 864252205
864256238 864256255
864259052 864259069
864261631 864261648
864263902 864263919
864266035 864266052
864268346 864268363
864270480 864270497
864272654 864272671
864274795 864274812
864276930 864276947
864279121 864279138
864281256 864281273
864283477 864283494
864287842 864287859
864290055 864290072
864292238 864292255
864294469 864294486
864296662 864296679
864298885 864298902
864301098 864301115
864303279 864303296
864305511 864305528
864307724 864307741
864312199 864312216
864314147 864314164
864314441 864314458
864316850 864316867
864319290 864319307
864321758 864321775
864324475 864324492
864327478 864327495
864330342 864330359
864334223 864334240
864338529 864338546
864341867 864341884
864345028 864345045
864348604 864348621
864350946 864350963
864353413 864353430
864355716 864355733
864358027 864358044
864360179 864360196
864362362 864362379
864364535 864364552
864366688 864366705
864368881 864368898
864373197 864373214
864375380 864375397
864377563 864377580
864379754 864379771
864381947 864381964
864384180 864384198
864386361 864386378
864388584 864388601
864388713 864388730
864390757 864390774
864392950 864392967
864395174 864395191
864397475 864397492
864402313 864402330
864404722 864404739
864407192 864407209
864409937 864409954
864415449 864415466
864418283 864418300
864422195 864422212
864425000 864425017
864428408 864428425
864431125 864431142
864433938 864433955
864436565 864436582
864438946 864438963
864443577 864443594
864445789 864445806
864448100 864448117
864450284 864450301
864452477 864452494
864454681 864454698
864457010 864457027
864459232 864459249
864461575 864461592
864463914 864463931
864466224 864466241
864468467 864468484
864470670 864470687
864472901 864472918
864477316 864477333
864479539 864479556
864484051 864484068
864485636 864485653
864485643 864485660
864502160 864502179
864504156 864504173
864506830 864506847
864511385 864511402
864518066 864518083
864520496 864520513
864523251 864523268
864525493 864525510
864527975 864527992
864530294 864530311
864532743 864532760
864534955 864534972
864537456 864537473
864539756 864539773
864544418 864544435
864546700 864546717
864548932 864548949
864551234 864551251
864553534 864553551
864555993 864556010
864558265 864558282
864562829 864562846
864563045 864563062
864569910 864569927
864572182 864572199
864574643 864574660
864576973 864576990
864579738 864579755
864582188 864582205
864582456 864582473
864583588 864583605
864586109 864586126
864588577 864588594
864598820 864598837
864601220 864601237
864603986 864604003
864606346 864606363
864608807 864608824
864611127 864611144
864613547 864613564
864615779 864615796
864618248 864618265
864620560 864620577
864623057 864623074
864625319 864625336
864627749 864627766
864629971 864629988
864634496 864634513
864636807 864636824
864639039 864639056
864641448 864641465
864643681 864643698
864646022 864646039
864648254 864648271
864652974 864652991
864655475 864655492
864657923 864657940
864661569 864661586
864664373 864664390
864665709 864665726
864666379 864666396
864666432 864666449
864666487 864666504
864666855 864666872
864666926 864666943
864667029 864667046
864667174 864667191
864667387 864667404
864668035 864668052
864668085 864668102
864668148 864668165
864672147 864672164
864672983 864673000
864673342 864673359
864673530 864673547
864673808 864673825
864673958 864673975
864674211 864674228
864674252 864674269
864674479 864674496
864675332 864675349
864675999 864676016
864677555 864677572
864678052 864678069
864678577 864678594
864678834 864678851
864678880 864678897
864679225 864679242
864681213 864681230
864682258 864682275
864682552 864682569
864683653 864683670
864684552 864684569
864684788 864684806
864687209 864687226
864689985 864690002
864692366 864692383
864695159 864695176
864697423 864697440
864699989 864700006
864702241 864702258
864704710 864704727
864706954 864706971
864709431 864709448
864711665 864711682
864713965 864713982
864716186 864716203
864718469 864718486
864720711 864720728
864729877 864729894
864732179 864732196
864734469 864734486
864735679 864735696
864736771 864736788
864739053 864739070
864741443 864741460
864746509 864746526
864748919 864748936
864756099 864756116
864783982 864783999
864784131 864784148
864788881 864788898
864791282 864791299
864793474 864793491
864795835 864795852
864798018 864798035
864800279 864800296
864802472 864802489
864809259 864809276
864811491 864811508
864813810 864813827
864816042 864816059
864818354 864818371
864820605 864820622
864822878 864822895
864825112 864825129
864827431 864827448
864829683 864829700
864832213 864832230
864838316 864838333
864871642 864871659
864874010 864874027
864876667 864876684
864878929 864878946
864881370 864881387
864883632 864883649
864886110 864886127
864890564 864890581
864892776 864892793
864895059 864895076
864897273 864897290
864899563 864899580
864901804 864901821
864904076 864904093
864906328 864906345
864908609 864908626
864910892 864910909
864913419 864913436
864915821 864915838
864919484 864919501
864922261 864922278
864942933 864942950
864944656 864944673
864956522 864956539
864956670 864956687
864959456 864959473
864961698 864961715
864964147 864964164
864966499 864966516
864969046 864969063
864971278 864971295
864976079 864976096
864978557 864978574
864980781 864980798
864983239 864983256
864985542 864985559
864987981 864987998
864990252 864990269
864990346 864990363
864995902 864995919
864996015 864996032
864997444 864997461
864999724 864999741
865002212 865002229
865004573 865004590
865026798 865026815
865026954 865026971
865030155 865030172
865032566 865032583
865035311 865035328
865037731 865037748
865040388 865040405
865042727 865042744
865045179 865045196
865047459 865047476
865049760 865049777
865051972 865051989
865054255 865054272
865056477 865056494
865058767 865058784
865061001 865061018
865063304 865063321
865065613 865065630
865067925 865067942
865070256 865070273
865072556 865072573
865074799 865074816
865077112 865077129
865079373 865079390
865081721 865081738
865083945 865083962
865086393 865086410
865135680 865135697
865135828 865135845
865138642 865138659
865141714 865141731
865144203 865144220
865146525 865146542
865149084 865149101
865153676 865153693
865155878 865155895
865158180 865158197
865160461 865160478
865162773 865162790
865164975 865164992
865174684 865174701
865192732 865192749
865192911 865192928
865193251 865193268
865193317 865193334
865193647 865193664
865193923 865193940
865194074 865194091
865194186 865194203
865194245 865194262
865194424 865194441
865194480 865194497
865194549 865194566
865194679 865194696
865194746 865194763
865194893 865194910
865194959 865194976
865195026 865195043
865195108 865195125
865195184 865195201
865195219 865195236
865195387 865195404
865195441 865195459
865195573 865195590
865196053 865196070
865196961 865196978
865208237 865208254
865208384 865208401
865209060 865209079
865212749 865212766
865223181 865223198
865225650 865225667
865228166 865228183
865230577 865230594
865233263 865233280
865235505 865235522
865240583 865240600
865243349 865243366
865245738 865245755
865248504 865248521
865253768 865253785
865256170 865256187
865325851 865325868
865328329 865328346
865331145 865331162
865333545 865333562
865336330 865336347
865338720 865338737
865341672 865341689
865344450 865344467
865381249 865381266
865381834 865381851
865381840 865381857
865381862 865381879
865381883 865381900
865381912 865381929
865382025 865382042
865382099 865382116
865382228 865382245
865382312 865382330
865382350 865382367
865382395 865382412
865382407 865382424
865382434 865382451
865382453 865382470
865382524 865382541
865382557 865382574
865382673 865382690
865382768 865382785
865383000 865383017
865397270 865397287
865397418 865397435
865400224 865400241
865402623 865402640
865405309 865405326
865407642 865407659
865410110 865410127
865412423 865412440
865414870 865414887
865417191 865417208
865419642 865419659
865421864 865421881
865424342 865424359
865426557 865426574
865429322 865429339
865438696 865438716
865462663 865462680
865463453 865463470
865463869 865463886
865464524 865464541
865464711 865464728
865464766 865464783
865464811 865464828
865464839 865464856
865464859 865464876
865464908 865464925
865465009 865465026
865465058 865465075
865465088 865465105
865465116 865465133
865465128 865465145
865465144 865465161
865465198 865465215
865465221 865465239
865465277 865465294
865465305 865465322
865465417 865465434
865465444 865465461
865465497 865465516
865465541 865465558
865465876 865465893
865465922 865465939
865466163 865466180
865466232 865466249
865466259 865466281
865466280 865466297
865466359 865466376
865466373 865466390
865466401 865466418
865466450 865466467
865466493 865466510
865466552 865466569
865466567 865466584
865466585 865466602
865466639 865466656
865466702 865466719
865466737 865466754
865466834 865466851
865466848 865466865
865466872 865466889
865466988 865467005
865467017 865467034
865467061 865467078
865467157 865467174
865467214 865467231
865467293 865467310
865467331 865467348
865467376 865467393
865467447 865467464
865467458 865467475
865467485 865467502
865467501 865467518
865467621 865467638
865467743 865467760
865467759 865467776
865467858 865467875
865467906 865467923
865467958 865467975
865467975 865467992
865468005 865468022
865468035 865468052
865468150 865468167
865468175 865468192
865468229 865468246
865468278 865468295
865468361 865468379
865468489 865468506
865468512 865468529
865468555 865468572
865468635 865468652
865468664 865468681
865468824 865468841
865468852 865468869
865468890 865468907
865468937 865468954
865468950 865468967
865468963 865468980
865469042 865469062
865469112 865469132
865469122 865469139
865469204 865469221
865469345 865469363
865469461 865469478
865469492 865469509
865469908 865469925
865470178 865470195
865470398 865470415
865470599 865470616
865470947 865470964
865471763 865471780
865471792 865471809
865473684 865473701
865473972 865473989
865474228 865474245
865476148 865476165
865476295 865476312
865479081 865479098
865481500 865481517
865483707 865483724
865483762 865483779
865484051 865484068
865486392 865486409
865486458 865486475
865489176 865489193
865491476 865491493
865493945 865493962
865496187 865496204
865498648 865498665
865500958 865500975
865503398 865503415
865505650 865505667
865508089 865508106
865510304 865510321
865512782 865512799
865515024 865515041
865517590 865517607
865520021 865520038
865537433 865537450
865573939 865573956
865574088 865574105
865576843 865576860
865581722 865581739
865584092 865584109
865586551 865586568
865588912 865588929
865591362 865591379
865593682 865593699
865600776 865600793
865603223 865603240
865631511 865631528
865631545 865631562
865631607 865631624
865631711 865631728
865631774 865631791
865631809 865631826
865631883 865631900
865631948 865631965
865632033 865632050
865632057 865632074
865632482 865632499
865632572 865632589
865632874 865632891
865634847 865634864
865634978 865634995
865635284 865635301
865635461 865635478
865635558 865635575
865635737 865635754
865635798 865635815
865635831 865635848
865635940 865635957
865635967 865635984
865636068 865636085
865636281 865636298
865636318 865636335
865636434 865636451
865636490 865636507
865636597 865636614
865636727 865636744
865636774 865636791
865636837 865636854
865636926 865636943
865636981 865636998
865637001 865637018
865637071 865637088
865637259 865637276
865652816 865652833
865652965 865652982
865655907 865655924
865658307 865658324
865660964 865660981
865663306 865663323
865665873 865665890
865668107 865668124
865670664 865670681
865672861 865672878
865675320 865675337
865677542 865677559
865680003 865680020
865684792 865684809
865733232 865733249
865735919 865735936
865740749 865740766
865743158 865743175
865745518 865745535
865750150 865750167
865752471 865752488
865754813 865754830
865757143 865757160
865761706 865761723
865764027 865764044
865766230 865766247
865768561 865768578
865773104 865773121
865775336 865775353
865777728 865777745
865780165 865780182
865782862 865782879
865812079 865812096
865812172 865812189
865812302 865812319
865812496 865812513
865812656 865812673
865812710 865812727
865812759 865812776
865813126 865813143
865816167 865816184
865816187 865816204
865816319 865816336
865816430 865816447
865816558 865816575
865816605 865816622
865816649 865816666
865816789 865816806
865816917 865816934
865817155 865817172
865817166 865817183
865817252 865817269
865817393 865817410
865817513 865817530
865817549 865817566
865818083 865818100
865818144 865818161
865818532 865818549
865818689 865818706
865821243 865821260
865823831 865823848
865828591 865828608
865830893 865830910
865833213 865833230
865835436 865835453
865839951 865839968
865842141 865842158
865844413 865844430
865846576 865846593
865848750 865848767
865850912 865850929
865853124 865853141
865855319 865855336
865857500 865857517
865859693 865859710
865861925 865861942
865867030 865867047
865870419 865870436
865906686 865906703
865909294 865909311
865911683 865911700
865914045 865914062
865916444 865916461
865918784 865918801
865921126 865921143
865923417 865923434
865925639 865925656
865927951 865927968
865930144 865930161
865932355 865932372
865934548 865934565
865936830 865936847
865939062 865939079
865941275 865941292
865943635 865943652
865956296 865956313
865957737 865957755
865961197 865961214
865962176 865962193
866077829 866077846
866080111 866080128
866082570 866082587
866084860 866084877
866087191 866087208
866089375 866089392
866091706 866091723
866093947 866093964
866096139 866096156
866098263 866098280
866100556 866100573
866102688 866102705
866104882 866104899
866107023 866107040
866109238 866109255
866111369 866111386
866113561 866113578
866115695 866115712
866117880 866117897
866120021 866120038
866122255 866122272
866124594 866124611
866127408 866127425
866130145 866130162
866134274 866134291
866152684 866152701
866168754 866168771
866171105 866171122
866173801 866173818
866176101 866176118
866178481 866178498
866180754 866180771
866183165 866183182
866194246 866194263
866196536 866196553
866198669 866198686
866200862 866200879
866203006 866203023
866205347 866205364
866210414 866210431
866213207 866213224
866219263 866219280
866219374 866219391
866220018 866220035
866220050 866220067
866220144 866220161
866220197 866220214
866220203 866220220
866220222 866220239
866220237 866220254
866220250 866220267
866220342 866220359
866220368 866220386
866220481 866220498
866220505 866220522
866220626 866220643
866220739 866220756
866220802 866220819
866220854 866220871
866220903 866220920
866220917 866220935
866220972 866220989
866220995 866221012
866221015 866221032
866221048 866221065
866221091 866221108
866221114 866221131
866221132 866221149
866221166 866221183
866221206 866221225
866232912 866232929
866232972 866232989
866235560 866235577
866240212 866240229
866243452 866243469
866244445 866244462
866244832 866244849
866244909 866244926
866245105 866245122
866245301 866245318
866247786 866247803
866250099 866250116
866252606 866252623
866254898 866254915
866257367 866257384
866259539 866259556
866261920 866261937
866264210 866264227
866266601 866266618
866271163 866271180
866273446 866273463
866275797 866275814
866277951 866277968
866280310 866280327
866282472 866282489
866284793 866284810
866286957 866286974
866289159 866289176
866296063 866296080
866299660 866299677
866320801 866320818
866321082 866321099
866321095 866321112
866321304 866321321
866321330 866321347
866321372 866321389
866321766 866321783
866321852 866321869
866321999 866322016
866322029 866322046
866322121 866322138
866322231 866322248
866322411 866322428
866322456 866322473
866322505 866322522
866322533 866322550
866322597 866322614
866322624 866322641
866322657 866322674
866322672 866322689
866322706 866322723
866322830 866322848
866322932 866322949
866322950 866322967
866322986 866323003
866323011 866323028
866323041 866323058
866323053 866323070
866323070 866323087
866323084 866323101
866323122 866323139
866323162 866323179
866323236 866323253
866323265 866323282
866323288 866323305
866323383 866323400
866323396 866323413
866323467 866323484
866323486 866323503
866323549 866323566
866323560 866323577
866323582 866323599
866323602 866323619
866323625 866323642
866323641 866323658
866323661 866323678
866323696 866323716
866323730 866323747
866323756 866323773
866323765 866323782
866323780 866323798
866323786 866323803
866323801 866323818
866323806 866323823
866323827 866323846
866323864 866323881
866323887 866323904
866323898 866323915
866323967 866323984
866324019 866324036
866324047 866324064
866324064 866324081
866324085 866324102
866324104 866324121
866324125 866324142
866324146 866324166
866324164 866324181
866324220 866324238
866324246 866324263
866324276 866324293
866324297 866324314
866324311 866324328
866324339 866324356
866324343 866324360
866324369 866324386
866324383 866324400
866324398 866324415
866324463 866324480
866324482 866324499
866324512 866324529
866324528 866324545
866324554 866324571
866324618 866324636
866324875 866324892
866325027 866325045
866325107 866325124
866325152 866325169
866325361 866325378
866325390 866325407
866325449 866325466
866325500 866325517
866325512 866325529
866325553 866325570
866325736 866325753
866325748 866325765
866325843 866325861
866325863 866325880
866325937 866325954
866325952 866325969
866326158 866326175
866326192 866326209
866329227 866329244
866329231 866329248
866329260 866329277
866329280 866329297
866329297 866329314
866329320 866329337
866329335 866329352
866329343 866329360
866329377 866329394
866329389 866329406
866329410 866329428
866329434 866329452
866329446 866329463
866329478 866329495
866329489 866329506
866329531 866329549
866329536 866329553
866329602 866329619
866329622 866329639
866329644 866329661
866329664 866329681
866329699 866329716
866329743 866329760
866329770 866329787
866329780 866329797
866329803 866329821
866329833 866329850
866329847 866329864
866329875 866329892
866329895 866329912
866329926 866329943
866329946 866329963
866329963 866329980
866329971 866329988
866330003 866330020
866330054 866330071
866330074 866330091
866330084 866330101
866330154 866330171
866330163 866330180
866330174 866330191
866330190 866330209
866330241 866330259
866330256 866330273
866330289 866330306
866330359 866330376
866330366 866330383
866330422 866330439
866330490 866330507
866330519 866330537
866330545 866330562
866330616 866330633
866330680 866330697
866330715 866330732
866330730 866330747
866330838 866330855
866330904 866330921
866330930 866330947
866330950 866330968
866330982 866330999
866331007 866331024
866331032 866331049
866331060 866331077
866331079 866331096
866331103 866331120
866331132 866331150
866331144 866331161
866331176 866331193
866331181 866331198
866331191 866331208
866331206 866331223
866331226 866331243
866331242 866331259
866331271 866331288
866331282 866331299
866331304 866331322
866331312 866331329
866331317 866331334
866331365 866331382
866331387 866331404
866331404 866331421
866331410 866331427
866331423 866331440
866331441 866331461
866331498 866331515
866331505 866331522
866331566 866331583
866331589 866331606
866331607 866331624
866331612 866331629
866331632 866331649
866331664 866331681
866331697 866331714
866331711 866331728
866331774 866331791
866331806 866331823
866331839 866331856
866331894 866331911
866331912 866331929
866331942 866331959
866331978 866331995
866331994 866332011
866332024 866332042
866332038 866332055
866332061 866332078
866332069 866332086
866332090 866332107
866332094 866332111
866332182 866332199
866332263 866332280
866332284 866332301
866332331 866332348
866332346 866332363
866332359 866332376
866332390 866332407
866335506 866335523
866335523 866335540
866335633 866335651
866335833 866335850
866335866 866335883
866335992 866336009
866336023 866336040
866336199 866336216
866336273 866336290
866336464 866336481
866336573 866336590
866336878 866336895
866336899 866336916
866337063 866337081
866337301 866337319
866337345 866337362
866337513 866337530
866337671 866337688
866337735 866337752
866337861 866337879
866345065 866345082
866345069 866345086
866345460 866345477
866348363 866348380
866349568 866349585
866349596 866349613
866349638 866349655
866351170 866351187
866353817 866353834
866356049 866356066
866358518 866358535
866363130 866363147
866365352 866365369
866367763 866367780
866369975 866369992
866372149 866372166
866374399 866374416
866376791 866376808
866381510 866381527
866383753 866383770
866388503 866388520
866391635 866391652
866400866 866400883
866433741 866433758
866433897 866433914
866438857 866438874
866441296 866441313
866443518 866443535
866445928 866445945
866448140 866448157
866450412 866450429
866452614 866452631
866454885 866454902
866457090 866457107
866459390 866459407
866461612 866461629
866466226 866466243
866468743 866468760
866470995 866471012
866474197 866474214
866476941 866476958
866515896 866515913
866518238 866518255
866520735 866520752
866522958 866522975
866525403 866525420
866527575 866527592
866529858 866529875
866532049 866532066
866534342 866534359
866536525 866536542
866538865 866538882
866541097 866541114
866543380 866543397
866545671 866545688
866548011 866548028
866550252 866550269
866552545 866552562
866600487 866600504
866600636 866600653
866603422 866603439
866605349 866605367
866605761 866605778
866610552 866610569
866613059 866613076
866615243 866615260
866619846 866619863
866622108 866622125
866624300 866624317
866626561 866626578
866628765 866628782
866631066 866631083
866633308 866633325
866635728 866635745
866637942 866637959
866640488 866640505
866642750 866642767
866664793 866664810
866690860 866690877
866691010 866691027
866694070 866694087
866696480 866696497
866698952 866698969
866701359 866701376
866703840 866703857
866706130 866706147
866709084 866709101
866711366 866711383
866713903 866713920
866716135 866716152
866718626 866718643
866720946 866720963
866723465 866723482
866725101 866725118
866725795 866725812
866731109 866731126
866738380 866738397
866745499 866745516
866745809 866745826
866746046 866746063
866748110 866748127
866749075 866749092
866776326 866776343
866776473 866776490
866779309 866779326
866781582 866781599
866784011 866784028
866786223 866786240
866788861 866788878
866791161 866791178
866793630 866793647
866795782 866795799
866798232 866798249
866800474 866800491
866802985 866803002
866805235 866805252
866807844 866807861
866822841 866822858
866832391 866832408
866833659 866833676
866839316 866839333
866839580 866839597
866839803 866839820
866839932 866839949
866840004 866840021
866840158 866840175
866840450 866840467
866840766 866840783
866840981 866840998
866841050 866841067
866841096 866841113
866841128 866841145
866841202 866841219
866841310 866841328
866843684 866843701
866846768 866846785
866847445 866847462
866847635 866847652
866849701 866849718
866852092 866852109
866852244 866852261
866854847 866854864
866857179 866857196
866859944 866859961
866862176 866862193
866864705 866864722
866866987 866867004
866869494 866869511
866871795 866871812
866874256 866874273
866879065 866879082
866881377 866881394
866883885 866883902
866886208 866886225
866888606 866888623
866890850 866890867
866893377 866893394
866898127 866898144
866900389 866900406
866959522 866959539
866961904 866961921
866964075 866964092
866968729 866968746
866971079 866971096
866973241 866973258
866975573 866975590
866977717 866977734
866979958 866979975
866982111 866982128
866984432 866984449
866996038 866996055
866998150 866998167
867003775 867003792
867051031 867051048
867053173 867053190
867055385 867055402
867057539 867057556
867059771 867059788
867061923 867061940
867064148 867064165
867117699 867117716
867120156 867120173
867122320 867122337
867124631 867124648
867126755 867126772
867129065 867129082
867131209 867131226
867133510 867133527
867135654 867135671
867137895 867137912
867140038 867140055
867142231 867142248
867144404 867144421
867146586 867146603
867148760 867148777
867150991 867151008
867153165 867153182
867155337 867155354
867165742 867165759
867169200 867169217
867176610 867176627
867180308 867180325
867180337 867180354
867180352 867180369
867180368 867180385
867180404 867180421
867180444 867180461
867180469 867180489
867180504 867180521
867180531 867180548
867180561 867180578
867180565 867180582
867180590 867180607
867180620 867180637
867180656 867180673
867180699 867180716
867180723 867180740
867180774 867180791
867180864 867180881
867180917 867180934
867181001 867181018
867181045 867181062
867181061 867181078
867181078 867181095
867181136 867181153
867181146 867181163
867181205 867181225
867181244 867181261
867181260 867181277
867181306 867181323
867181329 867181346
867181365 867181382
867181408 867181425
867181421 867181438
867181461 867181478
867181465 867181482
867181500 867181517
867181557 867181574
867181594 867181611
867181607 867181624
867181643 867181660
867181656 867181673
867181765 867181782
867181842 867181859
867182238 867182255
867182281 867182298
867182301 867182318
867182333 867182350
867182379 867182399
867182405 867182422
867182444 867182461
867182505 867182522
867182554 867182571
867182568 867182585
867182599 867182617
867182636 867182653
867182671 867182688
867182708 867182725
867182762 867182779
867182816 867182833
867182875 867182892
867182939 867182956
867183073 867183090
867183208 867183225
867183271 867183288
867183336 867183353
867183411 867183428
867183699 867183716
867183744 867183761
867184100 867184117
867184340 867184357
867184466 867184483
867184499 867184516
867184571 867184588
867184702 867184719
867184714 867184731
867184840 867184857
867184897 867184914
867185094 867185111
867185218 867185235
867185542 867185559
867185727 867185744
867185811 867185828
867185909 867185926
867186052 867186069
867186181 867186198
867186320 867186337
867187232 867187249
867187289 867187306
867187734 867187751
867189587 867189604
867191393 867191410
867193881 867193898
867196942 867196959
867199255 867199272
867201912 867201929
867204202 867204219
867206572 867206589
867208875 867208892
867211196 867211213
867213378 867213395
867215708 867215725
867217873 867217890
867220065 867220082
867222219 867222236
867224519 867224536
867226662 867226679
867228845 867228862
867231008 867231025
867233220 867233237
867235373 867235390
867237575 867237592
867239738 867239755
867241921 867241938
867244076 867244093
867246437 867246454
867249044 867249061
867254791 867254808
867278229 867278246
867280856 867280873
867283946 867283963
867286302 867286319
867288949 867288966
867291222 867291239
867293689 867293706
867295961 867295978
867298312 867298329
867300476 867300493
867302807 867302824
867304960 867304977
867307280 867307297
867309442 867309459
867311647 867311664
867313828 867313845
867316020 867316037
867318185 867318202
867320397 867320414
867322531 867322548
867324733 867324750
867326886 867326903
867329059 867329076
867331192 867331209
867333661 867333678
867336100 867336117
867344013 867344030
867349242 867349259
867349392 867349409
867349504 867349521
867349594 867349611
867349755 867349772
867349906 867349923
867349949 867349966
867349959 867349976
867350056 867350073
867350094 867350111
867350132 867350149
867350154 867350171
867350169 867350186
867350194 867350211
867350245 867350262
867350274 867350291
867350431 867350448
867350465 867350482
867350496 867350513
867350555 867350572
867350629 867350646
867350664 867350681
867350926 867350943
867350979 867350996
867351006 867351023
867351373 867351390
867351426 867351443
867351494 867351511
867351657 867351674
867351834 867351851
867352018 867352035
867352061 867352078
867352100 867352117
867352151 867352168
867352171 867352188
867352285 867352302
867352402 867352419
867352641 867352658
867352906 867352923
867357202 867357219
867357265 867357282
867357299 867357316
867357358 867357375
867357587 867357604
867357866 867357883
867358636 867358653
867358848 867358865
867359475 867359492
867359552 867359569
867359779 867359796
867359802 867359819
867359850 867359867
867359933 867359950
867359970 867359987
867360191 867360208
867360268 867360285
867360374 867360391
867371804 867371821
867374146 867374163
867375919 867375936
867376643 867376660
867378946 867378963
867381286 867381303
867383450 867383467
867385849 867385866
867387983 867388000
867390303 867390320
867392447 867392464
867394660 867394677
867396811 867396828
867399112 867399129
867401266 867401283
867403439 867403456
867405602 867405619
867407796 867407813
867409927 867409945
867412142 867412159
867414263 867414280
867421246 867421263
867423695 867423712
867454900 867454917
867454987 867455004
867455076 867455093
867455105 867455122
867455137 867455154
867455181 867455198
867455232 867455249
867455257 867455274
867455274 867455292
867455286 867455303
867455307 867455324
867455330 867455347
867455348 867455365
867455356 867455373
867455378 867455395
867455382 867455399
867455410 867455428
867455415 867455432
867455430 867455447
867455460 867455477
867455476 867455494
867455508 867455526
867455536 867455553
867455552 867455569
867455587 867455608
867455606 867455623
867455639 867455657
867455674 867455691
867455693 867455710
867455701 867455718
867455747 867455764
867455782 867455799
867455840 867455857
867455856 867455873
867455905 867455922
867455921 867455938
867456022 867456039
867456054 867456072
867456230 867456247
867456330 867456348
867456393 867456410
867456462 867456479
867456496 867456513
867456516 867456533
867456548 867456565
867456576 867456593
867456591 867456608
867456662 867456679
867456677 867456694
867456683 867456700
867456865 867456882
867456973 867456990
867457020 867457037
867457737 867457754
867460044 867460061
867462334 867462351
867464753 867464770
867467114 867467131
867469464 867469481
867471727 867471744
867474047 867474064
867476239 867476256
867478581 867478598
867480744 867480761
867483055 867483072
867485209 867485226
867496536 867496553
867498671 867498688
867500912 867500929
867503075 867503092
867553821 867553838
867554989 867555006
867555184 867555201
867556051 867556068
867556201 867556218
867558364 867558381
867560706 867560723
867562888 867562905
867565120 867565137
867567283 867567300
867569507 867569524
867571660 867571677
867573911 867573928
867576053 867576070
867578276 867578293
867580429 867580446
867582650 867582667
867584824 867584841
867587077 867587094
867589259 867589276
867591618 867591635
867593930 867593947
867596350 867596367
867598711 867598728
867601436 867601453
867604123 867604140
867610805 867610822
867612116 867612133
867612537 867612554
867612629 867612646
867612820 867612837
867612843 867612860
867612912 867612929
867612966 867612983
867612991 867613008
867613124 867613141
867613136 867613153
867613260 867613277
867613413 867613430
867613433 867613450
867613543 867613560
867613569 867613586
867613637 867613654
867613653 867613670
867613729 867613746
867613742 867613759
867613752 867613769
867613768 867613785
867613798 867613815
867613807 867613824
867613877 867613894
867613916 867613933
867613935 867613952
867613948 867613966
867614016 867614033
867614029 867614046
867614036 867614053
867614051 867614068
867614066 867614083
867614086 867614103
867614104 867614121
867614124 867614141
867614128 867614145
867614135 867614152
867614146 867614163
867614155 867614172
867614171 867614189
867614186 867614203
867614198 867614215
867614205 867614222
867614227 867614244
867614233 867614250
867614242 867614259
867614253 867614270
867614259 867614277
867614268 867614286
867614282 867614299
867614287 867614304
867614303 867614320
867614319 867614338
867614328 867614347
867614344 867614361
867614354 867614371
867614363 867614380
867614390 867614407
867614406 867614423
867614416 867614433
867614422 867614439
867614436 867614453
867614446 867614463
867614452 867614469
867614473 867614490
867614487 867614504
867614499 867614516
867614535 867614552
867614545 867614562
867614574 867614594
867614588 867614605
867614607 867614624
867614622 867614639
867614644 867614661
867614679 867614696
867614686 867614706
867614714 867614731
867614744 867614761
867614800 867614817
867614825 867614842
867614839 867614857
867614854 867614871
867614884 867614901
867614905 867614922
867614940 867614957
867614949 867614966
867614977 867614994
867615018 867615035
867615077 867615094
867615096 867615114
867620885 867620902
867623294 867623311
867625575 867625592
867627936 867627953
867630257 867630274
867632618 867632635
867634781 867634798
867637123 867637140
867639295 867639312
867641644 867641661
867643887 867643904
867646248 867646265
867648432 867648449
867650810 867650827
867653012 867653029
867657665 867657682
867660046 867660063
867662238 867662255
867664589 867664606
867666791 867666808
867669120 867669137
867673635 867673652
867680491 867680508
867683235 867683252
867685951 867685968
867701307 867701324
867703503 867703520
867705684 867705701
867708056 867708073
867710356 867710373
867712796 867712813
867714998 867715015
867717429 867717446
867726504 867726521
867728679 867728696
867730989 867731006
867733151 867733168
867735376 867735393
867737537 867737554
867741883 867741900
867744126 867744143
867746289 867746306
867748511 867748528
867750693 867750710
867752915 867752932
867754210 867754227
867755077 867755094
867757329 867757346
867766328 867766345
867768678 867768695
867771109 867771126
867773487 867773504
867776995 867777012
867779770 867779787
867785636 867785653
867788699 867788716
867798228 867798245
867806555 867806572
867809113 867809130
867811908 867811925
867814239 867814256
867816916 867816933
867819227 867819244
867821675 867821692
867823978 867823995
867826349 867826366
867828531 867828548
867830941 867830958
867833114 867833131
867835552 867835569
867837865 867837882
867840284 867840301
867842457 867842474
867844826 867844843
867847138 867847155
867849559 867849576
867851957 867851974
867855189 867855206
867857846 867857863
867861441 867861458
867865963 867865980
867867300 867867317
867896334 867896351
867898637 867898654
867901144 867901161
867903336 867903353
867905707 867905724
867907869 867907886
867910220 867910237
867912374 867912391
867914725 867914742
867919168 867919185
867921333 867921350
867923653 867923670
867925825 867925842
867928030 867928047
867930171 867930188
867932512 867932529
867934694 867934711
867937085 867937102
867939495 867939512
867942626 867942643
867946033 867946050
867958237 867958254
867958309 867958326
867958372 867958389
867958439 867958456
867958477 867958494
867958580 867958597
867958771 867958788
867958886 867958903
867958890 867958907
867958940 867958957
867959012 867959029
867959056 867959073
867959114 867959131
867959158 867959175
867959202 867959219
867959295 867959312
867959365 867959383
867959427 867959444
867959576 867959593
867959658 867959675
867959697 867959714
867959722 867959739
867959749 867959766
867959773 867959790
867959798 867959815
867959814 867959831
867959825 867959842
867959845 867959862
867959888 867959905
867959924 867959941
867959933 867959950
867959951 867959968
867959961 867959978
867959998 867960016
867960093 867960110
867960168 867960185
867960206 867960223
867960221 867960238
867960250 867960267
867960263 867960281
867960295 867960312
867960333 867960350
867960358 867960375
867960377 867960395
867960394 867960411
867960430 867960447
867960456 867960473
867960482 867960499
867960499 867960516
867960511 867960528
867960523 867960540
867960552 867960569
867960603 867960620
867960634 867960651
867960672 867960689
867960694 867960711
867960720 867960737
867960751 867960768
867960776 867960793
867960823 867960840
867960858 867960875
867960889 867960907
867960917 867960934
867960932 867960949
867960972 867960989
867961013 867961030
867961029 867961046
867961053 867961070
867961155 867961172
867961255 867961272
867961284 867961301
867961320 867961337
867961366 867961383
867961392 867961409
867961526 867961543
867961566 867961583
867961580 867961597
867961602 867961619
867961621 867961638
867961824 867961841
867961901 867961918
867961926 867961943
867962136 867962153
867962302 867962319
867962358 867962375
867962389 867962406
867962508 867962525
867962523 867962540
867962610 867962627
867962659 867962676
867962681 867962698
867962705 867962722
867962725 867962742
867962746 867962763
867962770 867962787
867962811 867962828
867962836 867962853
867962853 867962870
867962873 867962890
867962878 867962895
867962901 867962919
867962916 867962933
867963033 867963050
867963066 867963083
867963101 867963118
867963117 867963134
867963138 867963156
867963167 867963184
867963183 867963200
867963196 867963213
867963214 867963231
867963237 867963254
867963242 867963261
867963269 867963286
867963290 867963307
867963303 867963320
867963335 867963352
867963344 867963361
867963352 867963369
867963357 867963377
867963371 867963388
867963385 867963402
867963404 867963421
867963416 867963433
867963421 867963438
867963425 867963442
867963435 867963452
867963445 867963462
867963449 867963466
867963454 867963471
867963477 867963496
867963483 867963503
867963492 867963509
867969976 867969993
867970071 867970088
867972346 867972363
867976553 867976570
867978973 867978990
867981707 867981724
867984078 867984095
867986468 867986485
867988622 867988639
867991013 867991030
867993215 867993232
867995556 867995573
867997710 867997727
868002212 868002229
868004592 868004609
868006754 868006771
868009067 868009084
868011231 868011248
868013443 868013460
868015596 868015613
868017807 868017824
868019951 868019968
868022322 868022339
868024661 868024678
868028475 868028492
868033068 868033085
868038965 868038982
868039141 868039158
868039330 868039347
868039747 868039764
868039977 868039994
868040278 868040295
868040444 868040461
868041064 868041081
868041695 868041712
868041877 868041894
868042670 868042687
868042988 868043005
868043225 868043242
868043401 868043418
868043681 868043698
868044009 868044026
868044400 868044417
868048091 868048108
868048304 868048321
868050116 868050133
868050222 868050239
868050333 868050350
868050866 868050883
868050928 868050945
868050952 868050969
868050990 868051007
868051005 868051022
868051047 868051064
868051089 868051107
868051148 868051165
868051237 868051254
868051355 868051372
868051871 868051888
868051985 868052003
868052776 868052793
868053522 868053539
868053571 868053588
868053937 868053954
868054145 868054162
868054192 868054209
868054264 868054281
868054344 868054361
868054358 868054375
868054473 868054490
868054588 868054605
868054833 868054850
868054892 868054909
868054936 868054953
868055022 868055039
868055123 868055140
868055159 868055176
868055207 868055224
868055256 868055273
868055311 868055328
868055330 868055347
868055440 868055457
868061483 868061500
868064059 868064076
868066893 868066910
868069236 868069253
868071645 868071662
868073947 868073964
868076298 868076315
868077816 868077833
868078578 868078595
868080950 868080967
868083220 868083237
868085601 868085618
868087903 868087920
868090322 868090339
868092506 868092523
868094746 868094763
868096928 868096945
868099289 868099306
868101473 868101490
868103833 868103850
868110904 868110921
868112851 868112868
868112861 868112878
868145219 868145236
868145827 868145844
868147392 868147409
868147430 868147447
868147516 868147533
868147587 868147604
868147685 868147702
868165179 868165196
868165328 868165345
868168182 868168199
868170612 868170629
868173415 868173432
868175796 868175813
868178317 868178334
868180627 868180644
868183125 868183142
868185387 868185404
868187865 868187882
868190138 868190155
868192805 868192822
868195284 868195301
868228648 868228665
868244467 868244484
868259503 868259520
868261943 868261960
868264719 868264736
868267108 868267125
868269826 868269843
868272207 868272224
868274990 868275007
868277391 868277408
868299488 868299505
868302793 868302810
868302934 868302951
868302998 868303015
868303080 868303097
868303480 868303497
868303538 868303555
868303637 868303654
868303656 868303673
868303728 868303745
868304187 868304204
868304306 868304323
868304335 868304352
868304417 868304434
868304498 868304516
868304884 868304901
868304900 868304917
868304924 868304941
868304944 868304961
868304962 868304979
868304984 868305001
868305007 868305024
868305036 868305053
868305115 868305132
868305229 868305246
868305249 868305266
868305432 868305449
868305526 868305543
868305581 868305598
868305643 868305660
868305740 868305757
868305847 868305864
868306073 868306090
868306138 868306155
868306268 868306285
868306364 868306381
868306397 868306414
868306512 868306529
868306642 868306659
868306662 868306679
868306692 868306709
868306724 868306741
868306771 868306788
868306802 868306819
868306835 868306852
868306855 868306872
868306883 868306900
868306918 868306935
868306959 868306976
868307005 868307022
868307027 868307044
868307043 868307060
868307085 868307102
868307111 868307128
868307149 868307166
868307164 868307181
868307186 868307203
868307197 868307214
868307211 868307228
868307234 868307251
868307249 868307266
868307270 868307287
868307315 868307332
868307356 868307373
868307375 868307392
868307399 868307416
868307438 868307455
868307549 868307566
868307570 868307587
868307599 868307616
868307621 868307638
868307641 868307658
868307669 868307686
868307707 868307724
868307747 868307764
868307759 868307776
868307787 868307804
868307838 868307855
868307884 868307901
868307912 868307929
868307985 868308002
868308035 868308052
868308052 868308069
868308117 868308134
868308144 868308161
868308248 868308265
868308268 868308285
868308407 868308424
868308432 868308449
868308491 868308508
868308521 868308538
868308575 868308592
868308669 868308686
868308711 868308728
868308844 868308861
868309143 868309160
868309445 868309462
868309473 868309490
868309541 868309558
868309587 868309604
868309661 868309678
868309694 868309711
868309735 868309752
868309773 868309790
868309809 868309826
868309865 868309882
868309930 868309947
868309999 868310016
868310072 868310089
868310117 868310134
868310419 868310436
868310876 868310893
868312226 868312243
868312340 868312357
868312400 868312417
868312439 868312456
868312532 868312549
868312582 868312599
868312663 868312680
868312675 868312692
868312696 868312713
868312765 868312782
868312824 868312841
868312856 868312873
868312871 868312888
868312907 868312924
868312923 868312940
868312947 868312964
868312966 868312983
868312999 868313016
868313098 868313115
868313140 868313157
868313160 868313177
868313197 868313214
868313203 868313220
868313231 868313248
868313249 868313266
868313253 868313270
868313262 868313279
868313335 868313352
868313423 868313440
868313486 868313503
868313525 868313542
868313529 868313546
868313642 868313659
868313672 868313689
868313697 868313714
868313882 868313899
868313911 868313928
868314044 868314061
868314052 868314069
868314092 868314109
868314156 868314173
868314251 868314268
868314323 868314340
868314375 868314392
868314672 868314689
868314882 868314899
868314979 868314996
868315099 868315116
868315132 868315149
868315213 868315230
868315396 868315413
868315439 868315457
868315482 868315499
868315552 868315569
868315629 868315646
868315647 868315664
868315851 868315868
868315873 868315890
868316033 868316050
868316118 868316135
868316346 868316363
868316397 868316414
868316497 868316514
868316647 868316664
868316699 868316716
868316861 868316878
868316880 868316897
868317024 868317041
868317076 868317093
868317161 868317178
868317166 868317183
868317188 868317205
868317266 868317283
868317409 868317426
868317422 868317439
868317455 868317472
868317560 868317578
868317623 868317640
868317725 868317742
868317864 868317881
868317903 868317920
868318238 868318255
868318494 868318511
868319289 868319306
868321771 868321788
868321865 868321882
868323190 868323207
868323300 868323317
868323349 868323366
868323643 868323660
868323669 868323686
868323773 868323790
868323810 868323827
868323899 868323916
868323957 868323974
868324064 868324081
868324223 868324240
868324888 868324905
868325116 868325133
868325182 868325199
868325639 868325656
868330079 868330096
868330145 868330162
868330230 868330247
868330394 868330411
868330696 868330713
868330846 868330863
868332985 868333002
868333277 868333294
868333625 868333642
868333795 868333812
868333932 868333949
868333985 868334002
868336347 868336364
868339140 868339157
868341501 868341518
868344001 868344018
868348801 868348818
868351062 868351079
868353563 868353580
868355863 868355880
868358342 868358359
868360564 868360581
868363034 868363051
868365256 868365273
868367973 868367990
868370502 868370519
868406671 868406688
868407229 868407246
868407715 868407732
868408139 868408156
868410345 868410362
868410408 868410425
868410703 868410720
868410728 868410745
868410758 868410775
868410775 868410792
868410787 868410804
868410800 868410817
868410810 868410827
868410828 868410845
868410841 868410859
868410884 868410901
868410909 868410926
868411134 868411151
868411281 868411298
868411655 868411672
868412066 868412083
868412242 868412259
868412342 868412359
868412709 868412726
868412785 868412802
868412849 868412866
868412960 868412977
868420075 868420092
868420231 868420248
868421698 868421715
868422949 868422966
868425238 868425255
868427707 868427724
868429930 868429947
868432389 868432406
868437102 868437119
868441890 868441907
868444163 868444180
868446850 868446867
868449102 868449119
868451590 868451607
868453832 868453849
868456894 868456911
868459581 868459598
868467965 868467982
868468219 868468236
868468406 868468423
868468476 868468493
868468543 868468560
868468698 868468715
868468766 868468783
868468837 868468854
868468915 868468932
868468998 868469015
868469085 868469102
868469362 868469380
868469460 868469477
868470346 868470363
868473734 868473751
868474742 868474759
868474980 868474997
868476193 868476210
868476699 868476716
868478960 868478977
868481420 868481437
868484284 868484301
868486544 868486561
868489312 868489329
868491780 868491797
868494545 868494562
868496806 868496823
868499346 868499363
868504076 868504093
868506379 868506396
868508915 868508932
868511177 868511194
868513648 868513665
868515958 868515975
868518446 868518463
868520708 868520725
868523169 868523186
868525519 868525536
868527997 868528014
868530280 868530297
868533721 868533738
868534734 868534751
868535070 868535087
868537589 868537606
868538750 868538767
868538803 868538820
868539990 868540007
868540011 868540031
868540083 868540103
868540099 868540116
868555948 868555965
868556060 868556077
868556770 868556787
868556867 868556884
868556882 868556899
868558630 868558647
868558706 868558723
868559059 868559076
868559100 868559117
868559307 868559324
868559443 868559460
868559622 868559639
868560135 868560152
868560809 868560826
868561207 868561224
868561618 868561635
868562122 868562139
868562340 868562357
868562674 868562691
868563871 868563888
868565491 868565509
868565940 868565957
868566208 868566225
868566331 868566348
868568671 868568688
868571161 868571178
868573422 868573439
868575931 868575948
868578214 868578231
868580800 868580817
868583051 868583068
868595142 868595159
868597383 868597400
868599832 868599849
868602094 868602111
868606963 868606980
868609453 868609470
868611774 868611791
868614252 868614269
868616504 868616521
868618944 868618961
868619570 868619587
868621287 868621304
868621580 868621597
868622628 868622645
868622807 868622824
868625900 868625917
868626017 868626034
868626835 868626852
868651242 868651259
868654186 868654203
868674346 868674363
868676715 868676732
868679205 868679222
868686344 868686361
868689070 868689087
868693939 868693956
868696201 868696218
868698672 868698689
868700972 868700989
868703451 868703468
868710563 868710580
868712574 868712591
868712816 868712833
868713018 868713035
868713041 868713058
868713186 868713203
868713679 868713696
868713924 868713941
868714180 868714197
868752557 868752574
868754927 868754944
868764074 868764091
868766383 868766400
868768547 868768564
868770790 868770807
868772944 868772961
868775184 868775201
868777336 868777353
868781752 868781769
868784005 868784022
868786178 868786195
868788399 868788416
868790582 868790599
868797169 868797186
868799332 868799349
868801703 868801720
868804025 868804042
868806919 868806936
868809634 868809651
868844773 868844790
868849280 868849297
868851660 868851677
868854157 868854174
868858919 868858936
868861180 868861197
868868034 868868051
868870305 868870322
868872666 868872683
868874829 868874846
868877171 868877188
868879335 868879352
868881703 868881720
868893467 868893484
868897468 868897485
868901151 868901168
868911879 868911896
868914337 868914354
868923760 868923777
868929321 868929338
868931689 868931706
868934129 868934146
868936460 868936477
868938830 868938847
868941122 868941139
868943374 868943391
868945674 868945691
868950298 868950315
868952647 868952664
868954811 868954828
868957182 868957199
868959374 868959391
868961735 868961752
868963907 868963924
868966279 868966296
868968461 868968478
868977845 868977862
868980708 868980725
868983494 868983511
869006281 869006298
869006882 869006899
869007322 869007339
869009251 869009268
869011660 869011677
869013983 869014000
869016402 869016419
869018694 869018711
869021074 869021091
869023347 869023364
869025678 869025695
869027848 869027865
869030189 869030206
869032462 869032479
869034684 869034701
869036838 869036855
869041232 869041249
869043454 869043471
869045606 869045623
869047848 869047865
869049992 869050009
869052225 869052242
869054369 869054386
869056601 869056618
869058773 869058790
869066140 869066157
869107652 869107669
869109983 869110000
869112602 869112619
869114943 869114960
869117381 869117398
869119671 869119688
869124267 869124284
869126624 869126641
869128887 869128904
869131257 869131274
869133452 869133469
869135692 869135709
869137864 869137881
869140068 869140085
869150931 869150948
869193500 869193517
869195990 869196007
869198903 869198920
869201382 869201399
869203931 869203948
869206438 869206455
869216020 869216037
869218350 869218367
869220553 869220570
869222853 869222870
869224947 869224964
869227230 869227247
869229322 869229339
869233994 869234011
869234173 869234190
869238173 869238190
869279339 869279356
869279495 869279512
869282745 869282762
869288090 869288107
869290767 869290784
869293413 869293430
869295960 869295977
869305926 869305943
869308484 869308501
869310696 869310713
869313285 869313302
869315517 869315534
869318124 869318141
869318484 869318501
869374654 869374671
869393201 869393218
869397815 869397832
869400381 869400398
869434654 869434671
869434720 869434737
869434804 869434821
869434867 869434884
869435576 869435593
869437088 869437105
869476317 869476334
869481640 869481657
869484374 869484391
869515997 869516014
869654347 869654364
869656994 869657011
869683694 869683711
869687640 869687657
869688678 869688695
869688749 869688766
869689135 869689152
869689800 869689817
869690249 869690266
869690479 869690496
869693761 869693778
869701634 869701651
869701830 869701847
869702210 869702227
869702339 869702356
869703257 869703274
869703749 869703766
869705190 869705207
869766992 869767009
869767296 869767313
869767364 869767381
869852231 869852248
869852450 869852467
869852698 869852715
869852915 869852932
869853680 869853697
869854045 869854062
869854147 869854164
869854209 869854226
869854367 869854384
869854426 869854443
869854478 869854495
869854514 869854531
869854627 869854644
869854643 869854660
869854699 869854716
869854711 869854728
869854717 869854734
869854753 869854770
869854789 869854806
869854804 869854821
869854840 869854857
869854878 869854895
869854887 869854904
869854920 869854937
869854948 869854965
869854954 869854971
869854973 869854990
869854995 869855012
869855024 869855041
869855047 869855067
869855096 869855113
869855141 869855158
869855164 869855181
869855179 869855196
869855222 869855239
869855230 869855247
869855254 869855271
869855279 869855296
869855302 869855319
869855325 869855342
869855350 869855367
869855356 869855373
869855393 869855410
869855411 869855428
869855452 869855469
869855465 869855485
869855484 869855501
869855512 869855530
869855541 869855558
869855559 869855577
869855581 869855598
869855592 869855610
869855609 869855626
869855629 869855646
869855658 869855675
869855671 869855688
869864244 869864261
869864776 869864793
869864838 869864855
869864958 869864975
869865196 869865213
869865256 869865273
869865374 869865394
869868204 869868221
869879123 869879140
869879932 869879949
869880049 869880066
869880071 869880088
869880115 869880132
869880221 869880238
869880262 869880279
869880502 869880519
869880610 869880627
869880724 869880741
869880839 869880856
869880862 869880879
869880937 869880954
869881109 869881126
869881139 869881156
869881196 869881213
869881233 869881250
869881478 869881495
869881724 869881741
869881753 869881770
869881823 869881841
869881855 869881872
869881885 869881902
869882193 869882210
869882271 869882288
869882334 869882351
869882385 869882402
869882438 869882455
869882489 869882506
869882514 869882531
869882661 869882678
869882730 869882747
869882770 869882787
869882777 869882795
869882857 869882874
869882900 869882917
869882990 869883007
869883067 869883084
869883115 869883132
869883179 869883196
869883277 869883294
869883340 869883357
869883410 869883427
869883476 869883493
869883510 869883527
869883683 869883700
869883777 869883794
869883891 869883908
869883969 869883986
869884011 869884028
869884061 869884078
869884093 869884110
869884199 869884216
869884260 869884277
869884423 869884440
869884540 869884557
869884651 869884668
869884754 869884771
869884888 869884905
869884963 869884980
869884988 869885005
869885036 869885053
869885155 869885172
869885382 869885400
869885501 869885518
869885545 869885562
869885648 869885665
869886968 869886985
869887061 869887078
869887276 869887293
869921166 869921184
869921893 869921910
869957476 869957493
869958645 869958662
869970028 869970045
869970176 869970193
869976921 869976938
869979450 869979467
869984596 869984613
869987204 869987221
869992597 869992614
869999758 869999775
870002650 870002667
870006502 870006520
870009158 870009175
870044076 870044093
870044277 870044294
870044409 870044426
870044418 870044435
870044501 870044518
870044542 870044559
870044619 870044636
870044685 870044702
870044709 870044726
870044726 870044743
870044780 870044797
870044795 870044812
870044820 870044837
870044849 870044866
870044855 870044872
870044903 870044920
870044918 870044935
870044966 870044983
870044981 870044998
870045026 870045043
870045050 870045067
870045110 870045127
870045130 870045147
870045169 870045186
870045267 870045284
870049690 870049707
870050440 870050457
870074632 870074649
870079994 870080011
870082554 870082571
870085516 870085533
870088014 870088031
870090661 870090678
870093211 870093228
870096173 870096190
870099403 870099420
870127134 870127156
870128570 870128587
870128849 870128868
870130229 870130246
870131827 870131844
870131978 870131995
870142426 870142443
870145340 870145357
870149714 870149731
870152321 870152338
870155205 870155222
870157814 870157831
870161033 870161050
870163482 870163499
870166425 870166442
870168708 870168725
870171294 870171311
870173784 870173801
870176343 870176360
870178841 870178858
870217150 870217167
870217313 870217330
870217393 870217410
870242408 870242425
870242564 870242581
870247127 870247144
870249804 870249821
870255345 870255362
870258346 870258363
870260828 870260845
870263571 870263588
870266102 870266119
870332313 870332330
870335227 870335244
870339484 870339501
870341984 870342001
870345194 870345211
870347780 870347797
870350685 870350702
870404587 870404604
870430132 870430149
870430281 870430298
870434488 870434505
870437460 870437477
870471487 870471508
870511961 870511978
870512108 870512125
870517018 870517035
870519881 870519898
870558583 870558600
870581655 870581672
870795186 870795203
870928645 870928665
870935130 870935147
870943470 870943487
870951261 870951278
870951412 870951429
870955854 870955871
870957839 870957856
871042205 871042222
871086747 871086764
871089888 871089905
871138249 871138266
871181711 871181728
871529333 871529352
871568065 871568082
871568157 871568174
871568553 871568570
871568847 871568864
871569086 871569103
871595108 871595125
871595185 871595202
871595335 871595352
871595442 871595459
871595531 871595548
871647724 871647741
871647873 871647890
871788589 871788606
871791610 871791627
871793962 871793979
871796638 871796655
871798940 871798957
871801359 871801376
871803523 871803540
871808066 871808083
871810405 871810422
871812549 871812566
871814802 871814819
871816944 871816961
871819186 871819203
871821320 871821337
871823691 871823708
871826020 871826037
871873083 871873100
871875641 871875658
871878061 871878078
871880351 871880368
871882722 871882739
871884914 871884931
871887237 871887254
871889409 871889426
871891691 871891708
871893883 871893900
871896116 871896133
871898260 871898277
871900452 871900469
871902624 871902641
871904836 871904853
871906990 871907007
871909321 871909338
871911513 871911530
871919341 871919358
871959060 871959077
871961410 871961427
871964027 871964044
871966300 871966317
871968747 871968764
871970893 871970910
871977776 871977793
871979920 871979937
871982151 871982168
871984294 871984311
871986486 871986503
871988630 871988647
871990812 871990830
871992946 871992963
871995129 871995146
872002101 872002118
872046241 872046258
872048809 872048826
872051240 872051257
872051534 872051551
872053865 872053882
872056305 872056322
872058596 872058613
872060977 872060994
872063258 872063275
872065599 872065616
872067771 872067788
872070104 872070121
872072266 872072283
872074637 872074654
872076791 872076808
872079139 872079156
872081303 872081320
872083663 872083680
872085885 872085902
872088297 872088314
872090933 872090950
872113491 872113508
872114189 872114206
872115920 872115937
872125353 872125370
872127764 872127781
872130251 872130268
872132593 872132610
872134972 872134989
872137264 872137281
872139614 872139631
872141796 872141813
872144167 872144184
872146379 872146396
872148740 872148757
872153293 872153310
872155457 872155474
872157836 872157853
872160000 872160017
872162212 872162229
872164356 872164373
872166589 872166606
872168752 872168769
872171110 872171127
872173461 872173478
872176307 872176324
872192485 872192502
872192832 872192849
872193375 872193392
872193451 872193468
872193587 872193604
872193684 872193701
872193724 872193741
872193793 872193810
872193862 872193879
872196575 872196592
872198087 872198104
872198990 872199007
872199180 872199197
872199212 872199229
872199253 872199270
872199333 872199350
872199386 872199403
872199457 872199474
872199485 872199502
872199540 872199557
872199570 872199587
872199613 872199630
872199704 872199721
872199787 872199804
872199974 872199991
872200079 872200096
872200171 872200188
872201594 872201611
872201824 872201841
872201861 872201878
872201983 872202000
872208900 872208917
872211210 872211227
872211588 872211605
872213827 872213844
872216128 872216145
872218489 872218506
872220741 872220758
872223082 872223099
872225255 872225272
872227488 872227505
872229651 872229668
872234164 872234181
872236377 872236394
872238531 872238548
872240743 872240760
872242885 872242902
872245087 872245104
872247241 872247258
872249443 872249460
872251607 872251624
872255963 872255980
872258343 872258360
872258538 872258555
872280139 872280156
872284873 872284891
872285746 872285763
872286062 872286079
872286122 872286139
872286483 872286500
872286802 872286819
872286968 872286985
872287291 872287308
872287421 872287438
872287507 872287524
872287595 872287612
872287645 872287662
872287662 872287679
872287688 872287707
872287702 872287719
872287716 872287733
872289760 872289778
872289891 872289909
872289976 872289993
872290175 872290192
872290228 872290245
872290424 872290441
872290505 872290522
872290735 872290752
872297038 872297055
872299360 872299377
872301978 872301995
872304287 872304304
872306658 872306675
872308831 872308848
872311181 872311198
872313335 872313352
872315658 872315675
872317820 872317837
872320191 872320208
872322334 872322351
872324556 872324573
872326709 872326726
872328931 872328948
872331085 872331102
872333295 872333312
872335459 872335476
872337680 872337697
872339834 872339851
872342046 872342063
872373940 872373957
872379207 872379224
872393051 872393068
872393199 872393216
872396035 872396052
872398455 872398472
872401002 872401019
872403244 872403261
872405705 872405722
872407945 872407962
872412658 872412675
872415098 872415115
872417339 872417356
872419789 872419806
872422059 872422076
872426930 872426947
872429428 872429445
872441530 872441547
872442918 872442935
872443033 872443050
872443125 872443142
872443164 872443181
872443541 872443558
872443561 872443578
872443741 872443758
872443813 872443830
872443860 872443877
872443870 872443887
872443892 872443909
872443932 872443949
872443978 872443995
872444031 872444048
872444062 872444079
872444115 872444132
872444168 872444185
872444260 872444277
872444302 872444319
872444439 872444456
872444496 872444513
872444683 872444700
872444746 872444763
872444789 872444806
872444867 872444884
872444976 872444993
872445059 872445076
872445266 872445283
872445465 872445482
872445562 872445579
872445612 872445629
872445661 872445678
872445710 872445727
872445766 872445783
872448725 872448742
872475267 872475284
872475417 872475434
872478291 872478308
872480748 872480765
872483456 872483473
872485847 872485864
872488601 872488618
872490952 872490969
872493578 872493595
872495909 872495926
872498369 872498386
872500611 872500628
872503072 872503089
872505382 872505399
872507831 872507848
872548216 872548233
872548289 872548306
872548579 872548596
872555468 872555485
872555616 872555633
872558551 872558568
872560998 872561015
872563686 872563703
872570954 872570971
872573425 872573442
872578204 872578221
872580477 872580494
872585187 872585204
872589869 872589886
872592348 872592365
872594599 872594616
872597120 872597137
872599440 872599457
872639333 872639350
872642068 872642085
872647116 872647133
872649358 872649375
872651826 872651843
872654068 872654085
872656010 872656027
872656170 872656187
872656237 872656254
872656367 872656384
872656465 872656482
872656568 872656585
872656597 872656614
872656740 872656757
872656798 872656815
872656853 872656870
872656993 872657010
872657183 872657200
872657293 872657310
872657485 872657502
872657581 872657598
872658342 872658359
872658829 872658846
872661318 872661335
872663592 872663609
872666128 872666145
872668420 872668437
872670939 872670956
872673219 872673236
872675760 872675777
872678219 872678236
872680689 872680706
872683038 872683055
872685477 872685494
872687739 872687756
872690447 872690464
872692877 872692894
872700461 872700478
872706581 872706598
872707319 872707336
872707418 872707435
872707548 872707565
872707612 872707629
872707647 872707664
872707691 872707708
872707735 872707752
872707769 872707786
872707784 872707801
872707828 872707845
872707841 872707858
872707860 872707877
872707922 872707939
872707961 872707978
872708001 872708018
872708090 872708107
872708131 872708148
872708197 872708214
872708269 872708286
872708416 872708433
872708447 872708464
872708509 872708526
872708571 872708588
872708593 872708610
872708620 872708637
872708640 872708657
872708668 872708685
872708701 872708718
872708725 872708742
872708740 872708757
872708752 872708769
872708771 872708788
872708780 872708797
872708795 872708812
872708804 872708821
872708825 872708842
872708832 872708849
872708845 872708862
872708851 872708868
872708859 872708876
872708882 872708899
872708899 872708916
872708908 872708925
872708918 872708935
872708928 872708945
872708940 872708957
872708956 872708973
872708965 872708982
872708973 872708990
872708988 872709005
872709005 872709022
872709020 872709037
872709035 872709052
872709052 872709069
872709068 872709085
872709086 872709103
872709103 872709120
872709114 872709131
872709133 872709150
872709150 872709167
872709176 872709193
872709215 872709232
872709237 872709254
872709271 872709288
872709284 872709301
872709315 872709332
872709334 872709351
872709364 872709381
872709424 872709441
872718413 872718430
872718857 872718874
872719242 872719259
872721652 872721669
872724372 872724389
872725312 872725329
872727048 872727065
872727178 872727195
872727325 872727342
872747800 872747817
872750270 872750287
872752512 872752529
872755022 872755039
872759684 872759701
872761964 872761981
872764414 872764431
872766646 872766663
872771074 872771092
872771327 872771344
872773253 872773273
872773838 872773855
872776177 872776194
872781829 872781846
872805250 872805267
872822787 872822804
872822935 872822952
872825996 872826013
872828406 872828423
872830887 872830904
872833265 872833282
872835932 872835949
872838265 872838282
872840723 872840740
872842955 872842972
872845425 872845442
872847725 872847742
872850145 872850162
872852398 872852415
872854877 872854894
872859509 872859526
872861741 872861758
872864857 872864874
872891588 872891605
872891639 872891656
872891672 872891689
872891704 872891721
872891772 872891789
872891831 872891848
872891927 872891944
872892048 872892065
872892814 872892832
872892986 872893003
872893044 872893061
872893298 872893315
872893360 872893377
872893462 872893479
872893575 872893592
872893710 872893727
872893849 872893866
872894271 872894288
872900349 872900366
872900395 872900412
872900519 872900536
872900623 872900640
872914796 872914813
872914953 872914970
872918064 872918081
872920474 872920491
872923280 872923297
872925671 872925688
872928435 872928452
872930687 872930704
872933156 872933173
872935497 872935514
872937975 872937992
872940209 872940226
872942637 872942654
872972759 872972776
872972783 872972800
872972819 872972836
872972823 872972840
872972832 872972849
872972853 872972870
872972868 872972885
872972889 872972906
872972905 872972923
872972965 872972982
872972981 872972998
872973017 872973034
872973041 872973058
872973057 872973074
872973099 872973116
872973103 872973120
872973151 872973168
872973201 872973218
872973218 872973235
872973333 872973350
872973373 872973390
872973397 872973414
872973407 872973424
872973438 872973455
872973461 872973478
872973470 872973487
872973505 872973522
872973525 872973542
872973552 872973569
872973570 872973587
872973584 872973601
872973597 872973614
872973616 872973633
872973648 872973665
872973657 872973674
872973677 872973694
872973702 872973719
872973715 872973732
872973731 872973748
872973765 872973782
872973831 872973848
872973875 872973892
872973892 872973909
872973917 872973934
872973945 872973962
872973995 872974012
872974017 872974034
872974035 872974052
872974100 872974117
872974139 872974156
872974190 872974207
872974224 872974241
872974291 872974308
872974370 872974387
872974453 872974470
872974490 872974507
872974544 872974561
872974745 872974762
872974752 872974769
872977160 872977177
872977352 872977369
872977449 872977466
872977477 872977494
872977537 872977554
872977633 872977651
872977730 872977747
872977850 872977867
872978041 872978058
872978281 872978298
872978362 872978379
872978452 872978469
872978914 872978931
872979058 872979075
872979248 872979265
872979416 872979433
872979566 872979583
872979639 872979656
872979796 872979813
872980044 872980061
872980223 872980240
872980617 872980634
872981041 872981058
872981252 872981269
872982073 872982090
872983382 872983399
872984850 872984867
872985920 872985937
872987180 872987197
872989619 872989636
872991942 872991959
872994400 872994417
872996573 872996590
873003498 873003515
873005690 873005707
873007920 873007937
873010104 873010121
873014617 873014634
873016930 873016947
873019101 873019118
873021325 873021342
873023478 873023495
873025817 873025834
873027979 873027996
873030330 873030347
873032514 873032531
873037166 873037183
873040446 873040463
873044711 873044728
873064055 873064072
873077661 873077678
873080288 873080305
873083014 873083031
873085365 873085382
873090085 873090102
873092475 873092492
873094748 873094765
873097177 873097194
873099369 873099386
873106312 873106329
873108485 873108502
873110865 873110882
873113019 873113036
873115261 873115278
873117423 873117440
873119655 873119672
873162491 873162508
873167537 873167554
873169928 873169945
873172575 873172592
873174896 873174913
873177256 873177273
873179451 873179468
873181860 873181877
873184033 873184050
873186411 873186428
873190954 873190971
873193128 873193145
873195469 873195486
873197643 873197660
873199883 873199900
873202037 873202054
873204398 873204415
873206689 873206706
873209108 873209125
873211548 873211565
873236746 873236763
873236789 873236806
873236853 873236870
873236948 873236965
873237229 873237246
873237787 873237804
873238006 873238023
873242724 873242741
873242766 873242783
873242994 873243011
873243564 873243581
873243841 873243858
873251361 873251378
873253691 873253708
873256123 873256140
873258284 873258301
873260615 873260632
873262829 873262846
873265168 873265185
873267361 873267378
873269702 873269719
873271884 873271901
873276319 873276336
873278632 873278649
873280802 873280819
873283114 873283131
873285307 873285324
873287550 873287567
873289711 873289728
873294156 873294173
873296615 873296632
873298976 873298993
873301752 873301769
873304829 873304846
873339061 873339078
873341393 873341410
873343880 873343897
873346211 873346228
873348573 873348590
873350715 873350732
873353076 873353093
873355230 873355247
873357591 873357608
873359732 873359749
873362053 873362070
873366429 873366446
873368582 873368599
873370776 873370793
873372918 873372935
873375100 873375117
873377312 873377329
873379507 873379524
873381797 873381814
873396295 873396312
873422223 873422240
873440219 873440236
873442401 873442418
873444555 873444572
873448860 873448877
873451032 873451049
873453186 873453203
873455398 873455415
873457532 873457549
873459763 873459780
873476140 873476157
873508218 873508235
873511131 873511148
873513502 873513519
873520564 873520581
873522825 873522842
873525156 873525173
873527341 873527358
873529712 873529729
873531882 873531899
873534086 873534103
873536228 873536245
873538452 873538469
873540606 873540623
873542836 873542853
873545000 873545017
873547231 873547248
873553800 873553817
873556574 873556591
873557792 873557809
873557800 873557817
873669266 873669283
873670342 873670359
873671713 873671730
873671783 873671800
873730198 873730215
873731512 873731529
873733291 873733308
873734282 873734299
873740251 873740268
873744468 873744485
873749724 873749741
873817077 873817094
873820819 873820836
873875346 873875363
873875493 873875510
873879967 873879984
873882654 873882671
873890812 873890829
873895721 873895738
873898725 873898742
873953432 873953449
873953581 873953598
873957985 873958002
873960485 873960502
873963200 873963217
873965471 873965489
873968089 873968106
873972920 873972937
873975082 873975099
873977493 873977510
873979685 873979702
873982294 873982311
873984554 873984571
873987922 873987939
873990649 873990666
874033792 874033809
874033948 874033965
874037949 874037966
874040498 874040515
874043213 874043230
874045465 874045482
874048132 874048149
874050375 874050392
874055352 874055369
874058029 874058046
874060271 874060288
874062828 874062845
874065090 874065107
874065501 874065518
874065560 874065577
874067679 874067696
874069911 874069928
874073230 874073247
874076054 874076071
874088919 874088936
874216445 874216462
874216593 874216610
874221028 874221045
874223616 874223633
874229492 874229509
874232505 874232522
874234865 874234882
874237631 874237648
874244961 874244978
874291628 874291645
874300656 874300673
874303235 874303252
874306860 874306877
874309386 874309403
874312617 874312634
874324844 874324861
874327461 874327478
874381725 874381742
874381873 874381890
874386456 874386473
874389054 874389071
874392510 874392527
874394861 874394878
874400471 874400488
874403940 874403957
874406230 874406247
874409222 874409239
874410677 874410694
874411524 874411541
874414556 874414573
874416858 874416875
874420634 874420651
874493808 874493825
874496406 874496423
874502864 874502881
874564968 874564985
874621857 874621874
874691455 874691474
874696282 874696299
874696370 874696387
874696644 874696661
874746506 874746523
874750973 874750990
874809113 874809130
874824343 874824360
874827699 874827716
874832134 874832151
874834762 874834779
874838624 874838641
874841152 874841169
874844134 874844151
874903987 874904004
874912956 874912973
874915414 874915431
874919840 874919857
874922290 874922307
874926931 874926948
874929123 874929140
874932906 874932923
874991307 874991324
874997637 874997654
874999882 874999899
875003267 875003284
875008532 875008549
875010794 875010811
875013529 875013546
875070478 875070495
875073196 875073213
875078795 875078812
875081273 875081290
875091803 875091820
875094607 875094624
875096838 875096855
875099436 875099453
875101648 875101665
875104098 875104115
875106310 875106327
875109067 875109084
875111595 875111612
875123401 875123418
875127864 875127883
875180978 875180995
