Dual Core AMD Opteron(tm) Processor 275   CIT   0.06
Quad-Core AMD Opteron(tm) Processor 2376  CIT   0.23
Intel(R) Xeon(R) CPU E5-2670 0 @ 2.60GHz  CIT   1.00
Intel(R) Xeon(R) CPU E3-1241 v3 @ 3.50GHz CIT   0.64 
Intel(R) Xeon(R) CPU E3-1220 v3 @ 3.10GHz ATLAS 0.57
Intel(R) Xeon(R) CPU E3-1231 v3 @ 3.40GHz ATLAS 0.63 
Intel(R) Xeon(R) CPU E5-1650 v2 @ 3.50GHz ATLAS 0.92
Intel(R) Xeon(R) CPU X3220 @ 2.40GHz      ATLAS 0.17
Intel(R) Xeon(R) CPU E5504 @ 2.00GHz      ATLAS 0.24

