862852291 862852294
862875174 862875177
863160364 863160367
863168030 863168033
863913092 863913094
863931480 863931483
863956951 863956954
864146853 864146855
864548810 864548813
865344981 865344983
865547932 865547934
865605366 865605368
865687580 865687583
865963072 865963074
866175783 866175786
866210885 866210888
866683800 866683803
866736263 866736266
866984997 866985000
867434788 867434790
867507139 867507142
867675523 867675525
869464996 869464999
870454665 870454668
870892544 870892546
870985966 870985969
871359436 871359439
871523474 871523477
871656471 871656474
872530988 872530990
872533973 872533975
872709529 872709532
873136323 873136326
873195149 873195152
873424549 873424552
875015202 875015204
