862130469 862130482
862139813 862139825
862158440 862158454
862167817 862167833
862177035 862177049
862179438 862179453
862258332 862258346
862262555 862262556
862350558 862350559
862356135 862356144
862381092 862381093
862384735 862384747
862444498 862444499
862462646 862462648
862521804 862521816
862524769 862524776
862533398 862533400
862556184 862556197
862599894 862599907
862668084 862668098
862695176 862695178
862697392 862697394
862698685 862698699
862701308 862701310
862701612 862701613
862704864 862704875
862713435 862713436
862732317 862732330
862768797 862768809
862770032 862770033
862773102 862773104
862870019 862870021
862870598 862870604
862880086 862880090
862897022 862897024
862934378 862934380
862944115 862944124
862947239 862947252
862948744 862948745
862954148 862954149
862957981 862957995
863027540 863027541
863051979 863051981
863053000 863053002
863053264 863053278
863185138 863185139
863197909 863197911
863202517 863202531
863216952 863216965
863295686 863295692
863301801 863301809
863311366 863311368
863316563 863316564
863344399 863344413
863367904 863367906
863377895 863377908
863398038 863398040
863457765 863457777
863476558 863476569
863528912 863528914
863532182 863532184
863534878 863534882
863539889 863539890
863547547 863547549
863636508 863636510
863637344 863637352
863669764 863669777
863683947 863683960
863743559 863743560
863760367 863760368
863770791 863770804
863831481 863831482
863931136 863931137
863979283 863979296
863982942 863982955
863984366 863984378
864058985 864058999
864062667 864062669
864069321 864069330
864149886 864149888
864151204 864151206
864158806 864158807
864253432 864253446
864257753 864257766
864314470 864314471
864325515 864325518
864328185 864328186
864339266 864339267
864340127 864340128
864340466 864340467
864341375 864341376
864341874 864341875
864353231 864353233
864418222 864418224
864434084 864434099
864464147 864464153
864507622 864507624
864577330 864577331
864592272 864592285
864594237 864594252
864606921 864606935
864608706 864608708
864612149 864612163
864671221 864671222
864673445 864673458
864746563 864746565
864751172 864751181
864777336 864777349
864778535 864778549
864859053 864859063
864921844 864921846
864963831 864963832
865015541 865015552
865019911 865019925
865029061 865029069
865030607 865030612
865034981 865034995
865057151 865057165
865079299 865079312
865130286 865130288
865172572 865172574
865184984 865184986
865185436 865185450
865190332 865190333
865198642 865198644
865201425 865201426
865202108 865202110
865345185 865345199
865361881 865361886
865465071 865465072
865474642 865474652
865490986 865491001
865542478 865542480
865557035 865557036
865621440 865621920
865645712 865645725
865668369 865668382
865684221 865684222
865695504 865695505
865743319 865743333
865785155 865785156
865793143 865793144
865793208 865793212
865795314 865795327
865798644 865798657
865807161 865807163
865808663 865808676
865824199 865824200
865827610 865827611
865829036 865829037
865864234 865864248
865876525 865876538
865885235 865885250
865887816 865887817
865893509 865893523
865949835 865949837
865957875 865957877
866032224 866032225
866134912 866134921
866160823 866160825
866164917 866164919
866166135 866166137
866166509 866166510
866168696 866168709
866169982 866169996
866172785 866172797
866190186 866190188
866193131 866193133
866223860 866223874
866231955 866231957
866240128 866240129
866257174 866257176
866325523 866325524
866333497 866333498
866382203 866382204
866386580 866386593
866389699 866389700
866413912 866413926
866447387 866447401
866468981 866468993
866475453 866475454
866497420 866497433
866583658 866583671
866605037 866605038
866605187 866605811
866726651 866726653
866736411 866736425
866738352 866738367
866774060 866774071
866958175 866958190
867029728 867030240
867035149 867035157
867036670 867036683
867056207 867056208
867120614 867120615
867121299 867121311
867170833 867170847
867191158 867191172
867298982 867298983
867344496 867344624
867353134 867353148
867364311 867364313
867440836 867440837
867450215 867450226
867511055 867511057
867627047 867627048
867689594 867689607
867766550 867766565
867771707 867771709
867775239 867775241
867782783 867782795
867795624 867795638
867836854 867836867
868028135 868028136
868054788 868054802
868059611 868059612
868114697 868114698
868162679 868162680
868216386 868216398
868223100 868223102
868223700 868223702
868232624 868232626
868247683 868247692
868253687 868253688
868262643 868262647
868388534 868388535
868389191 868389192
868399196 868399210
868472302 868472304
868527646 868527656
868540491 868540496
868584295 868584302
868603781 868603783
868631317 868631331
868651844 868651858
868654759 868654761
868662748 868662762
868701178 868701180
868745024 868745037
868748345 868748347
868753261 868753273
868794197 868794213
868864967 868864981
868903670 868903671
868916426 868916428
868919362 868919376
869005207 869005208
869051369 869051383
869060233 869060246
869068020 869068030
869234015 869234028
869323312 869323472
869413824 869413838
869442639 869442651
869466220 869466236
869473214 869473216
869505249 869505251
869513668 869513670
869524297 869524308
869535603 869535611
869544038 869544040
869604906 869604908
869613884 869613895
869616312 869616314
869617365 869617378
869720577 869720586
869773260 869773261
869831481 869831496
869858155 869858171
870007500 870007514
870011549 870011550
870024116 870024128
870030785 870030786
870031314 870031315
870031409 870031410
870031574 870031576
870038688 870038702
870046092 870046093
870052047 870052049
870059869 870059883
870103428 870103429
870110613 870110614
870132728 870132729
870177887 870177901
870214718 870214719
870273263 870273276
870274330 870274345
870290019 870290020
870342121 870342134
870403861 870403874
870467408 870467422
870521525 870521527
870560004 870560016
870568229 870568243
870578163 870578164
870629014 870629026
870657402 870657404
870743020 870743033
870758591 870758592
870763683 870763697
870815188 870815201
870873064 870873065
870900509 870900511
870905938 870905952
870939905 870939919
870960068 870960082
870980988 870980999
870991911 870991924
871016633 871016646
871032510 871032524
871057169 871057170
871061228 871061230
871070463 871070464
871075831 871075845
871105598 871105599
871165895 871165897
871228551 871228552
871243427 871243440
871272682 871272696
871277332 871277334
871289597 871289599
871291507 871291521
871300049 871300051
871300442 871300443
871307935 871307936
871329502 871329516
871351444 871351446
871392589 871392603
871393987 871393989
871409405 871409406
871414326 871414328
871441449 871441457
871597087 871597101
871619303 871619304
871672014 871672024
871679619 871679620
871681972 871681974
871685671 871685685
871695396 871695404
871765350 871765352
871818821 871818823
871851523 871851524
871920982 871920990
872014954 872014955
872019968 872019970
872049095 872049098
872103989 872104003
872129881 872129882
872167783 872167792
872171048 872171050
872201835 872201844
872242591 872242605
872263028 872263030
872348461 872348463
872367568 872367582
872373261 872373275
872515636 872515650
872530462 872530464
872534383 872534397
872545307 872545309
872564687 872564700
872626252 872626264
872635359 872635371
872643802 872643804
872645368 872645370
872645694 872645696
872706963 872706973
872709113 872709126
872731159 872731160
872731816 872731828
872871895 872871905
872885762 872885774
872953141 872953142
872979800 872979808
873039706 873039708
873055937 873055938
873060202 873060205
873081656 873081670
873103483 873103496
873119792 873119805
873137071 873137080
873141112 873141124
873145497 873145509
873147564 873147578
873154650 873154651
873179437 873179451
873222854 873222864
873227462 873227464
873235506 873235508
873236136 873236138
873236317 873236319
873424744 873424758
873482083 873482086
873583458 873583459
873586081 873586082
873591203 873591204
873631789 873631802
873645300 873645314
873648739 873648750
873665971 873665980
873670107 873670120
873677300 873677306
873690892 873690901
873745613 873745625
873749335 873749337
873759400 873759401
873959125 873959139
873994932 873994945
874098316 874098318
874132554 874132569
874162756 874162758
874181606 874181608
874227036 874227038
874272877 874272890
874275426 874275440
874313452 874313466
874316926 874316940
874342400 874342402
874347689 874347703
874349484 874349486
874352747 874352761
874354133 874354145
874360677 874360688
874436890 874436903
874501501 874501515
874514084 874514097
874622913 874622927
874650122 874650126
874695974 874695986
874706769 874706783
874787743 874787744
874802187 874802189
874817608 874817621
874846235 874846236
874848004 874848011
874857668 874857676
874878340 874878345
874885171 874885173
874935190 874935192
874979361 874979376
874984880 874984893
875022640 875022655
875041712 875041726
875056064 875056066
875103206 875103207
875104047 875104062
875154092 875154096
875167220 875167234
875182180 875182182
875184821 875184836
