825473632 825473736
828791287 828791375
841869296 841869336
844017697 844017769
849111837 849112149
851764514 851764522
851764546 851764570
851764650 851764706
851764762 851764842
851764890 851764898
852047624 852047648
852047672 852047680
852047712 852047720
852047768 852047784
853344346 853344482
854198048 854198232
854288010 854288378
