815214674 815214734
815216311 815216371
815217967 815217986
815221272 815221332
815230046 815230106
815239913 815239973
815247123 815247183
815266783 815266843
815299831 815299891
815303600 815303660
815304722 815304782
815306449 815306509
815307268 815307328
815308005 815308065
815313309 815313369
815332208 815332268
815370509 815370569
815378676 815378736
815394268 815394328
815404206 815404266
815409025 815409047
815420624 815420684
815422219 815422279
815426734 815426794
815447636 815447671
815447676 815447691
815450632 815450692
815456660 815456720
815458646 815458706
815470931 815470991
815571732 815571792
815610500 815610546
815620172 815620232
815626075 815626135
815635914 815635974
815658099 815658159
815661925 815661985
815663124 815663184
815686805 815686865
815700442 815700497
815766629 815766689
815788929 815788989
815791302 815791362
815908885 815908917
815959574 815959634
815988404 815988464
816037579 816037639
816040142 816040202
816185339 816185399
816195439 816195499
816211220 816211280
816379650 816379710
816439258 816439318
816471709 816471769
816500069 816500129
816526711 816526771
816623355 816623415
816630889 816630949
816638271 816638331
816807180 816807240
816814404 816814464
816818372 816818432
816897886 816897946
816969434 816969494
816971389 816971447
816988774 816988834
817031498 817031550
817224684 817224744
817231966 817232026
817243328 817243388
817340696 817340756
817346993 817347052
817423329 817423389
817442375 817442435
817447595 817447644
817488830 817488890
817504455 817504515
817508332 817508392
817565024 817565084
817596458 817596518
817618137 817618176
817662136 817662196
817707629 817707689
817781783 817781843
817821554 817821614
817824846 817824906
817852355 817852415
817915243 817915254
818012179 818012239
818034319 818034379
818059260 818059320
818068429 818068489
818077156 818077216
818112800 818112860
818160940 818161000
818172838 818172898
818182047 818182107
818326531 818326553
818343168 818343228
818345436 818345496
818346810 818346870
818352256 818352316
818457109 818457169
818460082 818460142
818479667 818479727
818524928 818524963
818564791 818564851
818569717 818569777
818634991 818635051
818645201 818645261
818677592 818677652
818734823 818734883
818793810 818793870
818831794 818831854
818878532 818878592
818971157 818971217
819028013 819028073
819044142 819044175
819057875 819057935
819093815 819093875
819144546 819144606
819204049 819204109
819211257 819211317
819229126 819229186
819269422 819269478
819295049 819295109
819308205 819308265
819317074 819317134
819325333 819325393
819347947 819348007
819401321 819401381
819409183 819409243
819604099 819604159
819656549 819656609
819697588 819697648
819789988 819790048
819825348 819825408
819881006 819881066
819887356 819887416
819974466 819974519
820002896 820002956
820062946 820063006
820087047 820087106
820108740 820108800
820115130 820115190
820175671 820175731
820196348 820196408
820199614 820199664
820210620 820210680
820218614 820218674
820275870 820275930
820321173 820321233
820327190 820327244
820364640 820364700
820372140 820372200
820398971 820399031
820429956 820430016
820450934 820450994
820523815 820523875
820539350 820539410
820544801 820544861
820554496 820554556
820626471 820626528
820636258 820636318
820752428 820752488
820756032 820756092
820805014 820805074
820873180 820873240
820879025 820879085
820944165 820944225
820966520 820966580
820986480 820986540
820988845 820988905
820991006 820991066
820998764 820998824
821056302 821056362
821070929 821070989
821103966 821104026
821107461 821107521
821113278 821113302
821222710 821222770
821287388 821287448
821477406 821477466
821480113 821480173
821496255 821496315
821513336 821513396
821583830 821583890
821592239 821592299
821612911 821612971
821663939 821663999
821681637 821681697
821718624 821718684
821721090 821721150
821725763 821725823
821756484 821756544
821783004 821783064
821824697 821824757
821831844 821831904
821834397 821834457
821872791 821872851
821990643 821990703
822012062 822012122
822032131 822032190
822085178 822085238
822090555 822090615
822094511 822094571
822153534 822153539
822175148 822175208
822177448 822177508
822179679 822179726
822182905 822182965
822184973 822185031
822205468 822205528
822208628 822208688
822220273 822220333
822282853 822282913
822290391 822290451
822327679 822327739
822357725 822357785
822375804 822375864
822385896 822385956
822386556 822386579
822413297 822413357
822417118 822417178
822424755 822424815
822427323 822427383
822427837 822427897
822477475 822477535
822481753 822481813
822484344 822484404
822487840 822487900
822493107 822493167
822494632 822494692
822497751 822497811
822511714 822511774
822527247 822527307
822535279 822535339
822554174 822554234
822576520 822576580
822578795 822578855
822579936 822579996
822584014 822584074
822605188 822605248
822610195 822610255
822632810 822632870
822636028 822636088
822638506 822638566
822650992 822651052
822654082 822654142
822664675 822664735
822666814 822666874
822668352 822668412
822714339 822714399
822725777 822725837
822732690 822732750
822734912 822734972
822737883 822737943
822804898 822804958
822806371 822806431
822814681 822814741
822828722 822828782
822850809 822850869
822853254 822853314
822859328 822859388
822862220 822862280
822873278 822873338
822914965 822915025
822920364 822920424
822944112 822944172
822947047 822947107
822966471 822966531
822967832 822967892
822973478 822973538
822985543 822985603
822994747 822994807
823012303 823012363
823029588 823029648
823032378 823032438
823077969 823078029
823086251 823086311
823089311 823089371
823093219 823093279
823101943 823102003
823104517 823104577
823161881 823161941
823200074 823200134
823223103 823223163
823240768 823240828
823255700 823255752
823267695 823267755
823280183 823280243
823336813 823336873
823351200 823351260
823355432 823355492
823423425 823423485
824211884 824211944
824214383 824214443
824217388 824217448
824390189 824390249
824397869 824397929
824409120 824409180
824411859 824411919
824494619 824494679
824501140 824501200
824596541 824596601
824618417 824618477
824631388 824631448
824671402 824671462
824674499 824674559
824676207 824676267
824682953 824683013
824686526 824686586
824694198 824694258
824720609 824720669
824778002 824778062
824807168 824807228
824825496 824825556
824833048 824833108
824837845 824837905
824842001 824842061
824846404 824846464
824855288 824855348
824858187 824858247
824932220 824932280
824937500 824937560
824996720 824996780
825014648 825014708
825089241 825089301
825093155 825093215
825097871 825097931
825105108 825105168
825109927 825109987
825114574 825114634
825119791 825119851
825150212 825150272
825208347 825208407
825240581 825240641
825246047 825246107
825257829 825257882
825262552 825262612
825268891 825268951
825282184 825282244
825299794 825299846
825319529 825319589
825331288 825331348
825348939 825348999
825378309 825378369
825428851 825428911
825448371 825448431
825482177 825482237
825528696 825528756
825546377 825546437
825578987 825579047
825605345 825605405
825615127 825615187
825697320 825697380
825702827 825702887
825711291 825711351
825748892 825748952
825781321 825781381
825822762 825822822
825841385 825841445
825873686 825873746
825880358 825880418
825889560 825889620
825891752 825891812
825898653 825898713
825910137 825910197
825944764 825944824
825956690 825956750
825960945 825961005
825962112 825962172
825965829 825965889
825975536 825975596
826014409 826014469
826017120 826017180
826062447 826062507
826074994 826075054
826078938 826078998
826083589 826083649
826092447 826092507
826111561 826111621
826127268 826127328
826135459 826135519
826169130 826169190
826172333 826172393
826181987 826182047
826194414 826194474
826229334 826229394
826237023 826237083
826260091 826260151
826264948 826265008
826275569 826275629
826316308 826316368
826319390 826319450
826326867 826326927
826339586 826339646
826341412 826341472
826346972 826347032
826355777 826355837
826368257 826368317
826380785 826380835
826387644 826387704
826439420 826439480
826468297 826468357
826478572 826478632
826489422 826489478
826496966 826497026
826507241 826507301
826553999 826554059
826564531 826564591
826569486 826569546
826573705 826573765
826580359 826580419
826582912 826582972
826602618 826602678
826626571 826626631
826640943 826641003
826642160 826642220
826643573 826643633
826658278 826658338
826660901 826660961
826667353 826667413
826700179 826700239
826709158 826709218
826717489 826717549
826718232 826718292
826724347 826724407
826730459 826730519
826744852 826744912
826801489 826801549
826804175 826804235
826829253 826829313
826920600 826920660
826923648 826923708
826992738 826992789
827017457 827017517
827031767 827031827
827041398 827041458
827082729 827082789
827092947 827093007
827101379 827101439
827104786 827104846
827115518 827115578
827156348 827156408
827162949 827163009
827189344 827189404
827247695 827247755
827250079 827250139
827255639 827255699
827267732 827267792
827274924 827274984
827291825 827291885
827352904 827352964
827364294 827364354
827370414 827370474
827373547 827373607
827378538 827378598
827385394 827385454
827461989 827462049
827465041 827465101
827466410 827466470
827503791 827503851
827513271 827513331
827517873 827517933
827528660 827528720
827536941 827536996
827588587 827588647
827618440 827618500
827619603 827619663
827687601 827687661
827696466 827696526
827698152 827698212
827706804 827706864
827771513 827771573
827784067 827784127
827786424 827786475
827791483 827791543
827793055 827793115
827794712 827794772
827817688 827817748
827849440 827849500
827868847 827868907
827876333 827876393
827882066 827882126
827921689 827921749
827945775 827945835
827971402 827971462
827980649 827980709
828038055 828038115
828041271 828041331
828112467 828112527
828118018 828118078
828128087 828128141
828138324 828138384
828153399 828153410
828156291 828156351
828158125 828158185
828167407 828167467
828170844 828170904
828178567 828178627
828182058 828182118
828185888 828185948
828186767 828186827
828190716 828190776
828191747 828191807
828224940 828225000
828233628 828233688
828265840 828265900
828282038 828282098
828291957 828292017
828306990 828307050
828313669 828313729
828345011 828345071
828347341 828347401
828361788 828361848
828380390 828380450
828382784 828382844
828384916 828384919
828388209 828388269
828425573 828425633
828434452 828434512
828457769 828457821
828486799 828486856
828503366 828503424
828527851 828527911
828555103 828555163
828571374 828571434
828581626 828581633
828585094 828585154
828588495 828588555
828591234 828591294
828622873 828622933
828712708 828712768
828758394 828758454
828798803 828798863
828893876 828893936
828910497 828910557
828968171 828968231
828985218 828985278
828987160 828987220
828994298 828994358
829066393 829066453
829071196 829071256
829076345 829076405
829083857 829083912
829187802 829187862
829204493 829204553
829223958 829224018
829248272 829248328
829259465 829259525
829330971 829331030
829333699 829333759
829335914 829335974
829349085 829349145
829363273 829363333
829601328 829601388
829607406 829607466
829611139 829611199
829653694 829653754
829669500 829669560
829701759 829701819
829704988 829705048
829705907 829705967
829707258 829707318
829708957 829709017
829726155 829726215
829744706 829744766
829782861 829782921
829842542 829842580
829886916 829886976
829893857 829893898
829928544 829928604
829935983 829936043
829937738 829937798
829942070 829942130
829948655 829948705
829956019 829956079
829981915 829981968
830037504 830037563
830044369 830044427
830057148 830057208
830058091 830058151
830062973 830063033
830096686 830096743
830113076 830113136
830116528 830116585
830124627 830124687
830143960 830144020
830145330 830145336
830191916 830191976
830194100 830194160
830200464 830200520
830204528 830204588
830210429 830210489
830273012 830273072
830280053 830280113
830294003 830294063
830324417 830324477
830334732 830334792
830360225 830360285
830361044 830361104
830365527 830365587
830387213 830387273
830393821 830393877
830434080 830434140
830437143 830437203
830440427 830440487
830450707 830450767
830460562 830460615
830469219 830469244
830534885 830534945
830542487 830542547
830545180 830545240
830547496 830547556
830548406 830548466
830551527 830551577
830574485 830574545
830575926 830575986
830602660 830602720
830612729 830612789
830617290 830617350
830661941 830662001
830702233 830702293
830705894 830705954
830717434 830717494
830719713 830719773
830722029 830722089
830727249 830727304
830770916 830770976
830777857 830777894
830800795 830800855
830811386 830811442
830815403 830815451
830857459 830857519
830862290 830862350
830872509 830872569
830882733 830882793
830889138 830889198
830892657 830892715
830895245 830895305
830904814 830904867
830906552 830906558
830985396 830985449
830999134 830999194
831005158 831005218
831008308 831008368
831022646 831022701
831038902 831038962
831096880 831096935
831099615 831099675
831104631 831104669
831138568 831138628
831141152 831141212
831144446 831144458
831147011 831147065
831151169 831151229
831152959 831153019
831162195 831162255
831171476 831171536
831174692 831174752
831176142 831176202
831180487 831180547
831208232 831208249
831242093 831242148
831247089 831247149
831263308 831263368
831264524 831264580
831273206 831273266
831277124 831277184
831312222 831312282
831323456 831323516
831331529 831331589
831343973 831344033
831350933 831350993
831396027 831396087
831401986 831402046
831412598 831412658
831419037 831419084
831420127 831420187
831454676 831454734
831465587 831465592
831475473 831475533
831483982 831484042
831510494 831510553
831518595 831518655
831552762 831552822
831569497 831569557
831582557 831582613
831588727 831588787
831616671 831616696
831621190 831621238
831630942 831631002
831669125 831669185
831688893 831688953
831699338 831699398
831747165 831747225
831765147 831765202
831790789 831790849
831811913 831811973
831848854 831848914
831850382 831850442
831911388 831911448
831923428 831923488
831933984 831934044
831938780 831938840
831982675 831982734
832001361 832001421
832008846 832008903
832012627 832012687
832017664 832017724
832019004 832019064
832029162 832029222
832031751 832031811
832037587 832037647
832049701 832049761
832052245 832052305
832054140 832054200
832072698 832072758
832100807 832100867
832109321 832109381
832116416 832116476
832162363 832162423
832175503 832175563
832197024 832197084
832199714 832199774
832205653 832205713
832234780 832234840
832271960 832272020
832284861 832284921
832295686 832295746
832300362 832300422
832331963 832332023
832338019 832338079
832345327 832345387
832350179 832350239
832370331 832370391
832427105 832427165
832454546 832454606
832458478 832458538
832461945 832462005
832465085 832465145
832472611 832472671
832479797 832479857
832493868 832493928
832504050 832504110
832520387 832520447
832542503 832542563
832553299 832553359
832555429 832555489
832601868 832601928
832613810 832613853
832619048 832619108
832620963 832621023
832625436 832625496
832627493 832627553
832630366 832630426
832640476 832640536
832643475 832643535
832650572 832650624
832658020 832658080
832688324 832688384
832690113 832690173
832698862 832698922
832702330 832702390
832706507 832706567
832713943 832714003
832716631 832716691
832718824 832718884
832772724 832772784
832801903 832801963
832821882 832821942
832823275 832823335
832852980 832853040
832858371 832858431
832860448 832860508
832865443 832865503
832882920 832882980
832939952 832940012
832954102 832954162
833009913 833009973
833016114 833016174
833020471 833020531
833026124 833026184
833051304 833051364
833058981 833059018
833061496 833061556
833137544 833137604
833140756 833140816
833144638 833144698
833147211 833147271
833148437 833148468
833210601 833210661
833227269 833227329
833228392 833228452
833233670 833233730
833235156 833235216
833269351 833269411
833320090 833320150
833369451 833369511
833386714 833386774
833389779 833389839
833393756 833393816
833396743 833396803
833414737 833414797
833425390 833425450
833446678 833446738
833451074 833451134
833574104 833574164
833576822 833576875
833578407 833578467
833580649 833580709
833658790 833658807
833663446 833663506
833681807 833681867
833728615 833728675
833742296 833742356
833749128 833749188
833753138 833753198
833756482 833756542
833811787 833811847
833827167 833827227
833833819 833833879
833836563 833836623
833839497 833839557
833845516 833845576
833868553 833868613
833885486 833885546
833947510 833947570
833957622 833957682
833987271 833987331
834091951 834092011
834095587 834095643
834156365 834156425
834183032 834183092
834270487 834270547
834281999 834282059
834294350 834294410
834307631 834307691
834322652 834322712
834326354 834326414
834346895 834346955
834350520 834350580
834353250 834353310
834358365 834358425
834390105 834390165
834435471 834435531
834450445 834450505
834518326 834518386
834520086 834520146
834525300 834525360
834530015 834530075
834596590 834596650
834624385 834624445
834635011 834635071
834691057 834691117
834744381 834744441
834779903 834779963
834781841 834781901
834795865 834795925
834800166 834800226
834811483 834811543
834833018 834833078
834839872 834839932
834846512 834846572
834953210 834953270
834963518 834963578
835009354 835009414
835039679 835039739
835099602 835099662
835100762 835100822
835212305 835212365
835247068 835247128
835374843 835374903
835393102 835393162
835411596 835411656
835413006 835413066
835443390 835443450
835475731 835475791
835479997 835480057
835489980 835490040
835495806 835495866
835499575 835499635
835501681 835501741
835545122 835545182
835567429 835567489
835643653 835643713
835647974 835648034
835721793 835721853
835770698 835770758
835818089 835818149
835848085 835848145
835895096 835895156
835900434 835900494
835954287 835954347
836039481 836039541
836080633 836080693
836108833 836108893
836118765 836118825
836188607 836188667
836247717 836247777
836261476 836261536
836293049 836293109
836331590 836331650
836335156 836335216
836352684 836352744
836375167 836375227
836412479 836412539
836426802 836426862
836454184 836454244
836459627 836459687
836461505 836461565
836485017 836485077
836601932 836601992
836709888 836709948
836769033 836769093
836771077 836771137
836776301 836776361
836853218 836853278
836861724 836861784
836928965 836929025
836932057 836932117
836943462 836943522
837025844 837025904
837033681 837033741
837038028 837038088
837086080 837086140
837110188 837110248
837134987 837135047
837160758 837160818
837164648 837164708
837223636 837223696
837227333 837227393
837333037 837333097
837344570 837344630
837369491 837369551
837384530 837384590
837452390 837452450
837458131 837458191
837547994 837548054
837569205 837569265
837579751 837579811
837723694 837723754
837801600 837801660
837815428 837815488
837832615 837832675
837834737 837834797
837843206 837843266
837865900 837865960
837924252 837924312
838041764 838041824
838064513 838064573
838078914 838078974
838087130 838087190
838108367 838108427
838153928 838153988
838174473 838174533
838238518 838238578
838257900 838257960
838294964 838295024
838325652 838325712
838373634 838373694
838399460 838399520
838406310 838406370
838415379 838415439
838419127 838419187
838469722 838469782
838569380 838569440
838607491 838607551
838609793 838609853
838629557 838629617
838635715 838635775
838683752 838683812
838688322 838688382
838713198 838713258
838756453 838756513
838831579 838831639
838844109 838844169
838911775 838911835
838923928 838923948
839020477 839020537
839025019 839025079
839073575 839073635
839103089 839103149
839127684 839127744
839185820 839185880
839193146 839193206
839201722 839201782
839258134 839258178
839267059 839267119
839284901 839284961
839296803 839296863
839297658 839297718
839299222 839299282
839300063 839300123
839300938 839300939
839302158 839302218
839304150 839304210
839337885 839337945
839342181 839342241
839347313 839347373
839370996 839371056
839564646 839564706
839618592 839618652
839626446 839626506
839629540 839629600
839630634 839630694
839680386 839680446
839718621 839718681
839721919 839721979
839801268 839801328
839808163 839808223
839828513 839828573
839848763 839848823
839863821 839863881
839869568 839869628
839885267 839885327
839971555 839971615
839977602 839977662
840039637 840039697
840047931 840047955
840049216 840049276
840078616 840078676
840081636 840081696
840176659 840176719
840194105 840194165
840196417 840196477
840197486 840197546
840200682 840200742
840222235 840222295
840224951 840225011
840230165 840230225
840231557 840231617
840238278 840238338
840243943 840244003
840317165 840317225
840403539 840403599
840488355 840488415
840491945 840492005
840500843 840500903
840502579 840502639
840576598 840576658
840671237 840671297
840734598 840734658
840736771 840736831
840737623 840737683
840740699 840740759
840752561 840752621
840836466 840836526
840857887 840857947
840882737 840882797
840926164 840926224
840931091 840931151
840932603 840932663
840995703 840995763
841063294 841063354
841085883 841085943
841141890 841141950
841143842 841143902
841147784 841147844
841178557 841178617
841236682 841236742
841242248 841242308
841262290 841262350
841305633 841305693
841342836 841342896
841471782 841471842
841533286 841533346
841554470 841554530
841585952 841586012
841691416 841691476
841767422 841767482
841777341 841777401
841792398 841792458
841811422 841811482
841827805 841827865
841863855 841863915
841922145 841922205
842036984 842037044
842046941 842047001
842048405 842048465
842103769 842103829
842189685 842189745
842205390 842205450
842219558 842219618
842236194 842236254
842294279 842294339
842295327 842295387
842303916 842303976
842325838 842325898
842385125 842385185
842409221 842409281
842428618 842428678
842443910 842443952
842458142 842458202
842468411 842468471
842472435 842472495
842478472 842478532
842485300 842485360
842495190 842495250
842521580 842521640
842561728 842561788
842586484 842586544
842652907 842652967
842666942 842667002
842670921 842670981
842678753 842678813
842689136 842689196
842740150 842740180
842762922 842762982
842803491 842803551
842814173 842814233
842816562 842816622
842821867 842821927
842823556 842823616
842825825 842825885
842832875 842832935
842900096 842900156
842907806 842907866
842910955 842911015
842915590 842915650
842917166 842917226
842922565 842922625
842928214 842928274
842967481 842967541
842981106 842981166
842986039 842986099
842988937 842988997
842994475 842994535
842995991 842996051
842997938 842997998
842999740 842999800
843025558 843025618
843105329 843105389
843108802 843108862
843132664 843132724
843167684 843167744
843174943 843175003
843223830 843223890
843251586 843251646
843257699 843257759
843272212 843272272
843421600 843421660
843427949 843428009
843429093 843429153
843435809 843435869
843443168 843443228
843445225 843445285
843460405 843460465
843506044 843506104
843507387 843507447
843512764 843512824
843514447 843514507
843571063 843571123
843589944 843590004
843604863 843604923
843635571 843635631
843642803 843642863
843644471 843644531
843656372 843656432
843669515 843669521
843674377 843674437
843703535 843703595
843709042 843709102
843710847 843710907
843721469 843721529
843722202 843722262
843729320 843729380
843742027 843742087
843795730 843795790
843801472 843801532
843802702 843802762
843833249 843833309
843836128 843836188
843837393 843837446
843855561 843855621
843887021 843887081
843901981 843902041
843906297 843906357
843912235 843912295
843921398 843921458
843965861 843965921
844007013 844007073
844010651 844010711
844013599 844013659
844015162 844015222
844015974 844016034
844017673 844017733
844024592 844024652
844035179 844035239
844051525 844051585
844097015 844097075
844121980 844122040
844245152 844245212
844310889 844310949
844423912 844423972
844430885 844430945
844439985 844440045
844457437 844457497
844463039 844463099
844464516 844464576
844485609 844485669
844497487 844497547
844508432 844508492
844514848 844514908
845360281 845360341
845377176 845377236
845398902 845398962
845421324 845421384
845446554 845446614
845476742 845476802
845478622 845478682
845492539 845492599
845504013 845504073
845533065 845533125
845541880 845541940
845560789 845560849
845636113 845636173
845657641 845657701
845665796 845665856
845668106 845668166
845669885 845669945
845674107 845674167
845700223 845700283
845889203 845889263
845892478 845892538
845899860 845899920
846013168 846013228
846016617 846016677
846020852 846020912
846095513 846095573
846106843 846106903
846188919 846188979
846191727 846191787
846311937 846311997
846334185 846334245
846342438 846342498
846449519 846449579
846457768 846457828
846510669 846510729
846529414 846529474
846544968 846545028
846623330 846623390
846632695 846632754
846675189 846675249
846689845 846689905
846692373 846692433
846698808 846698868
846745999 846746059
846751109 846751169
846826508 846826568
846834574 846834634
846853769 846853829
846920753 846920813
846924920 846924980
846930629 846930689
846936432 846936492
846941824 846941884
846951278 846951338
847041916 847041976
847096811 847096871
847120068 847120128
847230597 847230657
847237334 847237394
847317932 847317992
847381398 847381458
847383589 847383649
847402597 847402657
847417066 847417126
847421793 847421853
847469238 847469298
847604904 847604964
847622440 847622500
847637407 847637467
847639267 847639327
847661479 847661539
847731408 847731468
847734762 847734822
847744263 847744323
847753376 847753436
847797058 847797118
847802526 847802586
847811749 847811809
847823911 847823971
847834661 847834721
847837378 847837438
847841010 847841070
847883669 847883729
847900042 847900102
847915317 847915377
847922193 847922253
847945226 847945286
847955108 847955168
847998376 847998436
848004594 848004654
848069380 848069440
848086185 848086245
848095160 848095220
848099881 848099941
848116269 848116329
848155956 848156016
848219928 848219988
848229882 848229942
848237045 848237105
848311609 848311669
848317852 848317912
848319542 848319602
848324905 848324965
848325616 848325676
848330539 848330599
848335439 848335499
848348033 848348093
848418217 848418277
848424894 848424954
848430922 848430982
848439929 848439989
848458088 848458148
848466255 848466315
848492152 848492212
848527610 848527657
848581213 848581273
848619385 848619445
848623963 848624023
848629949 848630009
848638770 848638830
848648633 848648693
848673381 848673441
848684603 848684663
848691382 848691442
848701395 848701455
848735256 848735316
848736655 848736715
848741924 848741984
848744502 848744562
848750463 848750523
848755538 848755598
848785844 848785904
848789380 848789440
848842273 848842333
848846336 848846396
848850492 848850552
848853341 848853401
848855589 848855649
848865303 848865363
848876400 848876460
848896771 848896831
848918478 848918538
848922305 848922365
848942019 848942079
848944262 848944322
848970201 848970214
848970221 848970244
848981847 848981907
849037082 849037142
849044894 849044954
849050292 849050352
849053414 849053474
849076359 849076419
849089048 849089108
849147647 849147707
849212986 849213046
849214742 849214802
849248175 849248235
849299976 849300036
849396823 849396883
849413687 849413711
849443355 849443415
849470570 849470630
849477066 849477126
849554364 849554424
849564232 849564292
849568039 849568099
849637504 849637564
849705256 849705316
849711457 849711517
849719440 849719500
849726010 849726070
849729259 849729319
849750957 849751017
849773985 849774045
849786064 849786124
849870078 849870138
849892604 849892664
849901273 849901333
849906525 849906585
849950566 849950626
849958625 849958685
850020455 850020515
850061052 850061112
850063986 850064046
850101538 850101598
850137728 850137788
850153521 850153581
850161518 850161578
850164404 850164464
850170161 850170221
850172943 850173003
850182122 850182182
850187375 850187435
850197762 850197822
850271852 850271912
850275943 850276003
850282683 850282743
850317392 850317452
850330568 850330628
850331099 850331153
850346009 850346069
850370115 850370175
850395780 850395840
850405207 850405267
850488132 850488192
850490709 850490769
850514441 850514501
850517947 850518007
850532591 850532651
850602853 850602913
850642977 850643037
850666458 850666518
850674262 850674322
850677368 850677428
850679326 850679386
850692198 850692258
850694541 850694601
850697130 850697190
850715768 850715828
850744816 850744876
850749548 850749608
850757429 850757489
850759899 850759959
850777108 850777168
850780607 850780667
850825096 850825156
850841024 850841084
850853360 850853420
850856830 850856890
850880180 850880240
851033051 851033111
851038815 851038875
851071097 851071106
851239480 851239540
851262728 851262788
851276568 851276628
851286618 851286678
851332016 851332076
851338572 851338632
851341095 851341155
851343900 851343960
851346939 851346999
851353930 851353990
851362625 851362685
851395756 851395816
851408046 851408106
851464207 851464267
851513335 851513395
851519949 851520009
851522100 851522160
851646508 851646568
851660131 851660191
851665929 851665989
851670338 851670398
851674054 851674114
851697992 851698052
851729438 851729498
851778282 851778342
851784584 851784644
851785325 851785385
851787903 851787963
851934603 851934663
851970208 851970268
852025641 852025701
852051426 852051486
852065225 852065285
852147349 852147409
852156106 852156166
852212268 852212328
852263350 852263410
852276856 852276916
852312922 852312982
852323395 852323455
852325401 852325461
852358152 852358212
852393165 852393225
852435928 852435988
852440031 852440091
852458840 852458900
852489532 852489592
852490444 852490450
852493223 852493283
852497192 852497252
852502369 852502429
852509030 852509090
852520696 852520756
852566202 852566262
852574978 852575038
852576257 852576317
852577440 852577444
852580416 852580476
852583796 852583856
852595269 852595329
852627947 852628007
852633461 852633521
852652896 852652956
852661325 852661385
852669876 852669936
852679272 852679332
852697942 852698002
852715674 852715734
852716820 852716880
852745598 852745658
852752817 852752877
852758726 852758786
852794477 852794537
852825635 852825695
852920908 852920968
852931448 852931508
852953008 852953068
852998196 852998228
853067302 853067362
853196673 853196733
853263954 853264014
853272920 853272980
853280235 853280295
853290890 853290950
853315952 853316012
853414888 853414948
853444699 853444759
853453899 853453959
853478998 853479058
853483030 853483090
853522264 853522287
853595377 853595437
853668676 853668736
853673676 853673736
853758714 853758774
853781065 853781100
853838640 853838700
853949375 853949435
853954986 853955046
854041708 854041755
854123079 854123139
854249298 854249358
854292365 854292425
854306043 854306103
854311819 854311879
854408718 854408778
854427553 854427613
854476818 854476878
854478726 854478786
854482181 854482241
854483396 854483456
854504631 854504691
854584146 854584206
854617975 854618035
854658270 854658330
854666426 854666486
854705263 854705323
854706493 854706553
854751213 854751273
854770176 854770236
854794470 854794530
854910385 854910445
854916937 854916997
854919359 854919419
854926227 854926287
854987973 854988033
855004841 855004901
855011469 855011529
855030862 855030922
855086898 855086958
855158504 855158564
855199378 855199438
855220489 855220549
855243339 855243399
855258318 855258378
855268041 855268101
855312409 855312469
855414352 855414412
855461307 855461367
855476909 855476969
855526427 855526487
855544052 855544112
855620176 855620236
855689274 855689334
855706388 855706448
855778680 855778740
855783210 855783270
855809670 855809730
855824175 855824235
855862383 855862443
855867651 855867711
855869710 855869770
855901476 855901536
855907750 855907810
855943394 855943454
855948970 855949030
855953788 855953848
855954919 855954979
855987146 855987177
856006397 856006457
856067850 856067910
856075732 856075792
856105771 856105831
856127765 856127825
856133489 856133549
856135718 856135778
856142885 856142945
856150183 856150243
856167318 856167378
856210297 856210357
856218020 856218080
856223783 856223843
856233054 856233114
856258755 856258815
856276848 856276908
856294278 856294338
856320377 856320437
856323695 856323709
856331049 856331109
856382950 856383010
856396219 856396279
856401804 856401864
856410952 856411012
856414716 856414776
856436289 856436349
856451106 856451166
856466275 856466335
856471125 856471185
856500848 856500908
856527658 856527718
856536378 856536438
856544246 856544306
856571472 856571532
856583560 856583620
856591003 856591063
856613419 856613479
856695686 856695705
856698595 856698655
856702967 856703027
856718626 856718686
856726072 856726110
856727620 856727680
856728745 856728805
856778836 856778896
856826498 856826558
856876790 856876850
856900876 856900936
856908861 856908881
856912758 856912818
856922444 856922504
856928184 856928244
856987215 856987275
857006978 857007038
857094615 857094675
857131772 857131832
857215079 857215114
857257954 857258014
857262578 857262638
857268756 857268816
857334863 857334923
857362590 857362650
857366060 857366120
857402320 857402380
857406399 857406459
857435160 857435220
857436305 857436365
857445536 857445596
857461638 857461698
857502278 857502338
857505358 857505418
857507440 857507500
857509712 857509772
857516468 857516528
857531000 857531061
857544318 857544378
857551751 857551795
857559112 857559172
857581950 857582010
857592025 857592085
857596866 857596926
857632738 857632798
857636282 857636342
857639279 857639339
857645386 857645446
857651986 857652046
857667222 857667282
857673193 857673253
857678540 857678600
857681977 857682037
857686135 857686195
857695415 857695475
857706516 857706576
857715449 857715509
857735236 857735296
857738960 857739020
857742976 857743036
857754971 857755031
857763704 857763718
857790188 857790248
857862258 857862318
857898476 857898536
857932453 857932513
857940884 857940944
857946407 857946467
857949005 857949065
857995187 857995247
858024570 858024630
858031450 858031510
858107523 858107583
858115474 858115534
858132533 858132593
858164972 858165032
858184949 858185009
858207120 858207180
858216953 858217013
858219590 858219650
858268923 858268983
858291743 858291803
858377747 858377807
858390301 858390361
858465344 858465404
858467772 858467832
858469980 858470040
858489716 858489776
858531992 858532052
858535202 858535262
858556012 858556072
858594412 858594472
858607717 858607777
858617648 858617708
858620331 858620391
858626600 858626660
858643024 858643084
858693313 858693373
858724899 858724959
858741221 858741281
858765939 858765999
858784958 858785018
858797893 858797953
858805103 858805163
858819150 858819210
858885475 858885535
858892047 858892107
858951682 858951742
858961212 858961272
858963278 858963338
858964075 858964082
858966235 858966270
858973747 858973807
859068934 859068994
859075079 859075139
859082292 859082352
859082770 859082800
859084662 859084722
859093631 859093691
859094893 859094949
859095833 859095893
859123565 859123625
859127606 859127666
859140840 859140902
859145806 859145868
859155383 859155443
859182021 859182081
859231873 859231933
859242735 859242795
859281312 859281372
859312503 859312563
859320079 859320139
859348498 859348558
859399891 859399951
859431696 859431756
859474760 859474820
859477483 859477543
859495948 859496008
859551294 859551354
859575967 859576027
859591310 859591370
859607343 859607403
859704438 859704498
859720384 859720444
859751573 859751633
859761427 859761487
859781228 859781288
859787041 859787081
859831548 859831608
859848794 859848854
859898924 859898984
859934437 859934497
860000699 860000759
860010941 860011001
860060431 860060491
860091080 860091140
860149641 860149701
860160301 860160361
860162563 860162623
860166802 860166862
860168633 860168693
860284275 860284335
860292886 860292946
860341438 860341498
860342939 860342999
860357828 860357888
860364186 860364247
860366103 860366163
860371146 860371206
860440141 860440202
860453946 860454006
860478515 860478575
860489416 860489476
860497397 860497457
860506885 860506945
860509614 860509674
860527249 860527309
860543474 860543534
860550796 860550856
860552132 860552192
860585159 860585219
860624018 860624078
860675445 860675505
860710758 860710818
860736217 860736250
860759654 860759714
860789248 860789308
860796742 860796802
860857325 860857385
860878969 860879029
860894385 860894445
860921017 860921077
860944644 860944704
860947934 860947994
860970655 860970715
861038186 861038246
861040840 861040900
861044608 861044668
861055378 861055438
861064744 861064804
861071769 861071829
861073772 861073832
861084145 861084197
861089085 861089145
861111659 861111719
861131156 861131216
861133786 861133846
861140970 861141030
861175470 861175530
861214896 861214956
861233067 861233095
861278742 861278802
861306814 861306874
861315666 861315726
861390902 861390962
861398660 861398720
861424412 861424472
861428410 861428470
861489511 861489571
861495173 861495233
861501192 861501252
861504640 861504700
861544033 861544093
861566147 861566207
861577206 861577266
861616328 861616388
861625541 861625601
861629534 861629594
861641295 861641355
861644359 861644419
861647475 861647535
861650055 861650115
861652849 861652909
861654505 861654565
861739717 861739777
861750643 861750703
861824143 861824203
861842993 861843053
861866540 861866600
861886107 861886167
861919854 861919914
861924458 861924518
861931710 861931770
861946215 861946275
861992478 861992538
861996829 861996889
862009858 862009918
862139763 862139823
862158396 862158456
862163174 862163234
862167772 862167832
862176979 862177039
862179385 862179445
862187255 862187315
862207552 862207612
862258284 862258344
862262497 862262557
862278783 862278845
862312755 862312815
862324809 862324869
862351842 862351902
862381046 862381106
862384674 862384736
862404399 862404460
862408442 862408502
862462557 862462617
862521755 862521815
862524712 862524772
862533330 862533390
862543157 862543217
862556131 862556191
862565756 862565816
862567962 862568022
862583582 862583642
862599839 862599899
862605814 862605874
862646104 862646164
862668036 862668096
862689649 862689709
862698635 862698695
862700995 862701055
862704801 862704861
862705913 862705973
862716177 862716237
862732269 862732329
862768744 862768804
862773032 862773092
862813863 862813923
862855377 862855437
862858252 862858312
862869960 862870020
862880031 862880091
862896953 862897013
862942141 862942201
862944065 862944125
862947191 862947251
862948287 862948347
862954083 862954143
862976593 862976653
863034334 863034394
863052252 863052312
863073062 863073122
863091451 863091511
863119387 863119447
863201495 863201555
863202468 863202528
863205151 863205211
863216903 863216963
863295628 863295688
863301748 863301808
863317326 863317386
863371736 863371796
863377844 863377904
863457715 863457775
863539824 863539884
863547479 863547539
863635447 863635507
863637292 863637352
863669716 863669776
863683899 863683959
863713610 863713670
863734057 863734117
863770743 863770803
863805533 863805593
863830533 863830593
863848265 863848325
863931086 863931146
863938064 863938077
863945495 863945555
863979229 863979289
863982895 863982955
863984317 863984377
863993696 863993756
864014602 864014662
864058934 864058994
864069269 864069329
864107830 864107869
864131930 864131990
864146415 864146475
864149818 864149878
864158744 864158804
864168510 864168570
864253380 864253440
864280474 864280534
864305699 864305759
864314410 864314470
864325457 864325517
864328132 864328192
864339147 864339207
864340074 864340134
864416162 864416222
864434036 864434096
864436544 864436604
864464092 864464152
864585167 864585227
864592224 864592284
864594216 864594247
864604501 864604561
864606874 864606934
864612105 864612165
864628151 864628211
864673397 864673457
864678493 864678553
864751117 864751177
864761208 864761268
864777331 864777348
864778485 864778545
864859003 864859063
864921781 864921841
864963044 864963104
864969383 864969413
865019865 865019925
865029009 865029069
865030555 865030615
865055913 865055973
865085794 865085854
865090812 865090819
865129534 865129594
865134125 865134185
865181756 865181816
865183385 865183445
865196704 865196758
865198231 865198291
865199346 865199406
865330252 865330278
865345136 865345196
865364555 865364615
865373974 865374032
865397937 865397997
865465000 865465060
865474584 865474644
865490923 865490983
865542412 865542472
865556986 865557046
865613926 865613986
865625851 865625911
865668320 865668380
865684147 865684207
865695466 865695526
865720661 865720721
865743272 865743332
865795258 865795318
865798597 865798657
865808613 865808673
865824140 865824200
865828687 865828747
865829346 865829370
865853689 865853749
865864187 865864247
865876471 865876531
865893461 865893521
865947161 865947221
865971866 865971926
865982156 865982216
866032160 866032220
866075611 866075671
866078303 866078363
866086210 866086260
866110304 866110364
866123082 866123142
866125729 866125751
866150346 866150406
866159704 866159764
866160678 866160703
866162757 866162817
866164106 866164166
866183493 866183553
866209886 866209946
866231491 866231551
866235940 866236000
866259290 866259344
866325852 866325912
866333429 866333489
866386657 866386698
866410855 866410915
866477740 866477775
866524429 866524489
866567527 866567559
866583610 866583670
866593618 866593678
866600529 866600589
866601268 866601328
866603923 866603983
866605003 866605065
866672653 866672713
866698367 866698427
866711229 866711289
866736358 866736418
866762301 866762361
866770902 866770962
866774004 866774064
866776121 866776181
866836079 866836118
867056146 867056206
867119969 867120029
867143064 867143124
867206297 867206357
867212030 867212090
867246565 867246625
867275281 867275341
867285541 867285601
867298912 867298972
867319710 867319770
867364036 867364096
867378740 867378800
867449502 867449562
867501078 867501138
867558621 867558681
867628333 867628393
867687352 867687412
867708140 867708200
867710056 867710116
867771629 867771689
867795569 867795629
867815947 867816007
867956588 867956630
868045637 868045697
868054730 868054790
868060729 868060789
868114655 868114712
868143014 868143074
868144420 868144480
868212958 868213018
868216332 868216392
868232553 868232613
868236135 868236195
868247612 868247672
868253626 868253686
868262587 868262647
868300713 868300773
868305121 868305181
868391864 868391924
868399263 868399323
868472236 868472296
868527476 868527536
868540434 868540494
868584238 868584298
868602656 868602716
868608329 868608389
868612549 868612609
868631269 868631329
868651794 868651854
868661416 868661476
868701115 868701175
868744975 868745035
868753197 868753257
868851520 868851581
868909083 868909143
868919304 868919364
868987938 868987998
869006634 869006694
869020147 869020207
869060184 869060244
869067970 869068030
869164268 869164328
869177717 869177777
869233949 869234009
869255603 869255663
869282746 869282807
869342297 869342357
869367563 869367623
869442583 869442643
869464513 869464573
869505180 869505240
869524247 869524307
869535536 869535596
869540662 869540722
869600553 869600613
869604813 869604873
869613835 869613895
869616212 869616272
869617315 869617375
869648646 869648706
869661132 869661191
869720525 869720585
869773202 869773262
869858149 869858209
869868588 869868648
869871399 869871459
869922541 869922601
869954328 869954388
869986862 869986922
869991980 869992040
870024060 870024120
870038632 870038692
870058070 870058130
870060505 870060565
870067936 870067996
870071411 870071471
870103360 870103420
870122239 870122299
870214670 870214730
870261846 870261906
870273214 870273274
870289948 870290008
870292436 870292496
870342064 870342124
870453042 870453102
870467359 870467419
870526803 870526863
870559960 870560020
870568758 870568818
870578093 870578153
870628961 870629021
870645588 870645648
870716094 870716154
870788303 870788363
870813903 870813963
870815140 870815200
870824895 870824955
870891354 870891414
870905891 870905952
870939856 870939916
870956250 870956310
870980946 870981006
870991863 870991923
871061176 871061236
871075785 871075845
871105514 871105574
871236580 871236640
871243377 871243437
871257090 871257150
871272584 871272644
871277272 871277332
871289516 871289576
871293869 871293929
871300038 871300098
871312936 871312996
871352612 871352672
871356178 871356238
871392537 871392597
871404307 871404367
871409345 871409405
871414262 871414322
871441390 871441450
871522409 871522469
871590221 871590281
871597039 871597099
871619243 871619303
871653599 871653659
871671963 871672023
871679559 871679619
871685622 871685682
871695345 871695405
871718919 871718979
871803452 871803512
871920929 871920989
871933623 871933683
872015101 872015161
872049046 872049106
872092850 872092910
872103940 872104000
872129907 872129967
872142077 872142137
872167727 872167787
872183026 872183086
872201779 872201839
872299521 872299581
872304662 872304722
872315302 872315362
872331527 872331587
872345419 872345479
872367509 872367569
872373214 872373274
872419702 872419762
872442748 872442808
872461144 872461204
872635307 872635367
872643746 872643806
872704618 872704678
872712898 872712958
872731075 872731135
872816856 872816916
872871841 872871901
872885711 872885771
872894674 872894734
872917969 872918020
872953171 872953209
872979744 872979804
872997168 872997228
873039616 873039676
873060143 873060203
873137019 873137079
873141055 873141115
873222803 873222863
873245519 873245579
873257891 873257951
873274671 873274731
873318377 873318437
873413425 873413485
873424694 873424754
873489605 873489665
873582958 873583018
873618047 873618107
873631731 873631791
873645609 873645669
873648685 873648745
873651369 873651429
873657065 873657125
873665918 873665978
873670073 873670133
873677241 873677301
873689348 873689408
873690831 873690891
873713209 873713269
873733422 873733482
873736059 873736119
873745560 873745620
873769229 873769289
873786009 873786069
873806565 873806625
873814201 873814261
873834710 873834770
873844455 873844515
873903778 873903838
873964053 873964113
873995505 873995565
874015252 874015312
874023711 874023771
874087501 874087561
874189064 874189124
874272814 874272874
874275375 874275435
874313379 874313439
874347642 874347702
874352697 874352757
874354084 874354144
874360610 874360670
874436821 874436881
874439917 874439977
874478737 874478797
874501428 874501488
874514034 874514094
874524753 874524813
874526251 874526311
874530147 874530207
874536231 874536291
874567507 874567567
874622856 874622916
874650062 874650122
874687136 874687196
874695921 874695981
874706715 874706775
874802125 874802185
874817559 874817619
874846160 874846220
874867567 874867627
874878280 874878340
874901622 874901682
874952374 874952434
874959018 874959078
874977319 874977379
874979307 874979367
874985526 874985586
874987865 874987925
875022592 875022652
875041660 875041720
875056001 875056061
875103991 875104051
875109274 875109334
875120243 875120303
875154030 875154090
875166320 875166380
875167223 875167238
875182004 875182064
875200507 875200567
875230256 875230316
