862247058 862247075
862247556 862247573
862247681 862247698
862247997 862248014
862248119 862248136
862249775 862249792
862294256 862294273
862294376 862294393
862294922 862294939
862295077 862295094
862295328 862295345
862325152 862325169
862326121 862326138
862328707 862328724
862328844 862328861
862335213 862335230
862335562 862335579
862337815 862337832
863209685 863209702
863210401 863210418
863210754 863210771
863211237 863211254
863299312 863299329
863368189 863368206
863385809 863385826
863386466 863386483
863386535 863386552
863386636 863386653
863386743 863386760
863386841 863386858
863386978 863386995
863388735 863388752
863693216 863693233
863962821 863962838
864255737 864255754
864314147 864314164
864502160 864502177
864563045 864563062
864583588 864583605
864667173 864667190
864668035 864668052
864668085 864668102
864668148 864668165
864673808 864673825
864678577 864678594
864678880 864678897
864990346 864990363
864995902 864995919
864997012 864997029
865192911 865192928
865193251 865193268
865193923 865193940
865194245 865194262
865194549 865194566
865194679 865194696
865194746 865194763
865194893 865194910
865194959 865194976
865195026 865195043
865195108 865195125
865195387 865195404
865205646 865205663
865209060 865209077
865381208 865381225
865381334 865381351
865381834 865381851
865381840 865381857
865382099 865382116
865382228 865382245
865382312 865382329
865382350 865382367
865382434 865382451
865382453 865382470
865382557 865382574
865464811 865464828
865467017 865467034
865467155 865467172
865467906 865467923
865467958 865467975
865467975 865467992
865468361 865468378
865468824 865468841
865468941 865468958
865468948 865468965
865469042 865469059
865469346 865469363
865469908 865469925
865471763 865471780
865471792 865471809
865474866 865474883
865537433 865537450
865631607 865631624
865631809 865631826
865632033 865632050
865632482 865632499
865632571 865632588
865635284 865635301
865636981 865636998
865812172 865812189
865812496 865812513
865812656 865812673
865812710 865812727
865813126 865813143
865816430 865816447
865816605 865816622
865816789 865816806
865816917 865816934
865817549 865817566
865818144 865818161
865818532 865818549
866134274 866134291
866152684 866152701
866217481 866217498
866220250 866220267
866220802 866220819
866221091 866221108
866221132 866221149
866221206 866221225
866232972 866232989
866245301 866245318
866321095 866321112
866322831 866322848
866324104 866324121
866329231 866329248
866329377 866329394
866329478 866329495
866329602 866329619
866329875 866329892
866330930 866330947
866331242 866331259
866331365 866331382
866331410 866331427
866331444 866331461
866331632 866331649
866331807 866331824
866331894 866331911
866331942 866331959
866335634 866335651
866336023 866336040
866336899 866336916
866337063 866337081
866337302 866337319
866337513 866337530
866337861 866337878
866725101 866725118
866840004 866840021
866852244 866852261
866996038 866996055
867003775 867003792
867181078 867181095
867181205 867181225
867181260 867181277
867181329 867181346
867181461 867181478
867181643 867181660
867182505 867182522
867182599 867182616
867182671 867182688
867182708 867182725
867182762 867182779
867182816 867182833
867183073 867183090
867183208 867183225
867183411 867183428
867184340 867184357
867184499 867184516
867184571 867184588
867184702 867184719
867184897 867184914
867185094 867185111
867189587 867189604
867351834 867351851
867352018 867352035
867454900 867454917
867454987 867455004
867455105 867455122
867455137 867455154
867455181 867455198
867455232 867455249
867455274 867455291
867455307 867455324
867455411 867455428
867455460 867455477
867455476 867455493
867455508 867455525
867455587 867455608
867455606 867455623
867455674 867455691
867455693 867455710
867455782 867455799
867455905 867455922
867456022 867456039
867456230 867456247
867456393 867456410
867456865 867456882
867457737 867457754
867610805 867610822
867612736 867612753
867613413 867613430
867613543 867613560
867613948 867613965
867614029 867614046
867614679 867614696
867614839 867614857
867614977 867614994
867615018 867615035
867615097 867615114
867958890 867958907
867960511 867960528
867960672 867960689
867960751 867960768
867960858 867960875
867962523 867962540
867963357 867963374
867963404 867963421
867963454 867963471
867963477 867963496
867969232 867969249
868039330 868039347
868041695 868041712
868042135 868042152
868042670 868042687
868042988 868043005
868048091 868048108
868048304 868048321
868050116 868050133
868050222 868050239
868050333 868050350
868050866 868050883
868050952 868050969
868051047 868051064
868051089 868051107
868051148 868051165
868051190 868051207
868051355 868051372
868051871 868051888
868051986 868052003
868052776 868052793
868054135 868054152
868054192 868054209
868054473 868054490
868054588 868054605
868054892 868054909
868054935 868054952
868055022 868055039
868055123 868055140
868055159 868055176
868055206 868055223
868055330 868055347
868077816 868077833
868147392 868147409
868147430 868147447
868244467 868244484
868302560 868302577
868302686 868302703
868302695 868302712
868302812 868302829
868302892 868302909
868302934 868302951
868302998 868303015
868303109 868303126
868303133 868303150
868303233 868303250
868303361 868303378
868303480 868303497
868303538 868303555
868303600 868303617
868304335 868304352
868304900 868304917
868306138 868306155
868306512 868306529
868307549 868307566
868307599 868307616
868307884 868307901
868309473 868309490
868309587 868309604
868309735 868309752
868309930 868309947
868313718 868313735
868313911 868313928
868314052 868314069
868318569 868318586
868319289 868319306
868319345 868319362
868330079 868330096
868469362 868469379
868538750 868538767
868540083 868540103
868556662 868556679
868558706 868558723
868560135 868560152
868560809 868560826
868561207 868561224
868565492 868565509
869007322 869007339
869515997 869516014
869705190 869705207
869851893 869851910
869854478 869854495
869854753 869854770
869854789 869854806
869854954 869854971
869855047 869855064
869855230 869855247
869855302 869855319
869855411 869855428
869855484 869855501
869855512 869855529
869855541 869855558
869855581 869855598
869880221 869880238
869881855 869881872
869882193 869882210
869882271 869882288
869882489 869882506
869882730 869882747
869882778 869882795
869885545 869885562
869921167 869921184
869926256 869926273
870044247 870044264
870044502 870044519
870049690 870049707
870127134 870127152
870128570 870128587
870128849 870128866
870129943 870129960
870401996 870402013
870404587 870404604
870471487 870471504
870471491 870471508
870558583 870558600
870581655 870581672
870928648 870928665
870943470 870943487
870954316 870954333
871042205 871042222
871086747 871086764
871089888 871089905
871181711 871181728
871459067 871459084
871466292 871466309
871492677 871492694
871529333 871529352
871542998 871543015
871595108 871595125
871595185 871595202
871595335 871595352
871595442 871595459
871595531 871595548
871643553 871643570
871713772 871713789
871778579 871778596
871797524 871797541
871804661 871804678
871819514 871819531
871825404 871825421
871898246 871898263
872051240 872051257
872080664 872080681
872088540 872088557
872113430 872113447
872114189 872114206
872115920 872115937
872143129 872143146
872192485 872192502
872192832 872192849
872193375 872193392
872193451 872193468
872193587 872193604
872193724 872193741
872193793 872193810
872193862 872193879
872199333 872199350
872199704 872199721
872199836 872199853
872200170 872200187
872201594 872201611
872201806 872201823
872201824 872201841
872201861 872201878
872201964 872201981
872201983 872202000
872249867 872249884
872258538 872258555
872276405 872276422
872284873 872284891
872287595 872287612
872287608 872287625
872287645 872287662
872287662 872287679
872287688 872287707
872287716 872287733
872289760 872289777
872289891 872289908
872290505 872290522
872290735 872290752
872312910 872312927
872379207 872379224
872431318 872431335
872443932 872443949
872443978 872443995
872444031 872444048
872444062 872444079
872444260 872444277
872444302 872444319
872444439 872444456
872444496 872444513
872444683 872444700
872444746 872444763
872444867 872444884
872444917 872444934
872444976 872444993
872445059 872445076
872445163 872445180
872445266 872445283
872445465 872445482
872445562 872445579
872445612 872445629
872445710 872445727
872445733 872445750
872445766 872445783
872445894 872445911
872448725 872448742
872548578 872548595
872572176 872572193
872656170 872656187
872656237 872656254
872656367 872656384
872656465 872656482
872656597 872656614
872656798 872656815
872656853 872656870
872656993 872657010
872657183 872657200
872657293 872657310
872657485 872657502
872657581 872657598
872658051 872658068
872658342 872658359
872658601 872658618
872662720 872662737
872707922 872707939
872707961 872707978
872708001 872708018
872708090 872708107
872708131 872708148
872708197 872708214
872708269 872708286
872708571 872708588
872709005 872709022
872709020 872709037
872709035 872709052
872709052 872709069
872709068 872709085
872709086 872709103
872709103 872709120
872709114 872709131
872709133 872709150
872709150 872709167
872709176 872709193
872709215 872709232
872709271 872709288
872709315 872709332
872709424 872709441
872718702 872718719
872718958 872718975
872721652 872721669
872725312 872725329
872773253 872773273
872805250 872805267
872893044 872893061
872900349 872900366
872900395 872900412
872900623 872900640
872906450 872906467
872972759 872972776
872972783 872972800
872972819 872972836
872972853 872972870
872972933 872972950
872973041 872973058
872973151 872973168
872973505 872973522
872973552 872973569
872973584 872973601
872973597 872973614
872973616 872973633
872973678 872973695
872973715 872973732
872973731 872973748
872973765 872973782
872973917 872973934
872973945 872973962
872973995 872974012
872974017 872974034
872974035 872974052
872974190 872974207
872974224 872974241
872974291 872974308
872974370 872974387
872974490 872974507
872974752 872974769
872977797 872977814
872977850 872977867
872977912 872977929
872978188 872978205
872978325 872978342
872978362 872978379
872978974 872978991
872979566 872979583
872981252 872981269
873236089 873236106
873236948 873236965
873242724 873242741
873242994 873243011
873243564 873243581
873243696 873243713
873243841 873243858
873378352 873378369
873671783 873671800
873733291 873733308
873744468 873744485
873749724 873749741
873817077 873817094
874088919 874088936
874410677 874410694
874564968 874564985
874691455 874691474
874746506 874746523
874750973 874750990
875123401 875123418
875127864 875127883
