831361166 831361183
831361492 831361509
831361628 831361645
831361635 831361652
831361877 831361894
831361896 831361913
831362105 831362122
831362111 831362128
831362187 831362204
831362287 831362304
831362328 831362345
831362366 831362383
831362389 831362406
831362654 831362674
831362810 831362827
831362884 831362903
831362907 831362924
831362960 831362977
831362965 831362982
831362970 831362987
831420708 831420725
831475034 831475051
831475309 831475326
831475726 831475743
831477762 831477782
831477791 831477808
831477800 831477820
831477843 831477860
831477864 831477882
831478229 831478246
831478253 831478270
831478388 831478405
831478595 831478613
831485082 831485099
831485316 831485333
831485497 831485514
831485797 831485814
831485881 831485898
831500663 831500680
831501679 831501696
831501987 831502004
831502006 831502023
831502066 831502083
831505537 831505554
831505900 831505917
831506372 831506389
831507273 831507290
831507278 831507295
831507302 831507319
831507306 831507323
831507321 831507339
831507331 831507348
831507646 831507663
831507764 831507781
831507810 831507827
831507825 831507842
831507829 831507846
831507907 831507924
831507911 831507928
831507920 831507937
831507972 831507989
831508035 831508052
831508052 831508069
831508068 831508088
831508075 831508092
831508093 831508110
831508108 831508125
831508116 831508133
831508187 831508204
831508201 831508218
831508215 831508232
831508232 831508249
831508236 831508255
831508338 831508355
831510963 831510980
831512302 831512319
831512310 831512330
831512325 831512342
831512343 831512360
831512355 831512372
831512367 831512384
831512382 831512400
831512389 831512406
831512410 831512427
831513395 831513412
831513399 831513417
831513425 831513446
831513447 831513464
831513451 831513468
831513915 831513932
831513937 831513954
831514153 831514170
831514180 831514197
831514184 831514201
831515912 831515929
831516155 831516172
831516160 831516177
831516276 831516293
831516329 831516346
831516354 831516371
831516368 831516385
831516373 831516390
831516426 831516443
831516430 831516447
831522864 831522881
831531775 831531792
831535712 831535729
831535797 831535814
831535909 831535926
831536043 831536062
831537477 831537494
831537545 831537562
831537681 831537698
831538530 831538547
831539506 831539523
831539511 831539528
831540338 831540357
831540623 831540640
831542453 831542470
831542538 831542555
831544089 831544106
831544538 831544555
831545169 831545187
831547259 831547276
831547397 831547414
831547795 831547812
831547954 831547971
831547975 831547992
831547988 831548005
831550612 831550629
831556138 831556155
831556166 831556183
831556183 831556200
831556352 831556369
831556364 831556381
831559936 831559953
831560192 831560209
831560771 831560788
831560839 831560856
831561032 831561049
831561125 831561142
831561130 831561147
831561290 831561307
831561322 831561339
831561381 831561398
831561430 831561447
831562029 831562046
831562058 831562075
831562876 831562893
831562894 831562911
831562988 831563005
831564015 831564032
831565450 831565467
831565650 831565667
831565654 831565672
831565698 831565715
831565772 831565789
831565802 831565819
831565903 831565920
831565910 831565927
831565924 831565941
831565941 831565958
831566017 831566034
831566027 831566044
831566136 831566153
831566208 831566225
831566407 831566424
831566538 831566555
831566624 831566643
831566717 831566734
831566764 831566781
831568261 831568278
831571530 831571547
831571833 831571850
831571871 831571888
831577994 831578011
831578015 831578032
831578057 831578074
831578316 831578333
831578433 831578450
831578457 831578474
831580015 831580032
831580087 831580104
831580458 831580475
831581722 831581739
831582647 831582664
831583713 831583730
831583802 831583819
831583813 831583830
831584036 831584053
831584084 831584101
831584311 831584328
831584353 831584371
831584541 831584558
831584549 831584566
831585172 831585190
831585335 831585352
831585386 831585403
831586080 831586097
831586189 831586206
831587036 831587053
831587073 831587090
831587178 831587196
831588170 831588187
831588347 831588364
831588363 831588381
831588385 831588402
831589469 831589486
831589549 831589566
831589555 831589574
831590589 831590606
831602104 831602122
831602119 831602136
831602161 831602178
831604196 831604213
831607604 831607621
831610253 831610270
831621011 831621028
831626218 831626235
831637751 831637768
831649907 831649924
831649937 831649954
831671993 831672010
831672115 831672132
831672146 831672163
831672175 831672192
831672183 831672200
831672739 831672756
831673894 831673911
831673975 831673994
831674000 831674017
831674021 831674038
831674075 831674092
831674168 831674185
831674752 831674769
831676012 831676029
831676340 831676357
831680120 831680138
831680134 831680151
831680154 831680171
831680216 831680234
831680266 831680283
831680494 831680511
831680526 831680543
831680530 831680547
831680558 831680581
831680582 831680599
831680586 831680603
831680600 831680617
831680619 831680636
831680624 831680642
831680630 831680647
831680645 831680662
831680653 831680670
831680662 831680679
831680690 831680707
831680709 831680727
831680743 831680760
831680862 831680879
831680878 831680895
831680904 831680921
831681225 831681242
831681290 831681310
831681755 831681772
831682075 831682092
831684225 831684242
831684253 831684270
831684260 831684277
831684271 831684288
831684276 831684293
831684302 831684319
831684307 831684327
831684361 831684378
831684406 831684423
831684431 831684452
831684446 831684463
831684464 831684481
831684501 831684518
831684509 831684526
831684519 831684537
831684531 831684551
831684554 831684571
831689085 831689102
831689913 831689937
831689927 831689944
831689952 831689969
831689973 831689990
831690158 831690175
831690192 831690209
831690211 831690228
831690424 831690444
831690556 831690573
831690575 831690592
831690584 831690601
831690620 831690637
831690683 831690700
831690745 831690762
831690767 831690784
831690783 831690800
831692061 831692078
831693055 831693072
831693612 831693629
831696612 831696629
831696646 831696664
831696674 831696691
831696779 831696796
831696815 831696832
831697218 831697235
831697822 831697839
831697982 831697999
831702351 831702368
831702357 831702374
831702363 831702381
831704144 831704161
831704199 831704216
831704246 831704263
831704497 831704517
831704597 831704614
831704681 831704698
831704698 831704715
831704762 831704779
831705167 831705184
831705177 831705194
831705204 831705222
831705629 831705646
831706438 831706455
831706444 831706461
831708433 831708450
831708886 831708903
831708934 831708951
831711253 831711270
831711449 831711466
831711464 831711486
831711486 831711503
831711495 831711512
831712996 831713013
831713818 831713835
831713829 831713846
831713852 831713870
831713869 831713890
831714429 831714446
831714441 831714459
831714451 831714468
831715527 831715544
831715999 831716016
831716003 831716020
831716067 831716084
831716205 831716222
831716219 831716236
831716232 831716250
831716241 831716258
831716253 831716270
831716282 831716301
831720512 831720529
831720564 831720581
831720581 831720599
831720631 831720648
831721318 831721335
831721369 831721389
831721398 831721415
831721561 831721578
831721667 831721684
831721903 831721920
831722877 831722894
831722884 831722901
831722901 831722918
831722937 831722954
831723054 831723071
831723065 831723082
831723318 831723337
831723338 831723356
831723355 831723373
831724139 831724157
831725917 831725934
831727360 831727378
831727429 831727446
831727466 831727483
831727974 831727992
831728496 831728513
831730698 831730715
831731324 831731341
831731333 831731350
831731751 831731769
831731852 831731869
831731862 831731879
831731866 831731883
831731878 831731896
831731883 831731900
831731887 831731904
831731899 831731917
831731906 831731925
831731915 831731935
831731926 831731943
831731930 831731947
831731939 831731956
831731945 831731962
831734068 831734085
831734184 831734201
831756533 831756550
831756672 831756689
831756855 831756872
831757589 831757607
831757825 831757842
831757893 831757910
831757914 831757933
831758163 831758180
831758208 831758225
831758274 831758291
831758466 831758483
831758558 831758575
831765020 831765037
831765033 831765050
831765119 831765138
831768786 831768803
831768802 831768819
831768864 831768881
831769444 831769461
831769448 831769471
831769593 831769610
831770041 831770058
831770294 831770311
831770786 831770804
831770931 831770948
831770936 831770953
831770950 831770967
831772154 831772171
831778087 831778104
831780220 831780237
831780273 831780291
831780710 831780727
831780983 831781000
831782558 831782575
831783610 831783627
831785660 831785677
831788177 831788195
831788351 831788369
831793871 831793888
831795292 831795309
831800758 831800775
831810329 831810346
831810338 831810355
831810342 831810359
831864909 831864926
831865365 831865382
831865447 831865464
831865531 831865548
831865697 831865714
831865740 831865757
831865819 831865836
831865983 831866000
831866075 831866092
831866109 831866126
831866149 831866166
831866966 831866983
831867024 831867041
831867036 831867053
831867052 831867069
831867067 831867084
831867076 831867093
831867201 831867218
831867270 831867287
831868541 831868558
831868653 831868670
831868692 831868709
831868707 831868724
831868733 831868750
831868842 831868859
831868897 831868914
831868913 831868930
831868974 831868991
831868998 831869017
831869097 831869114
831869164 831869181
831869335 831869352
831870027 831870044
831870241 831870259
831870337 831870354
831870389 831870406
831870410 831870427
831870434 831870451
831870448 831870465
831870499 831870516
831870513 831870530
831870756 831870773
831870768 831870785
831871136 831871153
831871198 831871215
831871230 831871247
831871505 831871522
831878826 831878843
831879031 831879048
831880051 831880073
831880109 831880126
831880119 831880136
831880184 831880201
831881305 831881322
831888355 831888372
831892925 831892942
831892942 831892959
831892953 831892970
831894158 831894175
831948078 831948095
831949081 831949098
831952313 831952330
831952323 831952342
831965041 831965058
831969085 831969102
831969092 831969109
831969119 831969136
831970155 831970172
831970164 831970181
831984169 831984186
831984830 831984847
831984893 831984910
831988760 831988777
831988948 831988965
832045817 832045834
832069658 832069675
832069672 832069689
832117325 832117342
832154538 832154557
832154556 832154573
832155492 832155509
832156986 832157003
832158386 832158403
832160952 832160969
832161952 832161969
832162644 832162661
832163632 832163649
832164113 832164130
832207680 832207697
832247376 832247393
832327900 832327917
832420492 832420509
832448668 832448685
832448928 832448945
832534276 832534293
832536633 832536650
832583017 832583034
832648411 832648428
832693606 832693623
832728714 832728731
832728999 832729016
832729022 832729040
832729052 832729069
832736436 832736453
832784766 832784783
832784910 832784927
832785138 832785155
832796252 832796269
832859835 832859852
832878290 832878307
832936227 832936244
832936237 832936254
832962091 832962108
832962151 832962168
832996404 832996421
833074005 833074022
833075176 833075193
833080353 833080370
833083405 833083423
833083959 833083976
833093924 833093941
833144696 833144713
833148492 833148509
833170448 833170465
833172547 833172564
833172577 833172594
833177262 833177279
833183381 833183398
833186904 833186921
833187210 833187227
833187380 833187397
833193047 833193064
833193432 833193449
833194131 833194148
833194235 833194252
833194505 833194522
833197721 833197738
833197951 833197968
833241765 833241782
833255289 833255306
833259329 833259346
833259485 833259502
833259636 833259653
833259705 833259722
833259739 833259756
833259942 833259959
833261400 833261417
833262097 833262114
833263800 833263817
833268700 833268717
833268713 833268730
833268847 833268864
833268898 833268916
833269224 833269241
833271849 833271866
833272357 833272374
833272362 833272379
833272645 833272662
833272762 833272779
833273063 833273080
833273145 833273162
833273220 833273237
833273954 833273971
833274093 833274113
833274101 833274118
833274119 833274136
833274130 833274147
833274174 833274191
833274209 833274226
833274214 833274231
833274233 833274253
833274240 833274257
833274245 833274262
833274257 833274277
833274942 833274959
833274956 833274973
833278023 833278041
833278043 833278060
833278057 833278075
833285562 833285580
833286927 833286944
833288029 833288046
833288048 833288072
833288206 833288223
833288769 833288786
833288778 833288795
833301680 833301698
833301701 833301718
833301868 833301885
833301977 833301994
833302694 833302711
833303366 833303383
833303372 833303389
833303404 833303421
833303496 833303513
833303501 833303518
833303774 833303791
833303823 833303840
833303864 833303881
833311236 833311253
833312821 833312838
833317265 833317282
833317325 833317343
833320658 833320675
833323570 833323587
833328055 833328072
833346399 833346416
833348841 833348858
833541450 833541467
833561453 833561470
833564610 833564627
833566156 833566175
833578252 833578269
833578826 833578843
833585459 833585476
833588646 833588663
833588687 833588705
833609070 833609087
833634345 833634362
833634367 833634384
833636940 833636958
833636992 833637010
833637012 833637029
833637515 833637532
833673089 833673106
833673770 833673787
833676583 833676600
833692568 833692585
833703983 833704000
833714734 833714751
833777995 833778012
833800704 833800721
833806820 833806837
833806881 833806898
833846060 833846077
833846076 833846093
833867426 833867443
833886904 833886921
833920227 833920244
833920287 833920305
833929649 833929666
833935525 833935542
833972861 833972879
833993094 833993111
833993099 833993116
834085842 834085859
834166807 834166824
834167518 834167535
834168232 834168249
834176497 834176514
834179489 834179506
834181705 834181722
834206401 834206418
834236469 834236486
834269672 834269689
834325593 834325610
834337097 834337114
834338085 834338102
834338764 834338781
834339384 834339401
834345276 834345293
834368123 834368140
834404954 834404972
834408593 834408610
834414711 834414728
834421286 834421303
834431601 834431619
834431749 834431766
834434806 834434823
834434831 834434848
834434901 834434918
834436705 834436722
834441145 834441162
834444259 834444276
834447305 834447322
834494824 834494841
834494926 834494944
834494946 834494963
834500227 834500244
834500248 834500265
834510919 834510937
834520627 834520644
834522847 834522864
834523142 834523159
834532864 834532881
834617823 834617840
834618196 834618213
834640884 834640901
834779471 834779488
834787153 834787170
834789118 834789135
834804924 834804941
834810619 834810636
834810677 834810694
834848496 834848513
834849430 834849447
834869832 834869849
834870932 834870949
834917273 834917290
834925679 834925697
834925700 834925717
834927738 834927755
834927756 834927773
834927821 834927838
834928563 834928581
834928617 834928634
834948659 834948676
834948727 834948744
834950380 834950397
834950420 834950437
834950477 834950494
834950499 834950516
834950655 834950672
834955334 834955351
834956031 834956048
834956054 834956071
835036151 835036168
835096027 835096044
835096077 835096094
835096535 835096552
835096814 835096831
835101630 835101647
835101744 835101761
835101881 835101898
835102680 835102697
835102700 835102717
835102710 835102727
835112115 835112132
835112866 835112885
835124980 835124997
835125094 835125111
835126062 835126079
835126088 835126105
835128060 835128077
835128573 835128590
835128879 835128896
835129188 835129206
835129207 835129224
835129306 835129323
835151487 835151505
835151507 835151524
835184927 835184944
835185300 835185317
835185324 835185341
835193287 835193304
835193615 835193632
835194943 835194960
835195412 835195429
835277630 835277647
835298492 835298509
835298958 835298975
835299293 835299310
835357485 835357502
835357491 835357508
835357543 835357560
835359874 835359891
835359933 835359950
835359973 835359990
835360401 835360418
835360497 835360514
835361480 835361497
835362323 835362340
835362715 835362732
835362833 835362850
835368663 835368680
835368733 835368750
835368824 835368841
835368852 835368869
835369159 835369176
835370617 835370634
835370662 835370679
835371983 835372000
835373286 835373303
835373338 835373355
835373343 835373360
835373376 835373393
835373430 835373447
835373494 835373511
835374269 835374286
835374432 835374449
835375066 835375083
835376930 835376947
835377028 835377045
835377160 835377177
835377204 835377221
835377230 835377247
835377497 835377514
835377536 835377553
835377648 835377665
835377696 835377713
835379532 835379549
835379547 835379564
835379653 835379670
835379671 835379688
835379825 835379842
835379862 835379879
835380172 835380189
835380340 835380357
835380494 835380513
835380504 835380521
835380872 835380889
835380893 835380910
835380963 835380980
835381124 835381141
835381482 835381499
835381761 835381778
835383270 835383288
835383388 835383405
835383403 835383420
835383446 835383463
835383515 835383532
835383917 835383934
835383998 835384015
835384090 835384107
835384119 835384136
835384132 835384149
835384156 835384173
835384165 835384184
835384179 835384196
835384195 835384212
835384245 835384262
835384261 835384278
835384274 835384291
835384529 835384546
835384536 835384553
835384823 835384840
835387476 835387493
835390069 835390086
835390979 835390999
835391112 835391129
835391355 835391372
835391801 835391818
835392073 835392090
835392091 835392108
835392197 835392214
835392217 835392234
835392291 835392308
835392324 835392341
835392413 835392430
835392740 835392757
835392912 835392931
835395199 835395216
835395257 835395274
835395289 835395306
835395296 835395313
835395322 835395341
835395338 835395355
835395453 835395472
835398949 835398966
835399972 835399989
835400136 835400153
835401005 835401022
835401470 835401487
835401474 835401493
835401535 835401552
835401595 835401612
835401647 835401665
835401694 835401714
835401705 835401722
835401710 835401727
835401720 835401737
835402069 835402086
835402161 835402178
835402171 835402188
835402737 835402754
835402770 835402787
835402890 835402911
835403090 835403107
835403116 835403133
835403581 835403598
835403826 835403843
835404131 835404148
835405475 835405492
835405579 835405596
835405939 835405956
835406364 835406381
835406423 835406440
835406469 835406486
835406616 835406633
835406641 835406658
835406844 835406861
835406873 835406890
835408646 835408663
835408966 835408983
835410171 835410188
835410552 835410569
835422639 835422656
835423463 835423480
835423932 835423949
835428950 835428967
835430085 835430102
835430471 835430488
835431422 835431439
835431447 835431464
835431915 835431932
835441416 835441433
835441916 835441933
835442219 835442236
835442377 835442394
835445260 835445277
835446344 835446361
835446410 835446427
835478663 835478680
835482409 835482426
835488414 835488431
835495353 835495370
835510549 835510566
835514985 835515002
835525902 835525919
835538384 835538401
835544398 835544415
835546109 835546126
835546156 835546173
835547565 835547582
835559646 835559663
835586007 835586024
835596777 835596794
835597820 835597837
835614725 835614742
835614855 835614872
835614909 835614926
835614923 835614940
835614956 835614973
835614966 835614983
835614985 835615003
835615027 835615044
835616853 835616870
835619533 835619550
835621359 835621376
835622162 835622179
835622264 835622282
835622734 835622751
835623401 835623418
835624091 835624108
835624201 835624218
835624354 835624371
835624855 835624872
835628050 835628067
835628115 835628132
835629887 835629904
835631943 835631960
835633150 835633167
835633503 835633520
835635431 835635448
835639987 835640004
835641390 835641407
835641406 835641423
835645814 835645831
835647445 835647462
835712155 835712172
835712164 835712181
835712180 835712197
835718816 835718834
835718936 835718953
835719003 835719020
835722444 835722461
835722497 835722514
835726020 835726037
835727270 835727287
835727468 835727485
835727544 835727561
835727721 835727738
835727741 835727758
835727838 835727855
835727858 835727875
835727874 835727891
835727889 835727906
835727902 835727919
835727918 835727940
835727938 835727955
835727943 835727960
835727959 835727976
835727981 835727998
835728018 835728035
835733816 835733833
835743614 835743631
835749481 835749498
835749870 835749887
835749883 835749900
835750097 835750114
835750834 835750851
835750909 835750926
835751221 835751238
835751578 835751595
835751603 835751620
835751613 835751630
835751625 835751642
835751634 835751657
835751725 835751747
835751748 835751765
835751752 835751774
835758236 835758253
835783525 835783542
835783530 835783547
835783673 835783690
835803963 835803980
835810133 835810150
835824836 835824853
835835581 835835598
835836916 835836933
835837876 835837893
835867458 835867475
835869817 835869834
835929916 835929933
835966223 835966240
835995311 835995328
835996043 835996060
835996092 835996111
835998378 835998395
836004394 836004411
836012508 836012525
836016120 836016137
836020838 836020855
836020987 836021004
836021590 836021607
836022394 836022411
836058082 836058099
836075824 836075842
836075846 836075863
836075999 836076016
836076940 836076957
836076974 836076991
836077008 836077025
836079494 836079511
836079604 836079621
836079616 836079633
836079628 836079645
836079639 836079656
836079690 836079707
836079748 836079765
836080460 836080477
836080743 836080760
836080969 836080986
836083330 836083347
836083362 836083379
836089102 836089119
836090972 836090989
836093540 836093557
836095684 836095701
836095735 836095752
836096613 836096631
836096839 836096856
836098405 836098422
836098411 836098428
836101795 836101812
836102732 836102749
836103168 836103185
836103194 836103211
836104928 836104945
836106456 836106473
836108004 836108021
836108058 836108075
836117909 836117926
836137853 836137870
836137872 836137889
836138039 836138056
836138052 836138069
836181525 836181543
836219860 836219877
836219889 836219906
836220275 836220292
836220359 836220376
836230221 836230238
836240389 836240406
836245833 836245850
836245886 836245903
836253174 836253191
836306562 836306579
836317605 836317622
836323517 836323534
836329811 836329828
836329836 836329853
836340945 836340962
836341847 836341865
836341899 836341916
836341927 836341944
836360074 836360096
836360116 836360133
836360123 836360140
836360368 836360385
836363757 836363774
836419294 836419311
836501736 836501753
836501978 836501995
836502057 836502074
836502403 836502420
836505566 836505583
836505650 836505667
836512446 836512463
836515037 836515054
836515300 836515317
836515315 836515332
836519286 836519303
836519442 836519459
836519904 836519921
836521498 836521515
836522776 836522793
836522957 836522974
836523120 836523137
836523138 836523155
836523183 836523200
836523204 836523221
836525594 836525611
836525715 836525732
836525721 836525738
836526534 836526551
836529293 836529310
836529503 836529520
836536662 836536679
836537954 836537971
836538883 836538900
836539170 836539187
836544134 836544151
836544211 836544228
836546137 836546154
836548188 836548208
836548454 836548471
836548551 836548568
836549721 836549738
836555350 836555367
836559946 836559963
836560234 836560251
836565956 836565974
836569788 836569805
836595266 836595284
836595273 836595290
836595291 836595308
836595465 836595482
836595500 836595517
836596658 836596675
836597317 836597335
836597331 836597348
836597346 836597363
836597590 836597607
836597595 836597612
836597688 836597705
836597757 836597774
836601645 836601662
836601685 836601702
836607816 836607833
836694759 836694776
836713357 836713374
836730257 836730274
836748514 836748531
836751157 836751174
836877790 836877807
837031306 837031323
837321526 837321543
837321662 837321679
837364482 837364499
837364988 837365005
837365073 837365090
837378737 837378755
837379494 837379511
837414595 837414613
837419228 837419245
837457437 837457455
837458511 837458528
837459748 837459765
837460556 837460573
837460602 837460619
837464105 837464124
837465504 837465521
837467711 837467729
837467741 837467758
837522389 837522406
837522449 837522466
837522470 837522487
837533641 837533658
837539174 837539191
837546397 837546414
837546444 837546461
837550720 837550737
837550727 837550744
837564578 837564595
837564615 837564632
837564802 837564819
837565974 837565991
837568174 837568191
837568203 837568221
837568218 837568235
837568269 837568286
837568325 837568343
837569106 837569123
837574043 837574060
837574438 837574455
837575502 837575519
837579952 837579969
837580043 837580060
837580156 837580173
837580423 837580440
837580528 837580545
837582475 837582492
837582522 837582539
837585879 837585896
837586466 837586483
837586496 837586513
837598897 837598914
837600058 837600075
837600940 837600957
837601335 837601352
837601621 837601638
837601885 837601902
837607682 837607699
837614119 837614136
837614129 837614147
837617072 837617089
837620546 837620563
837620605 837620622
837626303 837626320
837626327 837626344
837626378 837626395
837627077 837627095
837629423 837629441
837629472 837629489
837631598 837631615
837632578 837632595
837636019 837636036
837738529 837738548
837738802 837738821
837796310 837796327
837797345 837797362
837797595 837797612
837797879 837797896
837797988 837798005
837807834 837807851
837825226 837825243
837829382 837829399
837831273 837831290
837832849 837832866
837837486 837837503
837838049 837838066
837840902 837840919
837842107 837842124
838036110 838036127
838044442 838044459
838048768 838048785
838063903 838063920
838065223 838065240
838065571 838065588
838099150 838099167
838099977 838099994
838100011 838100028
838100079 838100096
838100654 838100671
838102167 838102184
838103342 838103359
838103647 838103664
838126499 838126516
838159211 838159228
838159253 838159270
838169420 838169437
838192609 838192626
838203750 838203767
838212933 838212950
838216645 838216662
838216698 838216715
838217164 838217181
838224141 838224158
838231569 838231586
838231677 838231694
838231774 838231791
838231850 838231867
838232010 838232027
838232033 838232050
838232062 838232079
838232080 838232097
838232820 838232840
838247392 838247409
838266140 838266157
838266293 838266310
838266351 838266368
838266361 838266378
838269232 838269249
838276464 838276481
838277860 838277877
838278148 838278165
838283189 838283206
838283511 838283528
838283532 838283549
838283579 838283596
838283615 838283632
838283625 838283642
838283666 838283683
838283707 838283724
838284032 838284049
838284112 838284129
838284193 838284210
838284317 838284334
838284326 838284343
838284385 838284402
838284498 838284515
838284509 838284526
838284544 838284562
838284551 838284568
838284556 838284573
838284560 838284577
838284606 838284623
838284623 838284640
838284627 838284644
838284678 838284695
838284761 838284778
838299737 838299754
838308874 838308891
838309314 838309331
838330029 838330046
838330063 838330080
838331299 838331316
838336188 838336205
838346938 838346955
838350575 838350592
838371836 838371853
838378083 838378100
838378606 838378623
838378801 838378818
838379079 838379096
838381493 838381510
838381501 838381520
838381582 838381599
838381741 838381758
838381757 838381774
838381786 838381803
838381806 838381823
838382125 838382142
838382129 838382146
838382326 838382343
838382846 838382863
838383069 838383086
838383971 838383988
838383995 838384012
838384008 838384025
838384025 838384042
838384044 838384061
838384128 838384145
838384502 838384519
838386630 838386647
838386644 838386661
838386828 838386845
838386989 838387006
838391233 838391250
838391303 838391320
838391493 838391510
838391534 838391551
838392763 838392780
838393331 838393348
838393678 838393695
838393888 838393905
838393929 838393946
838395197 838395214
838395531 838395549
838395714 838395731
838395766 838395783
838396607 838396624
838396650 838396667
838396661 838396678
838396674 838396693
838396821 838396838
838396839 838396858
838396957 838396975
838396963 838396980
838397078 838397095
838397139 838397156
838397145 838397162
838397227 838397244
838397231 838397251
838397240 838397257
838397247 838397264
838397272 838397289
838397285 838397302
838397302 838397319
838397386 838397403
838397484 838397501
838397589 838397606
838397699 838397716
838397706 838397723
838397751 838397768
838397758 838397775
838397784 838397801
838397827 838397844
838397926 838397943
838397955 838397972
838397966 838397984
838398008 838398027
838404038 838404055
838404088 838404108
838404187 838404204
838404348 838404366
838404542 838404559
838404567 838404584
838404599 838404616
838404699 838404716
838404750 838404767
838404791 838404808
838405018 838405035
838405143 838405160
838405271 838405288
838405403 838405420
838405478 838405495
838405793 838405810
838405830 838405847
838405839 838405856
838405856 838405873
838405886 838405903
838405909 838405926
838405945 838405962
838405964 838405981
838405977 838405994
838406064 838406081
838406164 838406181
838410998 838411015
838411093 838411110
838411113 838411130
838411365 838411382
838411385 838411402
838411497 838411514
838411565 838411582
838411577 838411594
838411609 838411626
838411658 838411675
838411665 838411685
838411689 838411706
838411796 838411813
838411976 838411998
838412025 838412042
838412370 838412387
838413566 838413583
838413743 838413760
838414343 838414360
838414641 838414658
838414708 838414725
838414742 838414759
838415074 838415094
838415087 838415104
838415097 838415114
838415389 838415406
838416384 838416401
838420679 838420696
838421437 838421454
838421490 838421507
838421500 838421517
838421532 838421549
838421568 838421585
838421627 838421644
838421787 838421804
838422062 838422079
838422078 838422095
838422716 838422733
838422729 838422746
838422906 838422923
838422945 838422963
838422998 838423015
838423049 838423066
838423087 838423104
838423182 838423199
838423272 838423289
838423282 838423299
838423315 838423332
838423359 838423376
838423363 838423380
838423545 838423562
838423579 838423596
838424192 838424209
838424213 838424230
838424232 838424249
838424245 838424262
838424328 838424348
838424589 838424606
838424599 838424616
838445874 838445893
838457371 838457388
838457440 838457457
838457455 838457472
838457470 838457487
838457483 838457501
838457522 838457539
838457543 838457561
838457550 838457567
838457615 838457632
838459189 838459206
838459205 838459222
838459210 838459230
838459223 838459240
838459252 838459269
838459270 838459292
838459288 838459305
838459326 838459343
838459391 838459408
838459409 838459426
838459440 838459457
838459464 838459481
838459512 838459529
838459532 838459552
838459690 838459707
838459742 838459759
838459762 838459779
838459769 838459786
838459773 838459791
838459786 838459803
838460090 838460107
838461017 838461034
838468011 838468028
838468073 838468090
838468089 838468106
838468148 838468165
838468221 838468238
838468339 838468356
838469219 838469236
838469224 838469243
838469716 838469733
838472817 838472834
838472983 838473000
838473041 838473058
838473171 838473190
838474470 838474487
838474589 838474606
838474605 838474622
838474857 838474874
838475171 838475188
838475186 838475207
838475210 838475230
838475231 838475248
838475274 838475291
838475310 838475327
838475390 838475407
838501070 838501087
838501203 838501220
838501298 838501315
838501363 838501380
838501876 838501893
838502154 838502171
838502181 838502198
838502195 838502212
838502228 838502247
838502245 838502262
838502499 838502516
838502750 838502767
838503679 838503702
838503765 838503782
838506155 838506172
838506184 838506201
838506317 838506334
838507049 838507066
838507281 838507301
838507506 838507523
838507703 838507720
838507710 838507727
838507714 838507731
838509280 838509297
838509368 838509385
838509729 838509746
838510943 838510960
838517752 838517769
838517759 838517776
838518396 838518413
838518783 838518800
838521195 838521212
838522370 838522387
838525516 838525533
838525983 838526000
838526055 838526072
838526152 838526169
838526413 838526430
838527289 838527306
838527598 838527615
838527983 838528000
838528994 838529011
838529219 838529236
838529494 838529511
838529527 838529544
838535230 838535247
838536276 838536293
838536335 838536352
838541725 838541742
838542116 838542133
838545463 838545480
838552348 838552365
838552480 838552497
838552862 838552879
838553085 838553104
838553170 838553187
838554112 838554129
838554170 838554187
838554227 838554244
838554874 838554891
838555417 838555434
838555587 838555604
838555897 838555914
838556156 838556173
838556218 838556235
838556826 838556843
838556860 838556877
838556883 838556902
838556904 838556921
838556909 838556926
838556983 838557000
838557092 838557109
838557173 838557190
838557190 838557207
838557346 838557363
838557372 838557389
838557492 838557509
838557513 838557531
838557681 838557698
838557757 838557774
838557945 838557962
838558077 838558094
838558119 838558136
838558514 838558531
838558676 838558693
838558741 838558759
838559184 838559203
838589797 838589814
838589832 838589849
838589867 838589884
838589902 838589919
838589932 838589949
838589952 838589969
838589976 838589993
838589986 838590003
838589999 838590016
838590037 838590054
838590109 838590126
838590134 838590151
838590162 838590179
838590211 838590228
838590258 838590275
838591773 838591790
838591777 838591797
838591785 838591802
838591795 838591813
838591936 838591953
838591968 838591985
838591981 838591998
838591989 838592006
838592001 838592018
838592006 838592023
838592031 838592048
838592091 838592108
838592103 838592120
838592114 838592131
838592161 838592178
838592218 838592236
838592231 838592248
838592277 838592294
838592306 838592326
838592340 838592357
838592351 838592368
838592359 838592376
838592392 838592409
838592400 838592417
838592425 838592443
838592472 838592489
838592524 838592541
838592662 838592680
838592743 838592760
838592836 838592853
838592859 838592876
838592874 838592891
838592985 838593002
838593064 838593081
838593070 838593088
838593130 838593148
838593152 838593170
838593163 838593180
838593347 838593365
838593502 838593521
838593508 838593525
838595849 838595866
838599167 838599187
838599187 838599204
838599624 838599641
838599630 838599647
838599736 838599753
838599746 838599763
838599751 838599768
838599758 838599775
838600303 838600320
838600423 838600440
838614822 838614839
838614867 838614884
838614888 838614905
838614905 838614922
838622303 838622320
838624759 838624776
838626312 838626329
838635397 838635416
838635403 838635420
838635432 838635449
838635503 838635520
838635513 838635530
838635562 838635579
838635635 838635653
838635644 838635661
838646074 838646091
838646868 838646886
838649487 838649504
838649598 838649615
838650451 838650468
838656912 838656929
838657194 838657211
838657199 838657216
838657203 838657221
838657291 838657308
838658007 838658024
838659170 838659187
838659205 838659222
838682196 838682213
838682398 838682416
838683251 838683268
838683292 838683309
838684691 838684708
838687055 838687072
838687062 838687079
838687247 838687264
838687307 838687324
838706621 838706638
838707801 838707818
838707912 838707929
838708108 838708125
838708115 838708132
838708166 838708183
838708388 838708405
838708484 838708501
838708718 838708735
838711423 838711440
838713653 838713670
838725509 838725526
838725539 838725556
838736091 838736108
838738126 838738143
838739143 838739160
838753142 838753161
838754833 838754850
838757643 838757660
838758303 838758320
838758404 838758421
838758409 838758426
838758418 838758437
838758436 838758453
838763096 838763113
838763326 838763343
838763339 838763356
838764512 838764529
838769200 838769217
838773654 838773671
838773861 838773878
838775382 838775399
838775795 838775814
838775958 838775975
838776097 838776114
838778576 838778593
838779098 838779115
838789047 838789064
838816154 838816171
838816327 838816344
838832648 838832665
838843336 838843354
838843597 838843614
838845311 838845328
838845841 838845858
838845856 838845873
838845937 838845954
838846052 838846069
838846158 838846175
838846244 838846261
838846350 838846368
838848230 838848247
838848298 838848315
838848307 838848324
838859902 838859919
838861704 838861721
838862611 838862631
838862968 838862985
838863552 838863569
838863860 838863877
838863970 838863987
838864003 838864021
838864804 838864821
838864851 838864868
838864861 838864879
838864897 838864916
838864927 838864945
838864992 838865009
838865007 838865024
838865030 838865047
838865035 838865052
838865047 838865064
838865060 838865077
838865067 838865084
838865075 838865092
838865088 838865107
838865159 838865176
838865402 838865421
838870644 838870661
838870648 838870665
838880544 838880561
838881338 838881355
838881603 838881620
838881735 838881752
838883521 838883538
838883605 838883622
838883617 838883634
838884472 838884489
838887552 838887569
838889904 838889921
838904896 838904913
838947221 838947238
838956316 838956333
838956325 838956342
838984830 838984847
838984893 838984910
838986945 838986962
838987000 838987017
838998591 838998608
839000462 839000480
839011461 839011478
839015061 839015078
839015363 839015380
839015538 839015555
839019642 839019659
839021187 839021204
839023810 839023827
839063158 839063175
839070841 839070858
839078750 839078768
839100232 839100249
839100314 839100331
839101984 839102001
839105152 839105169
839106281 839106298
839106464 839106481
839106738 839106755
839106821 839106838
839108762 839108779
839121671 839121688
839157806 839157823
839158207 839158225
839158232 839158249
839158290 839158307
839163461 839163478
839163487 839163504
839174889 839174906
839178996 839179013
839186655 839186672
839190222 839190239
839192287 839192304
839192667 839192684
839197789 839197806
839223429 839223446
839259221 839259239
839268587 839268604
839268657 839268676
839268694 839268711
839279497 839279514
839287178 839287195
839297269 839297286
839329843 839329860
839340768 839340785
839361758 839361775
839418952 839418969
839434662 839434679
839438409 839438426
839444197 839444214
839450876 839450893
839487053 839487070
839487183 839487200
839535891 839535908
839553160 839553177
839595050 839595067
839595094 839595111
839595098 839595116
839608325 839608343
839613165 839613182
839619921 839619938
839659507 839659524
839659552 839659569
839659585 839659602
839659684 839659701
839659744 839659762
839672035 839672052
839681869 839681886
839681882 839681900
839681890 839681907
839720498 839720515
839748670 839748687
839760798 839760815
839785669 839785686
839791223 839791240
839791254 839791271
839810765 839810782
839819397 839819414
839847083 839847100
839876913 839876930
839876962 839876979
839877068 839877085
839884401 839884419
839919005 839919022
839942796 839942813
839942864 839942881
839943218 839943235
839943550 839943567
839943595 839943613
839946498 839946515
839987099 839987116
839987512 839987529
839987893 839987910
839988106 839988123
839988284 839988301
839988329 839988346
839988574 839988591
839989484 839989501
839990667 839990684
839991438 839991455
839992059 839992076
839993728 839993745
839997819 839997836
839998525 839998542
840008828 840008845
840010728 840010745
840011910 840011927
840014866 840014883
840016561 840016578
840025642 840025659
840162112 840162129
840162129 840162146
840162708 840162725
840162951 840162968
840164262 840164279
840164345 840164362
840164720 840164737
840164941 840164958
840166385 840166402
840169948 840169965
840175010 840175027
840176064 840176081
840176107 840176124
840185051 840185068
840185930 840185947
840191250 840191267
840222205 840222222
840222282 840222299
840222326 840222343
840222347 840222364
840319424 840319441
840321210 840321227
840322695 840322712
840372209 840372226
840372233 840372251
840372275 840372292
840372308 840372325
840448916 840448933
840452718 840452735
840452770 840452788
840452785 840452802
840455395 840455412
840471691 840471708
840471780 840471797
840471853 840471870
840539856 840539873
840539904 840539922
840568994 840569011
840568999 840569016
840569018 840569035
840570820 840570837
840570887 840570904
840570915 840570932
840576370 840576387
840577009 840577026
840607861 840607878
840621445 840621462
840643552 840643569
840668778 840668795
840729067 840729084
840729182 840729199
840736118 840736135
840739704 840739721
840838966 840838983
840866415 840866432
840925450 840925467
840943358 840943375
841020119 841020136
841040323 841040340
841057907 841057924
841100260 841100280
841104190 841104207
841105280 841105297
841112040 841112057
841114882 841114899
841185288 841185305
841190704 841190721
841201181 841201198
841205289 841205306
841220620 841220637
841271768 841271785
841286916 841286933
841289081 841289098
841289851 841289868
841349380 841349397
841351433 841351450
841359436 841359453
841386905 841386922
841396814 841396831
841421546 841421563
841421875 841421892
841432613 841432630
841567402 841567419
841681916 841681933
841687374 841687391
841694437 841694454
841697981 841697998
841698031 841698048
841698086 841698103
841698645 841698662
841750199 841750216
841784801 841784818
841784825 841784842
841784874 841784892
841839009 841839026
841844304 841844321
842018239 842018256
842018479 842018496
842020109 842020126
842020778 842020795
842029628 842029645
842031986 842032003
842035438 842035456
842035555 842035572
842038487 842038504
842057423 842057440
842096412 842096429
842096425 842096442
842102486 842102503
842188699 842188716
842208046 842208063
842213198 842213215
842217253 842217270
842217268 842217285
842219209 842219226
842224063 842224080
842249983 842250000
842261941 842261958
842275339 842275356
842298195 842298212
842304746 842304763
842304806 842304826
842326848 842326865
842329056 842329073
842331670 842331687
842333659 842333676
842334788 842334805
842344637 842344654
842353813 842353830
842353838 842353855
842353901 842353918
842353918 842353935
842353929 842353946
842364285 842364302
842370606 842370623
842506118 842506135
842534352 842534369
842537536 842537554
842613761 842613778
842613852 842613869
842617400 842617417
842618089 842618106
842619300 842619317
842630827 842630844
842630909 842630926
842630919 842630936
842630943 842630961
842630992 842631009
842638573 842638590
842650151 842650169
842662147 842662164
842663886 842663903
842688081 842688098
842738800 842738817
842739446 842739463
842739722 842739739
842743800 842743817
842748670 842748687
842748891 842748908
842749618 842749635
842750748 842750765
842751176 842751193
842752298 842752315
842753952 842753969
842754610 842754627
842772413 842772430
842772433 842772450
842772456 842772473
842772499 842772516
842776141 842776158
842780819 842780836
842780833 842780850
842781038 842781055
842781058 842781075
842781081 842781099
842781103 842781121
842781217 842781234
842781246 842781263
842783760 842783777
842783880 842783897
842783950 842783967
842791533 842791550
842791901 842791918
842795245 842795262
842797107 842797124
842799911 842799928
842800294 842800311
842800483 842800500
842800945 842800962
842801265 842801282
842805582 842805599
842819696 842819713
842820847 842820864
842820909 842820926
842824247 842824264
842853212 842853229
842853218 842853235
842853238 842853255
842853245 842853262
842856784 842856801
842856957 842856974
842857003 842857020
842872921 842872938
842872945 842872962
842877962 842877979
842879550 842879567
842890452 842890469
842890459 842890476
842908480 842908497
842908728 842908745
842919368 842919385
842920374 842920391
842920468 842920485
842921171 842921188
842921393 842921410
842940087 842940104
842941709 842941726
842948376 842948393
842959295 842959312
842967945 842967962
842972871 842972888
843002059 843002076
843002216 843002233
843007149 843007166
843009039 843009056
843009400 843009417
843010599 843010616
843017022 843017039
843018902 843018919
843034608 843034625
843040597 843040614
843136000 843136017
843222090 843222107
843222459 843222476
843222524 843222541
843222699 843222716
843254240 843254257
843304284 843304301
843304563 843304580
843372298 843372316
843385787 843385804
843390199 843390216
843412885 843412902
843412944 843412962
843419231 843419248
843423220 843423237
843476665 843476682
843476743 843476760
843487731 843487748
843487760 843487777
843488669 843488687
843501054 843501071
843501068 843501085
843552213 843552230
843552231 843552248
843562517 843562534
843562540 843562557
843562547 843562564
843570913 843570930
843580596 843580613
843583450 843583467
843583543 843583560
843627022 843627039
843627775 843627792
843634674 843634691
843657834 843657851
843698551 843698568
843758797 843758814
843783872 843783889
843817461 843817478
843829824 843829841
843865504 843865521
843878160 843878177
843951923 843951940
843954147 843954164
843959669 843959686
844006294 844006311
844006417 844006436
844009179 844009196
844009202 844009219
844032013 844032031
844032064 844032081
844085991 844086008
844100284 844100301
844103591 844103609
844103668 844103685
844167907 844167924
844175530 844175547
844183689 844183706
844196885 844196902
844196943 844196960
844269621 844269638
844273419 844273436
844274357 844274374
844274387 844274404
844276967 844276984
844319620 844319637
844325635 844325652
844325719 844325736
844343661 844343678
844349241 844349258
844352584 844352601
844372220 844372237
844393632 844393649
844405642 844405659
844419833 844419850
844425779 844425796
844444710 844444727
844463546 844463563
844509420 844509437
844516172 844516189
844518459 844518476
844519571 844519588
844519646 844519663
844519956 844519973
844559362 844559379
844569026 844569043
844574678 844574695
844576024 844576041
844599319 844599336
844599653 844599670
844599675 844599692
844601910 844601927
844602371 844602388
844643327 844643344
844655753 844655770
844695681 844695698
844696101 844696118
844766193 844766210
844771784 844771801
844775169 844775186
844780051 844780068
844840408 844840425
844845079 844845096
844868647 844868664
844874571 844874588
844931831 844931848
845007762 845007779
845010525 845010542
845272048 845272065
845334877 845334894
845356038 845356055
845403229 845403247
845475354 845475371
845536018 845536035
845562751 845562768
845571507 845571524
845582860 845582877
845583103 845583120
845583179 845583197
845644190 845644207
845645360 845645377
845654292 845654309
845655977 845655994
845688340 845688357
845695293 845695310
845717472 845717489
845724370 845724387
845729412 845729429
845730348 845730366
845816886 845816903
845886119 845886136
845912053 845912070
846080151 846080170
846080172 846080189
846080178 846080196
846080196 846080213
846080200 846080218
846080211 846080228
846080216 846080233
846080225 846080242
846080241 846080258
846080344 846080361
846080397 846080420
846080410 846080428
846080420 846080437
846080425 846080442
846080429 846080447
846080455 846080472
846080486 846080503
846080571 846080588
846080581 846080601
846080588 846080605
846080592 846080609
846080596 846080620
846080628 846080645
846080635 846080654
846080733 846080750
846080738 846080755
846080752 846080769
846080808 846080829
846080851 846080868
846080897 846080914
846080930 846080947
846080934 846080962
846080957 846080976
846080965 846080985
846081011 846081028
846081028 846081046
846081053 846081070
846081069 846081086
846081159 846081176
846081181 846081198
846081188 846081205
846081217 846081241
846081239 846081256
846081268 846081288
846081286 846081305
846081297 846081314
846081303 846081323
846081388 846081405
846081413 846081430
846081425 846081442
846081497 846081514
846081531 846081549
846081579 846081596
846081603 846081620
846081659 846081678
846081671 846081692
846081679 846081696
846081685 846081705
846081726 846081746
846081799 846081816
846081916 846081933
846081924 846081941
846082070 846082087
846082077 846082094
846082542 846082559
846082582 846082599
846082796 846082813
846082841 846082858
846082905 846082922
846083035 846083054
846083041 846083058
846083062 846083079
846083074 846083091
846083233 846083250
846083844 846083861
846083855 846083875
846083868 846083885
846083959 846083979
846083970 846083987
846083974 846083991
846087200 846087217
846088367 846088384
846088723 846088740
846088757 846088774
846089477 846089494
846089492 846089509
846090919 846090936
846092320 846092337
846092998 846093015
846095971 846095988
846095985 846096002
846096500 846096517
846199238 846199255
846202208 846202225
846202215 846202232
846210479 846210496
846221430 846221447
846249090 846249109
846279806 846279824
846279840 846279857
846318440 846318457
846330990 846331007
846331050 846331070
846393797 846393814
846422797 846422814
846426632 846426649
846428505 846428522
846428557 846428574
846431934 846431951
846438227 846438244
846463989 846464006
846473908 846473925
846509246 846509264
846538992 846539009
846539009 846539026
846569988 846570005
846582835 846582852
846594726 846594744
846594744 846594761
846594754 846594771
846595183 846595200
846606236 846606253
846608789 846608806
846655457 846655474
846682324 846682341
846751875 846751893
846785996 846786013
846786020 846786037
846860647 846860664
846860862 846860879
846865555 846865572
846865604 846865621
846865632 846865650
846865645 846865662
846943333 846943350
846974686 846974703
846975078 846975095
846975434 846975451
846981375 846981392
846982101 846982118
846983025 846983042
846994597 846994614
847012559 847012576
847022005 847022022
847023140 847023157
847033090 847033107
847033713 847033730
847078374 847078395
847078384 847078401
847078434 847078451
847078450 847078467
847083806 847083823
847084113 847084130
847084122 847084139
847084132 847084149
847087895 847087912
847087902 847087921
847093637 847093654
847097340 847097357
847103323 847103340
847104347 847104364
847104416 847104433
847104529 847104551
847104548 847104565
847104600 847104617
847104765 847104785
847105668 847105685
847107384 847107401
847108336 847108353
847108600 847108618
847112238 847112255
847114857 847114874
847135461 847135478
847164936 847164953
847193317 847193334
847197355 847197372
847208284 847208301
847209332 847209350
847209365 847209382
847209417 847209435
847213300 847213317
847216962 847216979
847218806 847218823
847231972 847231989
847232264 847232281
847232315 847232332
847232332 847232349
847232583 847232600
847264739 847264756
847285824 847285841
847304059 847304076
847306990 847307007
847308758 847308775
847311642 847311659
847317550 847317567
847323422 847323439
847354395 847354412
847354400 847354417
847354422 847354439
847354428 847354446
847354440 847354457
847354475 847354492
847354488 847354507
847354495 847354512
847354546 847354564
847354765 847354782
847354785 847354802
847354796 847354813
847354802 847354819
847354818 847354835
847354832 847354849
847354888 847354907
847354931 847354948
847354942 847354959
847354966 847354983
847354993 847355010
847355019 847355036
847355029 847355053
847355063 847355081
847355075 847355092
847355083 847355103
847355093 847355111
847355098 847355117
847355111 847355133
847355129 847355146
847355144 847355161
847355167 847355184
847355240 847355257
847355283 847355300
847355984 847356001
847355988 847356011
847356021 847356039
847356030 847356053
847356046 847356063
847356055 847356072
847356067 847356092
847356087 847356104
847356100 847356117
847356211 847356228
847356318 847356335
847356328 847356346
847356338 847356355
847356380 847356397
847356422 847356439
847356426 847356445
847356438 847356464
847356513 847356530
847407026 847407043
847414370 847414389
847414379 847414396
847414392 847414412
847414430 847414449
847414445 847414465
847414508 847414525
847414794 847414811
847415422 847415439
847416542 847416559
847429309 847429328
847429332 847429349
847429340 847429357
847429362 847429379
847429482 847429499
847429486 847429507
847429496 847429513
847429525 847429544
847429550 847429567
847429564 847429582
847429570 847429593
847429585 847429603
847429593 847429610
847429599 847429616
847429609 847429627
847429621 847429638
847433372 847433390
847433378 847433396
847433391 847433408
847433396 847433413
847434398 847434415
847465144 847465161
847482225 847482242
847494807 847494824
847504767 847504784
847510921 847510946
847510933 847510952
847510939 847510960
847510948 847510968
847510956 847510997
847510984 847511001
847510992 847511009
847511001 847511018
847511007 847511026
847511015 847511035
847511031 847511053
847511124 847511144
847511143 847511162
847511156 847511173
847511164 847511181
847511170 847511192
847511198 847511216
847511213 847511236
847511231 847511248
847511248 847511265
847511253 847511270
847511258 847511276
847511263 847511280
847511267 847511294
847511283 847511302
847511295 847511312
847511300 847511320
847511307 847511341
847511328 847511345
847511333 847511352
847511339 847511358
847511346 847511364
847511354 847511372
847511361 847511378
847511372 847511390
847511388 847511405
847511393 847511411
847511408 847511426
847511414 847511431
847511422 847511445
847511436 847511453
847511443 847511462
847511450 847511469
847511457 847511475
847511463 847511481
847511472 847511491
847511485 847511502
847511558 847511575
847541303 847541320
847544538 847544555
