815216370 815216371
815221331 815221332
815230105 815230106
815239826 815239829
815239972 815239973
815247182 815247183
815266842 815266843
815304781 815304782
815332267 815332268
815370568 815370569
815378735 815378736
815394327 815394328
815404265 815404266
815413824 815413827
815422278 815422279
815470990 815470991
815480227 815480228
815626134 815626135
815635973 815635974
815700492 815700496
815788988 815788989
815988459 815988463
816040198 816040202
816185398 816185399
816209618 816209621
816209625 816209630
816217256 816217259
816217280 816217283
816369198 816369201
816379709 816379710
816390380 816390383
816439317 816439318
816471753 816471757
816526767 816526770
816623380 816623383
816807237 816807240
816814463 816814464
816971446 816971447
816988833 816988834
817232025 817232026
817347049 817347052
817431059 817431078
817440419 817440467
817504512 817504515
817596515 817596518
817693079 817693098
818077215 818077216
818120279 818120316
818352312 818352316
818493659 818493699
818780219 818780247
818878589 818878592
819269475 819269478
819401380 819401381
819409242 819409243
819687419 819687464
819790047 819790048
819828899 819828918
820364694 820364698
820372196 820372200
820399030 820399031
820523874 820523875
820554555 820554556
820626521 820626525
820635380 820635383
820756091 820756092
820920257 820920258
821098714 821098717
821477460 821477466
821487905 821487909
821496310 821496313
821497044 821497047
821497059 821497062
821571744 821571747
821630264 821630265
821725822 821725823
822089778 822089781
822175205 822175208
822182964 822182965
822290450 822290451
822355635 822355638
822480980 822480983
822485854 822485857
822486571 822486572
822487690 822487693
822492413 822492416
822494655 822494658
822546082 822546085
822786610 822786613
822790616 822790619
822794741 822794745
822794928 822794932
822796641 822796645
822797919 822797923
822798492 822798495
822799932 822799935
822801736 822801739
822802875 822802878
822803717 822803720
822804457 822804460
822804675 822804678
822804946 822804949
822823325 822823328
822824125 822824128
822826431 822826434
822828377 822828380
822828595 822828598
822847853 822847856
822848042 822848045
822848937 822848941
822849317 822849321
822849834 822849837
822852968 822852971
822853313 822853314
822856042 822856046
822857848 822857851
822857877 822857880
822858885 822858888
822858950 822858953
822860710 822860713
822873337 822873338
822920423 822920424
822966526 822966531
822973537 822973538
822977425 822977428
823032435 823032438
823081608 823081611
823082001 823082004
823082100 823082103
823083445 823083449
823085877 823085880
823086249 823086252
823092650 823092654
823092710 823092714
823092754 823092760
823092859 823092863
823101740 823101743
823102002 823102003
823240825 823240828
823336872 823336873
823423481 823423485
823961660 823961663
824596598 824596601
824807167 824807173
824807205 824807215
824807224 824807228
825014697 825014700
825093214 825093215
825114627 825114630
825319588 825319589
825348998 825348999
825428910 825428911
825448430 825448431
825579044 825579047
825822819 825822822
825889619 825889620
825909057 825909061
825910159 825910162
826062506 826062507
826111620 826111621
826150639 826150643
826341471 826341472
826355836 826355837
826380832 826380835
826489477 826489478
826497025 826497026
826554054 826554058
826580418 826580419
826643624 826643627
826667412 826667413
826730504 826730508
826730513 826730516
826958945 826958948
827017516 827017517
827031826 827031827
827101434 827101438
827104845 827104846
827250138 827250139
827267791 827267792
827459094 827459097
827536995 827536996
827868906 827868907
827945832 827945835
828112526 828112527
828118077 828118078
828128140 828128141
828388268 828388269
828527910 828527911
828712767 828712768
828985277 828985278
828994357 828994358
829066452 829066453
829187861 829187862
829248325 829248328
829505279 829505305
829508099 829508123
829516019 829516028
829607465 829607466
829611198 829611199
829726214 829726215
830057207 830057208
830096742 830096743
830334791 830334792
830365586 830365587
830534944 830534945
830811441 830811442
831022700 831022701
831099674 831099675
831151228 831151229
831171535 831171536
831263367 831263368
831264579 831264580
831465589 831465592
831616695 831616696
831621237 831621238
831767879 831767924
831923487 831923488
831934043 831934044
831982731 831982734
832008899 832008903
832031810 832031811
832109380 832109381
832479856 832479857
832504109 832504110
832627552 832627553
832650621 832650624
832698910 832698914
832698921 832698922
832718883 832718884
832823334 832823335
832940011 832940012
833020530 833020531
833227328 833227329
833235215 833235216
833576872 833576875
833663505 833663506
833681858 833681861
833742355 833742356
833811846 833811847
833845575 833845576
833868612 833868613
833885545 833885546
833947562 833947565
834092010 834092011
834183085 834183092
834270536 834270540
834282058 834282059
834340056 834340060
834346951 834346954
834353309 834353310
834409705 834409709
834409848 834409851
834450502 834450505
834475745 834475749
834518378 834518381
834518385 834518386
834520145 834520146
834596645 834596648
834596649 834596650
834624442 834624445
834691116 834691117
834795924 834795925
834833071 834833076
834833077 834833078
834874364 834874367
834874374 834874377
834932829 834932833
834953269 834953270
835039738 835039739
835212360 835212365
835393153 835393157
835401779 835401804
835411655 835411656
835443449 835443450
835450122 835450127
835450128 835450132
835450147 835450152
835450192 835450195
835475790 835475791
835567488 835567489
835643705 835643709
835643712 835643713
835648029 835648034
835721852 835721853
835818142 835818145
835848132 835848136
835848144 835848145
835895153 835895156
835954344 835954347
836188666 836188667
836273723 836273726
836325109 836325112
836331640 836331643
836331649 836331650
836335213 836335216
836343995 836343998
836352743 836352744
836426861 836426862
836454243 836454244
836459686 836459687
836771134 836771137
836861783 836861784
836932113 836932117
836943503 836943506
836948867 836948870
837033736 837033739
837038083 837038088
837086139 837086140
837135038 837135042
837135046 837135047
837164707 837164708
837218913 837218916
837218940 837218944
837344626 837344630
837369550 837369551
837456779 837456838
837474694 837474697
837641687 837641690
837642959 837643020
837723753 837723754
837843258 837843261
837843262 837843266
837865957 837865960
837924306 837924310
838064570 838064573
838087189 838087190
838108407 838108411
838108418 838108421
838153987 838153988
838238574 838238578
838242179 838242186
838242719 838242751
838257952 838257957
838257959 838257960
838325709 838325712
838373693 838373694
838388673 838388677
838413239 838413281
838583315 838583318
838609843 838609846
838609847 838609851
838629616 838629617
838664383 838664387
838664388 838664392
838664394 838664397
838664399 838664402
838677915 838677918
838683799 838683802
838688381 838688382
838713257 838713258
838831638 838831639
838844168 838844169
838894799 838894818
838910822 838910828
838910829 838910832
838911831 838911835
839017963 839017966
839017968 839017971
839033945 839033948
839184665 839184668
839184669 839184672
839201768 839201771
839201776 839201780
839201781 839201782
839267112 839267119
839296862 839296863
839300122 839300123
839337937 839337940
839337941 839337945
839371053 839371056
839375321 839375324
839552789 839552793
839626505 839626506
839680442 839680446
839801325 839801328
839863877 839863881
839869627 839869628
839963144 839963147
839977657 839977660
840039689 840039692
840039693 840039696
840049275 840049276
840144745 840144749
840176714 840176718
840222289 840222293
840230222 840230225
840317224 840317225
840403595 840403599
840481839 840481842
840488414 840488415
840491997 840492005
840576654 840576658
840585716 840585720
840743481 840743484
840752617 840752620
840836525 840836526
840857941 840857947
840926223 840926224
840995760 840995763
841003011 841003016
841003022 841003028
841073148 841073151
841141946 841141950
841236741 841236742
841262339 841262345
841554520 841554523
841554526 841554530
841691473 841691476
841705494 841705502
841767481 841767482
841769433 841769436
841792457 841792458
841827859 841827862
841827864 841827865
841915468 841915471
842037041 842037044
842189741 842189745
842219608 842219616
842219617 842219618
842236253 842236254
842303975 842303976
842309460 842309467
842309469 842309472
842309480 842309483
842385172 842385175
842409231 842409235
842409246 842409249
842409262 842409266
842521639 842521640
842803550 842803551
842814226 842814229
842821926 842821927
842832932 842832935
842896357 842896360
842900151 842900155
842915358 842915361
842915365 842915368
842915622 842915625
842915649 842915650
842922624 842922625
842928273 842928274
842981165 842981166
842987116 842987121
842988992 842988995
842996050 842996051
842997994 842997998
843108861 843108862
843132723 843132724
843174998 843175001
843175002 843175003
843251645 843251646
843257754 843257757
843421659 843421660
843427565 843427568
843427996 843428000
843428003 843428007
843443227 843443228
843507446 843507447
843514506 843514507
843545259 843545262
843571122 843571123
843590003 843590004
843604915 843604918
843642862 843642863
843669518 843669521
843703594 843703595
843721528 843721529
843726713 843726717
843729376 843729380
843801531 843801532
843855620 843855621
843887080 843887081
843897035 843897039
843902040 843902041
843906335 843906338
843960969 843960972
843965920 843965921
844035238 844035239
844120635 844120638
844122037 844122040
844208094 844208099
844245209 844245212
844422963 844422966
844463098 844463099
844485668 844485669
844508480 844508491
845360340 845360341
845377235 845377236
845478681 845478682
845492593 845492599
845504070 845504073
845665855 845665856
845674166 845674167
846188978 846188979
846421079 846421100
846457827 846457828
846623385 846623389
846675248 846675249
846689904 846689905
846813008 846813012
846826565 846826568
846924979 846924980
846941883 846941884
847008429 847008432
847026612 847026615
847041960 847041965
847215940 847215943
847226686 847226690
847237391 847237394
847304916 847304919
847415701 847415704
847490557 847490560
847492128 847492131
847656636 847656639
847660637 847660640
847661535 847661539
847727751 847727754
847915376 847915377
847922252 847922253
847955167 847955168
848069436 848069440
848133962 848133965
848319601 848319602
848701448 848701452
848823125 848823128
848865362 848865363
848918519 848918532
848981906 848981907
849037081 849037084
849050351 849050352
849214801 849214802
849470625 849470628
849470629 849470630
849554421 849554424
849711516 849711517
849719495 849719499
849729315 849729319
849774037 849774040
849774044 849774045
849784474 849784478
849786123 849786124
849805396 849805399
849805403 849805406
849880266 849880269
849887563 849887566
849887569 849887572
849889974 849889977
849892639 849892643
849904338 849904341
849904479 849904482
849904771 849904774
849905804 849905807
849908606 849908609
849910417 849910420
849910566 849910570
849910995 849910998
849911019 849911023
849911090 849911094
849912467 849912470
849913722 849913725
849913736 849913740
849914077 849914080
849914207 849914210
849915014 849915017
849915396 849915400
849915798 849915801
849915855 849915859
849915862 849915865
849915868 849915872
849916181 849916184
849917157 849917161
849917164 849917167
849917233 849917236
849917260 849917264
849917419 849917422
849918592 849918595
849918605 849918608
849918611 849918614
849918889 849918892
849918919 849918922
849919788 849919792
849920280 849920284
849920647 849920650
849920688 849920692
849920803 849920806
849920811 849920814
849921004 849921007
849921741 849921745
849922357 849922360
849922503 849922506
849922679 849922682
849922912 849922915
849923124 849923127
849923363 849923367
849923837 849923841
849923892 849923896
849924257 849924260
849924329 849924332
849924594 849924598
849924732 849924736
849924765 849924768
849924981 849924986
849925300 849925304
849925711 849925715
849925884 849925888
849926154 849926157
849926328 849926331
849926737 849926740
849927080 849927084
849927186 849927189
849927687 849927690
849928398 849928402
849928405 849928408
849928659 849928662
849928939 849928943
849929203 849929206
849929209 849929212
849931403 849931406
849932469 849932472
849932625 849932629
849932648 849932651
849933150 849933153
849933184 849933187
849933939 849933942
849933980 849933983
849934974 849934977
849937981 849937984
849938103 849938106
849938682 849938685
849940504 849940508
849944618 849944622
850061111 850061112
850105166 850105169
850109878 850109881
850111767 850111771
850126237 850126240
850129099 850129102
850137787 850137788
850153578 850153581
850161577 850161578
850168334 850168337
850170163 850170166
850173002 850173003
850187431 850187434
850193404 850193407
850195646 850195649
850195652 850195655
850196186 850196190
850196888 850196892
850197643 850197646
850197703 850197706
850197764 850197767
850197801 850197804
850197808 850197814
850317451 850317452
850346068 850346069
850426197 850426200
850437877 850437880
850514500 850514501
850518006 850518007
850677422 850677425
850677427 850677428
850679385 850679386
850714964 850714967
850715827 850715828
850721345 850721348
850721739 850721742
850724421 850724424
850728929 850728933
850731119 850731123
850732715 850732718
850733058 850733061
850734407 850734410
850735361 850735364
850737222 850737225
850737268 850737272
850737633 850737636
850738726 850738729
850738736 850738739
850738938 850738941
850739389 850739392
850739741 850739744
850739955 850739958
850741492 850741495
850741958 850741962
850742372 850742382
850742996 850743000
850743266 850743269
850743547 850743554
850743664 850743667
850744139 850744142
850744457 850744461
850744589 850744593
850744866 850744869
850751385 850751388
850751890 850751894
850752063 850752066
850752136 850752139
850752142 850752145
850754946 850754951
850754978 850754982
850755464 850755468
850755537 850755540
850755686 850755689
850755744 850755762
850755806 850755810
850755980 850755983
850755987 850755990
850756174 850756178
850756316 850756319
850756416 850756419
850756455 850756458
850756652 850756656
850756809 850756812
850756943 850756946
850757214 850757218
850757361 850757364
850757432 850757435
850757482 850757489
850758983 850758987
850776026 850776030
850777167 850777168
850780666 850780667
850791151 850791154
850799855 850799858
850856889 850856890
850899110 850899113
850915648 850915652
850919453 850919456
851099308 851099311
851114359 851114362
851115667 851115671
851125444 851125447
851130985 851130988
851218388 851218391
851218698 851218701
851218739 851218742
851219049 851219052
851219353 851219356
851219798 851219801
851219830 851219833
851220181 851220184
851220260 851220264
851220564 851220567
851221572 851221575
851222364 851222367
851223445 851223448
851223738 851223741
851223880 851223884
851224262 851224265
851224695 851224699
851224819 851224822
851225558 851225562
851225677 851225680
851225997 851226000
851226305 851226308
851226459 851226462
851226590 851226593
851226853 851226856
851226932 851226936
851226960 851226963
851227468 851227471
851227604 851227607
851228796 851228799
851228814 851228817
851228933 851228936
851229046 851229050
851229069 851229072
851229232 851229235
851229317 851229320
851229338 851229342
851229792 851229795
851229904 851229908
851230433 851230436
851230457 851230460
851230679 851230683
851233802 851233805
851233958 851233962
851234073 851234076
851234351 851234354
851234530 851234534
851234626 851234629
851234889 851234895
851234929 851234932
851235064 851235068
851235193 851235197
851235821 851235824
851235888 851235891
851235984 851235988
851236141 851236145
851236187 851236190
851236404 851236407
851236408 851236412
851236532 851236535
851236536 851236539
851236586 851236590
851237120 851237123
851237306 851237310
851237370 851237373
851237383 851237386
851237574 851237577
851237868 851237871
851238291 851238295
851238721 851238724
851238742 851238745
851238809 851238812
851238872 851238875
851239049 851239053
851239211 851239219
851243397 851243400
851243693 851243696
851243779 851243783
851243981 851243984
851244410 851244413
851245029 851245032
851247140 851247148
851247805 851247808
851249253 851249257
851252025 851252028
851256595 851256599
851259575 851259578
851261296 851261299
851262120 851262124
851262783 851262786
851271157 851271160
851271236 851271239
851273472 851273475
851273479 851273482
851273544 851273547
851273679 851273682
851275336 851275339
851275527 851275530
851275610 851275614
851275660 851275663
851275808 851275811
851275814 851275817
851276428 851276431
851276517 851276521
851284849 851284852
851285684 851285687
851286519 851286523
851289761 851289765
851295390 851295393
851295635 851295639
851295659 851295662
851297084 851297087
851297500 851297504
851298934 851298937
851299148 851299151
851299653 851299656
851301271 851301274
851302112 851302116
851302558 851302561
851305221 851305224
851338631 851338632
851395812 851395816
851431337 851431340
851457578 851457582
851729497 851729498
851867684 851867687
851870048 851870051
851875709 851875712
851875777 851875780
851878482 851878485
851881937 851881940
851894942 851894945
851895185 851895188
851898911 851898914
851964656 851964659
851964875 851964878
851968840 851968843
851988296 851988299
852051483 852051486
852062363 852062366
852062374 852062377
852063382 852063385
852065069 852065072
852212144 852212147
852212246 852212250
852258641 852258644
852262898 852262902
852262989 852262992
852263398 852263401
852286407 852286410
852287027 852287030
852294682 852294685
852304572 852304576
852308026 852308030
852312981 852312982
852325460 852325461
852331784 852331787
852333382 852333386
852351683 852351686
852393222 852393225
852566259 852566262
852583855 852583856
852649897 852649902
852652876 852652879
852652950 852652956
852698001 852698002
852752876 852752877
852794533 852794536
852920967 852920968
853196732 853196733
853272979 853272980
853668709 853668712
853668726 853668729
853838699 853838700
853949434 853949435
854292422 854292425
854311878 854311879
854408777 854408778
854427612 854427613
854584195 854584206
854618034 854618035
854658322 854658330
854705322 854705323
854706552 854706553
854751272 854751273
854910442 854910445
854916996 854916997
855004900 855004901
855011523 855011528
855152168 855152171
855220548 855220549
855312451 855312458
855312465 855312469
855414408 855414412
855689331 855689334
855706442 855706448
855778736 855778740
855869769 855869770
855949018 855949022
856061368 856061371
856072642 856072645
856103520 856103523
856126699 856126702
856127780 856127783
856127796 856127799
856127805 856127818
856127819 856127822
856142894 856142897
856142912 856142917
856142921 856142925
856142928 856142934
856142935 856142945
856150214 856150218
856150221 856150226
856150228 856150231
856150233 856150236
856150239 856150242
856204207 856204210
856218056 856218059
856218062 856218075
856218076 856218080
856223839 856223842
856233028 856233031
856233062 856233065
856233067 856233070
856233074 856233077
856233081 856233085
856233088 856233096
856233097 856233114
856250859 856250862
856251916 856251919
856251920 856251923
856251924 856251927
856251931 856251935
856251939 856251942
856251955 856251958
856286466 856286469
856294332 856294335
856294337 856294338
856308244 856308247
856322044 856322047
856322060 856322065
856322077 856322080
856323564 856323567
856323570 856323573
856323575 856323578
856323582 856323587
856323589 856323601
856323602 856323605
856323607 856323610
856323614 856323617
856323619 856323622
856323625 856323633
856323634 856323637
856323639 856323647
856323651 856323656
856323662 856323665
856323667 856323670
856323674 856323677
856323679 856323683
856323685 856323688
856323690 856323693
856323694 856323702
856331103 856331107
856396275 856396279
856411011 856411012
856436348 856436349
856451150 856451153
856451155 856451159
856451160 856451166
856466302 856466305
856466311 856466314
856466316 856466319
856466320 856466333
856466334 856466335
856471184 856471185
856500867 856500870
856500886 856500891
856500893 856500896
856500902 856500907
856527715 856527718
856550281 856550284
856550429 856550432
856550660 856550664
856583582 856583586
856583587 856583590
856583605 856583618
856591034 856591037
856591039 856591042
856591048 856591051
856591052 856591056
856591057 856591063
856613478 856613479
856703012 856703016
856703021 856703025
856703026 856703027
856718537 856718540
856718551 856718559
856718560 856718564
856718565 856718573
856718574 856718587
856718588 856718598
856718602 856718605
856718607 856718610
856718611 856718619
856718620 856718624
856718625 856718633
856718634 856718647
856718648 856718681
856726050 856726053
856726080 856726083
856726099 856726102
856726103 856726106
856876849 856876850
856908877 856908881
857007037 857007038
857262630 857262633
857366119 857366120
857406424 857406427
857445592 857445596
857461697 857461698
857521872 857521875
857521890 857521893
857521895 857521898
857521904 857521907
857521918 857521921
857521923 857521926
857536768 857536771
857544306 857544309
857544312 857544315
857544317 857544320
857544329 857544332
857544349 857544352
857544354 857544357
857544361 857544378
857551789 857551793
857551794 857551795
857559144 857559147
857559149 857559152
857559158 857559161
857559163 857559166
857559167 857559170
857574730 857574733
857582003 857582006
857582009 857582010
857596916 857596919
857632794 857632798
857652045 857652046
857673247 857673250
857673252 857673253
857695454 857695457
857695460 857695464
857695465 857695472
857706575 857706576
857733481 857733484
857733542 857733545
857733607 857733610
857734825 857734828
857790247 857790248
857995246 857995247
858031502 858031508
858107580 858107583
858182884 858182887
858185008 858185009
858207177 858207180
858372165 858372168
858372413 858372416
858372763 858372766
858377806 858377807
858390357 858390361
858429001 858429004
858429041 858429044
858429045 858429052
858429079 858429085
858429131 858429134
858437886 858437889
858465393 858465396
858532051 858532052
858556071 858556072
858617707 858617708
858626653 858626656
858643076 858643079
858643080 858643083
858693372 858693373
858741280 858741281
858765996 858765999
858805162 858805163
858849818 858849821
858951741 858951742
858961271 858961272
858966269 858966270
858985569 858985573
859094948 859094949
859123620 859123625
859145862 859145866
859155442 859155443
859215241 859215244
859224143 859224146
859224153 859224156
859231925 859231929
859231932 859231933
859242792 859242795
859312555 859312558
859312562 859312563
859399945 859399948
859576022 859576027
859607341 859607344
859607368 859607371
859751629 859751633
859759386 859759390
859759391 859759396
859761483 859761487
859781285 859781288
859831607 859831608
859965643 859965646
860055018 860055022
860067144 860067147
860071403 860071406
860071420 860071425
860091139 860091140
860149585 860149588
860149600 860149605
860149679 860149682
860149692 860149699
860160358 860160361
860245591 860245594
860284334 860284335
860342998 860342999
860364234 860364237
860364239 860364243
860364245 860364246
860366160 860366163
860440200 860440201
860585218 860585219
860624077 860624078
860643140 860643143
860646164 860646167
860646179 860646183
860646246 860646249
860675496 860675499
860710817 860710818
860796788 860796791
860921071 860921077
860970714 860970715
861038245 861038246
861040899 861040900
861131215 861131216
861175529 861175530
861214944 861214948
861214955 861214956
861278798 861278801
861306873 861306874
861315718 861315721
861315723 861315726
861390957 861390962
861398713 861398716
861489570 861489571
861544073 861544076
861544092 861544093
861561598 861561601
861561836 861561840
861566198 861566201
861577265 861577266
861616384 861616387
861625598 861625601
861641354 861641355
861650106 861650109
861650114 861650115
861660739 861660742
861666236 861666239
861732839 861732842
861732875 861732878
861750699 861750702
861824194 861824197
861843052 861843053
861852338 861852342
861866599 861866600
861881446 861881449
861886166 861886167
861919907 861919914
862009914 862009917
862027514 862027517
862139822 862139823
862158452 862158456
862163233 862163234
862187308 862187311
862203201 862203204
862203882 862203885
862207591 862207594
862324868 862324869
862343110 862343113
862351899 862351902
862381086 862381090
862434176 862434179
862462613 862462616
862556190 862556191
862668091 862668096
862698694 862698695
862855434 862855437
862870006 862870009
862870019 862870020
862880085 862880088
862931820 862931823
862942176 862942179
862944124 862944125
862947243 862947246
862947247 862947251
862965378 862965382
862965386 862965389
862966324 862966327
863031474 863031477
863034393 863034394
863051578 863051581
863051697 863051704
863052302 863052305
863126287 863126299
863126323 863126326
863179250 863179254
863205210 863205211
863216957 863216961
863301807 863301808
863377899 863377903
863392453 863392456
863398037 863398040
863457774 863457775
863539880 863539884
863629299 863629302
863632220 863632223
863637351 863637352
863697544 863697547
863752459 863752462
863752472 863752475
863757596 863757599
863759907 863759910
863760053 863760056
863760267 863760270
863760378 863760381
863760867 863760870
863760978 863760981
863761340 863761343
863761599 863761602
863761710 863761713
863761848 863761851
863780029 863780032
863783915 863783918
863805592 863805593
863825046 863825050
863825053 863825056
863825415 863825418
863826939 863826943
863827571 863827574
863827577 863827580
863828448 863828451
863828701 863828704
863828806 863828809
863828930 863828933
863829121 863829124
863829427 863829430
863829492 863829496
863830267 863830270
863830563 863830566
863830581 863830584
863830590 863830593
863931108 863931112
863931129 863931132
863931135 863931138
863982948 863982955
864058985 864058988
864158800 864158804
864168565 864168570
864325338 864325342
864325516 864325517
864424798 864424801
864426864 864426867
864436603 864436604
864464151 864464152
864584749 864584756
864584762 864584765
864585226 864585227
864592283 864592284
864606933 864606934
864612160 864612165
864667233 864667236
864673449 864673452
864673456 864673457
864751176 864751177
864859058 864859063
864921832 864921835
864963083 864963086
865019924 865019925
865029066 865029069
865055972 865055973
865178326 865178329
865183444 865183445
865345195 865345196
865364614 865364615
865465054 865465060
865474643 865474644
865557010 865557015
865566666 865566670
865568416 865568419
865632927 865632931
865636582 865636585
865653810 865653813
865654233 865654236
865657683 865657686
865668375 865668380
865684202 865684205
865798653 865798657
865808666 865808671
865824188 865824192
865853718 865853721
865853748 865853749
865864236 865864240
865872563 865872566
865872570 865872574
865876528 865876531
865905287 865905290
865956510 865956513
865956517 865956521
865971920 865971923
865971925 865971926
866032219 866032220
866056573 866056576
866071149 866071156
866075611 866075614
866075640 866075643
866144946 866144955
866157810 866157813
866158297 866158300
866159763 866159764
866231550 866231551
866592975 866592979
866593677 866593678
866600309 866600312
866672710 866672713
866876690 866876693
866880205 866880208
866881717 866881724
866882249 866882252
866888187 866888190
866890864 866890869
866892529 866892535
866897206 866897209
866900453 866900456
867056205 867056206
867171638 867171642
867185855 867185859
867298971 867298972
867364090 867364096
867378799 867378800
867438847 867438851
867441759 867441763
867449561 867449562
867487255 867487258
867613218 867613222
867652715 867652719
867708199 867708200
867710115 867710116
867754895 867754898
867813554 867813557
867814120 867814123
867814444 867814447
867841717 867841720
867885517 867885520
867897157 867897160
867983501 867983504
867999846 867999849
868045694 868045697
868054787 868054790
868144425 868144428
868213009 868213013
868213014 868213017
868247666 868247672
868253685 868253686
868262644 868262647
868290646 868290650
868300772 868300773
868305178 868305181
868359937 868359941
868381685 868381688
868385676 868385680
868385950 868385953
868386137 868386143
868390304 868390307
868390313 868390317
868390336 868390339
868399203 868399214
868472295 868472296
868483048 868483057
868527535 868527536
868540493 868540494
868565662 868565665
868565698 868565701
868571986 868571989
868587974 868587977
868651851 868651854
868661441 868661444
868661446 868661452
868661458 868661461
868661469 868661476
868668907 868668911
868668921 868668932
868668942 868668945
868681157 868681160
868681173 868681178
868681180 868681183
868681198 868681201
868681838 868681842
868753256 868753257
868916591 868916594
868987989 868987992
868987997 868987998
869020071 869020074
869068029 869068030
869265476 869265479
869265512 869265515
869265606 869265609
869505237 869505240
869519926 869519929
869524304 869524307
869535593 869535596
869540721 869540722
869600612 869600613
869604872 869604873
869613894 869613895
869617374 869617375
869648703 869648706
869684333 869684336
869686839 869686842
869690416 869690421
869690637 869690640
869691361 869691364
869694200 869694203
869694429 869694432
869711635 869711639
869720582 869720585
869773250 869773255
869773261 869773262
869798778 869798781
869798852 869798855
869798921 869798924
869798949 869798953
869799659 869799662
869800111 869800114
869800721 869800724
869800726 869800729
869801580 869801583
869810946 869810949
869837755 869837758
869839233 869839237
869845292 869845296
869847938 869847941
869852068 869852072
869852636 869852639
869868643 869868646
869868647 869868648
869915094 869915097
869922596 869922599
869922600 869922601
870024117 870024120
870038691 870038692
870060564 870060565
870086674 870086678
870103419 870103420
870122298 870122299
870214717 870214720
870233027 870233030
870273268 870273274
870289999 870290002
870290004 870290007
870415351 870415355
870415525 870415528
870453090 870453094
870467411 870467414
870474475 870474481
870481004 870481007
870560013 870560020
870568798 870568801
870578152 870578153
870629017 870629020
870645647 870645648
870716153 870716154
870788362 870788363
870896408 870896411
870905941 870905946
870905948 870905951
870939915 870939916
870956307 870956310
870980988 870980991
870981001 870981006
870991920 870991923
871065408 871065411
871075841 871075845
871158599 871158630
871228546 871228559
871236632 871236636
871257149 871257150
871272641 871272644
871277320 871277324
871277325 871277330
871289575 871289576
871293928 871293929
871300041 871300045
871300048 871300051
871300081 871300084
871342813 871342817
871367441 871367444
871392583 871392588
871404353 871404356
871404357 871404363
871414321 871414322
871422473 871422476
871432679 871432718
871441449 871441450
871446179 871446239
871456499 871456509
871468139 871468146
871478039 871478060
871500238 871500241
871515839 871515898
871522456 871522468
871539479 871539537
871551179 871551210
871560179 871560197
871566359 871566370
871567100 871567103
871597096 871597099
871598519 871598541
871601519 871601531
871604653 871604656
871619300 871619303
871629359 871629389
871639919 871639933
871653658 871653659
871679615 871679619
871685681 871685682
871695404 871695405
871803491 871803498
871803511 871803512
871836985 871836988
871842172 871842180
871920985 871920989
871942253 871942259
871942265 871942269
872049099 872049102
872103997 872104000
872129933 872129936
872129948 872129951
872142136 872142137
872167786 872167787
872217648 872217652
872229068 872229073
872262131 872262134
872373266 872373269
872515650 872515653
872629147 872629150
872635366 872635367
872816915 872816916
872871900 872871901
872953203 872953207
872997221 872997226
873084131 873084134
873137078 873137079
873231882 873231886
873271074 873271077
873274728 873274731
873315718 873315723
873315736 873315739
873318431 873318437
873419413 873419416
873424749 873424754
873489659 873489665
873631787 873631791
873749336 873749339
873786068 873786069
873806624 873806625
873828401 873828404
873834769 873834770
874007542 874007545
874023744 874023747
874024311 874024314
874044267 874044271
874044308 874044311
874044323 874044326
874044378 874044382
874227035 874227041
874227059 874227062
874238720 874238724
874260122 874260125
874263015 874263021
874275434 874275435
874313434 874313438
874343822 874343825
874343839 874343843
874343845 874343848
874343851 874343854
874347694 874347701
874352748 874352751
874352752 874352757
874354143 874354144
874359665 874359668
874360667 874360670
874369648 874369652
874370656 874370659
874370703 874370706
874372687 874372690
874375041 874375046
874449012 874449015
874478750 874478753
874478770 874478773
874501474 874501479
874501487 874501488
874511460 874511463
874514080 874514086
874514089 874514094
874521132 874521135
874522276 874522279
874522478 874522481
874524056 874524059
874524060 874524063
874555136 874555139
874604805 874604808
874605305 874605310
874605714 874605717
874608091 874608094
874608320 874608323
874608850 874608854
874612731 874612734
874613430 874613433
874613687 874613690
874613734 874613739
874614442 874614445
874614730 874614733
874614817 874614820
874616108 874616111
874617600 874617603
874621454 874621457
874621878 874621882
874622710 874622713
874622906 874622909
874622912 874622916
874650118 874650121
874680962 874680965
874680967 874680971
874682475 874682478
874694443 874694449
874701935 874701938
874706772 874706775
874709814 874709818
874747757 874747760
874789503 874789507
874790067 874790070
874846213 874846216
874846219 874846220
874867626 874867627
874959075 874959078
874977323 874977326
874977327 874977330
875020179 875020183
875041719 875041720
875056060 875056061
875116740 875116744
875154085 875154090
875166301 875166304
875166370 875166373
875166379 875166380
875200513 875200516
875200566 875200567
875212723 875212726
875228963 875228966
