815277702 815279497
815292212 815292510
816377159 816379335
828190585 828204982
828276693 828291086
828291118 828291119
828291128 828311178
828536224 828561405
828623717 828640164
828795296 828809694
830334466 830337512
840200644 840200645
840200647 840200648
840200651 840215047
847033902 847034623
847119787 847134185
852645497 852646394
852651338 852651636
852662647 852662665
853307690 853307691
853307694 853336491
853863409 853892207
854013987 854013988
854620831 854649623
854651063 854673820
855161337 855162059
856191542 856223915
856278152 856306492
856367796 856375273
856460487 856466551
856656583 856681832
856684506 856713303
856850395 856864793
857528217 857528218
857528220 857529505
859786950 859788933
865112912 865124614
865358540 865358541
865360311 865363627
865538246 865543818
865685341 865699738
865721224 865721225
865721245 865721995
865794895 865795491
865974437 865975199
866512365 866582636
866589156 866644945
866661147 866689944
866743162 866771959
866784792 866813590
866830385 866885623
867117603 867123717
867193985 867197583
867203999 867232796
870352404 870352699
870955686 870956356
871076889 871078687
871331715 871333279
871348715 871352313
873417924 873417925
873417930 873429940
