862084471 862084474
862085087 862085089
862085090 862085095
862139823 862139825
862158455 862158458
862163233 862163236
862166272 862166275
862167098 862167100
862177039 862177042
862179445 862179448
862179815 862179818
862179819 862179822
862179838 862179840
862179846 862179848
862179858 862179860
862187315 862187316
862207612 862207615
862258345 862258347
862262557 862262560
862278843 862278846
862312816 862312818
862324868 862324872
862351902 862351905
862381106 862381110
862384734 862384737
862404459 862404461
862408502 862408504
862409261 862409263
862462617 862462619
862521816 862521818
862524771 862524774
862533390 862533393
862543217 862543219
862556190 862556193
862565816 862565819
862568022 862568025
862583642 862583645
862599899 862599901
862605874 862605876
862630699 862630700
862646164 862646167
862668097 862668098
862674505 862674507
862685864 862685866
862685869 862685871
862685872 862685874
862685875 862685876
862685883 862685885
862685888 862685890
862686281 862686289
862688426 862688427
862688435 862688437
862688442 862688444
862689709 862689711
862697390 862697393
862698695 862698697
862701055 862701058
862704861 862704864
862705528 862705529
862705534 862705540
862705544 862705546
862705964 862705966
862705974 862705976
862711832 862711835
862714956 862714958
862716238 862716240
862716972 862716973
862716974 862716977
862716978 862716981
862732329 862732332
862768805 862768807
862769566 862769569
862769585 862769588
862769593 862769596
862773089 862773095
862813923 862813925
862855435 862855439
862858311 862858314
862870019 862870022
862871018 862871020
862871021 862871023
862871037 862871040
862880092 862880094
862895140 862895142
862897013 862897016
862897415 862897416
862942201 862942203
862942769 862942778
862942781 862942783
862944125 862944127
862947251 862947254
862948347 862948348
862954143 862954145
862954531 862954533
862954534 862954537
862954539 862954542
862954543 862954544
862976653 862976655
863034394 863034397
863052312 863052314
863073122 863073124
863091512 863091514
863119447 863119449
863146688 863146690
863149232 863149235
863149287 863149289
863151157 863151158
863151939 863151941
863154147 863154149
863156996 863156999
863158086 863158089
863167014 863167016
863201555 863201557
863202528 863202531
863205210 863205213
863216963 863216967
863217580 863217584
863217587 863217589
863217598 863217600
863217605 863217608
863217609 863217611
863217617 863217620
863277418 863277421
863295689 863295691
863301808 863301811
863317386 863317389
863318751 863318757
863318759 863318762
863371795 863371799
863377901 863377902
863377905 863377906
863378399 863378405
863378409 863378411
863378421 863378423
863401073 863401075
863457775 863457780
863461765 863461766
863461772 863461774
863470489 863470492
863488008 863488013
863491449 863491451
863539884 863539887
863547539 863547543
863555473 863555474
863556024 863556027
863635507 863635510
863637351 863637353
863648274 863648277
863667997 863667998
863669776 863669778
863683960 863683962
863713670 863713672
863715663 863715665
863718380 863718383
863734117 863734121
863770803 863770806
863805592 863805594
863810267 863810269
863810829 863810830
863830593 863830595
863845995 863845997
863848325 863848328
863885796 863885799
863898890 863898894
863931146 863931150
863938124 863938125
863938989 863938992
863945555 863945556
863951349 863951351
863969694 863969697
863977659 863977662
863979289 863979292
863982956 863982959
863984378 863984381
863984737 863984760
863984762 863984763
863993756 863993759
864014662 864014665
864058994 864058996
864069329 864069332
864069808 864069830
864107890 864107893
864131990 864131993
864146475 864146478
864149878 864149881
864158803 864158806
864168571 864168573
864193848 864193851
864253440 864253442
864258759 864258761
864258763 864258765
864258825 864258827
864266754 864266771
864266816 864266819
864267207 864267209
864272189 864272192
864273759 864273775
864273776 864273778
864274516 864274519
864280534 864280537
864305760 864305761
864314471 864314473
864325516 864325519
864328193 864328195
864328873 864328875
864328876 864328881
864328884 864328890
864328896 864328899
864339207 864339210
864340135 864340137
864353223 864353225
864416222 864416224
864417536 864417541
864417544 864417546
864417548 864417550
864434097 864434099
864436604 864436608
864464152 864464157
864486296 864486299
864501126 864501128
864511047 864511052
864511054 864511056
864511068 864511071
864511072 864511075
864511076 864511079
864511080 864511083
864511084 864511087
864585227 864585229
864586032 864586034
864592284 864592286
864594247 864594249
864604561 864604564
864606931 864606936
864612164 864612168
864612660 864612664
864612670 864612672
864612679 864612683
864612688 864612691
864612692 864612695
864612697 864612703
864628210 864628213
864673457 864673460
864678553 864678556
864678955 864678959
864678965 864678967
864678978 864678980
864678986 864678988
864709369 864709371
864751176 864751179
864761268 864761271
864771382 864771384
864772229 864772232
864772238 864772241
864777348 864777350
864778545 864778547
864859063 864859065
864921841 864921843
864950591 864950593
864963104 864963107
864969414 864969416
864969822 864969828
864969834 864969837
864969843 864969846
865019925 865019929
865029069 865029072
865030312 865030316
865030317 865030324
865030325 865030328
865030329 865030332
865030616 865030618
865055973 865055976
865085559 865085560
865085853 865085857
865090872 865090875
865093444 865093447
865094965 865094975
865094976 865094979
865094980 865094986
865094987 865094989
865094991 865094998
865095000 865095006
865095008 865095014
865095015 865095017
865095020 865095022
865095036 865095038
865111427 865111430
865112053 865112055
865112057 865112058
865129595 865129597
865134185 865134187
865181816 865181818
865183445 865183447
865196759 865196761
865197225 865197228
865197234 865197237
865198292 865198294
865199406 865199409
865330312 865330314
865331586 865331587
865345196 865345199
865354334 865354338
865354761 865354762
865354769 865354771
865364615 865364617
865374034 865374036
865376751 865376754
865397997 865397999
865465060 865465064
865474645 865474646
865475187 865475190
865475191 865475202
865490983 865490986
865542472 865542475
865557046 865557049
865613986 865613989
865625911 865625914
865668380 865668382
865684208 865684210
865695526 865695529
865710715 865710718
865717623 865717625
865720721 865720722
865737509 865737512
865743332 865743336
865795319 865795321
865798658 865798659
865808673 865808675
865824200 865824202
865826741 865826743
865826744 865826746
865826752 865826755
865826756 865826758
865826761 865826764
865826765 865826767
865828747 865828750
865829370 865829373
865830361 865830364
865853749 865853751
865864248 865864251
865872572 865872574
865876531 865876535
865893521 865893524
865947220 865947224
865966168 865966171
865971926 865971929
865982217 865982219
865990584 865990586
866032220 866032222
866075671 866075673
866078354 866078355
866078363 866078367
866086270 866086271
866086814 866086816
866086817 866086825
866087091 866087092
866099706 866099708
866110365 866110366
866123142 866123144
866125790 866125791
866129031 866129033
866129082 866129083
866129106 866129109
866131142 866131144
866132852 866132854
866150406 866150408
866159763 866159767
866160704 866160706
866162816 866162820
866163575 866163579
866164166 866164171
866176569 866176570
866183553 866183556
866185908 866185909
866209947 866209949
866213035 866213037
866216788 866216790
866221881 866221883
866221945 866221950
866225056 866225058
866225176 866225178
866226689 866226691
866227210 866227211
866227212 866227219
866227220 866227224
866229755 866229757
866230261 866230264
866230265 866230273
866230274 866230284
866230285 866230292
866230297 866230300
866231550 866231553
866233921 866233923
866233947 866233950
866235640 866235642
866236000 866236003
866240849 866240851
866241563 866241566
866259350 866259352
866300575 866300578
866301880 866301883
866302691 866302693
866321333 866321335
866325912 866325914
866333489 866333492
866351775 866351778
866351783 866351786
866352555 866352557
866352562 866352565
866352567 866352569
866353233 866353243
866353265 866353268
866353273 866353282
866353301 866353308
866353310 866353321
866353322 866353344
866353346 866353349
866353350 866353353
866353361 866353363
866353364 866353374
866353375 866353410
866353439 866353455
866353490 866353501
866353502 866353507
866353508 866353512
866353515 866353517
866353666 866353757
866353760 866353762
866353777 866353779
866353928 866353951
866354754 866354761
866354764 866354769
866354770 866354778
866355812 866355957
866356348 866356356
866356357 866356401
866356402 866356416
866356420 866356423
866357425 866357427
866357499 866357501
866357713 866357716
866357722 866357727
866357733 866357747
866357753 866357763
866357764 866357765
866357771 866357773
866357776 866357778
866357780 866357782
866357846 866357848
866357857 866357860
866357870 866357871
866357877 866357879
866357881 866357885
866357889 866357898
866357916 866357920
866357921 866357925
866357930 866357932
866386717 866386718
866396841 866396844
866410915 866410918
866413734 866413737
866477800 866477801
866495195 866495197
866495204 866495206
866495223 866495225
866495241 866495243
866495253 866495255
866495298 866495300
866495388 866495390
866497433 866497436
866524490 866524491
866558014 866558016
866558191 866558194
866558261 866558262
866558469 866558470
866560695 866560697
866567587 866567590
866571381 866571384
866576171 866576174
866578548 866578551
866583670 866583672
866592978 866592979
866593678 866593681
866600589 866600592
866600973 866600986
866600988 866600990
866601018 866601020
866601328 866601331
866603983 866603986
866604677 866604682
866604687 866604690
866604699 866604702
866605038 866605040
866605041 866605043
866605063 866605066
866656402 866656407
866656445 866656448
866672713 866672715
866690175 866690177
866698427 866698430
866698941 866698943
866698948 866698952
866698957 866698960
866711289 866711293
866736417 866736421
866740523 866740525
866762361 866762363
866770591 866770592
866770962 866770966
866774064 866774067
866776182 866776183
866835970 866835972
866835985 866835987
866836003 866836004
866836014 866836016
866836026 866836028
866836032 866836035
866836067 866836069
866836082 866836083
866836139 866836142
866839049 866839051
866839504 866839510
866905630 866905632
866906683 866906687
866933821 866933824
866940855 866940857
866940858 866940860
866941673 866941675
866952755 866952757
867000113 867000115
867008039 867008041
867014603 867014605
867017295 867017296
867018078 867018081
867018109 867018111
867019126 867019129
867021150 867021154
867027865 867027868
867056207 867056209
867078152 867078154
867089629 867089632
867092248 867092252
867109615 867109617
867117624 867117626
867120030 867120102
867143124 867143128
867172176 867172181
867174303 867174307
867175052 867175054
867175692 867175694
867175918 867175921
867175930 867175932
867175933 867175935
867176046 867176049
867178099 867178101
867191170 867191173
867202509 867202512
867202517 867202519
867206358 867206359
867212090 867212092
867246625 867246628
867247054 867247057
867275341 867275343
867277037 867277038
867278236 867278237
867281762 867281764
867285601 867285604
867298972 867298974
867319771 867319773
867364096 867364098
867378799 867378803
867411558 867411560
867449562 867449564
867501137 867501141
867510476 867510477
867539503 867539505
867548116 867548119
867549689 867549691
867549695 867549705
867549706 867549708
867550623 867550624
867558682 867558684
867619691 867619692
867628393 867628395
867687412 867687414
867689706 867689707
867692287 867692288
867693688 867693691
867694299 867694302
867694307 867694314
867694315 867694322
867696572 867696574
867696613 867696615
867708200 867708203
867710115 867710119
867719796 867719799
867771689 867771693
867774887 867774889
867777498 867777500
867779593 867779595
867782791 867782794
867789507 867789508
867791011 867791013
867795629 867795632
867797230 867797232
867816007 867816009
867956648 867956650
868045696 868045700
868054789 868054792
868060789 868060792
868114715 868114719
868123196 868123200
868143075 868143077
868144481 868144482
868213018 868213021
868216393 868216395
868224678 868224680
868232613 868232616
868236195 868236197
868247672 868247675
868253686 868253688
868262646 868262649
868300773 868300776
868305181 868305184
868391924 868391927
868399323 868399326
868417442 868417444
868472295 868472299
868527536 868527539
868540493 868540496
868584298 868584302
868585125 868585132
868585133 868585149
868585150 868585152
868585154 868585157
868585158 868585160
868602716 868602720
868608390 868608391
868612609 868612612
868623752 868623754
868631329 868631332
868651853 868651856
868661476 868661479
868701175 868701178
868720386 868720389
868728035 868728039
868731255 868731257
868734421 868734424
868734924 868734928
868734930 868734933
868734934 868734936
868734941 868734944
868734953 868734956
868735484 868735486
868745035 868745039
868753256 868753260
868753836 868753850
868753874 868753877
868753878 868753880
868794197 868794199
868835738 868835741
868836795 868836796
868836799 868836801
868836816 868836818
868837700 868837704
868839401 868839404
868851580 868851582
868851906 868851908
868909142 868909145
868919364 868919367
868922684 868922686
868929129 868929131
868929223 868929225
868929260 868929262
868929581 868929584
868929708 868929716
868929724 868929725
868929728 868929731
868929741 868929744
868929846 868929848
868929901 868929903
868930131 868930133
868930142 868930143
868930285 868930287
868930288 868930290
868930297 868930299
868930306 868930315
868930873 868930876
868930877 868930879
868930881 868930884
868931499 868931502
868932239 868932240
868932284 868932287
868932292 868932294
868932343 868932347
868932348 868932351
868932992 868932996
868932997 868933000
868933003 868933006
868933015 868933017
868933036 868933038
868933044 868933046
868933064 868933068
868933076 868933078
868933082 868933084
868933114 868933115
868933130 868933132
868933180 868933181
868933195 868933196
868933204 868933209
868933213 868933214
868933217 868933219
868933237 868933243
868933258 868933260
868933261 868933264
868934319 868934323
868934325 868934327
868934334 868934335
868934339 868934348
868934349 868934362
868934363 868934366
868934367 868934475
868934497 868934502
868934504 868934543
868934544 868934573
868941027 868941030
868941071 868941073
868941168 868941170
868941203 868941204
868941331 868941341
868941766 868941767
868941940 868941941
868941944 868941946
868942012 868942014
868942039 868942041
868942085 868942087
868942142 868942143
868942146 868942148
868942151 868942154
868943055 868943060
868943062 868943064
868943065 868943069
868943071 868943073
868943074 868943097
868943100 868943102
868943787 868943795
868987997 868988002
869006694 869006697
869008589 869008590
869020208 869020210
869060244 869060247
869068031 869068033
869164327 869164331
869177777 869177780
869197461 869197463
869234008 869234011
869255663 869255666
869282806 869282809
869327263 869327265
869342357 869342360
869367623 869367627
869442643 869442645
869464573 869464576
869472339 869472342
869474197 869474200
869474205 869474209
869474210 869474212
869474215 869474216
869474348 869474349
869474369 869474371
869505241 869505244
869524306 869524310
869535596 869535598
869540721 869540724
869583604 869583606
869600606 869600608
869600613 869600616
869601833 869601836
869601842 869601847
869604874 869604875
869613896 869613898
869616272 869616275
869617374 869617377
869648706 869648710
869661191 869661194
869662470 869662475
869662476 869662480
869662481 869662483
869668103 869668105
869668116 869668118
869720585 869720588
869773252 869773254
869773261 869773264
869776717 869776718
869868648 869868650
869871459 869871462
869922600 869922605
869954387 869954389
869986923 869986924
869992040 869992043
870024119 870024124
870034083 870034086
870038691 870038695
870058130 870058133
870060566 870060568
870067996 870067998
870071471 870071473
870103419 870103422
870122298 870122302
870211152 870211154
870214727 870214729
870214730 870214733
870261907 870261908
870273274 870273277
870290008 870290011
870292497 870292498
870342125 870342126
870453102 870453105
870467419 870467422
870526863 870526864
870535227 870535230
870544915 870544916
870546359 870546361
870548674 870548675
870560021 870560023
870568818 870568820
870578152 870578155
870629021 870629025
870645648 870645650
870716154 870716158
870788362 870788365
870788808 870788814
870788821 870788822
870813963 870813966
870815199 870815203
870824955 870824957
870891414 870891417
870892125 870892134
870892135 870892143
870892167 870892169
870905951 870905954
870939916 870939918
870956310 870956313
870981003 870981006
870981007 870981009
870991923 870991926
871061236 871061240
871075846 871075848
871105573 871105576
871140986 871140990
871150682 871150693
871150695 871150697
871150698 871150701
871150702 871150709
871150946 871150948
871176880 871176881
871176888 871176890
871176970 871176972
871177046 871177048
871177135 871177137
871177141 871177143
871177149 871177150
871177235 871177237
871177348 871177350
871177796 871177799
871181236 871181238
871181250 871181251
871181255 871181257
871181266 871181269
871181275 871181277
871181287 871181289
871181290 871181291
871181308 871181310
871181311 871181312
871181322 871181324
871181348 871181350
871181351 871181352
871181354 871181356
871181363 871181365
871181376 871181378
871181384 871181385
871181387 871181388
871181427 871181429
871181435 871181436
871181453 871181454
871181503 871181505
871181521 871181523
871181537 871181538
871181551 871181555
871181573 871181575
871181577 871181578
871181579 871181581
871182693 871182695
871182937 871182940
871184388 871184391
871186641 871186644
871186791 871186793
871186824 871186826
871187017 871187024
871187027 871187042
871187194 871187198
871187200 871187202
871187203 871187206
871187213 871187216
871187228 871187248
871187250 871187252
871187265 871187269
871187272 871187274
871187375 871187377
871187445 871187446
871187919 871187924
871236639 871236642
871243437 871243441
871257149 871257153
871270334 871270336
871272644 871272647
871277327 871277330
871277332 871277335
871289576 871289579
871293929 871293931
871300098 871300100
871312996 871312999
871441450 871441453
871522469 871522474
871590281 871590284
871597099 871597101
871619302 871619306
871653659 871653662
871672023 871672026
871679619 871679622
871685681 871685685
871686910 871686911
871695404 871695408
871718979 871718982
871719459 871719461
871719462 871719464
871745628 871745631
871803511 871803514
871857009 871857012
871920988 871920992
871933683 871933686
872015161 872015164
872049106 872049109
872092911 872092919
872093052 872093055
872093099 872093104
872093108 872093109
872104000 872104002
872105573 872105575
872129378 872129380
872129933 872129936
872129967 872129971
872142137 872142140
872167786 872167789
872183086 872183090
872201839 872201842
872299581 872299586
872304723 872304726
872315362 872315365
872331587 872331590
872345480 872345481
872366533 872366537
872366538 872366540
872367570 872367572
872373267 872373269
872373274 872373277
872419763 872419765
872442808 872442813
872461205 872461206
872635367 872635370
872643806 872643811
872704679 872704680
872712958 872712961
872731135 872731138
872816916 872816919
872871900 872871904
872885771 872885774
872886731 872886732
872894734 872894737
872918020 872918023
872953205 872953206
872953231 872953233
872979804 872979807
872997228 872997231
873039677 873039679
873057761 873057764
873060203 873060205
873104418 873104420
873137078 873137082
873141116 873141118
873148161 873148163
873222863 873222866
873245579 873245581
873257951 873257954
873271075 873271077
873274731 873274733
873318436 873318440
873413485 873413488
873424754 873424758
873436445 873436451
873489663 873489670
873508788 873508790
873508819 873508821
873583018 873583021
873618107 873618111
873631791 873631794
873645669 873645672
873648745 873648748
873651430 873651432
873657125 873657128
873665978 873665981
873668113 873668116
873670118 873670120
873670133 873670136
873677301 873677304
873689408 873689410
873690891 873690893
873713269 873713271
873715070 873715073
873715078 873715081
873733482 873733485
873735489 873735491
873736118 873736123
873745620 873745623
873769290 873769291
873786069 873786071
873806624 873806628
873807194 873807199
873814261 873814264
873834770 873834772
873844515 873844518
873903839 873903841
873915996 873915999
873964113 873964115
873995565 873995567
874015312 874015315
874023771 874023773
874024182 874024183
874087561 874087564
874088806 874088813
874163996 874163997
874189124 874189126
874265685 874265688
874272874 874272878
874275435 874275438
874313439 874313442
874347700 874347701
874347702 874347705
874352758 874352762
874354143 874354146
874360670 874360673
874436879 874436899
874439977 874439980
874478797 874478800
874501488 874501492
874503075 874503083
874503084 874503091
874503097 874503100
874503106 874503109
874503114 874503117
874514094 874514097
874514505 874514527
874514529 874514531
874514533 874514536
874514542 874514544
874524813 874524816
874526311 874526314
874530207 874530210
874536291 874536294
874567567 874567570
874622915 874622919
874625650 874625651
874650122 874650125
874687196 874687199
874695981 874695984
874706774 874706777
874768935 874768938
874782184 874782186
874802185 874802188
874817619 874817621
874846220 874846222
874846847 874846858
874846860 874846861
874846878 874846880
874846885 874846888
874867626 874867628
874878340 874878342
874901682 874901686
874948257 874948262
874948394 874948399
874952432 874952436
