1 829887393 0.490 36.789
2 830249692 15.692 62.027
3 833758378 2.803 14.749
4 837327050 1.228 -48.383
5 839544636 7.459 -29.844
6 841741056 2.121 0.330
7 844250902 3.087 -50.496
8 845480361 9.676 -21.953
9 849082318 7.012 -74.587
10 850795876 7.023 -25.865
11 852206732 10.628 -53.202
12 852448975 0.062 -52.978
13 854961048 13.193 61.946
14 855882630 17.348 69.345
15 856228514 10.230 43.132
16 858238150 3.232 -42.950
17 859330305 17.969 -63.799
18 860376437 12.102 40.133
19 861085107 8.083 -45.564
20 861697882 1.925 -27.603
21 862464972 23.147 10.711
22 862633111 20.855 -78.382
23 862714121 15.858 -78.657
24 864478122 18.915 20.648
25 865562247 0.134 -29.758
26 866503073 21.587 -24.809
27 868424383 3.857 28.294
28 869049242 2.209 -2.198
29 870378959 16.337 -59.957
