816445693 816446042
818991493 818992566
825746414 825751666
832720390 832724118
834092750 834099294
834294314 834295173
834431503 834431834
835220090 835222858
839231699 839234699
841295414 841296222
841313714 841316101
842034614 842038684
842045414 842048738
843669614 843671714
843674354 843675218
847879754 847880665
859316414 859323614
859718054 859719931
862235774 862248881
865864214 865868414
865879214 865886414
871644614 871664414
872269214 872276414
872872214 872879414
873085334 873086592
873575751 873581330
874313114 874314559
