862318500 862318560
862318680 862318800
862318860 862319040
862319220 862319280
862350720 862350780
862393620 862393740
862393800 862394280
862394460 862394640
862394760 862394820
862674660 862674720
862732500 862733040
863052000 863052060
863053620 863053680
863053980 863054100
863117400 863117460
863284740 863284800
863343540 863343600
863344140 863344380
863344440 863345760
863345820 863345940
863346000 863346120
863346180 863346300
863346420 863346540
863394600 863394660
863396820 863396880
863397120 863397180
863397780 863397840
863398140 863398380
863569680 863569740
863573400 863573580
863826180 863826240
863826780 863826840
863827080 863827140
863830260 863830320
863830440 863830500
863830980 863831040
863831400 863831460
863831760 863831820
863831880 863832120
863832300 863832360
863832900 863833020
863833080 863833140
863833260 863833320
863833500 863833560
863833620 863833680
863833800 863833860
863833920 863834100
863834160 863834340
863834400 863834460
863834520 863834580
863834640 863834760
863834940 863835000
863835240 863835360
863835420 863835540
863835600 863835960
863836020 863836140
863836200 863836260
863837100 863837160
863837760 863837880
863838420 863838480
863843640 863843760
863891400 863891520
863932200 863932680
863984100 863984160
864047160 864047220
864047280 864047400
864047460 864047580
864317580 864317640
864318060 864318240
864334740 864334800
864338880 864339060
864340020 864340080
864340200 864340320
864340380 864340440
864340500 864340860
864340980 864341100
864341160 864341220
864341280 864341580
864341820 864342000
864342060 864342420
864342480 864342720
864343020 864343140
864343260 864343620
864343800 864344100
864344160 864344340
864344580 864344640
864344700 864344940
864345000 864345120
864345240 864345360
864345540 864346080
864346140 864346200
864346260 864346380
864346440 864346560
864346620 864346740
864347040 864347340
864347520 864347640
864347760 864348000
864348060 864348300
864348360 864348420
864348480 864348780
864348840 864349080
864349320 864349500
864349680 864349740
864349800 864349860
864349920 864349980
864350100 864350160
864350280 864350460
864350640 864350760
864351180 864351240
864351420 864351540
864352260 864352320
864352440 864352500
864353220 864353280
864353640 864353700
864354300 864354360
864592500 864592560
864592800 864593280
864593340 864593640
864593700 864593820
864593940 864594060
864594120 864594180
864642660 864642720
864857820 864857940
864858540 864858660
864858720 864859800
864859920 864859980
864860100 864860160
864964080 864964200
864965100 864965160
864965880 864965940
864966060 864966120
864966480 864966540
864967020 864967080
864968520 864968640
865094400 865094520
865126320 865126380
865128480 865128540
865130100 865130160
865176780 865176840
865181520 865181640
865181820 865181880
865182900 865182960
865183020 865183140
865183620 865183680
865183800 865183860
865183920 865184040
865184160 865184220
865184400 865184460
865184520 865184580
865185360 865185420
865185600 865185660
865185840 865185900
865185960 865186380
865186440 865186500
865186740 865186920
865186980 865187040
865187340 865187400
865187520 865187700
865187820 865187940
865188000 865188060
865188180 865188360
865188420 865188480
865188600 865188720
865188840 865188900
865189380 865189440
865189740 865189860
865189980 865190100
865190460 865190640
865190700 865190880
865190940 865191060
865191120 865191180
865191360 865191480
865192740 865192920
865193040 865193100
865193160 865193460
865193580 865193640
865194180 865194240
865194840 865194960
865195080 865195140
865195620 865195680
865195920 865195980
865196340 865196400
865196700 865196760
865196940 865197000
865198200 865198260
865198320 865198380
865199100 865199220
865199640 865199820
865200360 865200480
865201320 865201380
865201500 865201560
865201620 865201740
865202220 865202400
865202820 865202880
865202940 865203120
865203180 865203240
865203300 865203480
865203600 865203660
865203720 865203780
865203840 865203960
865204020 865204080
865204320 865204380
865204500 865204560
865204920 865204980
865205400 865205460
865206180 865206300
865206540 865206600
865206660 865206780
865206900 865206960
865207080 865207200
865207380 865207440
865207560 865207680
865207920 865208220
865208280 865208340
865208640 865208700
865208880 865209060
865209120 865209180
865209300 865209420
865209540 865209720
865210080 865210260
865211100 865211220
865211580 865211760
865212180 865212240
865212300 865212360
865212480 865212540
865212600 865212780
865213140 865213200
865213560 865213800
865213920 865214040
865214100 865214520
865214640 865214700
865214760 865215420
865215480 865216080
865216560 865216620
865217760 865217820
865346280 865346580
865354440 865354860
865355100 865355220
865355280 865355340
865355520 865355580
865361640 865361760
865366800 865367040
865367460 865367640
865367700 865367880
865368840 865368900
865369140 865369380
865369500 865369560
865369740 865369800
865369860 865369980
865370040 865370220
865370280 865370340
865370820 865370880
865371000 865371180
865371840 865371900
865371960 865372140
865372560 865372680
865372980 865373100
865373280 865373400
865373580 865373700
865373760 865373820
865374120 865374300
865374900 865375020
865376040 865376100
865376220 865376340
865376940 865377000
865377360 865377600
865651860 865651920
865668720 865668780
865700700 865700940
865701060 865701120
865701360 865701480
865701540 865701780
865702800 865702920
865702980 865703100
865798740 865803180
865803240 865803420
865824780 865824900
865825080 865825140
865825320 865825440
865825560 865825620
865826520 865826580
865826820 865826880
865827840 865827900
865827960 865828020
865828860 865828920
866077980 866078040
866078640 866078760
866078880 866078940
866079600 866079660
866079840 866079900
866080620 866080740
866081400 866081520
866082000 866082060
866083560 866083620
866138280 866138340
866156880 866156940
866157420 866157540
866157600 866157660
866158080 866158260
866158920 866158980
866159400 866159520
866160300 866160480
866161020 866161080
866161320 866161500
866163600 866163660
866163840 866163960
866164440 866164500
866164920 866165040
866165160 866165220
866166180 866166240
866166900 866167020
866167200 866167320
866167620 866167680
866167860 866167980
866168220 866168280
866168400 866168460
866168520 866168580
866171220 866171280
866171820 866171880
866171940 866172000
866184300 866184360
866185200 866185440
866185500 866185620
866185740 866185800
866185860 866185920
866186160 866186460
866186580 866186700
866186880 866186940
866603460 866603520
866604360 866604420
866604900 866604960
866605080 866605140
866608080 866608140
866609700 866609760
866610060 866610120
866684580 866684640
866762760 866762820
866771280 866771340
866773920 866773980
866774220 866774400
866775960 866776080
866777820 866777880
867037440 867039420
867039480 867039960
867040020 867040080
867040140 867040440
867040860 867040980
867041040 867041160
867041520 867041580
867042000 867042060
867042420 867042540
867042840 867042900
867042960 867043020
867043140 867043200
867058140 867058200
867488220 867488280
867488940 867489420
867489600 867489660
867512160 867512220
867512460 867512580
867512700 867512940
867513060 867513120
867513180 867513240
867513960 867514020
867514080 867514140
867514200 867514260
867514860 867514980
867515640 867515760
867515820 867515880
867516420 867516660
867517380 867517500
867517920 867518040
867720960 867721080
867721140 867721200
867733320 867733380
867813960 867814020
867814320 867814380
867815640 867815700
867815880 867815940
867816480 867816600
867817860 867817920
867818520 867818580
868399800 868399860
868399980 868400280
868400340 868400520
868400700 868400760
868400880 868400940
868401060 868401120
868540860 868545180
868545240 868545600
868545660 868545720
868545780 868545900
868546140 868546200
868546440 868546500
868546620 868546680
868546920 868546980
868547040 868547100
868584360 868584480
868584960 868585680
868585740 868589220
868589340 868589580
868589640 868589940
868590000 868590060
868590360 868590420
868631520 868631580
868631940 868632360
868632420 868633860
868633920 868634100
868634340 868634520
868634820 868634880
868681740 868682040
868682100 868682220
868703040 868703460
868703520 868703760
868704540 868704600
868729680 868729800
868755360 868755480
868916220 868916280
869060820 869060880
869068680 869069040
869207400 869207460
869207520 869207640
869207700 869207760
869282700 869282760
869283900 869283960
869284020 869284080
869446140 869446200
869446260 869446920
869446980 869447040
869447100 869447280
869447460 869447520
869465160 869468820
869468940 869469300
869469360 869469420
869469540 869469840
869469900 869469960
869470020 869470080
869471640 869471700
869472000 869472060
869472420 869472480
869535780 869536080
869536260 869536500
869585220 869585340
869585520 869586120
869586180 869586480
869614080 869614380
869617620 869617740
869618160 869618460
869721540 869721660
869721840 869721960
869722020 869722080
869722200 869722260
869797560 869797620
869798340 869798400
869802300 869802420
869802660 869802720
869960520 869960580
869960820 869960940
869961060 869961120
870024240 870024300
870024480 870024540
870024660 870030120
870030180 870030900
870031080 870031140
870031620 870031680
870031800 870031920
870031980 870032100
870032580 870032640
870032700 870032760
870032940 870033060
870033360 870033480
870058800 870058920
870058980 870059280
870059340 870059400
870059460 870064260
870064320 870065580
870065640 870066060
870066120 870066300
870066420 870066480
870066540 870066600
870066660 870066720
870069600 870069660
870069720 870069780
870149100 870149160
870150120 870150180
870229560 870229620
870231480 870231540
870232440 870232500
870274260 870274320
870274380 870274980
870275040 870275100
870275640 870275760
870275820 870275880
870483540 870483600
870483900 870484020
870484140 870484200
870538320 870538440
870538560 870538620
870540840 870541020
870548160 870548220
870566580 870566700
870568080 870568140
870569100 870569160
870570420 870570480
870570540 870570600
870570840 870570900
870571740 870571800
870571860 870571980
870572280 870572400
870629160 870635700
870635820 870636360
870636480 870636660
870636780 870636960
870637020 870637140
870637260 870637320
870717420 870717480
870765240 870765300
870767820 870767940
871005540 871005600
871106160 871106460
871245000 871249500
871249560 871249800
871249860 871250160
871250220 871250400
871250520 871250700
871250760 871251060
871251120 871251240
871251300 871251420
871252020 871252080
871257180 871270620
871270740 871270860
871270920 871271340
871271580 871271640
871271700 871271760
871272600 871272660
871273200 871273260
871273680 871273860
871274100 871274280
871274400 871274520
871274760 871275060
871275120 871275180
871275240 871275360
871277940 871278000
871278960 871279080
871279140 871279920
871280040 871280160
871280280 871280340
871280460 871280520
871280940 871281000
871290240 871294020
871294260 871294560
871294620 871295040
871295160 871295220
871295280 871295400
871295460 871295580
871295820 871295880
871295940 871296120
871296300 871296360
871297200 871297260
871297440 871297560
871298400 871298460
871301880 871302240
871302540 871302600
871348560 871348620
871356780 871356840
871358280 871358460
871358640 871358820
871394400 871394880
871443300 871443600
871524360 871524720
871592160 871592280
871654440 871654620
871654740 871655100
871655460 871655520
871655640 871656300
871656360 871656540
871656600 871656720
871656840 871656900
871657200 871657260
871688700 871688760
871688820 871689120
871689180 871689240
871689300 871689420
871689480 871689600
871689780 871689840
871690200 871690320
872125980 872126040
872126520 872126700
872126760 872126820
872127660 872127720
872129100 872129160
872129640 872129700
872129760 872129820
872130660 872130720
872131080 872131140
872131320 872131380
872168460 872168520
872210280 872210340
872210880 872211000
872211180 872211240
872211360 872211420
872211480 872211600
872211840 872211900
872213760 872213820
872214540 872214600
872218620 872218680
872218800 872218860
872272560 872272620
872643600 872643660
872643960 872644080
872644500 872644560
872644620 872644680
872644920 872644980
872645040 872645160
872645340 872645520
872645580 872645700
872645760 872645820
872645940 872646120
872646300 872646360
872646480 872646540
872647260 872647320
872651460 872651520
872651580 872651640
872652360 872652420
872652840 872652900
872709840 872711220
872711280 872712600
872712660 872712780
872712840 872713080
872713200 872713260
872714340 872714460
872714640 872714700
872725920 872725980
872731200 872731320
872731380 872731440
872731680 872740620
872740680 872740740
872740800 872741100
872741160 872741400
872741580 872741640
872745060 872745120
872767200 872767500
872767560 872767620
872958120 872958180
872997720 872997960
872998020 872998200
873137760 873137820
873137880 873137940
873139260 873139320
873139620 873139680
873420000 873420060
873424800 873430680
873430740 873431160
873431220 873431340
873431400 873431520
873431580 873431760
873431880 873432000
873432780 873432840
873433320 873433380
873433440 873433500
873433800 873433860
873528720 873528960
873570840 873570900
873631680 873644040
873644100 873644340
873644460 873645600
873645660 873645900
873645960 873646140
873646200 873646260
873646380 873646440
873646500 873646560
873646620 873646680
873646800 873647220
873647340 873647400
873647580 873647640
873647760 873647880
873647940 873648180
873648300 873648420
873648480 873648540
873648780 873648840
873649200 873649260
873649500 873649560
873677220 873677280
873677460 873687720
873687780 873688680
873688740 873688860
873689040 873689280
873689340 873689400
873689460 873689520
873689580 873689940
873690240 873690420
873690480 873698100
873698160 873698520
873698580 873698700
873698760 873698880
873699060 873699240
873699300 873699360
873699480 873699540
873713700 873713820
873713880 873714000
873714900 873714960
873715200 873715680
873715740 873715800
873715980 873716040
873716400 873716460
873716700 873716760
873752460 873753000
873786660 873786720
873787320 873787380
873787920 873787980
873788580 873788640
873788880 873788940
873789060 873790740
873792180 873792240
874019880 874019940
874024320 874024800
874024860 874024920
874052460 874052520
874226700 874226760
874314180 874314420
874314840 874314900
874314960 874315020
874315140 874315260
874315320 874315440
874315500 874315620
874315680 874315800
874315860 874315920
874316040 874316340
874316400 874317960
874318020 874318260
874318320 874318500
874318620 874318680
874318740 874318800
874318860 874318920
874319100 874319760
874319880 874320120
874320180 874320300
874320420 874320540
874320600 874320720
874320840 874320900
874321020 874321080
874321320 874321380
874366200 874366260
874367220 874367280
874367880 874367940
874368000 874368060
874368480 874368540
874368900 874368960
874523580 874523700
874524840 874524900
874525140 874525200
874525620 874525680
874526040 874526100
874526220 874526280
874526460 874526520
874526640 874526700
874527840 874527900
874528380 874528440
874529040 874529100
874529220 874529280
874530600 874530660
874530900 874531020
874531140 874531200
874531680 874531800
874620780 874620840
874734000 874734060
874768620 874768680
874768800 874768860
874771260 874771380
874771680 874771800
874778880 874779000
874779300 874779420
874779600 874779660
874780440 874780500
874813440 874813500
874813680 874813740
874846860 874847400
874847520 874847580
874847820 874849080
874849140 874849860
874849920 874850100
874850160 874850400
874850460 874850520
874851000 874851060
874853820 874853940
874854240 874854300
874861080 874861140
874861320 874861440
874861560 874861680
874861800 874861920
874960680 874960800
874960860 874960920
874960980 874962420
874962540 874962600
874962660 874962720
874962840 874963080
874963320 874963440
874963560 874963620
874978020 874978080
874978200 874978260
874978380 874978680
874978740 874978800
874978860 874982880
874982940 874983360
874983480 874983960
874984020 874984140
874984860 874984920
874984980 874985040
874985160 874985220
874985340 874985400
874985520 874985640
874987020 874987080
874987140 874987200
875016540 875016600
875016660 875016720
875016900 875017440
875022660 875030700
875030880 875031000
875031060 875031180
875031300 875031420
875031480 875031600
875031660 875031720
875031900 875031960
875032020 875032080
875083740 875083860
875084160 875084220
875084280 875084340
875084580 875084640
875154180 875154240
875154300 875154660
875154720 875160360
875160420 875160540
875160600 875160660
875160720 875161020
875161140 875161200
875161380 875161500
875161560 875161620
875161740 875161860
875161920 875162400
875162460 875162580
875162760 875162880
875163060 875163120
875166300 875174340
875174460 875174520
875174580 875174820
875174880 875175000
875175060 875175120
875175180 875175240
875175300 875175360
875175420 875175660
875175900 875175960
875182740 875182860
875183100 875183160
875183220 875183280
875183400 875183460
875183880 875185740
875185800 875186820
875186880 875187060
875187120 875187480
875187600 875187660
875187720 875187780
875187960 875188020
875188380 875188740
