862560453 862560470
862653359 862653376
863160357 863160374
863168023 863168040
863956944 863956961
864288731 864288748
864548803 864548820
864699889 864699906
864829909 864829926
864856245 864856262
865053055 865053072
865115391 865115408
865116587 865116604
865332803 865332820
865394059 865394076
865724438 865724455
865725081 865725098
865812322 865812339
865812992 865813009
865882524 865882541
866077896 866077913
866136649 866136666
866149621 866149638
866175776 866175793
866278183 866278200
866524814 866524831
866552117 866552134
867182671 867182688
867604388 867604405
868308098 868308115
868511412 868511429
868555786 868555803
868595746 868595763
868606373 868606390
868989192 868989209
869080148 869080165
869091675 869091692
869216403 869216420
869232925 869232942
869273127 869273144
869315252 869315269
869391765 869391782
869476656 869476673
869597853 869597870
869623627 869623644
869731567 869731584
869737782 869737799
869780984 869781001
869801882 869801899
869829934 869829951
869873579 869873596
869883642 869883659
869893775 869893792
870098004 870098021
870317094 870317111
870375001 870375018
870404151 870404168
870454658 870454675
870511738 870511755
870525509 870525526
870587916 870587933
870605058 870605075
870823961 870823978
870905893 870905910
871018182 871018199
871050803 871050820
871065076 871065093
871433132 871433149
871499164 871499181
871697475 871697492
871775538 871775555
871888628 871888645
872043401 872043418
872081903 872081920
872181998 872182015
872223003 872223020
872402155 872402172
872748048 872748065
873040760 873040777
873195142 873195159
873235085 873235102
873288587 873288604
873379429 873379446
873440210 873440227
873577188 873577205
873783875 873783892
874147069 874147086
874553198 874553215
874742343 874742360
874795660 874795677
874875893 874875910
874971637 874971654
874991322 874991339
875036440 875036457
875180585 875180602
875194190 875194207
