%% Please write one name per line, and up to 20 alpha factors per waveform %%
msmagnetar_a.mat 2400.709025 15934.295229 105761.157126 701971.577412 4659216.189439 30924749.944959 205257734.407346 1362363078.408804 9042451738.885881 60017725631.246788
msmagnetar_b.mat 240070.902525 1593429.522861 10576115.712574 70197157.741184 465921618.943892 3092474994.495929 20525773440.734589 136236307840.880341 904245173888.588135 6001772563124.678711
msmagnetar_c.mat 311.969710 2070.645553 13743.555431 91220.496705 605460.432778 4018639.986626 26673035.045449 177037704.522783 1175057460.438633 7799242760.486638
msmagnetar_d.mat 31196.971042 207064.555343 1374355.543097 9122049.670517 60546043.277763 401863998.662611 2667303504.544889 17703770452.278343 117505746043.863358 779924276048.663818
msmagnetar_e.mat 150.045049 995.898331 6610.104708 43873.438555 291202.438644 1932806.341726 12828671.257062 85148109.600494 565156002.773582 3751126231.335153
msmagnetar_f.mat 15004.504925 99589.833139 661010.470787 4387343.855480 29120243.864367 193280634.172554 1282867125.706217 8514810960.049388 56515600277.358200 375112623133.515259
msmagnetar_g.mat 19.498004 129.414661 858.967663 5701.250834 37841.076536 251163.668297 1667055.856934 11064797.902453 73440702.129359 487450089.626803
msmagnetar_h.mat 1949.800359 12941.466135 85896.766293 570125.083425 3784107.653607 25116366.829650 166705585.693446 1106479790.245300 7344070212.935863 48745

