815214704 815214734
815216341 815216371
815221302 815221332
815230076 815230106
815239943 815239973
815247153 815247183
815266813 815266843
815299861 815299891
815303630 815303660
815304752 815304782
815306479 815306509
815307298 815307328
815308035 815308065
815313339 815313369
815332238 815332268
815370539 815370569
815378706 815378736
815394298 815394328
815404236 815404266
815420654 815420684
815422249 815422279
815426764 815426794
815447661 815447671
815447676 815447691
815450662 815450692
815456690 815456720
815458676 815458706
815470961 815470991
815571762 815571792
815610530 815610546
815620202 815620232
815626105 815626135
815635944 815635974
815658129 815658159
815661955 815661985
815663154 815663184
815686835 815686865
815700472 815700497
815766659 815766689
815788959 815788989
815791332 815791362
815908915 815908917
815959604 815959634
815988434 815988464
816037609 816037639
816040172 816040202
816185369 816185399
816195469 816195499
816211250 816211280
816379680 816379710
816439288 816439318
816471739 816471769
816500099 816500129
816526741 816526771
816623385 816623415
816630919 816630949
816638301 816638331
816807210 816807240
816814434 816814464
816818402 816818432
816897916 816897946
816969464 816969494
816971419 816971447
816988804 816988834
817031528 817031550
817224714 817224744
817231996 817232026
817243358 817243388
817340726 817340756
817347023 817347052
817423359 817423389
817442405 817442435
817447625 817447644
817488860 817488890
817504485 817504515
817508362 817508392
817565054 817565084
817596488 817596518
817618167 817618176
817662166 817662196
817707659 817707689
817781813 817781843
817821584 817821614
817824876 817824906
817852385 817852415
818012209 818012239
818034349 818034379
818059290 818059320
818068459 818068489
818077186 818077216
818112830 818112860
818160970 818161000
818172868 818172898
818182077 818182107
818343198 818343228
818345466 818345496
818346840 818346870
818352286 818352316
818457139 818457169
818460112 818460142
818479697 818479727
818524958 818524963
818564821 818564851
818569747 818569777
818635021 818635051
818645231 818645261
818677622 818677652
818734853 818734883
818793840 818793870
818831824 818831854
818878562 818878592
818971187 818971217
819028043 819028073
819044172 819044175
819057905 819057935
819093845 819093875
819144576 819144606
819204079 819204109
819211287 819211317
819229156 819229186
819269452 819269478
819295079 819295109
819308235 819308265
819317104 819317134
819325363 819325393
819347977 819348007
819401351 819401381
819409213 819409243
819604129 819604159
819656579 819656609
819697618 819697648
819790018 819790048
819825378 819825408
819881036 819881066
819887386 819887416
819974496 819974519
820002926 820002956
820062976 820063006
820087077 820087106
820108770 820108800
820115160 820115190
820175701 820175731
820196378 820196408
820199644 820199664
820210650 820210680
820218644 820218674
820275900 820275930
820321203 820321233
820327220 820327244
820364670 820364700
820372170 820372200
820399001 820399031
820429986 820430016
820450964 820450994
820523845 820523875
820539380 820539410
820544831 820544861
820554526 820554556
820626501 820626528
820636288 820636318
820752458 820752488
820756062 820756092
820805044 820805074
820873210 820873240
820879055 820879085
820944195 820944225
820966550 820966580
820986510 820986540
820988875 820988905
820991036 820991066
820998794 820998824
821056332 821056362
821070959 821070989
821103996 821104026
821107491 821107521
821222740 821222770
821287418 821287448
821477436 821477466
821480143 821480173
821496285 821496315
821513366 821513396
821583860 821583890
821592269 821592299
821612941 821612971
821663969 821663999
821681667 821681697
821718654 821718684
821721120 821721150
821725793 821725823
821756514 821756544
821783034 821783064
821824727 821824757
821831874 821831904
821834427 821834457
821872821 821872851
821990673 821990703
822012092 822012122
822032161 822032190
822085208 822085238
822090585 822090615
822094541 822094571
822175178 822175208
822177478 822177508
822179709 822179726
822182935 822182965
822185003 822185031
822205498 822205528
822208658 822208688
822220303 822220333
822282883 822282913
822290421 822290451
822327709 822327739
822357755 822357785
822375834 822375864
822385926 822385956
822386556 822386579
822413327 822413357
822417148 822417178
822424785 822424815
822427353 822427383
822427867 822427897
822477505 822477535
822481783 822481813
822484374 822484404
822487870 822487900
822493137 822493167
822494662 822494692
822497781 822497811
822511744 822511774
822527277 822527307
822535309 822535339
822554204 822554234
822576550 822576580
822578825 822578855
822579966 822579996
822584044 822584074
822605218 822605248
822610225 822610255
822632840 822632870
822636058 822636088
822638536 822638566
822651022 822651052
822654112 822654142
822664705 822664735
822666844 822666874
822668382 822668412
822714369 822714399
822725807 822725837
822732720 822732750
822734942 822734972
822737913 822737943
822804928 822804958
822806401 822806431
822814711 822814741
822828752 822828782
822850839 822850869
822853284 822853314
822859358 822859388
822862250 822862280
822873308 822873338
822914995 822915025
822920394 822920424
822944142 822944172
822947077 822947107
822966501 822966531
822967862 822967892
822973508 822973538
822985573 822985603
822994777 822994807
823012333 823012363
823029618 823029648
823032408 823032438
823077999 823078029
823086281 823086311
823089341 823089371
823093249 823093279
823101973 823102003
823104547 823104577
823161911 823161941
823200104 823200134
823223133 823223163
823240798 823240828
823255730 823255752
823267725 823267755
823280213 823280243
823336843 823336873
823351230 823351260
823355462 823355492
823423455 823423485
824211914 824211944
824214413 824214443
824217418 824217448
824390219 824390249
824397899 824397929
824409150 824409180
824411889 824411919
824494649 824494679
824501170 824501200
824596571 824596601
824618447 824618477
824631418 824631448
824671432 824671462
824674529 824674559
824676237 824676267
824682983 824683013
824686556 824686586
824694228 824694258
824720639 824720669
824778032 824778062
824807198 824807228
824825526 824825556
824833078 824833108
824837875 824837905
824842031 824842061
824846434 824846464
824855318 824855348
824858217 824858247
824932250 824932280
824937530 824937560
824996750 824996780
825014678 825014708
825089271 825089301
825093185 825093215
825097901 825097931
825105138 825105168
825109957 825109987
825114604 825114634
825119821 825119851
825150242 825150272
825208377 825208407
825240611 825240641
825246077 825246107
825257859 825257882
825262582 825262612
825268921 825268951
825282214 825282244
825299816 825299846
825319559 825319589
825331318 825331348
825348969 825348999
825378339 825378369
825428881 825428911
825448401 825448431
825482207 825482237
825528726 825528756
825546407 825546437
825579017 825579047
825605375 825605405
825615157 825615187
825697350 825697380
825702857 825702887
825711321 825711351
825748922 825748952
825781351 825781381
825822792 825822822
825841415 825841445
825873716 825873746
825880388 825880418
825889590 825889620
825891782 825891812
825898683 825898713
825910167 825910197
825944794 825944824
825956720 825956750
825960975 825961005
825962142 825962172
825965859 825965889
825975566 825975596
826014439 826014469
826017150 826017180
826062477 826062507
826075024 826075054
826078968 826078998
826083619 826083649
826092477 826092507
826111591 826111621
826127298 826127328
826135489 826135519
826169160 826169190
826172363 826172393
826182017 826182047
826194444 826194474
826229364 826229394
826237053 826237083
826260121 826260151
826264978 826265008
826275599 826275629
826316338 826316368
826319420 826319450
826326897 826326927
826339616 826339646
826341442 826341472
826347002 826347032
826355807 826355837
826368287 826368317
826380815 826380835
826387674 826387704
826439450 826439480
826468327 826468357
826478602 826478632
826489452 826489478
826496996 826497026
826507271 826507301
826554029 826554059
826564561 826564591
826569516 826569546
826573735 826573765
826580389 826580419
826582942 826582972
826602648 826602678
826626601 826626631
826640973 826641003
826642190 826642220
826643603 826643633
826658308 826658338
826660931 826660961
826667383 826667413
826700209 826700239
826709188 826709218
826717519 826717549
826718262 826718292
826724377 826724407
826730489 826730519
826744882 826744912
826801519 826801549
826804205 826804235
826829283 826829313
826920630 826920660
826923678 826923708
826992768 826992789
827017487 827017517
827031797 827031827
827041428 827041458
827082759 827082789
827092977 827093007
827101409 827101439
827104816 827104846
827115548 827115578
827156378 827156408
827162979 827163009
827189374 827189404
827247725 827247755
827250109 827250139
827255669 827255699
827267762 827267792
827274954 827274984
827291855 827291885
827352934 827352964
827364324 827364354
827370444 827370474
827373577 827373607
827378568 827378598
827385424 827385454
827462019 827462049
827465071 827465101
827466440 827466470
827503821 827503851
827513301 827513331
827517903 827517933
827528690 827528720
827536971 827536996
827588617 827588647
827618470 827618500
827619633 827619663
827687631 827687661
827696496 827696526
827698182 827698212
827706834 827706864
827771543 827771573
827784097 827784127
827786454 827786475
827791513 827791543
827793085 827793115
827794742 827794772
827817718 827817748
827849470 827849500
827868877 827868907
827876363 827876393
827882096 827882126
827921719 827921749
827945805 827945835
827971432 827971462
827980679 827980709
828038085 828038115
828041301 828041331
828112497 828112527
828118048 828118078
828128117 828128141
828138354 828138384
828156321 828156351
828158155 828158185
828167437 828167467
828170874 828170904
828178597 828178627
828182088 828182118
828185918 828185948
828186797 828186827
828190746 828190776
828191777 828191807
828224970 828225000
828233658 828233688
828265870 828265900
828282068 828282098
828291987 828292017
828307020 828307050
828313699 828313729
828345041 828345071
828347371 828347401
828361818 828361848
828380420 828380450
828382814 828382844
828384916 828384919
828388239 828388269
828425603 828425633
828434482 828434512
828457799 828457821
828486829 828486856
828503396 828503424
828527881 828527911
828555133 828555163
828571404 828571434
828585124 828585154
828588525 828588555
828591264 828591294
828622903 828622933
828712738 828712768
828758424 828758454
828798833 828798863
828893906 828893936
828910527 828910557
828968201 828968231
828985248 828985278
828987190 828987220
828994328 828994358
829066423 829066453
829071226 829071256
829076375 829076405
829083887 829083912
829187832 829187862
829204523 829204553
829223988 829224018
829248302 829248328
829259495 829259525
829331001 829331030
829333729 829333759
829335944 829335974
829349115 829349145
829363303 829363333
829601358 829601388
829607436 829607466
829611169 829611199
829653724 829653754
829669530 829669560
829701789 829701819
829705018 829705048
829705937 829705967
829707288 829707318
829708987 829709017
829726185 829726215
829744736 829744766
829782891 829782921
829842572 829842580
829886946 829886976
829893887 829893898
829928574 829928604
829936013 829936043
829937768 829937798
829942100 829942130
829948685 829948705
829956049 829956079
829981945 829981968
830037534 830037563
830044399 830044427
830057178 830057208
830058121 830058151
830063003 830063033
830096716 830096743
830113106 830113136
830116558 830116585
830124657 830124687
830143990 830144020
830191946 830191976
830194130 830194160
830200494 830200520
830204558 830204588
830210459 830210489
830273042 830273072
830280083 830280113
830294033 830294063
830324447 830324477
830334762 830334792
830360255 830360285
830361074 830361104
830365557 830365587
830387243 830387273
830393847 830393877
830434110 830434140
830437173 830437203
830440457 830440487
830450737 830450767
830460592 830460615
830534915 830534945
830542517 830542547
830545210 830545240
830547526 830547556
830548436 830548466
830551547 830551577
830574515 830574545
830575956 830575986
830602690 830602720
830612759 830612789
830617320 830617350
830661971 830662001
830702263 830702293
830705924 830705954
830717464 830717494
830719743 830719773
830722059 830722089
830727279 830727304
830770946 830770976
830777887 830777894
830800825 830800855
830811416 830811442
830815433 830815451
830857489 830857519
830862320 830862350
830872539 830872569
830882763 830882793
830889168 830889198
830892687 830892715
830895275 830895305
830904844 830904867
830906552 830906558
830985426 830985449
830999164 830999194
831005188 831005218
831008338 831008368
831022676 831022701
831038932 831038962
831096910 831096935
831099645 831099675
831104661 831104669
831138598 831138628
831141182 831141212
831147041 831147065
831151199 831151229
831152989 831153019
831162225 831162255
831171506 831171536
831174722 831174752
831176172 831176202
831180517 831180547
831242123 831242148
831247119 831247149
831263338 831263368
831264554 831264580
831273236 831273266
831277154 831277184
831312252 831312282
831323486 831323516
831331559 831331589
831344003 831344033
831350963 831350993
831396057 831396087
831402016 831402046
831412628 831412658
831419067 831419084
831420157 831420187
831454706 831454734
831475503 831475533
831484012 831484042
831510524 831510553
831518625 831518655
831552792 831552822
831569527 831569557
831582587 831582613
831588757 831588787
831621220 831621238
831630972 831631002
831669155 831669185
831688923 831688953
831699368 831699398
831747195 831747225
831765177 831765202
831790819 831790849
831811943 831811973
831848884 831848914
831850412 831850442
831911418 831911448
831923458 831923488
831934014 831934044
831938810 831938840
831982705 831982734
832001391 832001421
832008876 832008903
832012657 832012687
832017694 832017724
832019034 832019064
832029192 832029222
832031781 832031811
832037617 832037647
832049731 832049761
832052275 832052305
832054170 832054200
832072728 832072758
832100837 832100867
832109351 832109381
832116446 832116476
832162393 832162423
832175533 832175563
832197054 832197084
832199744 832199774
832205683 832205713
832234810 832234840
832271990 832272020
832284891 832284921
832295716 832295746
832300392 832300422
832331993 832332023
832338049 832338079
832345357 832345387
832350209 832350239
832370361 832370391
832427135 832427165
832454576 832454606
832458508 832458538
832461975 832462005
832465115 832465145
832472641 832472671
832479827 832479857
832493898 832493928
832504080 832504110
832520417 832520447
832542533 832542563
832553329 832553359
832555459 832555489
832601898 832601928
832613840 832613853
832619078 832619108
832620993 832621023
832625466 832625496
832627523 832627553
832630396 832630426
832640506 832640536
832643505 832643535
832650602 832650624
832658050 832658080
832688354 832688384
832690143 832690173
832698892 832698922
832702360 832702390
832706537 832706567
832713973 832714003
832716661 832716691
832718854 832718884
832772754 832772784
832801933 832801963
832821912 832821942
832823305 832823335
832853010 832853040
832858401 832858431
832860478 832860508
832865473 832865503
832882950 832882980
832939982 832940012
832954132 832954162
833009943 833009973
833016144 833016174
833020501 833020531
833026154 833026184
833051334 833051364
833059011 833059018
833061526 833061556
833137574 833137604
833140786 833140816
833144668 833144698
833147241 833147271
833148467 833148468
833210631 833210661
833227299 833227329
833228422 833228452
833233700 833233730
833235186 833235216
833269381 833269411
833320120 833320150
833369481 833369511
833386744 833386774
833389809 833389839
833393786 833393816
833396773 833396803
833414767 833414797
833425420 833425450
833446708 833446738
833451104 833451134
833574134 833574164
833576852 833576875
833578437 833578467
833580679 833580709
833658790 833658807
833663476 833663506
833681837 833681867
833728645 833728675
833742326 833742356
833749158 833749188
833753168 833753198
833756512 833756542
833811817 833811847
833827197 833827227
833833849 833833879
833836593 833836623
833839527 833839557
833845546 833845576
833868583 833868613
833885516 833885546
833947540 833947570
833957652 833957682
833987301 833987331
834091981 834092011
834095617 834095643
834156395 834156425
834183062 834183092
834270517 834270547
834282029 834282059
834294380 834294410
834307661 834307691
834322682 834322712
834326384 834326414
834346925 834346955
834350550 834350580
834353280 834353310
834358395 834358425
834390135 834390165
834435501 834435531
834450475 834450505
834518356 834518386
834520116 834520146
834525330 834525360
834530045 834530075
834596620 834596650
834624415 834624445
834635041 834635071
834691087 834691117
834744411 834744441
834779933 834779963
834781871 834781901
834795895 834795925
834800196 834800226
834811513 834811543
834833048 834833078
834839902 834839932
834846542 834846572
834953240 834953270
834963548 834963578
835009384 835009414
835039709 835039739
835099632 835099662
835100792 835100822
835212335 835212365
835247098 835247128
835374873 835374903
835393132 835393162
835411626 835411656
835413036 835413066
835443420 835443450
835475761 835475791
835480027 835480057
835490010 835490040
835495836 835495866
835499605 835499635
835501711 835501741
835545152 835545182
835567459 835567489
835643683 835643713
835648004 835648034
835721823 835721853
835770728 835770758
835818119 835818149
835848115 835848145
835895126 835895156
835900464 835900494
835954317 835954347
836039511 836039541
836080663 836080693
836108863 836108893
836118795 836118825
836188637 836188667
836247747 836247777
836261506 836261536
836293079 836293109
836331620 836331650
836335186 836335216
836352714 836352744
836375197 836375227
836412509 836412539
836426832 836426862
836454214 836454244
836459657 836459687
836461535 836461565
836485047 836485077
836601962 836601992
836709918 836709948
836769063 836769093
836771107 836771137
836776331 836776361
836853248 836853278
836861754 836861784
836928995 836929025
836932087 836932117
836943492 836943522
837025874 837025904
837033711 837033741
837038058 837038088
837086110 837086140
837110218 837110248
837135017 837135047
837160788 837160818
837164678 837164708
837223666 837223696
837227363 837227393
837333067 837333097
837344600 837344630
837369521 837369551
837384560 837384590
837452420 837452450
837458161 837458191
837548024 837548054
837569235 837569265
837579781 837579811
837723724 837723754
837801630 837801660
837815458 837815488
837832645 837832675
837834767 837834797
837843236 837843266
837865930 837865960
837924282 837924312
838041794 838041824
838064543 838064573
838078944 838078974
838087160 838087190
838108397 838108427
838153958 838153988
838174503 838174533
838238548 838238578
838257930 838257960
838294994 838295024
838325682 838325712
838373664 838373694
838399490 838399520
838406340 838406370
838415409 838415439
838419157 838419187
838469752 838469782
838569410 838569440
838607521 838607551
838609823 838609853
838629587 838629617
838635745 838635775
838683782 838683812
838688352 838688382
838713228 838713258
838756483 838756513
838831609 838831639
838844139 838844169
838911805 838911835
839020507 839020537
839025049 839025079
839073605 839073635
839103119 839103149
839127714 839127744
839185850 839185880
839193176 839193206
839201752 839201782
839258164 839258178
839267089 839267119
839284931 839284961
839296833 839296863
839297688 839297718
839299252 839299282
839300093 839300123
839300938 839300939
839302188 839302218
839304180 839304210
839337915 839337945
839342211 839342241
839347343 839347373
839371026 839371056
839564676 839564706
839618622 839618652
839626476 839626506
839629570 839629600
839630664 839630694
839680416 839680446
839718651 839718681
839721949 839721979
839801298 839801328
839808193 839808223
839828543 839828573
839848793 839848823
839863851 839863881
839869598 839869628
839885297 839885327
839971585 839971615
839977632 839977662
840039667 840039697
840047954 840047955
840049246 840049276
840078646 840078676
840081666 840081696
840176689 840176719
840194135 840194165
840196447 840196477
840197516 840197546
840200712 840200742
840222265 840222295
840224981 840225011
840230195 840230225
840231587 840231617
840238308 840238338
840243973 840244003
840317195 840317225
840403569 840403599
840488385 840488415
840491975 840492005
840500873 840500903
840502609 840502639
840576628 840576658
840671267 840671297
840734628 840734658
840736801 840736831
840737653 840737683
840740729 840740759
840752591 840752621
840836496 840836526
840857917 840857947
840882767 840882797
840926194 840926224
840931121 840931151
840932633 840932663
840995733 840995763
841063324 841063354
841085913 841085943
841141920 841141950
841143872 841143902
841147814 841147844
841178587 841178617
841236712 841236742
841242278 841242308
841262320 841262350
841305663 841305693
841342866 841342896
841471812 841471842
841533316 841533346
841554500 841554530
841585982 841586012
841691446 841691476
841767452 841767482
841777371 841777401
841792428 841792458
841811452 841811482
841827835 841827865
841863885 841863915
841922175 841922205
842037014 842037044
842046971 842047001
842048435 842048465
842103799 842103829
842189715 842189745
842205420 842205450
842219588 842219618
842236224 842236254
842294309 842294339
842295357 842295387
842303946 842303976
842325868 842325898
842385155 842385185
842409251 842409281
842428648 842428678
842443940 842443952
842458172 842458202
842468441 842468471
842472465 842472495
842478502 842478532
842485330 842485360
842495220 842495250
842521610 842521640
842561758 842561788
842586514 842586544
842652937 842652967
842666972 842667002
842670951 842670981
842678783 842678813
842689166 842689196
842762952 842762982
842803521 842803551
842814203 842814233
842816592 842816622
842821897 842821927
842823586 842823616
842825855 842825885
842832905 842832935
842900126 842900156
842907836 842907866
842910985 842911015
842915620 842915650
842917196 842917226
842922595 842922625
842928244 842928274
842967511 842967541
842981136 842981166
842986069 842986099
842988967 842988997
842994505 842994535
842996021 842996051
842997968 842997998
842999770 842999800
843025588 843025618
843105359 843105389
843108832 843108862
843132694 843132724
843167714 843167744
843174973 843175003
843223860 843223890
843251616 843251646
843257729 843257759
843272242 843272272
843421630 843421660
843427979 843428009
843429123 843429153
843435839 843435869
843443198 843443228
843445255 843445285
843460435 843460465
843506074 843506104
843507417 843507447
843512794 843512824
843514477 843514507
843571093 843571123
843589974 843590004
843604893 843604923
843635601 843635631
843642833 843642863
843644501 843644531
843656402 843656432
843674407 843674437
843703565 843703595
843709072 843709102
843710877 843710907
843721499 843721529
843722232 843722262
843729350 843729380
843742057 843742087
843795760 843795790
843801502 843801532
843802732 843802762
843833279 843833309
843836158 843836188
843837416 843837446
843855591 843855621
843887051 843887081
843902011 843902041
843906327 843906357
843912265 843912295
843921428 843921458
843965891 843965921
844007043 844007073
844010681 844010711
844013629 844013659
844015192 844015222
844016004 844016034
844017703 844017733
844024622 844024652
844035209 844035239
844051555 844051585
844097045 844097075
844122010 844122040
844245182 844245212
844310919 844310949
844423942 844423972
844430915 844430945
844440015 844440045
844457467 844457497
844463069 844463099
844464546 844464576
844485639 844485669
844497517 844497547
844508462 844508492
844514878 844514908
845360311 845360341
845377206 845377236
845398932 845398962
845421354 845421384
845446584 845446614
845476772 845476802
845478652 845478682
845492569 845492599
845504043 845504073
845533095 845533125
845541910 845541940
845560819 845560849
845636143 845636173
845657671 845657701
845665826 845665856
845668136 845668166
845669915 845669945
845674137 845674167
845700253 845700283
845889233 845889263
845892508 845892538
845899890 845899920
846013198 846013228
846016647 846016677
846020882 846020912
846095543 846095573
846106873 846106903
846188949 846188979
846191757 846191787
846311967 846311997
846334215 846334245
846342468 846342498
846449549 846449579
846457798 846457828
846510699 846510729
846529444 846529474
846544998 846545028
846623360 846623390
846632725 846632754
846675219 846675249
846689875 846689905
846692403 846692433
846698838 846698868
846746029 846746059
846751139 846751169
846826538 846826568
846834604 846834634
846853799 846853829
846920783 846920813
846924950 846924980
846930659 846930689
846936462 846936492
846941854 846941884
846951308 846951338
847041946 847041976
847096841 847096871
847120098 847120128
847230627 847230657
847237364 847237394
847317962 847317992
847381428 847381458
847383619 847383649
847402627 847402657
847417096 847417126
847421823 847421853
847469268 847469298
847604934 847604964
847622470 847622500
847637437 847637467
847639297 847639327
847661509 847661539
847731438 847731468
847734792 847734822
847744293 847744323
847753406 847753436
847797088 847797118
847802556 847802586
847811779 847811809
847823941 847823971
847834691 847834721
847837408 847837438
847841040 847841070
847883699 847883729
847900072 847900102
847915347 847915377
847922223 847922253
847945256 847945286
847955138 847955168
847998406 847998436
848004624 848004654
848069410 848069440
848086215 848086245
848095190 848095220
848099911 848099941
848116299 848116329
848155986 848156016
848219958 848219988
848229912 848229942
848237075 848237105
848311639 848311669
848317882 848317912
848319572 848319602
848324935 848324965
848325646 848325676
848330569 848330599
848335469 848335499
848348063 848348093
848418247 848418277
848424924 848424954
848430952 848430982
848439959 848439989
848458118 848458148
848466285 848466315
848492182 848492212
848527640 848527657
848581243 848581273
848619415 848619445
848623993 848624023
848629979 848630009
848638800 848638830
848648663 848648693
848673411 848673441
848684633 848684663
848691412 848691442
848701425 848701455
848735286 848735316
848736685 848736715
848741954 848741984
848744532 848744562
848750493 848750523
848755568 848755598
848785874 848785904
848789410 848789440
848842303 848842333
848846366 848846396
848850522 848850552
848853371 848853401
848855619 848855649
848865333 848865363
848876430 848876460
848896801 848896831
848918508 848918538
848922335 848922365
848942049 848942079
848944292 848944322
848970221 848970244
848981877 848981907
849037112 849037142
849044924 849044954
849050322 849050352
849053444 849053474
849076389 849076419
849089078 849089108
849147677 849147707
849213016 849213046
849214772 849214802
849248205 849248235
849300006 849300036
849396853 849396883
849443385 849443415
849470600 849470630
849477096 849477126
849554394 849554424
849564262 849564292
849568069 849568099
849637534 849637564
849705286 849705316
849711487 849711517
849719470 849719500
849726040 849726070
849729289 849729319
849750987 849751017
849774015 849774045
849786094 849786124
849870108 849870138
849892634 849892664
849901303 849901333
849906555 849906585
849950596 849950626
849958655 849958685
850020485 850020515
850061082 850061112
850064016 850064046
850101568 850101598
850137758 850137788
850153551 850153581
850161548 850161578
850164434 850164464
850170191 850170221
850172973 850173003
850182152 850182182
850187405 850187435
850197792 850197822
850271882 850271912
850275973 850276003
850282713 850282743
850317422 850317452
850330598 850330628
850331123 850331153
850346039 850346069
850370145 850370175
850395810 850395840
850405237 850405267
850488162 850488192
850490739 850490769
850514471 850514501
850517977 850518007
850532621 850532651
850602883 850602913
850643007 850643037
850666488 850666518
850674292 850674322
850677398 850677428
850679356 850679386
850692228 850692258
850694571 850694601
850697160 850697190
850715798 850715828
850744846 850744876
850749578 850749608
850757459 850757489
850759929 850759959
850777138 850777168
850780637 850780667
850825126 850825156
850841054 850841084
850853390 850853420
850856860 850856890
850880210 850880240
851033081 851033111
851038845 851038875
851239510 851239540
851262758 851262788
851276598 851276628
851286648 851286678
851332046 851332076
851338602 851338632
851341125 851341155
851343930 851343960
851346969 851346999
851353960 851353990
851362655 851362685
851395786 851395816
851408076 851408106
851464237 851464267
851513365 851513395
851519979 851520009
851522130 851522160
851646538 851646568
851660161 851660191
851665959 851665989
851670368 851670398
851674084 851674114
851698022 851698052
851729468 851729498
851778312 851778342
851784614 851784644
851785355 851785385
851787933 851787963
851934633 851934663
851970238 851970268
852025671 852025701
852051456 852051486
852065255 852065285
852147379 852147409
852156136 852156166
852212298 852212328
852263380 852263410
852276886 852276916
852312952 852312982
852323425 852323455
852325431 852325461
852358182 852358212
852393195 852393225
852435958 852435988
852440061 852440091
852458870 852458900
852489562 852489592
852490444 852490450
852493253 852493283
852497222 852497252
852502399 852502429
852509060 852509090
852520726 852520756
852566232 852566262
852575008 852575038
852576287 852576317
852577440 852577444
852580446 852580476
852583826 852583856
852595299 852595329
852627977 852628007
852633491 852633521
852652926 852652956
852661355 852661385
852669906 852669936
852679302 852679332
852697972 852698002
852715704 852715734
852716850 852716880
852745628 852745658
852752847 852752877
852758756 852758786
852794507 852794537
852825665 852825695
852920938 852920968
852931478 852931508
852953038 852953068
852998226 852998228
853067332 853067362
853196703 853196733
853263984 853264014
853272950 853272980
853280265 853280295
853290920 853290950
853315982 853316012
853414918 853414948
853444729 853444759
853453929 853453959
853479028 853479058
853483060 853483090
853595407 853595437
853668706 853668736
853673706 853673736
853758744 853758774
853781095 853781100
853838670 853838700
853949405 853949435
853955016 853955046
854041738 854041755
854123109 854123139
854249328 854249358
854292395 854292425
854306073 854306103
854311849 854311879
854408748 854408778
854427583 854427613
854476848 854476878
854478756 854478786
854482211 854482241
854483426 854483456
854504661 854504691
854584176 854584206
854618005 854618035
854658300 854658330
854666456 854666486
854705293 854705323
854706523 854706553
854751243 854751273
854770206 854770236
854794500 854794530
854910415 854910445
854916967 854916997
854919389 854919419
854926257 854926287
854988003 854988033
855004871 855004901
855011499 855011529
855030892 855030922
855086928 855086958
855158534 855158564
855199408 855199438
855220519 855220549
855243369 855243399
855258348 855258378
855268071 855268101
855312439 855312469
855414382 855414412
855461337 855461367
855476939 855476969
855526457 855526487
855544082 855544112
855620206 855620236
855689304 855689334
855706418 855706448
855778710 855778740
855783240 855783270
855809700 855809730
855824205 855824235
855862413 855862443
855867681 855867711
855869740 855869770
855901506 855901536
855907780 855907810
855943424 855943454
855949000 855949030
855953818 855953848
855954949 855954979
855987147 855987177
856006427 856006457
856067880 856067910
856075762 856075792
856105801 856105831
856127795 856127825
856133519 856133549
856135748 856135778
856142915 856142945
856150213 856150243
856167348 856167378
856210327 856210357
856218050 856218080
856223813 856223843
856233084 856233114
856258785 856258815
856276878 856276908
856294308 856294338
856320407 856320437
856331079 856331109
856382980 856383010
856396249 856396279
856401834 856401864
856410982 856411012
856414746 856414776
856436319 856436349
856451136 856451166
856466305 856466335
856471155 856471185
856500878 856500908
856527688 856527718
856536408 856536438
856544276 856544306
856571502 856571532
856583590 856583620
856591033 856591063
856613449 856613479
856698625 856698655
856702997 856703027
856718656 856718686
856726102 856726110
856727650 856727680
856728775 856728805
856778866 856778896
856826528 856826558
856876820 856876850
856900906 856900936
856908861 856908881
856912788 856912818
856922474 856922504
856928214 856928244
856987245 856987275
857007008 857007038
857094645 857094675
857131802 857131832
857215109 857215114
857257984 857258014
857262608 857262638
857268786 857268816
857334893 857334923
857362620 857362650
857366090 857366120
857402350 857402380
857406429 857406459
857435190 857435220
857436335 857436365
857445566 857445596
857461668 857461698
857502308 857502338
857505388 857505418
857507470 857507500
857509742 857509772
857516498 857516528
857531030 857531060
857544348 857544378
857551781 857551795
857559142 857559172
857581980 857582010
857592055 857592085
857596896 857596926
857632768 857632798
857636312 857636342
857639309 857639339
857645416 857645446
857652016 857652046
857667252 857667282
857673223 857673253
857678570 857678600
857682007 857682037
857686165 857686195
857695445 857695475
857706546 857706576
857715479 857715509
857735266 857735296
857738990 857739020
857743006 857743036
857755001 857755031
857763704 857763718
857790218 857790248
857862288 857862318
857898506 857898536
857932483 857932513
857940914 857940944
857946437 857946467
857949035 857949065
857995217 857995247
858024600 858024630
858031480 858031510
858107553 858107583
858115504 858115534
858132563 858132593
858165002 858165032
858184979 858185009
858207150 858207180
858216983 858217013
858219620 858219650
858268953 858268983
858291773 858291803
858377777 858377807
858390331 858390361
858465374 858465404
858467802 858467832
858470010 858470040
858489746 858489776
858532022 858532052
858535232 858535262
858556042 858556072
858594442 858594472
858607747 858607777
858617678 858617708
858620361 858620391
858626630 858626660
858643054 858643084
858693343 858693373
858724929 858724959
858741251 858741281
858765969 858765999
858784988 858785018
858797923 858797953
858805133 858805163
858819180 858819210
858885505 858885535
858892077 858892107
858951712 858951742
858961242 858961272
858963308 858963338
858964075 858964082
858966240 858966270
858973777 858973807
859068964 859068994
859075109 859075139
859082322 859082352
859082770 859082800
859084692 859084722
859093661 859093691
859094919 859094949
859095863 859095893
859123595 859123625
859127636 859127666
859140870 859140900
859145836 859145866
859155413 859155443
859182051 859182081
859231903 859231933
859242765 859242795
859281342 859281372
859312533 859312563
859320109 859320139
859348528 859348558
859399921 859399951
859431726 859431756
859474790 859474820
859477513 859477543
859495978 859496008
859551324 859551354
859575997 859576027
859591340 859591370
859607373 859607403
859704468 859704498
859720414 859720444
859751603 859751633
859761457 859761487
859781258 859781288
859787071 859787081
859831578 859831608
859848824 859848854
859898954 859898984
859934467 859934497
860000729 860000759
860010971 860011001
860060461 860060491
860091110 860091140
860149671 860149701
860160331 860160361
860162593 860162623
860166832 860166862
860168663 860168693
860284305 860284335
860292916 860292946
860341468 860341498
860342969 860342999
860357858 860357888
860364216 860364246
860366133 860366163
860371176 860371206
860440171 860440201
860453976 860454006
860478545 860478575
860489446 860489476
860497427 860497457
860506915 860506945
860509644 860509674
860527279 860527309
860543504 860543534
860550826 860550856
860552162 860552192
860585189 860585219
860624048 860624078
860675475 860675505
860710788 860710818
860736247 860736250
860759684 860759714
860789278 860789308
860796772 860796802
860857355 860857385
860878999 860879029
860894415 860894445
860921047 860921077
860944674 860944704
860947964 860947994
860970685 860970715
861038216 861038246
861040870 861040900
861044638 861044668
861055408 861055438
861064774 861064804
861071799 861071829
861073802 861073832
861084175 861084197
861089115 861089145
861111689 861111719
861131186 861131216
861133816 861133846
861141000 861141030
861175500 861175530
861214926 861214956
861278772 861278802
861306844 861306874
861315696 861315726
861390932 861390962
861398690 861398720
861424442 861424472
861428440 861428470
861489541 861489571
861495203 861495233
861501222 861501252
861504670 861504700
861544063 861544093
861566177 861566207
861577236 861577266
861616358 861616388
861625571 861625601
861629564 861629594
861641325 861641355
861644389 861644419
861647505 861647535
861650085 861650115
861652879 861652909
861654535 861654565
861739747 861739777
861750673 861750703
861824173 861824203
861843023 861843053
861866570 861866600
861886137 861886167
861919884 861919914
861924488 861924518
861931740 861931770
861946245 861946275
861992508 861992538
861996859 861996889
862009888 862009918
862139793 862139823
862158426 862158456
862163204 862163234
862167802 862167832
862177009 862177039
862179415 862179445
862187285 862187315
862207582 862207612
862258314 862258344
862262527 862262557
862278813 862278843
862312785 862312815
862324839 862324869
862351872 862351902
862381076 862381106
862384704 862384734
862404429 862404459
862408472 862408502
862462587 862462617
862521785 862521815
862524742 862524772
862533360 862533390
862543187 862543217
862556161 862556191
862565786 862565816
862567992 862568022
862583612 862583642
862599869 862599899
862605844 862605874
862646134 862646164
862668066 862668096
862689679 862689709
862698665 862698695
862701025 862701055
862704831 862704861
862705943 862705973
862716207 862716237
862732299 862732329
862768774 862768804
862773062 862773092
862813893 862813923
862855407 862855437
862858282 862858312
862869990 862870020
862880061 862880091
862896983 862897013
862942171 862942201
862944095 862944125
862947221 862947251
862948317 862948347
862954113 862954143
862976623 862976653
863034364 863034394
863052282 863052312
863073092 863073122
863091481 863091511
863119417 863119447
863201525 863201555
863202498 863202528
863205181 863205211
863216933 863216963
863295658 863295688
863301778 863301808
863317356 863317386
863371766 863371796
863377874 863377904
863457745 863457775
863539854 863539884
863547509 863547539
863635477 863635507
863637322 863637352
863669746 863669776
863683929 863683959
863713640 863713670
863734087 863734117
863770773 863770803
863805563 863805593
863830563 863830593
863848295 863848325
863931116 863931146
863945525 863945555
863979259 863979289
863982925 863982955
863984347 863984377
863993726 863993756
864014632 864014662
864058964 864058994
864069299 864069329
864107860 864107869
864131960 864131990
864146445 864146475
864149848 864149878
864158774 864158804
864168540 864168570
864253410 864253440
864280504 864280534
864305729 864305759
864314440 864314470
864325487 864325517
864328162 864328192
864339177 864339207
864340104 864340134
864416192 864416222
864434066 864434096
864436574 864436604
864464122 864464152
864585197 864585227
864592254 864592284
864594217 864594247
864604531 864604561
864606904 864606934
864612135 864612165
864628181 864628211
864673427 864673457
864678523 864678553
864751147 864751177
864761238 864761268
864777331 864777348
864778515 864778545
864859033 864859063
864921811 864921841
864963074 864963104
864969383 864969413
865019895 865019925
865029039 865029069
865030585 865030615
865055943 865055973
865085824 865085854
865129564 865129594
865134155 865134185
865181786 865181816
865183415 865183445
865196728 865196758
865198261 865198291
865199376 865199406
865345166 865345196
865364585 865364615
865374004 865374032
865397967 865397997
865465030 865465060
865474614 865474644
865490953 865490983
865542442 865542472
865557016 865557046
865613956 865613986
865625881 865625911
865668350 865668380
865684177 865684207
865695496 865695526
865720691 865720721
865743302 865743332
865795288 865795318
865798627 865798657
865808643 865808673
865824170 865824200
865828717 865828747
865829346 865829370
865853719 865853749
865864217 865864247
865876501 865876531
865893491 865893521
865947191 865947221
865971896 865971926
865982186 865982216
866032190 866032220
866075641 866075671
866078333 866078363
866086240 866086260
866110334 866110364
866123112 866123142
866150376 866150406
866159734 866159764
866160678 866160703
866162787 866162817
866164136 866164166
866183523 866183553
866209916 866209946
866231521 866231551
866235970 866236000
866259320 866259344
866325882 866325912
866333459 866333489
866386687 866386698
866410885 866410915
866477770 866477775
866524459 866524489
866567557 866567559
866583640 866583670
866593648 866593678
866600559 866600589
866601298 866601328
866603953 866603983
866605033 866605063
866672683 866672713
866698397 866698427
866711259 866711289
866736388 866736418
866762331 866762361
866770932 866770962
866774034 866774064
866776151 866776181
866836109 866836118
867056176 867056206
867119999 867120029
867143094 867143124
867206327 867206357
867212060 867212090
867246595 867246625
867275311 867275341
867285571 867285601
867298942 867298972
867319740 867319770
867364066 867364096
867378770 867378800
867449532 867449562
867501108 867501138
867558651 867558681
867628363 867628393
867687382 867687412
867708170 867708200
867710086 867710116
867771659 867771689
867795599 867795629
867815977 867816007
867956618 867956630
868045667 868045697
868054760 868054790
868060759 868060789
868114685 868114712
868143044 868143074
868144450 868144480
868212988 868213018
868216362 868216392
868232583 868232613
868236165 868236195
868247642 868247672
868253656 868253686
868262617 868262647
868300743 868300773
868305151 868305181
868391894 868391924
868399293 868399323
868472266 868472296
868527506 868527536
868540464 868540494
868584268 868584298
868602686 868602716
868608359 868608389
868612579 868612609
868631299 868631329
868651824 868651854
868661446 868661476
868701145 868701175
868745005 868745035
868753227 868753257
868851550 868851580
868909113 868909143
868919334 868919364
868987968 868987998
869006664 869006694
869020177 869020207
869060214 869060244
869068000 869068030
869164298 869164328
869177747 869177777
869233979 869234009
869255633 869255663
869282776 869282806
869342327 869342357
869367593 869367623
869442613 869442643
869464543 869464573
869505210 869505240
869524277 869524307
869535566 869535596
869540692 869540722
869600583 869600613
869604843 869604873
869613865 869613895
869616242 869616272
869617345 869617375
869648676 869648706
869661162 869661191
869720555 869720585
869773232 869773262
869858179 869858209
869868618 869868648
869871429 869871459
869922571 869922601
869954358 869954388
869986892 869986922
869992010 869992040
870024090 870024120
870038662 870038692
870058100 870058130
870060535 870060565
870067966 870067996
870071441 870071471
870103390 870103420
870122269 870122299
870214700 870214730
870261876 870261906
870273244 870273274
870289978 870290008
870292466 870292496
870342094 870342124
870453072 870453102
870467389 870467419
870526833 870526863
870559990 870560020
870568788 870568818
870578123 870578153
870628991 870629021
870645618 870645648
870716124 870716154
870788333 870788363
870813933 870813963
870815170 870815200
870824925 870824955
870891384 870891414
870905921 870905951
870939886 870939916
870956280 870956310
870980976 870981006
870991893 870991923
871061206 871061236
871075815 871075845
871105544 871105574
871236610 871236640
871243407 871243437
871257120 871257150
871272614 871272644
871277302 871277332
871289546 871289576
871293899 871293929
871300068 871300098
871312966 871312996
871352642 871352672
871356208 871356238
871392567 871392597
871404337 871404367
871409375 871409405
871414292 871414322
871441420 871441450
871522439 871522469
871590251 871590281
871597069 871597099
871619273 871619303
871653629 871653659
871671993 871672023
871679589 871679619
871685652 871685682
871695375 871695405
871718949 871718979
871803482 871803512
871920959 871920989
871933653 871933683
872015131 872015161
872049076 872049106
872092880 872092910
872103970 872104000
872129937 872129967
872142107 872142137
872167757 872167787
872183056 872183086
872201809 872201839
872299551 872299581
872304692 872304722
872315332 872315362
872331557 872331587
872345449 872345479
872367539 872367569
872373244 872373274
872419732 872419762
872442778 872442808
872461174 872461204
872635337 872635367
872643776 872643806
872704648 872704678
872712928 872712958
872731105 872731135
872816886 872816916
872871871 872871901
872885741 872885771
872894704 872894734
872917990 872918020
872953201 872953209
872979774 872979804
872997198 872997228
873039646 873039676
873060173 873060203
873137049 873137079
873141085 873141115
873222833 873222863
873245549 873245579
873257921 873257951
873274701 873274731
873318407 873318437
873413455 873413485
873424724 873424754
873489635 873489665
873582988 873583018
873618077 873618107
873631761 873631791
873645639 873645669
873648715 873648745
873651399 873651429
873657095 873657125
873665948 873665978
873670103 873670133
873677271 873677301
873689378 873689408
873690861 873690891
873713239 873713269
873733452 873733482
873736089 873736119
873745590 873745620
873769259 873769289
873786039 873786069
873806595 873806625
873814231 873814261
873834740 873834770
873844485 873844515
873903808 873903838
873964083 873964113
873995535 873995565
874015282 874015312
874023741 874023771
874087531 874087561
874189094 874189124
874272844 874272874
874275405 874275435
874313409 874313439
874347672 874347702
874352727 874352757
874354114 874354144
874360640 874360670
874436851 874436881
874439947 874439977
874478767 874478797
874501458 874501488
874514064 874514094
874524783 874524813
874526281 874526311
874530177 874530207
874536261 874536291
874567537 874567567
874622886 874622916
874650092 874650122
874687166 874687196
874695951 874695981
874706745 874706775
874802155 874802185
874817589 874817619
874846190 874846220
874867597 874867627
874878310 874878340
874901652 874901682
874952404 874952434
874959048 874959078
874977349 874977379
874979337 874979367
874985556 874985586
874987895 874987925
875022622 875022652
875041690 875041720
875056031 875056061
875104021 875104051
875109304 875109334
875120273 875120303
875154060 875154090
875166350 875166380
875167223 875167238
875182034 875182064
875200537 875200567
875230286 875230316
