816019290 816021390
816021630 816022770
816023610 816024570
816024990 816027810
816028110 816030510
816030630 816031590
816031890 816034890
816035310 816043170
816043470 816044790
816047670 816048630
816075450 816076410
816092250 816094110
816094530 816095490
816096270 816098850
816101070 816102630
816105090 816106230
816107490 816108450
816108510 816109470
816109770 816110730
816112170 816113130
816114570 816115530
816117030 816117990
816118350 816119310
816119670 816120630
816122850 816124530
816126330 816127290
816132750 816133710
816152670 816153630
816164130 816165090
816165150 816166110
816180690 816184050
816184290 816188850
816189210 816191070
816191610 816193650
816194190 816198570
816198810 816200010
816200670 816204030
816205890 816206970
816207090 816213990
816219270 816220230
816251970 816253890
816264750 816267870
816268170 816269130
816270750 816271710
816271770 816272730
816276570 816277530
816279570 816280530
816282390 816284010
816284610 816285930
816286530 816288150
816288690 816294990
816295890 816296910
816297810 816298950
816300510 816302010
816306750 816307710
816336990 816337950
816351450 816355410
816355950 816358470
816359310 816360270
816363750 816365310
816366810 816369210
816369630 816372930
816373950 816375750
816376590 816379950
816380190 816382590
816386310 816387270
816403830 816404910
816426390 816427470
816427650 816428610
816441090 816442050
816442470 816443610
816445290 816446370
816448590 816449550
816453810 816455490
816496950 816497910
816509550 816511470
816535110 816536070
816594630 816595770
816610950 816621630
816621870 816624630
816624690 816625950
816626010 816631830
816633090 816634290
816635370 816644490
816645390 816646350
816652590 816653670
816681990 816683070
816697830 816707850
816708030 816714210
816714630 816717570
816718650 816721890
816724290 816728670
816728910 816730470
816742050 816743010
816770910 816772830
816775170 816776130
816783870 816800670
816809610 816810570
816822390 816823350
816825690 816826650
816855690 816857790
816882630 816883830
816896310 816898110
816941310 816942270
816953970 816954930
816981210 816982290
816994770 816995910
817026630 817027770
817043370 817044330
817111290 817112670
817128630 817129590
817152510 817153950
817199310 817200690
817216710 817217670
817240650 817241610
817257810 817258950
817286430 817287390
817306110 817307070
817325670 817326630
817339470 817340550
817341150 817342110
817379490 817380870
817387410 817388370
817430190 817431150
817461150 817463250
817483350 817484970
817506510 817507710
817530090 817531050
817543170 817544130
817551870 817553310
817565070 817566390
817595790 817596750
817609650 817610610
817632930 817633890
817651830 817652910
817718730 817720050
817740990 817741950
817803210 817804770
817820670 817821630
817823430 817826670
817872450 817873410
817890570 817891710
817914750 817915890
817933950 817934910
817937430 817938930
817950390 817951530
817977030 817978350
818000970 818001930
818020830 818021790
818034930 818036070
818060670 818061750
818064210 818065890
818088390 818089890
818109150 818110290
818134170 818135250
818150970 818151930
818166630 818167590
818202690 818203650
818239170 818240970
818265750 818267430
818325510 818327310
818341350 818342970
818408730 818410350
818421030 818421990
818444610 818445570
818448930 818449890
818460450 818461410
818464890 818466030
818481750 818482890
818494470 818495970
818518350 818519310
818521110 818522190
818533350 818534310
818548230 818549190
818586810 818587770
818605170 818606310
818624250 818625210
818636490 818637570
818640630 818641590
818660670 818661630
818669970 818670930
818698050 818699010
818712570 818713530
818723790 818724750
818760390 818761350
818785410 818786370
818798670 818799630
818810490 818811570
818842950 818843910
818866290 818867670
818930970 818932410
818957250 818958210
819012450 819014010
819029730 819030690
819038850 819040410
819058230 819059190
819074730 819075690
819080250 819081210
819098790 819099750
819101130 819102270
819129930 819130890
819145050 819146010
819161310 819162270
819188550 819189510
819208050 819209550
819227730 819228690
819275850 819276810
819278070 819279030
819316410 819317370
819320010 819321330
819328770 819329730
819360210 819361170
819383490 819384450
819400050 819401010
819415710 819416670
819448050 819449010
819449130 819450090
819471810 819472770
819618270 819619770
819648450 819649590
819667650 819668610
819703650 819704790
819725010 819726150
819735210 819736170
819749070 819750150
819790890 819792570
819811110 819812070
819833190 819834150
819849690 819850650
819878910 819879870
819879930 819880890
819891210 819892290
819913770 819914970
819915030 819915990
819924630 819925710
819946470 819947610
819965250 819966210
819987450 819989190
819998310 819999270
820006530 820007490
820016190 820017150
820050150 820051710
820075230 820076370
820139670 820141290
820158330 820159710
820172430 820174530
820218510 820222470
820223310 820224810
820246050 820247010
820276170 820277370
820308450 820309410
820329390 820330530
820351890 820352850
820364730 820365690
820395870 820397550
820398630 820399770
820400730 820401690
820403010 820403970
820415190 820416150
820433730 820434690
820437990 820438950
820453170 820454130
820484850 820485810
820506210 820507350
820522230 820523310
820537770 820538850
820553910 820554870
820570230 820571190
820588770 820589910
820609290 820610250
820622190 820623150
820657830 820658790
820680450 820681710
820744170 820745130
820756290 820757250
820762830 820763790
820827390 820829010
820843590 820844550
820883910 820884870
820913670 820914630
820933410 820934490
820941810 820942770
820952850 820953810
820969110 820970190
821000550 821002170
821025510 821026470
821039550 821040510
821055990 821056950
821088870 821089830
821116110 821117490
821131830 821132790
821144490 821145630
821173530 821174910
821195130 821196510
821202510 821204070
821213490 821214570
821226390 821227470
821262810 821263770
821278050 821279310
821295870 821296830
821351370 821352330
821369730 821370690
821415510 821416470
821432430 821433990
821449350 821450310
821473230 821474190
821487210 821488290
821518890 821520510
821533650 821534610
821536050 821551770
821558670 821559630
821568630 821569590
821569650 821570610
821571630 821572590
821572830 821583090
821583390 821586150
821586270 821588670
821589450 821591070
821591610 821592570
821593890 821595210
821608050 821609310
821615610 821616570
821617590 821618550
821629770 821631690
821645910 821646990
821660250 821661330
821669790 821670750
821689950 821690910
821693730 821694690
821736690 821737650
821740830 821741790
821749110 821750190
821779890 821781810
821810370 821812170
821832810 821833890
821866050 821867010
821894430 821895390
821953590 821954550
821983110 821984250
822027750 822028710
822038790 822039750
822054270 822055230
822077970 822078930
822090810 822091890
822122790 822124410
822135930 822137430
822166830 822167790
822177330 822178410
822211890 822213150
822234990 822236730
822271290 822272250
822298650 822300270
822327090 822328050
822357930 822358890
822386430 822388230
822405990 822407670
822419070 822423690
822437010 822437970
822471210 822472170
822489630 822490590
822531090 822532050
822558090 822559050
822589290 822590430
822617970 822618930
822644490 822646230
822646290 822647790
822662490 822663570
822700230 822701370
822728550 822730230
822757170 822759450
822760830 822761790
822764610 822765570
822771450 822772410
822786210 822787290
822816990 822817950
822842310 822843270
822853050 822854010
822873810 822874950
822903090 822904050
822922950 822924570
822935070 822936030
822955350 822956310
822985290 822986670
822996810 822997770
823007910 823009050
823074090 823075770
823103490 823105350
823166430 823167390
823193010 823194630
823247790 823249110
823270230 823271190
823288950 823289910
823300950 823302030
823334550 823335690
823355370 823356690
823374930 823375890
823389930 823391070
823423770 823425210
823440870 823441830
823445130 823446810
823461210 823462170
823474290 823475430
823507290 823508970
823528290 823529610
823545750 823546710
823552050 823553190
823562670 823564530
823579770 823580730
823594650 823595610
823612830 823614330
823653390 823654530
823679610 823688550
823688730 823689810
823690770 823692270
823693170 823694130
823694430 823695390
823700550 823701510
823718310 823720470
823765410 823767090
823784670 823785630
823830150 823831530
823854090 823855650
823870110 823871370
823873050 823874010
823893390 823894350
823908390 823909470
823937010 823937970
823950210 823951410
823960890 823961850
823978710 823979850
823992210 823993290
824026890 824027850
824045790 824047350
824066910 824067870
824080650 824081610
824112810 824113770
824132310 824133270
824149650 824151210
824166030 824167110
824197770 824199090
824200110 824201310
824234130 824235690
824238990 824239950
824251110 824252190
824283750 824285670
824305170 824306430
824372610 824374410
824389950 824391090
824455830 824457450
824477610 824478750
824501370 824502330
824514630 824515590
824531130 824532090
824543010 824544510
824563950 824565090
824584950 824585910
824599050 824600010
824628570 824630370
824649750 824651190
824663850 824664810
824672070 824673030
824684790 824685750
824687190 824688930
824693310 824694270
824717370 824718330
824735310 824737470
824753430 824754390
824784510 824785470
824802510 824804550
824823210 824824590
824834190 824836050
824844930 824845890
824857110 824858070
824888610 824890530
824905650 824906610
824974290 824976030
824996670 824998110
825069390 825071010
825082230 825083850
825100290 825101250
825117750 825118710
825138570 825139530
825152310 825153930
825173850 825175410
825201330 825202290
825253170 825254790
825263430 825264810
825273930 825274890
825278850 825279810
825295350 825296310
825327990 825329370
825341250 825342750
825359850 825360810
825374130 825375210
825418290 825419610
825428250 825429990
825448530 825449490
825463110 825464070
825502170 825504090
825517110 825518250
825586110 825588510
825602730 825603690
825603750 825604710
825681450 825682950
825694290 825695250
825733650 825734610
825760950 825762570
825776730 825778470
825808770 825809730
825851490 825852450
825861990 825862950
825895230 825896190
825935610 825936570
825954390 825955710
825967890 825968850
825993630 825994710
826022790 826024470
826039350 826040310
826052250 826053210
826064550 826065630
826106490 826107870
826125690 826126650
826194510 826196190
826206570 826207890
826279710 826281270
826287690 826289310
826313010 826313970
826326870 826327950
826365990 826367550
826385370 826386450
826386870 826387830
826398150 826399110
826400190 826401330
826405170 826406130
826412250 826413210
826429170 826430310
826457310 826458270
826468890 826470510
826499550 826500510
826541430 826543470
826552470 826553970
826571850 826572810
826584750 826585710
826627710 826629690
826643190 826644150
826670850 826671930
826711770 826712730
826712790 826713750
826741770 826742730
826796850 826798410
826801110 826802190
826882890 826883850
826916370 826917330
826931010 826932090
826971210 826972770
826987350 826988310
827006970 827007930
827020170 827021250
827059890 827061330
827073570 827074530
827108790 827109750
827148210 827149170
827153670 827155230
827161950 827162910
827176230 827177190
827188770 827189730
827231370 827232330
827236830 827238630
827256150 827257230
827262450 827263410
827275950 827277090
827312310 827313690
827315490 827316750
827325270 827326410
827368410 827369370
827404350 827405310
827409390 827410710
827482770 827484330
827493630 827495310
827522190 827523150
827535750 827536710
827565270 827566890
827583630 827585130
827609130 827610090
827620890 827621970
827653170 827654130
827671110 827672250
827708550 827709630
827741850 827742810
827760150 827761110
827777310 827778270
827794410 827795490
827826450 827827830
827839650 827840610
827851230 827852970
827867550 827868510
827881530 827882490
827913690 827914650
827929830 827930790
827999490 828001110
828016770 828017730
828081750 828083250
828093630 828094770
828123270 828124230
828136770 828137850
828166770 828168090
828186870 828188670
828222210 828223290
828259530 828260670
828273990 828274950
828279090 828280230
828281970 828282930
828284370 828285510
828287490 828288510
828290790 828292350
828295710 828296670
828301650 828302850
828315990 828316950
828346470 828347430
828351870 828353310
828385770 828386730
828396690 828397770
828430470 828431430
828435810 828437550
828470310 828471270
828482370 828483330
828513450 828514410
828535830 828537210
828606810 828607770
828629910 828630870
828688230 828689190
828705210 828706710
828746010 828747090
828773370 828774750
828791790 828793470
828864750 828865710
828886650 828888450
828906750 828907710
828917610 828918750
828948090 828949050
828960810 828961950
828984810 828985770
828998730 828999810
829034490 829035450
829056930 829057890
829058730 829059690
829069470 829070430
829076070 829077030
829084530 829085490
829124310 829125270
829144170 829145490
829205850 829207590
829219830 829221390
829291890 829293450
829321710 829322850
829347330 829348290
829376910 829378470
829391310 829392270
829433430 829434390
829464690 829466010
829481850 829482810
829531950 829533030
829552710 829554270
829566690 829567830
829598490 829599450
829610970 829612470
829612590 829613550
829614810 829615770
829615830 829618410
829637490 829639230
829654710 829655850
829687830 829688910
829704150 829705230
829730130 829731090
829754550 829755510
829810710 829812150
829826850 829827810
829895730 829897290
829909290 829910430
829936410 829937370
829952610 829953570
829982610 829984110
829996770 829997730
830024130 830025090
830027070 830028030
830044230 830045190
830071950 830072910
830087910 830089050
830158050 830159010
830173530 830175270
830196090 830197050
830210550 830211870
830241750 830243430
830260770 830261730
830283210 830284170
830294910 830295870
830328210 830329710
830343570 830344530
830367030 830369250
830423190 830424810
830450190 830451150
830452230 830453190
830502450 830503590
830517570 830518710
830540190 830541150
830556690 830557650
830587710 830589270
830600850 830601810
830628150 830629110
830632170 830633250
830635830 830636790
830674830 830676690
830691210 830692170
830705610 830706570
830706870 830707830
830710110 830715630
830729010 830729970
830762550 830763510
830776530 830777490
830801550 830802510
830815950 830816910
830847570 830849010
830866290 830867250
830874570 830875530
830887050 830888010
830896650 830897610
830934390 830935350
830952990 830953950
831020550 831021510
831040410 831041550
831104430 831105930
831122070 831123030
831145950 831146910
831151410 831152370
831161850 831162810
831191850 831193350
831202170 831203130
831232230 831233190
831246210 831247170
831278550 831280230
831291090 831292050
831347850 831348810
831364770 831365730
831383790 831385230
831393870 831394830
831408510 831409470
831450810 831451770
831462030 831462990
831506670 831507630
831538170 831539490
831712110 831713070
831765870 831766830
831796890 831797850
831809730 831810810
831812250 831815370
831833310 831834930
831836970 831838110
831852750 831853890
831885330 831886290
831898050 831899730
831918390 831919350
831925110 831926070
831940350 831941430
831971850 831972810
831986070 831987030
832009890 832010970
832025970 832026930
832057410 832058370
832069590 832070550
832096770 832097730
832112250 832113210
832144590 832145550
832165290 832166250
832229190 832230510
832246830 832248630
832315110 832316670
832329090 832330230
832333350 832335870
832375590 832376550
832400550 832402170
832413690 832414830
832446210 832447170
832462830 832463790
832479990 832481190
832490730 832492650
832509510 832511310
832536690 832537650
832548150 832549110
832575990 832577790
832593750 832595190
832621710 832622670
832633170 832634130
832660230 832662030
832688970 832690410
832710030 832710990
832726290 832727310
832747110 832748910
832775190 832776630
832801650 832802610
832835250 832837050
832859310 832861050
832903530 832904490
832904550 832905510
832921050 832922610
832939410 832940370
832960410 832961370
833006070 833007870
833026650 833027970
833038650 833040510
833050230 833051190
833061570 833062530
833095770 833097390
833109630 833111010
833140710 833141670
833183250 833184630
833201610 833202870
833209710 833212530
833216790 833217750
833222730 833225850
833226330 833228190
833229390 833231610
833241990 833242950
833269050 833270010
833289150 833290110
833295210 833297250
833297490 833298690
833299650 833301150
833312610 833313570
833326650 833327610
833352510 833353770
833371770 833372730
833410710 833411670
833440290 833441250
833455530 833456610
833524410 833525610
833538990 833540070
833568570 833569530
833580930 833581890
833611890 833613510
833627550 833628690
833649510 833650470
833650590 833652930
833661030 833661990
833680110 833681070
833703390 833704350
833721030 833721990
833746770 833747730
833759130 833760090
833784510 833785830
833816130 833817210
833845410 833846370
833871030 833872350
833899590 833900970
833901570 833902530
833902830 833903790
833918490 833919450
833931330 833932410
833959530 833961450
833984490 833985450
834001950 834002910
834017010 834017970
834045810 834046770
834062550 834063510
834128010 834129510
834154770 834155730
834189750 834190710
834215550 834216510
834242070 834243030
834243390 834244350
834246630 834247590
834248850 834249810
834250770 834251730
834252930 834253890
834255750 834257910
834264090 834265050
834295710 834297810
834306030 834307710
834326850 834327810
834352890 834354090
834362970 834363930
834390570 834391530
834414210 834415710
834436710 834437670
834451110 834452190
834477390 834478350
834480630 834481590
834501750 834502710
834537450 834538410
834563310 834564270
834589530 834590490
834606930 834607890
834617730 834618870
834649890 834650970
834663090 834664350
834736710 834737670
834754050 834755010
834781650 834782610
834792210 834793170
834822330 834823830
834839250 834840870
834853710 834854670
834866550 834867510
834872190 834873150
834910650 834911610
834928590 834929550
834933930 834935970
834957270 834958230
834959370 834960330
834961350 834962490
834967470 834968430
834981930 834982890
834993930 834995310
835016730 835017690
835039890 835040850
835052430 835053390
835054470 835055430
835077330 835078290
835082070 835083030
835109130 835110510
835113570 835114530
835151190 835152330
835168470 835169430
835187850 835188810
835208670 835209630
835222650 835223610
835254690 835255650
835277190 835278270
835338870 835340430
835355670 835356810
835381890 835382850
835426710 835427910
835489230 835490730
835516230 835517910
835527690 835528650
835533390 835535250
835556610 835557570
835572810 835573770
835605450 835606410
835614390 835615350
835629450 835630410
835635630 835636590
835642050 835643010
835657230 835658370
835687770 835688730
835711530 835712610
835727490 835728450
835772970 835773930
835822410 835823730
835832910 835833870
835861350 835863030
835879470 835880910
835897890 835898910
835905450 835906410
835943670 835945170
835965690 835967370
835989090 835990050
835999470 836000430
836028870 836030490
836073390 836075130
836121930 836123670
836137410 836138910
836161530 836162490
836171850 836172810
836202630 836203590
836219970 836220930
836248110 836249070
836262630 836263590
836292870 836293830
836313750 836314710
836340150 836341110
836352570 836353530
836377650 836378610
836392590 836393550
836428650 836429610
836438970 836439930
836462610 836464110
836480850 836482170
836514690 836516550
836550690 836552250
836561670 836563110
836599590 836600910
836613210 836614350
836643870 836645430
836661690 836662650
836680590 836681790
836692350 836693430
836727150 836729010
836745210 836746170
836767710 836768850
836783070 836784030
836805930 836806890
836812050 836813910
836826210 836827170
836834130 836835510
836854530 836855730
836865210 836866170
836896830 836897790
836920290 836921610
836943030 836943990
836953770 836954730
836983170 836984130
837004470 837005610
837022890 837023850
837036450 837037410
837071070 837072510
837086610 837087570
837148890 837149850
837156930 837157890
837162330 837163290
837163710 837167370
837178890 837180510
837222090 837223050
837242190 837243810
837257970 837259590
837304410 837305370
837332370 837333330
837357330 837358290
837370350 837371430
837382830 837383910
837416250 837417210
837434010 837434970
837460710 837461670
837472830 837473970
837503310 837504630
837519570 837521010
837546390 837547530
837559350 837560310
837587310 837588270
837612450 837613410
837635010 837635970
837673590 837674550
837691230 837692190
837717990 837718950
837726750 837727710
837760590 837762210
837785610 837786570
837805290 837806250
837816810 837817770
837843690 837845190
837871230 837872190
837878550 837879510
837889290 837890250
837894930 837895890
837904410 837905370
837935370 837936690
837954510 837955470
837977190 837978150
837992370 837993330
838004490 838005450
838017270 838018230
838038630 838039710
838064790 838065750
838081890 838082970
838105830 838106790
838134390 838135350
838147650 838148610
838160910 838161870
838190670 838192470
838212390 838213890
838237710 838238670
838247970 838248930
838257990 838258950
838280070 838281930
838296090 838297410
838364430 838365510
838375530 838376490
838409370 838410330
838426230 838427190
838448670 838450170
838463790 838464870
838475430 838476390
838499550 838500510
838511190 838512150
838542690 838544610
838561230 838562910
838581690 838582650
838593090 838594050
838628970 838629930
838642710 838643670
838666170 838667130
838679130 838680390
838714230 838715190
838733610 838734570
838743090 838744050
838773030 838773990
838802490 838804230
838815690 838816650
838884990 838885950
838899810 838900890
838955790 838956990
838967910 838969410
838972410 838973370
838975590 838976550
838980990 838981950
839014590 839015730
839028990 839030310
839053830 839055330
839079030 839079990
839111010 839111970
839126310 839127270
839145990 839146950
839161650 839163150
839185890 839187030
839197950 839199030
839228370 839229330
839230170 839231130
839247090 839248050
839263650 839264910
839269830 839271750
839277810 839278770
839289270 839290230
839315550 839316510
839333310 839334270
839341590 839342550
839347530 839348490
839360850 839361810
839375730 839376690
839384610 839385570
839401710 839402670
839418390 839419710
839457450 839458410
839486670 839488170
839506710 839507670
839510310 839511390
839572410 839573910
839590650 839591610
839619150 839620110
839622750 839623710
839636610 839637690
839659170 839660130
839678310 839679390
839685570 839689830
839690670 839691810
839691870 839692830
839693790 839695110
839699490 839700450
839701230 839702190
839705190 839707770
839707950 839708910
839709150 839710950
839711070 839712690
839712990 839714370
839722650 839723610
839748270 839750190
839762970 839763930
839766270 839767230
839768010 839772450
839773050 839774010
839774850 839777730
839791410 839792370
839807010 839808090
839831790 839832750
839847090 839848410
839864550 839865510
839876250 839877210
839891550 839892510
839918370 839920110
839938650 839939610
839960730 839961690
839963310 839964270
839970930 839971890
839986950 839987910
840001230 840002190
840006510 840007470
840028890 840029970
840050130 840051090
840058710 840059850
840082050 840083010
840083190 840084450
840093390 840094350
840110610 840111570
840179550 840181050
840193830 840194790
840200670 840201630
840224370 840225330
840237090 840238050
840262770 840264270
840281430 840282390
840301590 840302790
840312870 840313830
840324750 840325710
840350670 840352170
840366390 840367350
840402690 840403650
840414450 840415410
840417870 840418830
840437190 840438510
840463650 840464610
840483990 840484950
840497130 840498090
840527430 840529470
840546810 840547770
840554130 840555090
840555270 840556230
840557910 840558870
840570090 840571290
840587010 840588090
840613170 840614130
840627990 840629310
840697770 840698730
840725010 840726510
840749370 840750330
840783570 840785070
840800070 840801150
840805770 840806730
840809190 840810330
840820410 840821370
840821670 840822630
840826830 840827790
840834270 840835230
840868290 840869850
840887550 840888870
840889470 840890430
840890790 840891750
840893010 840893970
840912690 840913890
840915630 840916590
840956430 840957390
840971130 840972750
840979350 840981210
840981330 840982290
840983370 840986970
840997650 840998610
841015590 841016550
841041810 841043310
841061010 841062930
841063110 841072110
841072290 841079730
841079970 841081530
841086030 841086990
841098630 841099710
841127070 841128030
841150110 841151790
841170930 841171890
841183590 841184550
841215870 841216830
841235190 841236150
841248450 841249410
841303890 841304850
841324410 841325550
841344270 841345230
841386330 841387290
841404690 841405770
841472970 841474530
841497390 841498350
841524150 841525230
841558050 841559130
841577130 841578090
841596450 841598250
841608030 841608990
841610250 841611210
841655970 841656930
841656990 841657950
841669950 841671210
841693590 841694550
841705950 841706910
841734510 841735470
841752210 841753170
841780770 841781730
841791870 841793010
841824750 841825710
841845570 841846530
841908030 841908990
841923630 841924590
841935030 841936170
841947210 841948350
841955790 841956750
841965030 841965990
841991910 841993350
842017530 842018970
842029650 842030610
842037990 842039310
842049510 842050590
842078910 842080470
842095650 842096790
842105310 842106270
842124810 842125770
842129010 842129970
842140110 842141070
842141730 842142690
842170170 842171310
842188110 842189070
842209830 842210970
842217090 842219730
842222670 842223630
842252730 842253690
842269470 842270610
842285490 842286450
842296470 842297430
842314170 842315130
842341050 842342010
842370030 842370990
842384070 842385030
842394150 842395230
842397330 842398410
842425470 842426670
842447370 842448330
842510850 842512530
842529270 842530770
842553630 842554590
842562750 842563710
842593350 842594970
842595450 842596410
842617650 842618610
842640330 842641530
842654970 842656110
842683350 842684910
842701290 842702250
842727090 842728050
842739090 842740170
842767170 842768130
842771970 842772930
842780550 842782590
842791350 842793030
842813310 842814510
842830050 842831010
842852850 842854350
842856450 842857770
842881350 842882910
842892690 842894010
842900430 842901390
842917830 842918790
842943090 842944650
842976270 842977230
842986530 842987490
843001050 843002010
843031350 843032310
843052590 843053670
843116370 843117330
843121110 843122070
843141810 843143130
843156210 843157170
843167550 843168510
843203670 843204630
843225690 843227310
843233610 843235410
843245910 843246870
843262470 843263610
843286950 843288510
843311310 843313290
843329970 843330930
843346830 843347790
843379230 843380190
843390810 843391770
843397350 843398310
843406290 843407250
843420330 843421530
843456390 843457470
843462270 843463230
843485370 843486330
843495270 843496230
843506370 843507330
843525210 843526170
843552210 843553170
843577110 843578070
843586650 843587730
843589110 843590070
843592590 843593670
843605670 843606630
843635610 843636570
843662790 843664110
843675690 843677850
843721890 843722850
843731610 843732690
843734010 843734970
843743130 843744090
843764850 843765810
843809790 843811410
843821910 843822870
843840390 843841350
843846810 843847770
843851850 843852810
843871170 843872130
843892230 843893190
843894810 843895770
843899250 843900210
843905250 843906210
843917430 843918510
843918870 843919830
843920070 843921030
843937290 843938250
843940470 843941430
843942270 843944190
843948450 843949410
843957810 843958770
843981210 843982170
843986250 843987210
844001490 844002990
844003830 844004790
844005690 844008150
844012110 844013070
844013910 844014870
844015230 844016910
844018110 844019430
844019790 844020750
844022250 844030770
844043670 844044750
844065510 844066470
844090470 844091430
844094730 844097130
844097970 844099410
844107690 844108890
844110690 844111950
844114830 844115790
844125570 844126530
844153470 844154430
844155630 844156590
844173990 844175430
844175550 844176510
844176690 844181730
844182450 844183410
844198710 844199850
844215270 844216230
844240770 844241730
844312710 844313670
844325310 844326630
844352130 844353090
844378830 844379790
844394850 844396710
844413210 844414770
844416510 844418070
844425330 844426290
844434330 844435290
844438650 844439610
844444650 844445610
844450890 844451850
844455930 844456890
844461330 844462650
844463970 844464930
844492650 844493610
844497450 844498410
844509030 844510170
844524630 844525590
844526370 844527330
844527990 844528950
844533150 844534110
844536930 844537890
844539510 844540710
844542510 844546590
844546830 844548570
844562190 844563270
844573650 844574610
844582350 844583970
844585890 844587270
844599570 844601070
844610970 844613850
844629510 844630470
844630770 844632810
844634610 844635570
844640310 844641270
844646430 844647390
844673370 844675230
844684050 844685790
844696770 844698330
844704870 844705830
844711470 844712430
844715430 844716390
844758450 844759890
844782390 844783350
844785210 844787130
844795530 844797690
844804710 844805670
844814670 844815630
844844670 844846650
844869210 844870470
844924350 844926090
844929330 844931670
844956450 844958550
844968810 844969770
845016510 845018070
845027070 845028030
845045730 845047110
845059830 845060790
845162190 845163150
845192130 845193090
845195130 845196630
845213970 845215050
845219010 845219970
845234490 845235450
845253090 845254170
845278830 845280510
845282850 845284110
845298930 845299890
845318850 845319810
845331210 845332170
845364270 845365230
845377050 845379450
845389170 845390850
845402670 845403630
845420910 845421870
845449950 845450910
845472630 845474130
845536230 845537190
845540250 845541210
845550210 845551170
845556030 845557110
845576310 845577270
845579790 845580870
845620170 845621130
845622750 845623710
845638230 845639190
845650290 845651550
845664570 845665530
845678490 845679450
845706990 845707950
845731710 845732670
845746050 845748810
845748930 845749890
845760090 845761050
845795730 845796690
845798550 845800050
845818530 845820690
845843550 845844510
845846010 845846970
845861910 845862870
845882010 845882970
845885970 845887530
845907090 845908050
845937270 845938410
845968710 845969670
846004530 846005490
846011310 846012270
846016230 846017190
846029130 846030090
846054630 846055590
846083430 846085050
846141390 846142350
846170730 846171690
846174930 846176070
846185250 846186210
846191430 846192390
846230130 846231450
846238290 846239250
846249390 846250530
846273810 846274770
846289650 846290610
846316890 846318030
846336390 846338130
846357150 846358110
846362670 846364350
846386250 846387210
846402510 846403830
846408030 846408990
846431370 846432630
846447990 846448950
846465450 846466410
846475290 846476250
846494010 846494970
846495210 846496170
846516990 846517950
846532650 846533610
846545790 846546750
846546810 846547770
846576990 846577950
846603450 846604590
846604770 846605730
846624810 846625770
846642810 846643770
846662670 846663750
846688950 846689910
846751290 846752970
846781410 846782370
846785430 846786390
846802290 846803310
846811290 846812370
846833130 846834090
846854550 846855510
846855750 846856710
846877230 846878190
846889410 846890370
846892890 846893850
846922830 846923790
846927990 846928950
846937950 846939090
846939150 846940110
846963210 846964170
846975270 846976230
847008930 847009890
847034850 847035930
847053630 847054590
847064130 847065090
847076550 847077510
847094310 847095270
847097070 847098510
847118790 847120770
847120830 847124790
847133370 847134690
847135350 847136310
847136430 847137810
847138770 847139730
847140810 847141770
847142370 847143330
847146450 847148010
847150710 847151670
847181730 847182690
847202250 847203570
847204710 847205670
847208250 847209210
847212210 847213170
847221390 847222350
847222470 847223430
847224690 847225650
847226070 847227030
847237830 847238970
847269270 847270230
847288890 847289970
847331430 847332570
847354650 847355610
847381650 847382910
847392990 847393950
847409490 847410450
847417050 847418010
847438410 847439370
847440750 847441710
847452690 847453650
847467570 847468650
847481070 847482030
847491930 847492890
847524810 847525770
847541490 847542450
847555470 847556430
847574670 847575870
847584570 847585530
847616970 847617930
847624830 847626090
847626630 847627590
847629150 847630110
847631070 847634970
847636470 847637430
847655550 847656510
847658970 847659930
847673190 847674270
847703130 847704090
847724070 847725210
847743930 847744890
847760490 847761450
847784130 847785750
847789770 847790730
847811130 847812090
847828050 847829010
847854210 847855170
847876290 847877250
847899030 847900650
847959810 847960770
847962570 847963530
847978350 847979850
847982550 847984170
848005890 848007090
848020530 848021490
848042250 848043750
848045850 848046810
848048910 848049870
848059710 848061210
848089650 848090610
848100390 848101350
848132130 848133090
848135010 848135970
848146050 848147010
848155770 848157090
848176530 848177490
848195550 848196510
848219190 848220150
848222610 848224110
848229090 848230050
848248170 848249130
848264010 848264970
848272170 848273250
848303070 848304510
848306070 848307150
848316390 848317350
848322810 848324370
848390850 848391810
848409330 848410290
848434650 848435610
848445030 848445990
848474790 848476350
848493750 848495310
848562210 848563710
848574510 848575650
848579730 848580870
848608410 848609790
848615790 848616750
848647290 848648250
848650830 848651790
848661510 848662470
848664690 848666250
848702970 848704050
848734830 848736390
848737710 848738670
848743650 848744610
848756370 848757870
848778510 848779470
848793930 848794890
848823870 848824830
848841030 848841990
848843310 848844630
848868510 848870490
848909910 848910870
848929830 848931090
848971590 848972550
848979810 848980770
848985870 848987730
848996310 848997270
849015330 849016830
849083070 849084030
849097470 849098430
849172170 849173550
849182910 849183870
849214110 849215670
849226650 849227610
849253710 849255150
849274410 849275910
849342150 849343350
849360510 849362010
849365610 849366570
849380490 849381450
849393510 849394470
849429690 849431310
849440130 849441090
849491070 849492510
849514410 849515370
849525810 849526770
849534210 849536250
849554610 849555570
849567030 849568110
849601590 849602550
849616230 849617310
849686250 849687510
849710070 849711030
849762330 849763290
849774750 849775710
849782010 849782970
849783450 849784410
849786630 849787590
849788190 849790110
849791790 849795090
849797970 849799470
849801990 849803910
849809730 849810810
849810930 849812790
849818130 849819090
849823890 849824850
849828570 849829530
849854250 849855210
849874890 849876030
849940050 849941310
849968250 849969210
850028670 850030110
850050510 850051470
850087410 850088370
850088430 850089390
850114950 850115910
850141590 850142550
850160250 850161510
850176390 850177350
850191210 850192170
850204110 850205310
850227150 850228230
850232130 850233270
850287450 850288830
850307970 850309710
850373850 850374810
850404690 850405650
850421430 850422630
850434630 850435710
850452150 850453110
850461690 850462650
850483710 850484670
850547490 850548450
850571190 850572570
850578150 850579110
850595190 850596150
850609950 850610910
850632270 850633710
850647930 850649430
850672710 850673670
850720050 850721010
850740450 850742130
850770750 850771710
850792770 850793730
850810230 850811190
850831950 850832910
850860810 850861770
850893270 850894230
850912050 850913010
850979670 850980630
851002710 851004510
851149290 851150250
851171310 851172270
851174610 851177610
851189370 851190330
851198070 851199030
851236530 851238150
851265510 851266470
851311890 851312850
851325870 851327730
851343210 851344170
851369010 851369970
851390850 851391810
851411730 851412690
851441130 851442090
851498010 851499090
851520090 851521050
851535510 851536470
851582550 851584170
851613030 851613990
851668710 851670270
851686110 851687070
851716110 851717070
851735070 851736150
851758950 851760450
851766390 851767710
851770470 851771430
851844390 851846010
851867970 851868930
851888130 851889270
851904150 851905110
851928510 851929770
851951130 851952090
851973270 851974470
851989290 851990250
852017190 852018150
852041550 852042510
852102750 852103710
852133830 852135090
852189930 852190890
852213270 852214230
852234570 852235530
852242130 852243090
852278670 852279750
852291990 852293790
852307770 852308730
852362910 852363870
852387510 852388470
852393990 852395130
852405990 852407190
852420390 852421350
852454890 852456270
852473130 852474090
852538830 852539790
852556170 852557130
852576990 852577950
852594930 852595890
852625650 852626610
852642390 852643350
852697710 852698670
852699210 852700170
852700590 852702210
852702570 852703530
852705150 852706110
852706770 852708690
852709230 852711090
852739050 852740010
852798330 852799290
852819150 852820410
852844050 852845010
852854130 852855090
852882930 852883890
852886050 852887310
852900270 852901230
852968010 852968970
852986910 852988410
853012710 853013670
853014210 853015170
853026030 853026990
853034070 853035030
853056030 853056990
853074510 853075470
853142970 853143930
853161570 853162530
853171890 853172850
853186890 853187850
853196310 853197270
853206030 853206990
853236450 853237410
853253970 853254930
853282230 853283310
853316430 853317390
853333710 853334670
853371990 853373370
853400850 853402230
853415010 853415970
853416030 853421730
853437810 853438950
853444770 853445730
853454310 853455270
853487490 853488510
853506390 853507830
853575750 853576710
853598190 853599150
853607550 853608630
853630350 853631310
853666230 853667190
853682850 853684110
853747470 853748430
853766010 853766970
853792170 853793130
853808130 853809090
853839330 853840290
853852890 853854090
853921350 853922310
853938390 853939350
854008590 854009550
854009610 854010570
854023830 854025330
854045850 854046810
854062650 854063610
854070510 854071470
854091150 854092230
854105850 854106810
854180430 854181390
854208810 854210370
854221830 854222790
854240430 854241390
854266650 854268330
854285130 854286090
854318730 854319690
854351970 854352930
854369190 854370510
854379870 854380830
854388810 854389770
854399250 854400210
854403570 854404530
854438370 854439330
854457930 854458890
854479230 854480190
854523150 854524110
854548710 854549670
854612010 854612970
854630010 854630970
854648850 854649810
854658810 854660310
854660610 854661570
854696310 854697810
854703990 854705610
854781570 854783070
854802330 854803890
854811270 854812230
854821770 854822730
854834190 854835150
854870910 854871870
854887710 854888970
854957370 854958330
854979630 854980590
855001410 855002610
855015990 855017070
855041190 855042150
855063390 855064350
855080370 855081450
855088770 855089730
855130350 855131310
855145830 855147510
855197370 855198570
855216750 855217710
855228330 855230370
855233190 855234510
855257250 855258210
855265410 855266490
855301590 855302910
855316590 855317730
855386550 855388050
855410550 855411690
855426810 855427770
855438330 855439290
855475110 855476070
855499290 855500970
855558330 855559290
855578670 855580110
855611970 855612930
855623190 855624150
855648870 855649830
855662610 855663570
855738810 855739770
855747870 855749430
855821250 855822210
855833910 855834870
855866310 855867270
855875250 855876330
855902730 855904350
855918990 855919950
855992370 855993330
856004310 856005270
856032810 856033950
856047930 856048890
856078890 856080510
856101450 856102650
856164870 856165830
856187070 856188150
856201830 856202790
856217550 856218510
856251330 856252290
856272270 856273230
856341810 856343670
856359810 856360950
856426170 856427130
856451130 856452090
856467750 856468890
856473990 856474950
856487370 856488330
856508490 856509870
856525350 856526310
856597170 856598670
856614090 856615050
856628310 856629270
856648530 856649490
856660350 856661310
856684290 856685610
856704870 856705830
856718190 856719150
856772850 856773810
856773870 856774830
856797270 856798230
856812090 856813050
856821690 856822830
856825650 856826610
856833930 856834890
856858170 856859130
856878570 856879830
856942830 856944510
856971630 856972590
857031270 857033190
857047470 857048550
857066190 857067150
857074230 857075190
857113350 857114850
857135670 857136630
857201190 857202150
857228790 857229750
857245470 857246430
857255550 857256510
857290470 857291430
857311470 857312430
857377890 857378850
857402190 857403150
857421210 857422350
857435850 857436810
857460210 857461170
857482290 857483250
857509050 857510010
857550090 857551050
857568030 857569110
857636010 857636970
857658630 857659590
857688510 857689710
857697090 857698050
857715630 857717130
857731770 857733030
857791290 857792250
857802870 857804370
857829570 857830530
857840730 857841690
857845290 857846250
857851830 857852790
857860050 857861010
857893530 857894910
857907210 857908890
857975130 857976510
857999550 858000510
858023490 858024510
858036330 858037290
858066210 858067710
858085770 858086730
858114330 858115290
858120990 858122310
858150870 858151830
858172230 858173190
858238950 858240630
858255270 858256350
858277470 858278610
858285270 858286230
858320670 858322050
858341430 858342390
858407250 858408750
858432390 858433350
858438570 858439530
858463290 858464490
858497730 858498690
858518250 858520050
858583590 858584550
858606570 858607890
858623550 858624510
858636690 858637650
858640230 858641190
858641730 858642690
858668730 858669690
858696570 858697530
858698070 858699030
858751830 858752790
858771510 858772470
858821430 858824550
858842010 858842970
858860790 858861750
858883590 858884550
858893130 858894090
858925830 858927330
858944610 858946110
859012590 859014150
859059150 859060290
859072350 859073310
859075890 859076850
859102230 859103190
859126230 859127190
859188570 859189530
859196250 859198110
859206870 859207830
859233030 859233990
859247310 859248270
859271250 859272210
859289850 859290810
859358790 859360110
859386690 859387650
859446990 859447950
859489710 859490670
859498890 859499850
859502130 859506210
859507110 859508190
859531890 859533090
859557630 859558890
859619070 859620030
859642230 859643910
859658850 859660050
859673190 859674150
859705950 859706910
859731030 859731990
859790610 859792110
859818210 859819170
859830630 859832130
859844310 859845270
859878930 859879890
859897710 859898670
859968030 859968990
859990890 859991850
860048730 860049690
860076990 860077950
860092770 860093730
860103210 860104170
860134170 860135610
860159010 860159970
860222850 860224350
860240550 860241630
860268450 860269410
860280270 860281230
860317650 860318610
860331870 860332830
860400570 860401530
860433450 860434410
860440710 860441850
860453790 860454750
860477970 860479110
860485590 860487030
860507370 860508990
860570010 860570970
860592990 860593950
860655630 860656590
860678730 860679690
860700390 860701530
860709750 860710710
860738850 860739810
860762490 860764170
860825550 860826510
860844270 860845230
860866410 860867370
860882550 860883510
860915550 860916510
860942850 860944350
861002010 861002970
861024930 861025890
861049050 861050130
861059430 861060390
861088350 861089310
861116550 861117510
861172410 861173370
861194190 861195150
861261210 861262170
861287850 861288810
861303450 861304410
861312090 861313050
861343950 861345330
861363210 861364170
861430110 861431730
861452430 861453870
861459570 861460530
861462750 861464010
861467790 861468750
861475890 861477030
861482910 861483870
861489690 861490770
861520470 861521550
861535830 861536790
861541350 861542310
861542430 861543390
861610290 861611250
861633450 861634890
861655410 861656370
861669330 861670290
861690930 861691890
861712830 861714570
861717330 861718290
861776790 861777750
861796170 861797430
861864570 861865890
861887130 861888090
861908430 861909390
861920010 861920970
861951030 861952290
861973290 861974250
862035690 862036650
862069710 862070670
862070790 862074030
862086510 862087470
862088850 862089810
862100310 862101390
862124370 862125330
862148610 862150110
862223670 862224630
862239570 862241070
862256190 862257390
862270770 862271730
862299750 862301370
862309230 862310190
862322550 862323690
862384110 862385070
862410270 862411230
862467450 862468410
862486050 862487010
862511850 862512810
862518870 862519830
862556850 862558470
862576170 862577130
862604130 862605090
862640490 862641450
862665030 862665990
862672650 862674090
862674450 862675410
862683690 862685490
862699170 862700130
862730010 862730970
862754730 862755690
862812810 862813770
862838430 862839390
862857570 862858530
862861230 862862190
862869990 862870950
862901010 862902510
862922190 862923150
862987650 862989570
863012250 863013210
863075670 863076630
863095710 863097030
863118870 863119830
863126010 863126970
863160630 863162190
863175450 863176410
863195370 863196330
863197530 863198490
863218110 863219070
863247450 863248410
863249910 863250870
863260590 863261550
863291970 863293530
863305830 863306790
863334210 863335170
863354190 863355150
863426970 863428710
863434050 863435370
863460330 863461290
863461890 863462850
863477310 863478510
863507430 863508390
863524770 863525730
863552250 863553210
863594010 863594970
863613450 863614410
863678730 863680110
863699910 863700870
863720490 863721450
863728350 863729430
863764830 863766510
863778030 863778990
863791410 863792370
863854230 863855190
863877510 863878470
863891430 863892570
863892630 863893590
863903970 863904930
863940090 863941050
863958690 863959650
863982330 863983290
864029670 864030630
864048570 864049530
864069150 864070110
864082590 864083550
864111510 864112470
864129570 864130530
864196950 864198570
864216210 864217170
864285030 864285990
864309690 864310650
864330150 864331110
864342870 864343830
864369690 864371310
864398910 864400170
864454830 864456390
864474090 864475710
864485730 864486690
864516570 864517530
864541650 864542610
864563250 864564210
864631230 864632190
864661290 864662910
864682110 864683070
864696090 864697050
864722250 864723210
864742350 864743310
864802950 864804450
864844890 864846510
864890490 864891990
864912030 864913110
864934110 864935070
864946890 864947850
864972570 864973530
864998130 864999390
865059750 865060710
865086390 865088550
865110270 865111230
865124550 865125510
865149930 865151430
865171830 865172790
865237230 865238190
865249890 865250850
865285470 865286610
865297290 865298370
865320690 865322010
865344570 865345530
865347090 865348050
865405110 865406070
865433190 865434150
865455930 865456890
865491450 865492410
865518150 865519110
865539750 865540710
865548510 865549590
865577610 865579110
865594770 865595730
865663230 865664790
865684950 865686090
865697370 865705950
865707750 865708710
865721490 865722450
865757490 865758450
865770330 865771710
865790730 865793310
865793790 865796730
865797990 865798950
865799550 865800930
865836930 865837890
865860690 865861650
865863270 865864230
865864470 865870290
865873050 865878510
865898850 865899810
865923930 865925430
865944870 865949430
865951110 865955670
865961070 865963710
865964070 865968930
865969350 865971030
866098110 866099370
866119650 866120910
866144130 866145090
866155650 866156610
866184090 866185050
866206110 866207070
866207850 866214990
866215050 866220750
866268630 866269590
866291970 866297610
866297910 866301390
866301510 866306490
866307270 866308230
866312130 866316750
866318070 866319030
866332110 866333070
866338230 866339190
866339790 866340750
866360310 866362230
866377890 866379330
866379990 866382390
866385450 866387010
866390490 866391450
866395050 866396250
866396850 866397810
866399070 866400330
866450370 866451330
866462670 866468010
866468070 866472030
866472510 866478690
866481210 866487690
866487930 866491170
866500530 866501490
866532330 866533290
866553690 866556810
866556870 866558070
866559870 866562270
866563350 866565450
866568330 866573370
866574330 866575770
866576310 866577630
866617170 866618130
866634150 866635410
866636970 866638230
866642550 866643750
866644170 866645610
866706210 866707710
866727570 866729310
866745990 866746950
866760750 866761710
866786490 866787450
866809470 866817030
866817090 866822430
866823870 866834130
866834370 866835330
866874570 866875530
866900430 866902110
866905530 866906490
866908650 866909610
866910450 866914410
866914650 866915610
866916210 866920650
866933550 866934510
866964930 866966850
866985330 866986470
866988150 866990130
866991150 866992110
866993130 866994090
866997270 866998830
866999970 867000930
867002850 867004290
867005070 867006030
867006330 867007290
867047850 867048810
867070290 867072090
867072270 867073230
867074250 867075210
867076110 867077070
867077430 867078390
867079110 867080070
867080850 867081810
867082710 867084450
867086550 867087510
867089670 867091890
867092010 867094170
867111990 867112950
867135810 867137730
867158250 867159990
867161790 867162750
867162930 867165930
867165990 867167790
867172950 867174270
867222330 867224130
867249330 867251370
867307890 867309150
867326550 867327990
867348930 867349890
867361050 867362010
867392610 867393930
867416010 867416970
867417570 867418530
867420630 867422010
867423150 867426030
867426270 867427230
867427830 867429210
867429630 867430590
867430710 867432390
867433290 867434250
867477630 867479550
867499530 867501150
867507390 867508350
867509010 867509970
867510030 867510990
867523410 867524370
867525210 867527010
867539610 867540570
867567450 867569250
867590670 867592410
867653490 867654810
867692730 867693690
867699990 867700950
867719130 867720090
867738930 867740730
867758670 867760110
867827430 867828930
867846750 867848250
867910050 867912210
867940290 867941250
867941550 867942510
867970290 867971250
867997770 867999690
868019670 868020630
868022190 868024710
868026390 868035210
868035270 868036230
868083330 868084290
868106970 868108890
868110150 868111110
868112910 868114170
868122810 868123770
868124730 868125690
868127070 868128030
868128690 868129710
868138950 868139910
868142430 868143390
868172190 868174350
868198830 868199790
868208370 868209330
868209450 868212930
868219710 868220670
868256730 868257690
868277490 868278450
868279710 868281510
868284810 868285770
868298610 868299570
868315350 868316310
868344930 868346310
868372110 868373730
868433790 868435710
868455210 868456290
868516470 868517790
868540650 868541730
868563870 868564830
868576470 868577430
868603230 868604970
868623030 868623990
868690290 868691670
868707810 868708770
868720710 868721670
868734510 868735470
868746990 868747950
868777710 868778670
868778730 868779690
868791810 868792950
868861890 868863690
868881990 868882950
868888230 868889190
868906530 868907490
868925610 868926570
868947750 868948710
868970070 868972110
869038710 869040570
869066430 869067390
869120850 869122710
869141190 869142150
869168370 869169330
869179590 869180550
869207010 869208750
869229990 869231790
869234310 869235270
869241630 869242710
869242770 869243730
869250570 869251530
869252250 869253330
869254890 869255850
869256150 869257710
869257950 869259690
869260290 869261250
869261730 869262690
869264850 869265810
869297070 869298330
869315730 869316810
869317350 869319090
869319270 869320230
869323050 869325030
869325930 869327070
869330730 869331690
869335530 869336610
869337450 869338410
869339010 869339970
869340330 869341410
869341650 869342970
869348970 869350110
869352390 869353350
869386710 869387670
869402430 869403390
869405490 869408430
869415330 869416290
869423790 869424750
869471190 869472630
869496450 869497710
869509530 869510490
869521890 869522910
869558490 869560050
869583810 869585550
869645910 869646990
869677170 869678130
869679690 869681310
869733090 869734050
869751630 869752770
869777550 869778510
869786370 869787330
869817630 869819010
869836110 869837190
869858130 869859090
869901690 869903070
869933670 869934630
869935650 869936610
869950470 869951430
869968110 869969070
869994030 869994990
870010170 870011250
870025650 870026610
870026730 870027690
870062010 870063450
870076710 870078630
870102090 870103230
870116310 870117270
870130410 870131370
870164010 870165390
870187830 870189090
870250830 870252630
870269130 870270270
870336030 870337470
870352350 870353310
870383250 870384210
870395490 870396450
870420690 870421650
870445110 870446970
870508470 870510270
870523710 870524670
870527850 870528810
870534870 870536490
870538110 870540750
870551670 870552630
870567030 870567990
870596250 870597570
870621270 870623130
870628650 870634230
870683250 870684210
870709770 870711030
870725850 870726810
870743070 870744030
870769470 870770670
870786390 870787350
870857070 870858570
870871050 870872010
870943470 870945030
870961830 870963150
870983310 870984270
870993210 870994170
871028250 871029630
871047390 871048530
871113570 871115010
871134450 871135710
871149750 871150710
871182570 871183530
871200690 871202070
871220670 871221630
871246830 871247790
871254090 871255050
871256550 871258710
871260570 871262310
871262850 871268430
871289070 871290870
871301970 871302930
871329030 871330110
871339050 871340010
871373970 871375290
871394730 871395870
871459410 871461210
871484190 871485330
871495950 871496910
871544970 871546770
871566330 871567710
871586310 871587270
871598370 871599330
871633470 871634910
871650990 871652130
871686030 871686990
871719030 871720410
871744710 871746390
871751670 871752630
871766550 871767510
871780410 871781370
871804650 871805730
871827450 871828410
871833990 871834950
871891290 871893150
871921890 871922850
871942950 871943910
871956210 871957170
871974990 871976430
871999290 872001090
872065530 872066490
872085930 872087070
872150370 872151450
872168970 872169930
872193570 872194530
872205450 872206410
872236230 872237310
872259510 872260470
872261790 872262750
872324790 872325750
872342670 872344410
872344650 872345610
872357730 872358690
872372310 872373270
872409870 872411190
872435790 872436750
872495970 872497830
872513610 872514570
872519130 872521170
872535450 872536410
872546970 872548050
872583270 872584950
872605890 872608050
872668230 872669970
872696970 872698110
872709570 872711490
872733990 872736870
872756730 872757690
872778150 872779110
872799270 872800230
872811810 872812770
872840730 872842350
872855850 872857410
872925330 872926950
872945670 872946630
872953590 872954550
872966610 872967570
872974770 872975850
873011670 873012630
873035010 873036630
873102330 873103290
873120990 873121950
873123450 873124410
873188070 873189030
873213750 873214830
873274050 873275310
873290910 873292410
873362910 873364170
873383430 873384570
873426030 873428010
873446730 873447930
873467250 873468510
873485370 873486330
873499650 873500610
873515490 873516450
873533730 873534690
873553530 873554910
873558630 873559590
873559650 873562590
873569370 873570330
873581730 873582690
873620250 873621210
873631410 873632370
873634470 873635430
873636570 873637530
873637830 873638790
873639630 873642090
873679890 873680850
873683250 873685830
873690750 873691710
873694110 873696990
873704790 873706110
873731190 873732690
873749250 873750210
873761670 873762630
873792750 873793890
873880710 873882210
873887250 873889050
873930390 873931470
873968790 873970710
873992970 873994350
874013970 874014930
874022850 874023810
874052250 874053690
874080810 874081770
874135470 874137210
874156590 874157550
874177530 874178490
874179510 874180470
874181730 874182690
874192830 874193790
874225290 874227330
874249170 874250130
874289550 874290510
874309650 874310910
874339650 874340610
874359210 874360170
874367730 874368690
874400790 874402530
874422330 874423290
874488030 874488990
874519350 874520310
874572450 874573830
874594590 874596030
874611810 874612770
874658370 874659930
874675050 874676490
874743450 874744410
874761330 874762290
874766610 874768110
874788330 874789410
874806810 874807950
874833270 874834230
874854630 874855590
874916250 874917210
874936770 874937730
874957650 874959210
874966710 874967670
874978350 874979310
875004690 875006490
875023530 875024490
875025810 875027970
875042070 875043030
875089470 875090430
875115390 875116350
875156490 875158650
875166450 875167410
875167710 875170110
875176170 875177130
875194950 875196510
