816096195 816096198
816318259 816318262
816416540 816416543
816437950 816437953
816473726 816473729
816578688 816578691
816581398 816581401
816664206 816664209
816771706 816771709
816864100 816864103
816913393 816913396
817306157 817306160
817473089 817473092
817588126 817588129
817878028 817878031
818244351 818244354
818393795 818393798
818623815 818623818
818659493 818659496
818660672 818660674
818779720 818779722
819093086 819093089
819205615 819205618
819205817 819205819
819206495 819206498
819307687 819307690
819316545 819316549
819369197 819369200
819557286 819557289
819810637 819810639
819913321 819913323
819917277 819917280
819965878 819965880
819996612 819996614
820326757 820326759
820358593 820358596
820493656 820493658
820570955 820570959
820592661 820592664
820684228 820684230
820768638 820768641
820807344 820807346
820851224 820851227
820972064 820972067
821019829 821019832
821050515 821050518
821093588 821093591
821109794 821109796
821110855 821110858
821127920 821127922
821246769 821246772
821302781 821302783
821352066 821352069
821378700 821378702
821450197 821450200
821467493 821467495
821471450 821471452
821471757 821471760
822065842 822065844
822135244 822135246
822170495 822170497
822243592 822243594
822250951 822250953
822663005 822663007
822948829 822948831
823098756 823098758
823152567 823152570
823275203 823275206
823446373 823446375
824056176 824056178
824113494 824113496
824131498 824131500
824151822 824151824
824505075 824505077
824646373 824646375
824649973 824649975
824735562 824735564
824834466 824834468
825053489 825053492
825059927 825059930
825069156 825069159
825109662 825109665
825110631 825110633
825424914 825424916
825425822 825425825
825534052 825534054
825618450 825618453
825771272 825771274
825886676 825886678
825888595 825888597
825896342 825896345
825914694 825914696
826135378 826135380
826155841 826155844
826282658 826282660
826302598 826302601
826314545 826314547
826560305 826560307
826579992 826579994
826657946 826657948
826663195 826663198
826916568 826916570
826981647 826981650
826987293 826987295
827067739 827067741
827069227 827069230
827090427 827090429
827150627 827150629
827167141 827167144
827175739 827175741
827237390 827237392
827524933 827524935
827653348 827653350
827669287 827669289
827670690 827670692
827700826 827700828
827755038 827755040
827758889 827758891
828099056 828099058
828104776 828104778
828265350 828265353
828272398 828272400
828272988 828272991
828273601 828273603
828346007 828346010
829054449 829054451
829391935 829391938
829395771 829395773
829515229 829515231
829584116 829584119
829665946 829665948
829942424 829942427
830007486 830007488
830085860 830085862
830113217 830113220
830182026 830182029
830192549 830192551
830193340 830193342
830221035 830221038
830230005 830230007
830258229 830258231
830270124 830270126
830275560 830275562
830283219 830283222
830343962 830343965
830438792 830438794
830611154 830611157
831306655 831306657
831325745 831325747
831374060 831374063
831406550 831406553
831492300 831492303
831665101 831665104
831873463 831873465
833673097 833673100
833889158 833889160
834327328 834327331
834501872 834501875
834969663 834969678
835375287 835375290
837357100 837357103
837363108 837363111
839078857 839078860
840021601 840021603
840280387 840280389
840351190 840351192
840729075 840729078
840761990 840761993
841573664 841573667
841820186 841820189
842013078 842013081
842199538 842199540
842973065 842973067
843231481 843231484
843233773 843233776
843265296 843265298
843717510 843717513
844801852 844801855
844966800 844966803
845376675 845376677
845403888 845403890
846095979 846095982
846095992 846095995
846454243 846454246
846556730 846556733
846582843 846582846
846945609 846945612
847137262 847137265
847193325 847193328
847491213 847491216
847534463 847534465
848066667 848066670
848194529 848194532
848194536 848194539
848215205 848215207
849326413 849326416
849450196 849450198
849720379 849720381
850352113 850352115
850449699 850449702
853095932 853095935
853180147 853180150
853858309 853858312
854465255 854465257
854757526 854757528
855073386 855073388
855351996 855351998
855878176 855878179
857254724 857254726
857406501 857406504
857409444 857409447
857484459 857484462
859128026 859128029
859826072 859826075
859833041 859833043
860328674 860328676
860473271 860473273
860526276 860526278
861372329 861372331
862598465 862598467
862760049 862760052
863379806 863379808
863913092 863913094
864146853 864146855
864513136 864513139
864668809 864668812
864668965 864668968
865605366 865605368
865963072 865963074
867434788 867434790
868207677 868207679
868916361 868916364
869668578 869668581
872431916 872431918
872986275 872986277
873424549 873424552
873501808 873501810
874103750 874103753
874379837 874379839
