831362545 831362562
831378558 831378575
831396073 831396090
831396296 831396313
831403799 831403816
831403815 831403832
831431955 831431972
831437895 831437912
831438352 831438369
831440407 831440424
831440501 831440518
831440773 831440791
831440793 831440810
831440859 831440876
831440881 831440898
831441174 831441194
831441271 831441288
831441429 831441446
831441444 831441461
831441581 831441598
831441797 831441814
831442025 831442042
831442156 831442173
831442387 831442404
831443078 831443095
831444079 831444096
831444709 831444726
831444758 831444775
831444838 831444855
831444903 831444920
831444921 831444939
831444926 831444943
831444934 831444951
831444990 831445007
831445060 831445077
831445079 831445096
831445111 831445128
831449822 831449839
831451507 831451524
831489102 831489119
831518853 831518870
831588794 831588811
831589988 831590005
831607146 831607163
831629827 831629844
831630804 831630821
831644831 831644848
831644861 831644878
831645373 831645390
831645799 831645816
831646045 831646062
831646487 831646504
831655528 831655545
831723227 831723244
831783524 831783541
831880103 831880120
831883971 831883988
831919239 831919256
831919250 831919267
831946880 831946897
831946890 831946907
831946934 831946951
831950319 831950336
832021472 832021489
832045269 832045286
832045300 832045317
832045322 832045339
832045435 832045452
832045512 832045529
832045527 832045544
832045544 832045561
832045664 832045681
832046352 832046369
832049552 832049569
832057028 832057045
832061528 832061545
832077092 832077109
832089575 832089592
832096500 832096517
832099798 832099815
832242195 832242212
832289848 832289865
832293173 832293190
832317409 832317426
832318742 832318759
832324414 832324431
832382170 832382187
832404255 832404272
832465147 832465164
832465256 832465273
832465393 832465410
832477108 832477125
832520306 832520323
832548360 832548377
832561879 832561896
832568131 832568148
832636329 832636346
832660005 832660022
832667457 832667474
832667461 832667478
832674779 832674796
832678122 832678139
832678598 832678615
832695417 832695436
832722046 832722063
832723666 832723683
832727589 832727606
832730193 832730210
832731368 832731385
832736247 832736264
832736686 832736703
832780700 832780717
832837081 832837098
832849279 832849296
832851155 832851172
832851199 832851216
832910671 832910688
832921379 832921396
832921389 832921407
832923470 832923487
832942507 832942524
832957959 832957976
832967052 832967069
833003496 833003513
833015938 833015955
833026832 833026849
833034134 833034151
833054478 833054495
833094970 833094987
833098791 833098808
833123971 833123988
833128643 833128660
833128649 833128666
833148476 833148493
833190180 833190197
833190999 833191016
833191700 833191717
833191740 833191757
833229428 833229445
833260524 833260541
833274948 833274965
833289637 833289654
833290167 833290184
833292248 833292265
833308900 833308917
833311005 833311022
833315510 833315527
833315967 833315984
833321634 833321651
833323142 833323159
833323155 833323172
833323192 833323209
833369503 833369520
833375140 833375157
833377586 833377603
833380384 833380401
833395242 833395259
833396798 833396815
833396811 833396828
833396821 833396838
833400373 833400390
833400950 833400967
833404787 833404804
833410013 833410030
833416115 833416132
833416501 833416518
833417205 833417222
833434971 833434988
833441474 833441491
833445030 833445047
833448992 833449009
833480199 833480216
833480252 833480269
833484051 833484068
833488373 833488390
833539519 833539536
833539609 833539626
833539648 833539665
833564224 833564241
833574139 833574156
833582526 833582543
833586772 833586789
833618686 833618703
833667694 833667713
833688476 833688493
833698162 833698179
833706661 833706678
833707104 833707121
833712975 833712992
833714233 833714250
833721697 833721714
833733987 833734004
833767439 833767456
833777260 833777277
833777317 833777334
833782964 833782981
833783016 833783033
833785698 833785715
833806090 833806107
833807517 833807534
833815600 833815617
833829437 833829454
833829517 833829534
833829522 833829539
833829577 833829594
833829654 833829671
833829661 833829678
833829847 833829864
833830100 833830117
833834350 833834367
833845621 833845638
833845625 833845642
833847123 833847140
833868624 833868641
833868677 833868694
833891949 833891966
833903226 833903243
833904491 833904508
833904817 833904834
833915218 833915235
833915633 833915650
833947154 833947171
833961972 833961989
834016615 834016632
834019008 834019025
834022875 834022892
834027050 834027067
834038846 834038863
834038994 834039012
834040054 834040071
834060504 834060521
834067515 834067532
834068394 834068411
834083426 834083443
834088033 834088050
834090415 834090432
834097562 834097579
834101272 834101289
834109659 834109676
834111713 834111730
834119435 834119452
834119463 834119480
834120277 834120294
834121270 834121287
834121598 834121615
834121980 834121997
834125208 834125225
834126653 834126670
834134398 834134415
834136451 834136468
834163102 834163119
834171875 834171892
834171919 834171936
834213776 834213793
834216952 834216969
834242414 834242431
834341798 834341815
834341813 834341830
834342680 834342697
834344026 834344043
834344405 834344422
834345373 834345390
834364768 834364785
834373792 834373809
834380094 834380111
834382612 834382629
834382790 834382807
834383752 834383769
834383802 834383819
834383849 834383866
834383896 834383913
834385759 834385776
834416395 834416412
834419242 834419259
834430424 834430441
834434891 834434908
834465481 834465498
834467625 834467642
834473104 834473121
834473811 834473828
834473831 834473848
834490797 834490814
834490985 834491002
834504135 834504152
834505697 834505714
834523790 834523807
834567513 834567530
834568045 834568062
834568074 834568091
834568092 834568109
834574127 834574144
834580738 834580755
834598977 834598994
834631803 834631820
834654502 834654519
834655867 834655884
834656329 834656346
834664916 834664933
834668930 834668947
834669376 834669393
834670351 834670368
834704948 834704965
834712693 834712710
834713004 834713021
834713328 834713345
834718635 834718652
834731628 834731645
834731637 834731654
834740061 834740078
834741086 834741103
834751536 834751553
834756328 834756345
834761979 834761996
834767480 834767497
834770183 834770200
834771747 834771764
834775004 834775021
834791230 834791247
834791884 834791901
834792403 834792420
834793637 834793654
834800107 834800124
834800302 834800319
834800453 834800470
834827404 834827421
834839887 834839904
834850680 834850697
834882766 834882783
834883728 834883745
834883995 834884012
834905997 834906014
834929270 834929287
834936356 834936373
834940059 834940076
834940091 834940108
834981687 834981704
835022812 835022829
835025001 835025018
835025087 835025104
835027450 835027467
835030228 835030245
835509861 835509878
835513995 835514012
835524513 835524530
835526601 835526618
835528632 835528649
835540860 835540877
835541077 835541094
835549772 835549789
835562585 835562602
835603458 835603475
835624663 835624680
835654973 835654990
835694886 835694903
835695498 835695515
835726203 835726220
835729644 835729661
835739017 835739034
835739270 835739287
835752946 835752963
835759585 835759602
835759724 835759741
835766964 835766981
835768427 835768444
835773649 835773666
835773686 835773703
835776274 835776294
835776286 835776306
835776376 835776393
835799904 835799921
835799913 835799930
835801730 835801747
835802817 835802834
835810387 835810404
835851090 835851107
835871315 835871332
835881546 835881563
835883805 835883822
835884108 835884125
835892489 835892506
835903312 835903329
835903458 835903475
835903586 835903603
835929728 835929745
835944845 835944862
835945961 835945978
835956796 835956813
835958619 835958636
835965473 835965490
835966262 835966279
835966266 835966283
835966327 835966344
835969907 835969924
835970056 835970073
835972806 835972823
835974205 835974222
835975170 835975187
835978469 835978486
835982232 835982249
835985136 835985153
836005972 836005989
836038448 836038465
836061545 836061562
836061976 836061993
836087313 836087330
836097744 836097761
836111074 836111091
836112019 836112036
836113959 836113976
836118823 836118840
836162524 836162541
836169979 836169996
836169988 836170005
836179044 836179061
836191252 836191269
836191512 836191529
836191562 836191579
836193852 836193869
836195590 836195607
836201079 836201096
836201997 836202014
836208210 836208227
836209687 836209704
836210167 836210184
836225863 836225880
836226148 836226165
836226474 836226491
836231087 836231104
836233731 836233748
836233998 836234015
836261534 836261551
836262618 836262635
836262623 836262640
836270538 836270555
836270547 836270564
836272487 836272504
836298722 836298739
836298865 836298882
836300831 836300848
836300837 836300854
836300862 836300879
836319514 836319531
836319585 836319602
836330863 836330880
836331133 836331150
836344411 836344428
836344653 836344670
836344667 836344684
836344979 836344996
836345082 836345099
836346155 836346172
836346212 836346229
836346256 836346273
836346265 836346282
836346512 836346529
836346525 836346542
836346540 836346557
836346816 836346833
836346835 836346852
836346910 836346927
836346945 836346962
836346959 836346976
836347076 836347093
836347110 836347127
836347412 836347429
836358901 836358918
836358925 836358942
836360712 836360729
836361660 836361677
836363999 836364016
836364196 836364213
836366778 836366795
836368940 836368957
836368947 836368964
836369880 836369897
836370080 836370097
836370360 836370377
836370378 836370395
836370504 836370524
836371179 836371196
836374722 836374739
836387160 836387177
836389343 836389362
836389414 836389431
836389433 836389450
836394412 836394429
836395522 836395539
836401405 836401422
836401857 836401874
836440751 836440768
836440826 836440843
836450675 836450692
836450837 836450854
836451250 836451267
836451272 836451289
836451792 836451809
836453365 836453383
836457904 836457921
836459156 836459173
836462777 836462794
836464494 836464511
836475051 836475068
836475156 836475173
836475370 836475387
836475374 836475391
836479980 836479997
836484999 836485016
836491095 836491112
836494357 836494374
836508310 836508327
836511144 836511161
836511810 836511827
836513541 836513558
836513807 836513824
836558370 836558387
836558398 836558417
836559616 836559633
836565886 836565903
836576491 836576508
836582253 836582270
836583208 836583225
836583284 836583301
836586672 836586689
836587841 836587858
836588587 836588604
836588705 836588722
836588953 836588970
836588963 836588980
836593320 836593337
836593852 836593869
836596599 836596616
836600561 836600578
836601203 836601220
836601742 836601759
836615359 836615376
836616143 836616160
836616637 836616654
836618513 836618530
836619225 836619242
836620138 836620155
836621820 836621837
836621841 836621858
836626339 836626356
836627963 836627980
836635586 836635603
836636447 836636464
836637879 836637896
836642015 836642032
836644795 836644812
836645082 836645099
836645347 836645364
836645386 836645403
836645409 836645426
836646299 836646316
836647427 836647444
836647706 836647723
836647891 836647908
836648207 836648224
836648268 836648285
836648615 836648632
836648693 836648710
836648894 836648911
836649013 836649030
836650380 836650397
836650919 836650936
836651469 836651486
836651892 836651909
836655870 836655887
836658303 836658320
836661181 836661198
836663568 836663585
836701340 836701357
836701667 836701684
836702292 836702309
836746269 836746286
836750678 836750695
836752337 836752354
836753538 836753555
836755496 836755513
836761781 836761798
836762069 836762086
836765449 836765466
836765925 836765942
836766103 836766120
836766136 836766153
836766253 836766270
836766269 836766286
836779835 836779852
836780099 836780116
836780555 836780572
836781406 836781423
836797650 836797667
836798000 836798017
836808469 836808486
836809098 836809115
836810464 836810481
836810554 836810571
836810575 836810592
836814292 836814309
836835414 836835431
836843215 836843232
836843221 836843238
836843318 836843335
836843768 836843785
836843777 836843794
836845456 836845473
836852471 836852488
836853740 836853757
836853748 836853765
836865205 836865222
836866482 836866499
836869194 836869211
836870638 836870655
836871215 836871232
836873573 836873590
836873594 836873612
836873634 836873651
836873754 836873771
836874985 836875002
836874995 836875012
836908958 836908975
836939129 836939147
836952825 836952842
836953002 836953019
836953014 836953031
836953063 836953080
836953070 836953087
836953198 836953215
836953206 836953223
836956088 836956105
836957524 836957541
836957867 836957884
836957996 836958013
836958000 836958017
836960790 836960807
836971151 836971168
836971189 836971206
836971529 836971546
836979645 836979662
836979682 836979699
836979705 836979722
836993588 836993605
836994862 836994879
837001244 837001261
837003086 837003103
837003289 837003306
837003820 837003837
837004187 837004204
837004441 837004458
837004697 837004717
837004750 837004767
837007678 837007695
837008348 837008365
837008381 837008398
837009295 837009312
837009410 837009427
837010903 837010920
837010945 837010962
837011522 837011539
837011896 837011914
837012524 837012541
837014161 837014178
837014289 837014306
837014301 837014318
837014907 837014924
837037056 837037074
837037276 837037293
837045792 837045809
837065972 837065989
837065989 837066006
837066115 837066132
837066145 837066162
837066167 837066184
837067317 837067334
837068469 837068486
837068893 837068910
837070679 837070696
837070687 837070704
837070756 837070773
837072646 837072663
837072655 837072673
837072691 837072708
837072913 837072930
837072947 837072964
837072951 837072968
837073718 837073735
837074160 837074177
837074221 837074238
837076439 837076456
837077623 837077640
837077801 837077818
837077831 837077848
837078064 837078081
837078091 837078108
837088328 837088346
837089772 837089790
837090125 837090142
837090178 837090195
837090344 837090361
837090380 837090397
837090392 837090409
837090418 837090435
837090461 837090478
837090525 837090542
837091574 837091591
837096615 837096632
837102507 837102524
837102779 837102796
837105029 837105046
837105106 837105123
837106393 837106410
837107037 837107054
837107045 837107062
837107156 837107173
837108528 837108545
837108670 837108687
837108714 837108731
837108721 837108738
837108760 837108777
837108853 837108870
837113456 837113473
837113792 837113809
837113798 837113815
837115537 837115554
837116378 837116395
837117840 837117857
837117916 837117933
837118010 837118027
837118290 837118307
837118762 837118779
837118789 837118806
837119474 837119491
837121064 837121081
837121121 837121138
837122494 837122511
837123258 837123275
837123969 837123986
837124060 837124077
837124237 837124254
837124252 837124269
837124788 837124805
837126904 837126921
837157929 837157946
837159073 837159090
837171196 837171213
837171391 837171408
837171423 837171440
837172282 837172299
837172490 837172507
837173177 837173194
837173187 837173204
837173749 837173766
837173787 837173804
837173797 837173814
837173916 837173933
837173928 837173945
837173982 837173999
837173991 837174008
837174005 837174022
837174074 837174091
837174147 837174164
837174308 837174325
837174333 837174350
837174388 837174405
837174411 837174428
837174468 837174485
837174499 837174516
837174505 837174522
837174510 837174527
837174515 837174532
837174531 837174548
837174790 837174807
837184806 837184823
837185574 837185591
837185594 837185611
837186520 837186537
837186810 837186827
837187086 837187103
837187775 837187792
837187872 837187889
837188341 837188358
837192870 837192887
837195701 837195718
837198153 837198170
837198191 837198208
837199042 837199059
837199084 837199101
837199371 837199388
837200056 837200073
837201233 837201250
837201251 837201268
837201262 837201279
837206894 837206911
837206911 837206928
837207277 837207294
837208008 837208025
837208179 837208196
837208217 837208234
837208518 837208535
837208522 837208539
837208752 837208769
837208764 837208781
837209508 837209525
837209530 837209547
837209584 837209601
837210094 837210114
837210618 837210635
837211760 837211777
837211824 837211841
837211835 837211852
837211841 837211860
837212140 837212157
837212419 837212436
837213181 837213198
837213847 837213864
837214041 837214058
837214825 837214842
837214890 837214907
837214900 837214917
837214909 837214929
837214942 837214962
837215029 837215046
837215180 837215197
837215714 837215731
837215721 837215738
837215784 837215801
837216119 837216136
837216323 837216340
837217525 837217542
837217697 837217714
837218003 837218020
837218016 837218033
837218032 837218049
837218076 837218093
837218600 837218617
837218853 837218870
837220017 837220034
837221480 837221497
837221945 837221962
837222005 837222022
837226472 837226489
837228697 837228717
837229968 837229988
837232570 837232587
837234011 837234028
837234075 837234092
837234783 837234800
837235191 837235208
837235827 837235844
837236551 837236568
837236572 837236589
837236842 837236859
837236931 837236948
837242713 837242730
837242722 837242739
837242777 837242794
837243619 837243636
837267835 837267852
837268311 837268331
837268556 837268573
837269303 837269320
837269446 837269463
837270142 837270159
837270229 837270246
837270246 837270265
837270270 837270287
837270285 837270302
837301965 837301982
837301996 837302013
837310565 837310582
837310704 837310722
837312085 837312102
837312115 837312132
837312752 837312769
837313410 837313427
837313584 837313601
837313604 837313621
837313718 837313735
837314386 837314403
837314546 837314563
837316212 837316229
837317172 837317189
837318446 837318465
837319390 837319407
837319418 837319435
837319428 837319445
837319470 837319487
837319486 837319503
837319741 837319758
837320716 837320733
837320905 837320922
837321463 837321480
837321896 837321913
837323424 837323441
837323437 837323454
837323912 837323929
837324245 837324262
837324563 837324580
837324927 837324944
837325494 837325511
837325670 837325687
837325718 837325735
837325881 837325898
837325929 837325946
837326260 837326277
837326270 837326287
837326424 837326441
837326511 837326528
837326681 837326698
837327046 837327063
837327157 837327174
837327983 837328000
837328620 837328637
837329123 837329140
837329146 837329163
837329286 837329303
837329323 837329340
837329370 837329387
837329872 837329889
837329968 837329985
837334768 837334785
837336262 837336281
837336274 837336291
837337140 837337157
837337231 837337248
837337434 837337451
837337635 837337652
837337694 837337711
837338412 837338429
837338632 837338649
837338771 837338788
837338818 837338835
837338864 837338882
837338969 837338986
837338987 837339004
837339017 837339035
837339246 837339263
837339807 837339824
837340111 837340128
837340597 837340615
837340641 837340658
837340661 837340678
837340743 837340760
837340760 837340777
837340875 837340892
837341133 837341150
837341197 837341214
837341332 837341349
837341612 837341629
837341684 837341701
837341722 837341739
837342070 837342087
837342087 837342104
837342168 837342185
837342356 837342373
837342572 837342589
837342771 837342788
837342890 837342907
837343032 837343049
837343126 837343143
837343260 837343277
837343331 837343348
837343371 837343388
837343376 837343393
837343431 837343448
837343767 837343784
837343795 837343812
837343859 837343876
837344249 837344266
837344333 837344350
837344397 837344415
837344471 837344489
837344507 837344524
837348252 837348269
837348310 837348327
837348373 837348391
837348416 837348433
837348439 837348456
837348462 837348479
837348479 837348496
837348579 837348596
837348596 837348613
837348644 837348664
837348681 837348698
837348745 837348762
837348771 837348788
837348835 837348852
837348851 837348868
837348860 837348877
837348917 837348934
837349061 837349078
837349149 837349166
837349343 837349360
837349477 837349494
837349731 837349748
837349788 837349805
837359549 837359566
837363751 837363768
837365640 837365657
837367190 837367207
837374562 837374579
837384394 837384411
837387784 837387801
837391199 837391216
837391375 837391392
837392104 837392121
837399528 837399545
837400199 837400216
837400315 837400332
837400369 837400386
837400471 837400488
837401535 837401552
837402602 837402619
837403244 837403261
837403341 837403359
837413695 837413712
837414231 837414248
837416071 837416088
837416091 837416108
837419042 837419059
837421022 837421039
837423571 837423588
837424273 837424290
837425898 837425915
837427798 837427815
837429421 837429439
837429456 837429473
837429531 837429548
837429555 837429572
837429560 837429577
837429589 837429606
837429602 837429619
837429695 837429712
837430830 837430847
837431069 837431086
837431085 837431102
837432763 837432780
837432792 837432809
837433346 837433363
837434771 837434788
837436546 837436563
837437433 837437450
837437453 837437474
837437686 837437703
837438244 837438261
837438333 837438350
837438777 837438794
837438792 837438809
837439702 837439719
837439713 837439730
837439742 837439760
837439963 837439980
837440139 837440156
837440156 837440173
837440166 837440183
837440178 837440195
837440557 837440574
837440900 837440917
837441604 837441621
837441838 837441858
837441903 837441920
837450580 837450599
837450732 837450749
837450967 837450984
837452407 837452424
837452616 837452633
837453218 837453235
837453913 837453930
837457195 837457212
837458446 837458463
837462121 837462138
837464772 837464790
837477219 837477236
837479404 837479421
837479413 837479430
837479418 837479436
837492799 837492816
837498156 837498173
837499005 837499022
837500116 837500133
837500220 837500237
837500809 837500826
837501392 837501409
837501418 837501437
837501708 837501725
837501903 837501920
837501920 837501937
837501972 837501989
837502377 837502394
837502393 837502410
837502397 837502421
837502460 837502477
837502989 837503006
837503160 837503177
837503187 837503204
837504094 837504111
837504105 837504123
837504114 837504131
837504668 837504685
837505337 837505354
837505839 837505856
837507354 837507371
837508089 837508106
837508609 837508626
837508953 837508970
837509034 837509051
837509116 837509133
837509260 837509277
837517868 837517885
837519191 837519208
837519545 837519562
837520162 837520179
837520390 837520407
837521265 837521282
837521354 837521371
837521474 837521491
837521481 837521498
837521517 837521535
837521965 837521982
837522791 837522808
837523912 837523929
837523921 837523938
837525343 837525360
837525390 837525407
837525465 837525482
837525498 837525515
837525516 837525533
837525982 837525999
837525987 837526004
837527187 837527204
837528480 837528497
837532214 837532231
837533640 837533657
837544506 837544523
837549814 837549831
837585285 837585302
837585519 837585536
837586004 837586021
837586728 837586745
837590060 837590077
837593450 837593467
837594563 837594580
837595199 837595216
837596917 837596934
837596936 837596955
837597075 837597092
837597325 837597342
837597374 837597391
837597486 837597503
837597653 837597670
837597678 837597695
837597703 837597720
837597713 837597730
837597724 837597741
837597748 837597765
837597760 837597777
837597849 837597866
837598113 837598130
837598774 837598792
837603062 837603079
837604130 837604147
837604810 837604827
837605855 837605874
837606054 837606071
837606239 837606256
837606958 837606975
837607256 837607273
837607338 837607355
837607560 837607577
837608036 837608053
837608765 837608782
837609723 837609740
837609741 837609758
837609763 837609780
837610392 837610409
837616043 837616060
837616351 837616368
837616537 837616554
837616844 837616861
837617551 837617568
837620249 837620266
837621668 837621685
837624108 837624125
837624121 837624138
837624212 837624229
837624367 837624384
837624430 837624447
837624512 837624529
837626173 837626190
837626321 837626338
837626405 837626422
837626415 837626432
837626932 837626949
837627683 837627700
837635881 837635898
837635897 837635914
837645526 837645543
837645539 837645556
837645571 837645588
837645667 837645688
837645685 837645702
837645713 837645731
837649006 837649023
837650650 837650667
837650931 837650948
837651014 837651031
837651246 837651263
837653548 837653565
837654822 837654839
837659173 837659190
837663012 837663029
837668975 837668992
837672859 837672876
837673872 837673889
837676098 837676115
837676195 837676212
837676224 837676244
837676278 837676295
837676329 837676346
837676665 837676682
837676722 837676739
837677082 837677099
837677089 837677106
837677218 837677235
837677259 837677276
837677511 837677528
837677525 837677542
837677534 837677551
837677854 837677871
837677971 837677988
837678100 837678117
837678130 837678147
837678215 837678232
837678290 837678307
837678358 837678375
837679371 837679388
837680104 837680121
837680346 837680364
837680397 837680417
837681771 837681790
837681809 837681828
837681917 837681934
837682135 837682152
837682857 837682874
837682876 837682893
837682927 837682944
837683010 837683027
837683181 837683198
837683218 837683235
837683228 837683245
837683233 837683250
837683607 837683624
837683922 837683939
837683970 837683987
837683995 837684012
837684221 837684238
837684244 837684261
837684304 837684324
837684363 837684380
837684464 837684481
837684507 837684524
837684543 837684560
837684724 837684741
837684751 837684768
837685006 837685024
837686190 837686207
837686627 837686644
837686789 837686806
837687052 837687069
837687066 837687083
837687209 837687226
837687226 837687243
837687251 837687268
837687648 837687666
837688307 837688324
837688422 837688439
837688875 837688892
837694487 837694504
837694576 837694593
837694897 837694914
837694954 837694971
837696120 837696137
837696125 837696142
837696134 837696151
837696187 837696206
837696226 837696243
837696307 837696324
837696354 837696371
837696384 837696401
837696388 837696405
837696407 837696424
837696415 837696432
837696595 837696612
837696793 837696810
837696806 837696823
837697344 837697362
837697373 837697390
837697481 837697498
837697487 837697504
837716790 837716807
837732836 837732853
837732850 837732867
837734042 837734059
837734170 837734187
837734188 837734205
837734210 837734227
837734226 837734243
837734237 837734254
837734253 837734270
837734263 837734283
837734881 837734898
837735184 837735201
837735230 837735247
837736860 837736877
837737109 837737126
837737488 837737507
837737763 837737780
837737807 837737824
837737829 837737846
837738270 837738287
837738378 837738395
837738558 837738575
837740953 837740970
837740962 837740979
837740968 837740985
837740974 837740991
837741081 837741098
837741319 837741336
837741519 837741536
837742136 837742153
837742181 837742198
837742296 837742313
837742301 837742318
837742429 837742446
837743395 837743412
837743405 837743422
837744106 837744123
837745980 837745997
837746291 837746308
837747037 837747055
837747489 837747506
837748225 837748242
837748665 837748682
837748806 837748823
837748831 837748848
837748979 837748996
837749065 837749082
837749128 837749145
837749262 837749279
837749277 837749294
837749350 837749367
837749425 837749442
837749496 837749515
837749516 837749535
837749540 837749557
837749556 837749573
837749818 837749835
837750085 837750102
837750101 837750118
837751270 837751287
837751281 837751298
837752127 837752144
837752346 837752363
837752969 837752986
837753273 837753296
837753746 837753763
837754225 837754242
837754254 837754271
837754500 837754517
837754535 837754552
837754638 837754655
837754728 837754745
837755055 837755072
837755219 837755236
837755692 837755710
837756057 837756074
837756061 837756078
837756147 837756164
837756242 837756259
837757083 837757100
837757160 837757177
837757282 837757299
837757331 837757348
837757362 837757379
837757605 837757622
837757756 837757773
837757855 837757872
837758329 837758346
837758374 837758391
837758499 837758516
837758632 837758652
837758680 837758698
837758838 837758855
837758902 837758919
837759201 837759218
837759257 837759274
837759272 837759289
837759329 837759346
837759540 837759557
837759556 837759573
837759570 837759587
837759577 837759594
837759694 837759711
837759704 837759722
837759754 837759771
837759762 837759779
837759768 837759785
837759772 837759789
837759811 837759828
837760344 837760361
837760453 837760470
837761149 837761166
837761206 837761223
837761552 837761569
837761676 837761693
837761784 837761801
837761793 837761810
837761798 837761815
837761983 837762000
837762229 837762246
837762429 837762446
837762448 837762465
837762452 837762469
837762620 837762637
837763144 837763161
837763187 837763204
837763403 837763420
837763410 837763427
837763479 837763496
837763768 837763785
837764058 837764075
837764403 837764420
837764431 837764448
837764522 837764539
837764544 837764561
837764708 837764725
837764719 837764736
837764726 837764743
837764882 837764899
837765113 837765130
837765118 837765135
837765188 837765205
837765233 837765250
837765373 837765390
837765849 837765866
837765948 837765965
837766341 837766358
837767563 837767580
837767680 837767697
837768096 837768114
837768243 837768260
837768281 837768298
837768382 837768399
837768683 837768700
837768958 837768975
837769121 837769138
837769607 837769624
837769782 837769799
837770006 837770023
837770041 837770058
837770190 837770207
837770487 837770504
837770498 837770515
837771103 837771120
837772458 837772475
837772697 837772714
837772711 837772728
837772767 837772784
837772782 837772799
837772788 837772805
837772871 837772888
837772895 837772912
837773084 837773101
837774744 837774761
837774770 837774787
837774791 837774808
837774797 837774814
837776169 837776186
837776242 837776259
837776678 837776697
837776708 837776725
837776723 837776740
837776732 837776749
837777085 837777102
837777460 837777477
837777504 837777521
837777511 837777529
837777683 837777700
837777738 837777755
837777843 837777860
837777853 837777870
837777859 837777876
837777955 837777972
837778005 837778022
837778010 837778027
837779169 837779189
837779193 837779210
837779216 837779233
837779245 837779262
837779280 837779297
837779322 837779339
837780131 837780148
837780232 837780249
837780894 837780914
837781391 837781408
837781395 837781412
837781417 837781434
837781473 837781490
837781661 837781678
837782239 837782256
837782244 837782261
837782258 837782275
837782467 837782484
837782827 837782844
837783229 837783246
837783280 837783297
837783312 837783329
837783356 837783373
837783468 837783485
837783552 837783569
837783595 837783612
837783681 837783698
837783718 837783735
837783736 837783756
837783970 837783987
837784027 837784048
837784053 837784070
837784180 837784197
837784198 837784215
837784247 837784264
837784657 837784674
837784912 837784929
837785080 837785098
837785096 837785113
837785125 837785142
837785175 837785192
837785199 837785216
837785293 837785312
837785358 837785377
837785376 837785393
837785436 837785453
837785467 837785484
837785473 837785490
837790661 837790678
837790854 837790871
837791071 837791088
837791083 837791100
837791120 837791137
837791143 837791160
837791229 837791246
837791270 837791287
837791290 837791307
837791345 837791362
837791363 837791380
837791565 837791582
837791613 837791630
837791631 837791648
837791704 837791721
837791749 837791766
837791789 837791806
837791794 837791811
837791813 837791830
837791933 837791950
837792020 837792037
837792031 837792048
837792045 837792062
837792177 837792194
837792412 837792429
837793174 837793191
837793252 837793269
837793268 837793285
837793512 837793529
837793575 837793593
837794278 837794298
837794319 837794336
837794394 837794411
837795623 837795642
837795759 837795776
837795815 837795832
837795858 837795876
837795871 837795888
837795880 837795897
837796070 837796087
837796640 837796657
837796664 837796681
837796680 837796697
837796788 837796805
837797498 837797515
837797644 837797661
837797728 837797745
837797735 837797752
837797789 837797806
837797801 837797818
837797832 837797849
837797932 837797949
837798430 837798447
837799142 837799159
837799473 837799490
837799791 837799808
837800317 837800334
837800400 837800417
837800751 837800768
837800900 837800918
837803731 837803748
837804480 837804497
837804554 837804571
837805742 837805759
837805875 837805892
837806082 837806099
837806182 837806201
837806322 837806339
837806332 837806349
837806994 837807011
837807029 837807046
837807267 837807284
837807775 837807792
837807791 837807808
837807867 837807884
837807899 837807916
837807937 837807954
837807961 837807978
837807969 837807986
837808007 837808024
837808945 837808962
837809227 837809244
837809258 837809275
837809371 837809388
837809411 837809428
837809463 837809480
837810086 837810103
837811965 837811982
837812190 837812207
837812306 837812323
837812718 837812735
837812725 837812742
837812813 837812830
837813024 837813041
837813053 837813070
837813118 837813135
837813393 837813410
837813445 837813463
837813667 837813684
837813771 837813788
837813787 837813804
837813803 837813820
837814056 837814073
837814178 837814195
837814191 837814208
837814198 837814215
837814204 837814223
837816796 837816813
837816807 837816824
837817436 837817454
837819156 837819173
837819482 837819499
837820193 837820210
837822229 837822246
837822628 837822645
837823861 837823878
837824778 837824795
837824801 837824819
837824901 837824918
837825001 837825018
837825044 837825061
837825064 837825081
837825121 837825138
837825132 837825149
837825145 837825164
837825186 837825203
837826365 837826382
837826421 837826438
837826501 837826518
837826649 837826666
837826938 837826955
837827324 837827341
837827641 837827658
837827645 837827662
837827973 837827990
837827994 837828011
837828269 837828286
837828274 837828291
837828326 837828343
837828355 837828372
837828459 837828476
837828485 837828502
837828506 837828523
837828570 837828587
837828761 837828778
837828807 837828824
837828862 837828879
837828870 837828887
837828996 837829013
837829014 837829031
837829029 837829046
837829070 837829087
837829088 837829107
837829097 837829114
837829121 837829139
837829130 837829147
837829151 837829169
837829200 837829217
837829210 837829229
837829221 837829238
837829432 837829449
837829651 837829668
837829717 837829735
837829808 837829825
837829818 837829835
837829828 837829845
837830165 837830182
837830177 837830194
837830635 837830654
837830649 837830666
837830729 837830746
837830742 837830759
837830783 837830800
837830795 837830812
837830801 837830818
837831205 837831222
837831514 837831531
837831585 837831602
837831718 837831735
837831758 837831775
837831807 837831824
837832165 837832182
837837129 837837146
837838110 837838127
837838332 837838349
837846980 837846997
837942868 837942885
837988043 837988060
838039024 838039041
838091077 838091094
838414582 838414599
838425408 838425425
838429982 838429999
838496286 838496303
838498671 838498688
838503348 838503365
838512737 838512754
838523316 838523333
838566366 838566383
838568606 838568623
838569188 838569205
838583309 838583326
838595830 838595847
838595837 838595854
838595961 838595978
838606214 838606231
838606517 838606534
838606790 838606807
838607082 838607099
838607096 838607113
838607175 838607192
838607278 838607295
838607300 838607317
838607503 838607520
838607676 838607693
838607769 838607786
838608369 838608386
838608466 838608483
838609096 838609113
838609414 838609431
838613449 838613466
838615506 838615523
838616047 838616064
838616083 838616100
838616130 838616147
838616179 838616196
838616709 838616726
838616904 838616921
838617728 838617745
838620278 838620295
838620316 838620333
838620502 838620519
838621769 838621786
838621907 838621924
838621929 838621946
838623261 838623278
838623335 838623352
838623432 838623449
838624447 838624464
838626133 838626150
838626329 838626346
838626500 838626517
838626597 838626614
838628027 838628044
838628219 838628236
838629252 838629269
838629307 838629324
838646768 838646785
838661640 838661657
838665697 838665714
838665825 838665842
838665886 838665903
838665936 838665953
838665992 838666009
838666057 838666075
838666088 838666105
838666160 838666177
838666201 838666218
838666253 838666270
838666487 838666504
838666547 838666564
838667244 838667261
838667289 838667306
838671547 838671564
838671667 838671684
838672255 838672272
838672402 838672419
838673331 838673348
838673367 838673384
838673858 838673875
838674133 838674150
838674148 838674165
838674169 838674186
838674178 838674195
838674185 838674202
838674221 838674238
838678676 838678693
838684266 838684283
838687663 838687680
838701423 838701440
838701479 838701496
838704729 838704746
838704736 838704753
838705378 838705395
838705515 838705532
838705771 838705788
838706375 838706392
838707376 838707393
838707718 838707735
838707948 838707965
838708834 838708851
838708992 838709009
838709339 838709356
838709379 838709396
838709858 838709875
838709982 838709999
838710001 838710018
838710079 838710096
838710115 838710132
838710276 838710293
838710361 838710378
838710419 838710436
838710772 838710789
838710789 838710806
838710813 838710830
838710828 838710845
838710886 838710903
838710907 838710924
838710919 838710939
838710940 838710957
838710953 838710970
838711019 838711039
838711036 838711053
838711122 838711140
838711149 838711166
838711160 838711177
838711236 838711253
838711585 838711602
838711701 838711718
838711820 838711837
838712026 838712043
838712032 838712049
838712048 838712065
838712094 838712111
838712209 838712226
838712227 838712244
838712956 838712974
838712982 838712999
838713012 838713029
838714794 838714811
838714817 838714835
838714834 838714851
838714873 838714890
838714890 838714907
838714936 838714953
838715288 838715305
838718479 838718496
838718526 838718543
838742049 838742066
838742092 838742110
838749407 838749424
838755081 838755098
838756503 838756520
838760211 838760228
838789819 838789836
838797122 838797139
838801328 838801348
838801342 838801359
838811074 838811091
838832572 838832589
838907481 838907498
838927446 838927463
838944568 838944585
838944866 838944883
838945096 838945113
838951628 838951645
838964313 838964330
838966557 838966574
838968014 838968031
838968198 838968215
838968251 838968268
838968514 838968531
838970373 838970390
839057373 839057390
839057443 839057460
839057546 839057563
839057710 839057727
839059175 839059192
839060722 839060739
839060792 839060809
839060841 839060858
839060926 839060943
839060932 839060952
839060980 839060997
839060999 839061016
839061015 839061032
839061030 839061047
839061070 839061087
839061077 839061094
839061114 839061131
839061258 839061275
839061275 839061292
839061342 839061359
839061733 839061750
839061926 839061943
839062413 839062430
839062609 839062626
839062732 839062749
839062949 839062966
839062993 839063010
839063119 839063136
839063553 839063570
839063608 839063625
839063864 839063881
839064156 839064173
839066273 839066290
839066309 839066326
839066389 839066406
839067457 839067474
839068235 839068253
839068439 839068456
839068791 839068808
839068798 839068815
839068816 839068833
839070134 839070151
839070790 839070807
839082799 839082816
839082872 839082889
839082892 839082909
839083102 839083119
839083124 839083141
839083187 839083204
839083218 839083235
839083231 839083248
839083406 839083423
839106952 839106969
839120981 839120998
839121321 839121339
839121362 839121379
839174873 839174890
839219850 839219867
839246255 839246272
839250220 839250237
839250394 839250411
839250724 839250742
839250730 839250747
839250762 839250779
839250805 839250822
839250831 839250848
839250837 839250854
839250866 839250883
839250888 839250905
839250947 839250964
839250990 839251007
839251007 839251026
839251025 839251042
839251059 839251077
839251077 839251094
839251163 839251180
839251221 839251238
839251242 839251262
839251269 839251287
839251290 839251307
839251299 839251318
839252017 839252034
839252076 839252093
839252083 839252100
839252167 839252184
839252179 839252197
839252225 839252242
839252310 839252327
839252578 839252595
839252609 839252626
839252668 839252685
839252790 839252807
839252897 839252914
839252997 839253014
839253530 839253547
839253594 839253611
839253653 839253670
839253680 839253697
839253807 839253824
839253823 839253842
839253871 839253888
839253928 839253945
839253933 839253950
839253937 839253954
839253984 839254001
839253992 839254009
839254291 839254308
839254307 839254324
839254461 839254478
839262883 839262901
839262894 839262911
839263301 839263318
839263349 839263366
839283745 839283762
839287260 839287277
839296045 839296062
839296293 839296310
839296386 839296403
839296741 839296758
839301503 839301520
839301552 839301569
839302240 839302257
839302365 839302382
839302449 839302466
839302544 839302561
839302693 839302710
839302766 839302783
839302857 839302874
839302868 839302885
839302905 839302922
839302994 839303012
839303008 839303025
839303027 839303044
839303116 839303133
839303174 839303191
839303219 839303236
839303240 839303257
839303300 839303317
839303359 839303376
839303399 839303416
839303413 839303430
839303945 839303962
839304171 839304188
839307425 839307442
839323473 839323490
839323511 839323528
839323585 839323602
839323974 839323991
839324104 839324121
839324141 839324158
839324244 839324261
839324369 839324386
839349228 839349245
839349946 839349964
839357463 839357480
839357506 839357523
839358371 839358388
839358851 839358868
839358961 839358978
839358971 839358988
839359096 839359113
839359118 839359135
839359122 839359139
839359205 839359222
839359269 839359286
839359708 839359725
839360062 839360079
839360380 839360397
839360399 839360416
839360504 839360521
839360552 839360569
839360589 839360606
839360711 839360728
839432590 839432607
839432629 839432646
839443916 839443933
839596834 839596851
839629310 839629328
839643755 839643772
839644888 839644905
839644895 839644912
839656239 839656256
839656313 839656330
839658214 839658231
839658720 839658737
839659306 839659323
839659429 839659446
839662376 839662393
839673162 839673179
839687173 839687190
839689640 839689657
839859783 839859800
839877781 839877798
839953737 839953754
840130836 840130853
840222288 840222305
840249460 840249477
840249536 840249553
840249542 840249559
840249667 840249684
840249676 840249693
840249714 840249731
840249736 840249753
840249842 840249859
840249847 840249864
840249881 840249898
840249992 840250009
840250023 840250040
840250598 840250615
840251811 840251828
840251854 840251871
840252041 840252058
840253228 840253246
840253243 840253261
840255137 840255154
840255167 840255184
840256159 840256176
840256235 840256253
840257930 840257947
840260569 840260586
840269132 840269149
840272156 840272173
840273729 840273746
840273826 840273843
840284356 840284373
840285726 840285743
840285942 840285959
840287153 840287170
840314626 840314643
840316266 840316283
840316285 840316302
840316291 840316308
840316418 840316435
840316422 840316439
840316438 840316455
840316442 840316459
840316456 840316473
840316468 840316485
840316482 840316499
840316487 840316504
840316649 840316666
840320324 840320341
840320381 840320398
840320572 840320589
840321596 840321613
840326707 840326724
840327034 840327052
840329441 840329458
840352573 840352590
840353047 840353064
840353084 840353101
840353283 840353300
840353345 840353362
840353362 840353379
840353658 840353675
840353990 840354007
840354019 840354036
840354040 840354057
840358270 840358287
840361532 840361549
840362997 840363014
840363079 840363096
840363180 840363197
840365875 840365893
840365899 840365916
840366182 840366199
840366291 840366308
840366359 840366376
840366400 840366417
840368169 840368186
840368207 840368224
840368485 840368502
840368557 840368574
840369268 840369285
840369273 840369290
840369480 840369497
840370199 840370216
840370304 840370321
840375236 840375253
840382034 840382051
840382129 840382146
840382548 840382565
840383701 840383718
840384025 840384042
840384166 840384183
840384193 840384210
840384581 840384598
840385169 840385186
840385375 840385392
840385573 840385590
840385583 840385601
840385596 840385613
840385618 840385635
840385636 840385653
840389859 840389876
840390586 840390603
840410012 840410029
840420467 840420484
840420489 840420506
840421528 840421545
840422763 840422780
840427824 840427841
840429617 840429634
840436438 840436455
840437164 840437181
840506742 840506759
840518749 840518766
840519149 840519166
840520323 840520340
840520327 840520344
840522241 840522258
840522284 840522301
840523256 840523273
840527138 840527155
840527563 840527580
840527800 840527820
840527808 840527825
840527819 840527836
840527900 840527917
840528098 840528115
840528123 840528140
840530705 840530722
840532817 840532834
840532908 840532925
840532920 840532937
840533303 840533320
840533334 840533351
840533406 840533423
840533458 840533475
840533573 840533590
840533834 840533851
840533948 840533965
840534203 840534220
840534868 840534885
840535056 840535073
840535470 840535487
840539556 840539573
840539659 840539676
840540093 840540110
840540207 840540224
840540237 840540254
840540728 840540745
840540861 840540878
840542096 840542113
840542708 840542725
840645740 840645757
840645761 840645778
840645773 840645791
840646128 840646145
840646535 840646552
840646927 840646944
840646948 840646965
840646955 840646972
840646968 840646985
840646975 840646992
840647045 840647062
840647056 840647073
840647151 840647168
840647215 840647232
840648040 840648057
840648056 840648073
840648083 840648100
840648103 840648123
840851102 840851119
840855362 840855379
840855954 840855971
840857744 840857761
840860702 840860719
840860796 840860813
840860806 840860823
840860811 840860828
840860823 840860840
840860976 840860993
840863501 840863518
840865415 840865432
840871667 840871684
840871962 840871979
840872116 840872133
840882519 840882536
840956691 840956708
840975564 840975581
841002102 841002119
841003441 841003458
841005058 841005075
841010018 841010035
841031636 841031653
841042958 841042975
841054952 841054969
841056096 841056113
841060767 841060784
841060870 841060887
841060887 841060904
841060901 841060918
841060905 841060922
841082471 841082488
841082486 841082503
841084079 841084096
841084284 841084301
841101663 841101680
841128932 841128949
841133336 841133353
841151565 841151582
841152670 841152687
841163084 841163101
841163174 841163191
841169459 841169476
841580195 841580212
841681484 841681501
841705491 841705509
841827852 841827869
841827856 841827873
841856583 841856600
841856600 841856617
841856626 841856643
841856667 841856684
841856683 841856700
841856703 841856720
841869319 841869336
842028008 842028025
842139087 842139104
842140588 842140605
842236247 842236264
842295376 842295393
842300567 842300586
842463930 842463948
842463946 842463963
842533735 842533752
842923536 842923553
842923579 842923596
842924876 842924893
842986093 842986110
843408675 843408692
843417569 843417586
843425534 843425551
843493743 843493760
843496375 843496392
843720068 843720085
843737464 843737481
843757111 843757128
843950197 843950214
844017746 844017763
844095874 844095891
844095878 844095896
844096630 844096648
844096683 844096700
844096701 844096718
844103680 844103697
844103688 844103705
844103706 844103723
844103715 844103732
844103732 844103749
844112170 844112187
844112184 844112201
844122032 844122049
844210443 844210460
844445683 844445700
844446526 844446543
844450665 844450682
844457484 844457501
844457489 844457506
844618508 844618525
844620592 844620609
844759159 844759176
844818767 844818785
844860411 844860428
844863484 844863501
844878828 844878845
844880681 844880698
844897176 844897193
844897395 844897412
844903974 844903991
844904008 844904025
844904012 844904029
844904350 844904367
844904422 844904442
844904434 844904451
844904445 844904462
844904460 844904477
844904475 844904492
844904494 844904511
844904504 844904521
844904509 844904526
844904532 844904549
844904548 844904565
844904574 844904591
844904586 844904607
844904604 844904621
844904642 844904659
844904698 844904715
844904753 844904770
844905013 844905030
844905039 844905056
844905103 844905120
844905151 844905168
844905301 844905318
844905413 844905430
844920625 844920642
844945203 844945220
844957560 844957577
844958003 844958020
845006442 845006459
845019492 845019509
845185826 845185843
845204032 845204049
845221782 845221803
845234740 845234757
845235290 845235307
845236916 845236933
845657696 845657713
846003508 846003525
846005979 846005996
846082306 846082323
846082312 846082329
846082454 846082471
846262084 846262101
846262105 846262122
846262897 846262915
846262908 846262925
846277219 846277236
846278035 846278052
846278272 846278289
846281268 846281285
846333007 846333024
846377652 846377669
846381879 846381896
846383743 846383760
846388390 846388407
846601741 846601758
846601802 846601820
846601861 846601878
846602219 846602236
846602232 846602249
846605021 846605038
846606114 846606131
846607431 846607448
846607450 846607467
846607469 846607486
846607526 846607543
846607599 846607616
846607620 846607637
846608270 846608287
846608472 846608489
846610202 846610219
846610293 846610310
846612189 846612206
846612201 846612218
846612446 846612463
846613621 846613639
846618205 846618222
846618271 846618288
846675242 846675259
846691512 846691529
846851355 846851372
846851360 846851378
846854942 846854959
846854969 846854986
846855196 846855213
846860339 846860356
846861860 846861877
846861864 846861881
846861891 846861908
847097955 847097972
847101621 847101638
847101681 847101698
847102203 847102220
847105572 847105589
847111229 847111246
847111257 847111274
847114051 847114068
847114857 847114874
847114894 847114911
847114948 847114965
847115238 847115255
847115513 847115530
847115520 847115537
847115547 847115564
847115585 847115602
847115678 847115695
847115693 847115710
847116184 847116201
847116398 847116415
847116671 847116688
847119680 847119698
847119701 847119718
847119898 847119915
847119915 847119932
847119934 847119951
847119992 847120009
847123565 847123582
847123579 847123596
847123596 847123613
847128571 847128588
847128619 847128636
847129241 847129258
847129321 847129338
847129694 847129711
847206735 847206752
847206794 847206811
847206827 847206844
847208025 847208044
847208237 847208254
847208338 847208355
847209023 847209040
847209049 847209066
847209084 847209101
847221743 847221760
847221766 847221783
847223828 847223846
847223839 847223856
847223860 847223877
847266923 847266940
847267825 847267842
847268483 847268500
847268637 847268654
847268741 847268758
847268785 847268805
847269761 847269778
847269771 847269788
847275754 847275771
847277087 847277104
847277115 847277132
847277757 847277774
847277954 847277971
847277967 847277984
847278593 847278610
847287702 847287719
847287726 847287743
847287857 847287874
847287940 847287957
847287976 847287993
847288182 847288199
847288194 847288211
847288237 847288254
847288260 847288277
847288339 847288356
847288474 847288491
847314988 847315005
847315735 847315752
847317796 847317813
847318230 847318247
847319567 847319584
847319582 847319599
847323561 847323578
847323696 847323713
847329300 847329317
847329316 847329333
847330216 847330233
847330270 847330287
847330533 847330550
847330537 847330554
847330580 847330597
847371370 847371387
847371708 847371725
847371746 847371763
847371917 847371934
847377848 847377865
847428129 847428147
847486168 847486185
847486294 847486311
847491621 847491638
847491669 847491686
847492280 847492297
847492451 847492468
847492478 847492495
847492756 847492773
847518877 847518894
847528993 847529010
847529106 847529123
847529123 847529140
847529931 847529948
847534214 847534231
847534283 847534300
847535579 847535596
847538070 847538087
847538148 847538165
847538373 847538390
847538787 847538804
847543748 847543765
847543761 847543778
847543859 847543876
847545631 847545648
847546856 847546873
847547292 847547309
