849592624 849592641
855494023 855494040
856787864 856787881
856906243 856906260
856906271 856906288
856906283 856906300
856906330 856906348
856906488 856906505
856906497 856906518
856906505 856906522
856906531 856906548
856906535 856906552
861480632 861480650
861499730 861499747
861502377 861502394
861505200 861505217
861507709 861507726
861508155 861508172
861510900 861510917
861513486 861513503
861515995 861516012
861518413 861518430
861518435 861518452
861520945 861520962
861525685 861525702
861527916 861527933
861530079 861530096
861530293 861530310
861531077 861531094
861532088 861532105
861532198 861532215
861532260 861532277
861532283 861532300
861534524 861534541
861535706 861535723
861536706 861536723
861545151 861545168
861557161 861557178
861563805 861563822
861564037 861564054
861564634 861564651
861564843 861564860
861565218 861565235
861571192 861571209
861571250 861571267
861571292 861571309
861571450 861571467
861576474 861576491
861576570 861576587
861576644 861576661
861576785 861576802
861578160 861578177
861579270 861579287
861580102 861580119
861580822 861580839
861581218 861581235
861581693 861581710
861581877 861581894
861582133 861582150
861582407 861582424
861583233 861583250
861583300 861583317
861583372 861583389
861583637 861583654
861583663 861583680
861584036 861584053
861584220 861584237
861584234 861584251
861584545 861584562
861585437 861585454
861585654 861585671
861585677 861585694
861585786 861585803
861586531 861586548
861587828 861587845
861588484 861588501
861589103 861589120
861589153 861589170
861589231 861589248
861589354 861589371
861589647 861589664
861590719 861590736
861591250 861591267
861591611 861591628
861591664 861591681
861591754 861591771
861592025 861592042
861592085 861592102
861592180 861592197
861592611 861592628
861593090 861593107
861593154 861593171
861593158 861593175
861593531 861593548
861593581 861593598
861595819 861595837
861595826 861595843
861595866 861595883
861596033 861596050
861596080 861596097
861596167 861596184
861596384 861596401
861596452 861596469
861596577 861596594
861596669 861596686
861596866 861596883
861596905 861596922
861596936 861596953
861597414 861597431
861597455 861597472
861597923 861597940
861598125 861598142
861598172 861598189
861598246 861598263
861598493 861598510
861598836 861598854
861601824 861601841
861601882 861601899
861602146 861602164
861602263 861602280
861602392 861602409
861602883 861602900
861603030 861603047
861603141 861603158
861604067 861604084
861604330 861604347
861604352 861604369
861605223 861605240
861606831 861606848
861607756 861607773
861609408 861609425
861611909 861611926
861614476 861614493
861617021 861617038
861617044 861617061
861622053 861622070
861624450 861624467
861626908 861626925
861626930 861626947
861629508 861629525
861632461 861632478
861639968 861639985
861640726 861640743
861641487 861641504
861643046 861643063
861651953 861651970
861659464 861659481
861662719 861662736
861664962 861664979
861665191 861665208
861666186 861666203
861667397 861667414
861670414 861670431
861670436 861670453
861670642 861670659
861672579 861672596
861672866 861672883
861675069 861675086
861677459 861677476
861681794 861681811
861683930 861683947
861686327 861686344
861688521 861688538
861690903 861690920
861695375 861695392
861697607 861697624
861700128 861700145
861702250 861702267
861704383 861704400
861706517 861706534
861708699 861708716
861710922 861710939
861713152 861713169
861715298 861715315
861717449 861717466
861728274 861728291
861730425 861730442
861730448 861730465
861732996 861733013
861735314 861735331
861735336 861735353
861737933 861737950
861740600 861740617
861755620 861755637
861755644 861755661
861758536 861758553
861760928 861760945
861763437 861763454
861765619 861765636
861767801 861767818
861769973 861769990
861772048 861772065
861774162 861774179
861782882 861782899
861784857 861784874
861787041 861787058
861789431 861789448
861791781 861791798
861794212 861794229
861796512 861796529
861798695 861798712
861800700 861800717
861802921 861802938
861805421 861805438
861811384 861811401
861811406 861811423
861846292 861846309
861849363 861849380
861851783 861851800
861854280 861854297
861856454 861856471
861858568 861858585
861860759 861860776
861862913 861862930
861869580 861869597
861871969 861871986
861874162 861874179
861876561 861876578
861879012 861879029
861881184 861881201
861883248 861883265
861885422 861885439
861893026 861893043
861900339 861900356
861935211 861935228
861938500 861938517
861940998 861941015
861943536 861943553
861945928 861945945
861948434 861948451
861950608 861950625
861964010 861964027
861966192 861966209
861968318 861968335
861977647 861977664
861977671 861977688
861980293 861980315
861997200 861997217
862040673 862040690
862042836 862042853
862045059 862045076
862047252 862047269
862049403 862049420
862051625 862051642
862053770 862053787
862055883 862055900
862058115 862058132
862060308 862060325
862062807 862062824
