815214724 815214734
815216361 815216371
815221322 815221332
815230096 815230106
815239963 815239973
815247173 815247183
815266833 815266843
815299881 815299891
815303650 815303660
815304772 815304782
815306499 815306509
815307318 815307328
815308055 815308065
815313359 815313369
815332258 815332268
815370559 815370569
815378726 815378736
815394318 815394328
815404256 815404266
815420674 815420684
815422269 815422279
815426784 815426794
815447681 815447691
815450682 815450692
815456710 815456720
815458696 815458706
815470981 815470991
815571782 815571792
815620222 815620232
815626125 815626135
815635964 815635974
815658149 815658159
815661975 815661985
815663174 815663184
815686855 815686865
815700492 815700497
815766679 815766689
815788979 815788989
815791352 815791362
815959624 815959634
815988454 815988464
816037629 816037639
816040192 816040202
816185389 816185399
816195489 816195499
816211270 816211280
816379700 816379710
816439308 816439318
816471759 816471769
816500119 816500129
816526761 816526771
816623405 816623415
816630939 816630949
816638321 816638331
816807230 816807240
816814454 816814464
816818422 816818432
816897936 816897946
816969484 816969494
816971439 816971447
816988824 816988834
817031548 817031550
817224734 817224744
817232016 817232026
817243378 817243388
817340746 817340756
817347043 817347052
817423379 817423389
817442425 817442435
817488880 817488890
817504505 817504515
817508382 817508392
817565074 817565084
817596508 817596518
817662186 817662196
817707679 817707689
817781833 817781843
817821604 817821614
817824896 817824906
817852405 817852415
818012229 818012239
818034369 818034379
818059310 818059320
818068479 818068489
818077206 818077216
818112850 818112860
818160990 818161000
818172888 818172898
818182097 818182107
818343218 818343228
818345486 818345496
818346860 818346870
818352306 818352316
818457159 818457169
818460132 818460142
818479717 818479727
818564841 818564851
818569767 818569777
818635041 818635051
818645251 818645261
818677642 818677652
818734873 818734883
818793860 818793870
818831844 818831854
818878582 818878592
818971207 818971217
819028063 819028073
819057925 819057935
819093865 819093875
819144596 819144606
819204099 819204109
819211307 819211317
819229176 819229186
819269472 819269478
819295099 819295109
819308255 819308265
819317124 819317134
819325383 819325393
819347997 819348007
819401371 819401381
819409233 819409243
819604149 819604159
819656599 819656609
819697638 819697648
819790038 819790048
819825398 819825408
819881056 819881066
819887406 819887416
819974516 819974519
820002946 820002956
820062996 820063006
820087097 820087106
820108790 820108800
820115180 820115190
820175721 820175731
820196398 820196408
820210670 820210680
820218664 820218674
820275920 820275930
820321223 820321233
820327240 820327244
820364690 820364700
820372190 820372200
820399021 820399031
820430006 820430016
820450984 820450994
820523865 820523875
820539400 820539410
820544851 820544861
820554546 820554556
820626521 820626528
820636308 820636318
820752478 820752488
820756082 820756092
820805064 820805074
820873230 820873240
820879075 820879085
820944215 820944225
820966570 820966580
820986530 820986540
820988895 820988905
820991056 820991066
820998814 820998824
821056352 821056362
821070979 821070989
821104016 821104026
821107511 821107521
821222760 821222770
821287438 821287448
821477456 821477466
821480163 821480173
821496305 821496315
821513386 821513396
821583880 821583890
821592289 821592299
821612961 821612971
821663989 821663999
821681687 821681697
821718674 821718684
821721140 821721150
821725813 821725823
821756534 821756544
821783054 821783064
821824747 821824757
821831894 821831904
821834447 821834457
821872841 821872851
821990693 821990703
822012112 822012122
822032181 822032190
822085228 822085238
822090605 822090615
822094561 822094571
822175198 822175208
822177498 822177508
822182955 822182965
822185023 822185031
822205518 822205528
822208678 822208688
822220323 822220333
822282903 822282913
822290441 822290451
822327729 822327739
822357775 822357785
822375854 822375864
822385946 822385956
822386569 822386579
822413347 822413357
822417168 822417178
822424805 822424815
822427373 822427383
822427887 822427897
822477525 822477535
822481803 822481813
822484394 822484404
822487890 822487900
822493157 822493167
822494682 822494692
822497801 822497811
822511764 822511774
822527297 822527307
822535329 822535339
822554224 822554234
822576570 822576580
822578845 822578855
822579986 822579996
822584064 822584074
822605238 822605248
822610245 822610255
822632860 822632870
822636078 822636088
822638556 822638566
822651042 822651052
822654132 822654142
822664725 822664735
822666864 822666874
822668402 822668412
822714389 822714399
822725827 822725837
822732740 822732750
822734962 822734972
822737933 822737943
822804948 822804958
822806421 822806431
822814731 822814741
822828772 822828782
822850859 822850869
822853304 822853314
822859378 822859388
822862270 822862280
822873328 822873338
822915015 822915025
822920414 822920424
822944162 822944172
822947097 822947107
822966521 822966531
822967882 822967892
822973528 822973538
822985593 822985603
822994797 822994807
823012353 823012363
823029638 823029648
823032428 823032438
823078019 823078029
823086301 823086311
823089361 823089371
823093269 823093279
823101993 823102003
823104567 823104577
823161931 823161941
823200124 823200134
823223153 823223163
823240818 823240828
823255750 823255752
823267745 823267755
823280233 823280243
823336863 823336873
823351250 823351260
823355482 823355492
823423475 823423485
824211934 824211944
824214433 824214443
824217438 824217448
824390239 824390249
824397919 824397929
824409170 824409180
824411909 824411919
824494669 824494679
824501190 824501200
824596591 824596601
824618467 824618477
824631438 824631448
824671452 824671462
824674549 824674559
824676257 824676267
824683003 824683013
824686576 824686586
824694248 824694258
824720659 824720669
824778052 824778062
824807218 824807228
824825546 824825556
824833098 824833108
824837895 824837905
824842051 824842061
824846454 824846464
824855338 824855348
824858237 824858247
824932270 824932280
824937550 824937560
824996770 824996780
825014698 825014708
825089291 825089301
825093205 825093215
825097921 825097931
825105158 825105168
825109977 825109987
825114624 825114634
825119841 825119851
825150262 825150272
825208397 825208407
825240631 825240641
825246097 825246107
825257879 825257882
825262602 825262612
825268941 825268951
825282234 825282244
825299836 825299846
825319579 825319589
825331338 825331348
825348989 825348999
825378359 825378369
825428901 825428911
825448421 825448431
825482227 825482237
825528746 825528756
825546427 825546437
825579037 825579047
825605395 825605405
825615177 825615187
825697370 825697380
825702877 825702887
825711341 825711351
825748942 825748952
825781371 825781381
825822812 825822822
825841435 825841445
825873736 825873746
825880408 825880418
825889610 825889620
825891802 825891812
825898703 825898713
825910187 825910197
825944814 825944824
825956740 825956750
825960995 825961005
825962162 825962172
825965879 825965889
825975586 825975596
826014459 826014469
826017170 826017180
826062497 826062507
826075044 826075054
826078988 826078998
826083639 826083649
826092497 826092507
826111611 826111621
826127318 826127328
826135509 826135519
826169180 826169190
826172383 826172393
826182037 826182047
826194464 826194474
826229384 826229394
826237073 826237083
826260141 826260151
826264998 826265008
826275619 826275629
826316358 826316368
826319440 826319450
826326917 826326927
826339636 826339646
826341462 826341472
826347022 826347032
826355827 826355837
826368307 826368317
826387694 826387704
826439470 826439480
826468347 826468357
826478622 826478632
826489472 826489478
826497016 826497026
826507291 826507301
826554049 826554059
826564581 826564591
826569536 826569546
826573755 826573765
826580409 826580419
826582962 826582972
826602668 826602678
826626621 826626631
826640993 826641003
826642210 826642220
826643623 826643633
826658328 826658338
826660951 826660961
826667403 826667413
826700229 826700239
826709208 826709218
826717539 826717549
826718282 826718292
826724397 826724407
826730509 826730519
826744902 826744912
826801539 826801549
826804225 826804235
826829303 826829313
826920650 826920660
826923698 826923708
826992788 826992789
827017507 827017517
827031817 827031827
827041448 827041458
827082779 827082789
827092997 827093007
827101429 827101439
827104836 827104846
827115568 827115578
827156398 827156408
827162999 827163009
827189394 827189404
827247745 827247755
827250129 827250139
827255689 827255699
827267782 827267792
827274974 827274984
827291875 827291885
827352954 827352964
827364344 827364354
827370464 827370474
827373597 827373607
827378588 827378598
827385444 827385454
827462039 827462049
827465091 827465101
827466460 827466470
827503841 827503851
827513321 827513331
827517923 827517933
827528710 827528720
827536991 827536996
827588637 827588647
827618490 827618500
827619653 827619663
827687651 827687661
827696516 827696526
827698202 827698212
827706854 827706864
827771563 827771573
827784117 827784127
827786474 827786475
827791533 827791543
827793105 827793115
827794762 827794772
827817738 827817748
827849490 827849500
827868897 827868907
827876383 827876393
827882116 827882126
827921739 827921749
827945825 827945835
827971452 827971462
827980699 827980709
828038105 828038115
828041321 828041331
828112517 828112527
828118068 828118078
828128137 828128141
828138374 828138384
828156341 828156351
828158175 828158185
828167457 828167467
828170894 828170904
828178617 828178627
828182108 828182118
828185938 828185948
828186817 828186827
828190766 828190776
828191797 828191807
828224990 828225000
828233678 828233688
828265890 828265900
828282088 828282098
828292007 828292017
828307040 828307050
828313719 828313729
828345061 828345071
828347391 828347401
828361838 828361848
828380440 828380450
828382834 828382844
828384916 828384919
828388259 828388269
828425623 828425633
828434502 828434512
828457819 828457821
828486849 828486856
828503416 828503424
828527901 828527911
828555153 828555163
828571424 828571434
828585144 828585154
828588545 828588555
828591284 828591294
828622923 828622933
828712758 828712768
828758444 828758454
828798853 828798863
828893926 828893936
828910547 828910557
828968221 828968231
828985268 828985278
828987210 828987220
828994348 828994358
829066443 829066453
829071246 829071256
829076395 829076405
829083907 829083912
829187852 829187862
829204543 829204553
829224008 829224018
829248322 829248328
829259515 829259525
829331021 829331030
829333749 829333759
829335964 829335974
829349135 829349145
829363323 829363333
829601378 829601388
829607456 829607466
829611189 829611199
829653744 829653754
829669550 829669560
829701809 829701819
829705038 829705048
829705957 829705967
829707308 829707318
829709007 829709017
829726205 829726215
829744756 829744766
829782911 829782921
829886966 829886976
829928594 829928604
829936033 829936043
829937788 829937798
829942120 829942130
829956069 829956079
829981965 829981968
830037554 830037563
830044419 830044427
830057198 830057208
830058141 830058151
830063023 830063033
830096736 830096743
830113126 830113136
830116578 830116585
830124677 830124687
830144010 830144020
830191966 830191976
830194150 830194160
830200514 830200520
830204578 830204588
830210479 830210489
830273062 830273072
830280103 830280113
830294053 830294063
830324467 830324477
830334782 830334792
830360275 830360285
830361094 830361104
830365577 830365587
830387263 830387273
830393867 830393877
830434130 830434140
830437193 830437203
830440477 830440487
830450757 830450767
830460612 830460615
830534935 830534945
830542537 830542547
830545230 830545240
830547546 830547556
830548456 830548466
830551567 830551577
830574535 830574545
830575976 830575986
830602710 830602720
830612779 830612789
830617340 830617350
830661991 830662001
830702283 830702293
830705944 830705954
830717484 830717494
830719763 830719773
830722079 830722089
830727299 830727304
830770966 830770976
830800845 830800855
830811436 830811442
830857509 830857519
830862340 830862350
830872559 830872569
830882783 830882793
830889188 830889198
830892707 830892715
830895295 830895305
830904864 830904867
830906552 830906558
830985446 830985449
830999184 830999194
831005208 831005218
831008358 831008368
831022696 831022701
831038952 831038962
831096930 831096935
831099665 831099675
831138618 831138628
831141202 831141212
831147061 831147065
831151219 831151229
831153009 831153019
831162245 831162255
831171526 831171536
831174742 831174752
831176192 831176202
831180537 831180547
831242143 831242148
831247139 831247149
831263358 831263368
831264574 831264580
831273256 831273266
831277174 831277184
831312272 831312282
831323506 831323516
831331579 831331589
831344023 831344033
831350983 831350993
831396077 831396087
831402036 831402046
831412648 831412658
831420177 831420187
831454726 831454734
831475523 831475533
831484032 831484042
831510544 831510553
831518645 831518655
831552812 831552822
831569547 831569557
831582607 831582613
831588777 831588787
831630992 831631002
831669175 831669185
831688943 831688953
831699388 831699398
831747215 831747225
831765197 831765202
831790839 831790849
831811963 831811973
831848904 831848914
831850432 831850442
831911438 831911448
831923478 831923488
831934034 831934044
831938830 831938840
831982725 831982734
832001411 832001421
832008896 832008903
832012677 832012687
832017714 832017724
832019054 832019064
832029212 832029222
832031801 832031811
832037637 832037647
832049751 832049761
832052295 832052305
832054190 832054200
832072748 832072758
832100857 832100867
832109371 832109381
832116466 832116476
832162413 832162423
832175553 832175563
832197074 832197084
832199764 832199774
832205703 832205713
832234830 832234840
832272010 832272020
832284911 832284921
832295736 832295746
832300412 832300422
832332013 832332023
832338069 832338079
832345377 832345387
832350229 832350239
832370381 832370391
832427155 832427165
832454596 832454606
832458528 832458538
832461995 832462005
832465135 832465145
832472661 832472671
832479847 832479857
832493918 832493928
832504100 832504110
832520437 832520447
832542553 832542563
832553349 832553359
832555479 832555489
832601918 832601928
832619098 832619108
832621013 832621023
832625486 832625496
832627543 832627553
832630416 832630426
832640526 832640536
832643525 832643535
832650622 832650624
832658070 832658080
832688374 832688384
832690163 832690173
832698912 832698922
832702380 832702390
832706557 832706567
832713993 832714003
832716681 832716691
832718874 832718884
832772774 832772784
832801953 832801963
832821932 832821942
832823325 832823335
832853030 832853040
832858421 832858431
832860498 832860508
832865493 832865503
832882970 832882980
832940002 832940012
832954152 832954162
833009963 833009973
833016164 833016174
833020521 833020531
833026174 833026184
833051354 833051364
833061546 833061556
833137594 833137604
833140806 833140816
833144688 833144698
833147261 833147271
833210651 833210661
833227319 833227329
833228442 833228452
833233720 833233730
833235206 833235216
833269401 833269411
833320140 833320150
833369501 833369511
833386764 833386774
833389829 833389839
833393806 833393816
833396793 833396803
833414787 833414797
833425440 833425450
833446728 833446738
833451124 833451134
833574154 833574164
833576872 833576875
833578457 833578467
833580699 833580709
833658797 833658807
833663496 833663506
833681857 833681867
833728665 833728675
833742346 833742356
833749178 833749188
833753188 833753198
833756532 833756542
833811837 833811847
833827217 833827227
833833869 833833879
833836613 833836623
833839547 833839557
833845566 833845576
833868603 833868613
833885536 833885546
833947560 833947570
833957672 833957682
833987321 833987331
834092001 834092011
834095637 834095643
834156415 834156425
834183082 834183092
834270537 834270547
834282049 834282059
834294400 834294410
834307681 834307691
834322702 834322712
834326404 834326414
834346945 834346955
834350570 834350580
834353300 834353310
834358415 834358425
834390155 834390165
834435521 834435531
834450495 834450505
834518376 834518386
834520136 834520146
834525350 834525360
834530065 834530075
834596640 834596650
834624435 834624445
834635061 834635071
834691107 834691117
834744431 834744441
834779953 834779963
834781891 834781901
834795915 834795925
834800216 834800226
834811533 834811543
834833068 834833078
834839922 834839932
834846562 834846572
834953260 834953270
834963568 834963578
835009404 835009414
835039729 835039739
835099652 835099662
835100812 835100822
835212355 835212365
835247118 835247128
835374893 835374903
835393152 835393162
835411646 835411656
835413056 835413066
835443440 835443450
835475781 835475791
835480047 835480057
835490030 835490040
835495856 835495866
835499625 835499635
835501731 835501741
835545172 835545182
835567479 835567489
835643703 835643713
835648024 835648034
835721843 835721853
835770748 835770758
835818139 835818149
835848135 835848145
835895146 835895156
835900484 835900494
835954337 835954347
836039531 836039541
836080683 836080693
836108883 836108893
836118815 836118825
836188657 836188667
836247767 836247777
836261526 836261536
836293099 836293109
836331640 836331650
836335206 836335216
836352734 836352744
836375217 836375227
836412529 836412539
836426852 836426862
836454234 836454244
836459677 836459687
836461555 836461565
836485067 836485077
836601982 836601992
836709938 836709948
836769083 836769093
836771127 836771137
836776351 836776361
836853268 836853278
836861774 836861784
836929015 836929025
836932107 836932117
836943512 836943522
837025894 837025904
837033731 837033741
837038078 837038088
837086130 837086140
837110238 837110248
837135037 837135047
837160808 837160818
837164698 837164708
837223686 837223696
837227383 837227393
837333087 837333097
837344620 837344630
837369541 837369551
837384580 837384590
837452440 837452450
837458181 837458191
837548044 837548054
837569255 837569265
837579801 837579811
837723744 837723754
837801650 837801660
837815478 837815488
837832665 837832675
837834787 837834797
837843256 837843266
837865950 837865960
837924302 837924312
838041814 838041824
838064563 838064573
838078964 838078974
838087180 838087190
838108417 838108427
838153978 838153988
838174523 838174533
838238568 838238578
838257950 838257960
838295014 838295024
838325702 838325712
838373684 838373694
838399510 838399520
838406360 838406370
838415429 838415439
838419177 838419187
838469772 838469782
838569430 838569440
838607541 838607551
838609843 838609853
838629607 838629617
838635765 838635775
838683802 838683812
838688372 838688382
838713248 838713258
838756503 838756513
838831629 838831639
838844159 838844169
838911825 838911835
839020527 839020537
839025069 839025079
839073625 839073635
839103139 839103149
839127734 839127744
839185870 839185880
839193196 839193206
839201772 839201782
839267109 839267119
839284951 839284961
839296853 839296863
839297708 839297718
839299272 839299282
839300113 839300123
839300938 839300939
839302208 839302218
839304200 839304210
839337935 839337945
839342231 839342241
839347363 839347373
839371046 839371056
839564696 839564706
839618642 839618652
839626496 839626506
839629590 839629600
839630684 839630694
839680436 839680446
839718671 839718681
839721969 839721979
839801318 839801328
839808213 839808223
839828563 839828573
839848813 839848823
839863871 839863881
839869618 839869628
839885317 839885327
839971605 839971615
839977652 839977662
840039687 840039697
840049266 840049276
840078666 840078676
840081686 840081696
840176709 840176719
840194155 840194165
840196467 840196477
840197536 840197546
840200732 840200742
840222285 840222295
840225001 840225011
840230215 840230225
840231607 840231617
840238328 840238338
840243993 840244003
840317215 840317225
840403589 840403599
840488405 840488415
840491995 840492005
840500893 840500903
840502629 840502639
840576648 840576658
840671287 840671297
840734648 840734658
840736821 840736831
840737673 840737683
840740749 840740759
840752611 840752621
840836516 840836526
840857937 840857947
840882787 840882797
840926214 840926224
840931141 840931151
840932653 840932663
840995753 840995763
841063344 841063354
841085933 841085943
841141940 841141950
841143892 841143902
841147834 841147844
841178607 841178617
841236732 841236742
841242298 841242308
841262340 841262350
841305683 841305693
841342886 841342896
841471832 841471842
841533336 841533346
841554520 841554530
841586002 841586012
841691466 841691476
841767472 841767482
841777391 841777401
841792448 841792458
841811472 841811482
841827855 841827865
841863905 841863915
841922195 841922205
842037034 842037044
842046991 842047001
842048455 842048465
842103819 842103829
842189735 842189745
842205440 842205450
842219608 842219618
842236244 842236254
842294329 842294339
842295377 842295387
842303966 842303976
842325888 842325898
842385175 842385185
842409271 842409281
842428668 842428678
842458192 842458202
842468461 842468471
842472485 842472495
842478522 842478532
842485350 842485360
842495240 842495250
842521630 842521640
842561778 842561788
842586534 842586544
842652957 842652967
842666992 842667002
842670971 842670981
842678803 842678813
842689186 842689196
842762972 842762982
842803541 842803551
842814223 842814233
842816612 842816622
842821917 842821927
842823606 842823616
842825875 842825885
842832925 842832935
842900146 842900156
842907856 842907866
842911005 842911015
842915640 842915650
842917216 842917226
842922615 842922625
842928264 842928274
842967531 842967541
842981156 842981166
842986089 842986099
842988987 842988997
842994525 842994535
842996041 842996051
842997988 842997998
842999790 842999800
843025608 843025618
843105379 843105389
843108852 843108862
843132714 843132724
843167734 843167744
843174993 843175003
843223880 843223890
843251636 843251646
843257749 843257759
843272262 843272272
843421650 843421660
843427999 843428009
843429143 843429153
843435859 843435869
843443218 843443228
843445275 843445285
843460455 843460465
843506094 843506104
843507437 843507447
843512814 843512824
843514497 843514507
843571113 843571123
843589994 843590004
843604913 843604923
843635621 843635631
843642853 843642863
843644521 843644531
843656422 843656432
843674427 843674437
843703585 843703595
843709092 843709102
843710897 843710907
843721519 843721529
843722252 843722262
843729370 843729380
843742077 843742087
843795780 843795790
843801522 843801532
843802752 843802762
843833299 843833309
843836178 843836188
843837436 843837446
843855611 843855621
843887071 843887081
843902031 843902041
843906347 843906357
843912285 843912295
843921448 843921458
843965911 843965921
844007063 844007073
844010701 844010711
844013649 844013659
844015212 844015222
844016024 844016034
844017723 844017733
844024642 844024652
844035229 844035239
844051575 844051585
844097065 844097075
844122030 844122040
844245202 844245212
844310939 844310949
844423962 844423972
844430935 844430945
844440035 844440045
844457487 844457497
844463089 844463099
844464566 844464576
844485659 844485669
844497537 844497547
844508482 844508492
844514898 844514908
845360331 845360341
845377226 845377236
845398952 845398962
845421374 845421384
845446604 845446614
845476792 845476802
845478672 845478682
845492589 845492599
845504063 845504073
845533115 845533125
845541930 845541940
845560839 845560849
845636163 845636173
845657691 845657701
845665846 845665856
845668156 845668166
845669935 845669945
845674157 845674167
845700273 845700283
845889253 845889263
845892528 845892538
845899910 845899920
846013218 846013228
846016667 846016677
846020902 846020912
846095563 846095573
846106893 846106903
846188969 846188979
846191777 846191787
846311987 846311997
846334235 846334245
846342488 846342498
846449569 846449579
846457818 846457828
846510719 846510729
846529464 846529474
846545018 846545028
846623380 846623390
846632745 846632754
846675239 846675249
846689895 846689905
846692423 846692433
846698858 846698868
846746049 846746059
846751159 846751169
846826558 846826568
846834624 846834634
846853819 846853829
846920803 846920813
846924970 846924980
846930679 846930689
846936482 846936492
846941874 846941884
846951328 846951338
847041966 847041976
847096861 847096871
847120118 847120128
847230647 847230657
847237384 847237394
847317982 847317992
847381448 847381458
847383639 847383649
847402647 847402657
847417116 847417126
847421843 847421853
847469288 847469298
847604954 847604964
847622490 847622500
847637457 847637467
847639317 847639327
847661529 847661539
847731458 847731468
847734812 847734822
847744313 847744323
847753426 847753436
847797108 847797118
847802576 847802586
847811799 847811809
847823961 847823971
847834711 847834721
847837428 847837438
847841060 847841070
847883719 847883729
847900092 847900102
847915367 847915377
847922243 847922253
847945276 847945286
847955158 847955168
847998426 847998436
848004644 848004654
848069430 848069440
848086235 848086245
848095210 848095220
848099931 848099941
848116319 848116329
848156006 848156016
848219978 848219988
848229932 848229942
848237095 848237105
848311659 848311669
848317902 848317912
848319592 848319602
848324955 848324965
848325666 848325676
848330589 848330599
848335489 848335499
848348083 848348093
848418267 848418277
848424944 848424954
848430972 848430982
848439979 848439989
848458138 848458148
848466305 848466315
848492202 848492212
848581263 848581273
848619435 848619445
848624013 848624023
848629999 848630009
848638820 848638830
848648683 848648693
848673431 848673441
848684653 848684663
848691432 848691442
848701445 848701455
848735306 848735316
848736705 848736715
848741974 848741984
848744552 848744562
848750513 848750523
848755588 848755598
848785894 848785904
848789430 848789440
848842323 848842333
848846386 848846396
848850542 848850552
848853391 848853401
848855639 848855649
848865353 848865363
848876450 848876460
848896821 848896831
848918528 848918538
848922355 848922365
848942069 848942079
848944312 848944322
848970234 848970244
848981897 848981907
849037132 849037142
849044944 849044954
849050342 849050352
849053464 849053474
849076409 849076419
849089098 849089108
849147697 849147707
849213036 849213046
849214792 849214802
849248225 849248235
849300026 849300036
849396873 849396883
849443405 849443415
849470620 849470630
849477116 849477126
849554414 849554424
849564282 849564292
849568089 849568099
849637554 849637564
849705306 849705316
849711507 849711517
849719490 849719500
849726060 849726070
849729309 849729319
849751007 849751017
849774035 849774045
849786114 849786124
849870128 849870138
849892654 849892664
849901323 849901333
849906575 849906585
849950616 849950626
849958675 849958685
850020505 850020515
850061102 850061112
850064036 850064046
850101588 850101598
850137778 850137788
850153571 850153581
850161568 850161578
850164454 850164464
850170211 850170221
850172993 850173003
850182172 850182182
850187425 850187435
850197812 850197822
850271902 850271912
850275993 850276003
850282733 850282743
850317442 850317452
850330618 850330628
850331143 850331153
850346059 850346069
850370165 850370175
850395830 850395840
850405257 850405267
850488182 850488192
850490759 850490769
850514491 850514501
850517997 850518007
850532641 850532651
850602903 850602913
850643027 850643037
850666508 850666518
850674312 850674322
850677418 850677428
850679376 850679386
850692248 850692258
850694591 850694601
850697180 850697190
850715818 850715828
850744866 850744876
850749598 850749608
850757479 850757489
850759949 850759959
850777158 850777168
850780657 850780667
850825146 850825156
850841074 850841084
850853410 850853420
850856880 850856890
850880230 850880240
851033101 851033111
851038865 851038875
851239530 851239540
851262778 851262788
851276618 851276628
851286668 851286678
851332066 851332076
851338622 851338632
851341145 851341155
851343950 851343960
851346989 851346999
851353980 851353990
851362675 851362685
851395806 851395816
851408096 851408106
851464257 851464267
851513385 851513395
851519999 851520009
851522150 851522160
851646558 851646568
851660181 851660191
851665979 851665989
851670388 851670398
851674104 851674114
851698042 851698052
851729488 851729498
851778332 851778342
851784634 851784644
851785375 851785385
851787953 851787963
851934653 851934663
851970258 851970268
852025691 852025701
852051476 852051486
852065275 852065285
852147399 852147409
852156156 852156166
852212318 852212328
852263400 852263410
852276906 852276916
852312972 852312982
852323445 852323455
852325451 852325461
852358202 852358212
852393215 852393225
852435978 852435988
852440081 852440091
852458890 852458900
852489582 852489592
852490444 852490450
852493273 852493283
852497242 852497252
852502419 852502429
852509080 852509090
852520746 852520756
852566252 852566262
852575028 852575038
852576307 852576317
852577440 852577444
852580466 852580476
852583846 852583856
852595319 852595329
852627997 852628007
852633511 852633521
852652946 852652956
852661375 852661385
852669926 852669936
852679322 852679332
852697992 852698002
852715724 852715734
852716870 852716880
852745648 852745658
852752867 852752877
852758776 852758786
852794527 852794537
852825685 852825695
852920958 852920968
852931498 852931508
852953058 852953068
853067352 853067362
853196723 853196733
853264004 853264014
853272970 853272980
853280285 853280295
853290940 853290950
853316002 853316012
853414938 853414948
853444749 853444759
853453949 853453959
853479048 853479058
853483080 853483090
853595427 853595437
853668726 853668736
853673726 853673736
853758764 853758774
853838690 853838700
853949425 853949435
853955036 853955046
854123129 854123139
854249348 854249358
854292415 854292425
854306093 854306103
854311869 854311879
854408768 854408778
854427603 854427613
854476868 854476878
854478776 854478786
854482231 854482241
854483446 854483456
854504681 854504691
854584196 854584206
854618025 854618035
854658320 854658330
854666476 854666486
854705313 854705323
854706543 854706553
854751263 854751273
854770226 854770236
854794520 854794530
854910435 854910445
854916987 854916997
854919409 854919419
854926277 854926287
854988023 854988033
855004891 855004901
855011519 855011529
855030912 855030922
855086948 855086958
855158554 855158564
855199428 855199438
855220539 855220549
855243389 855243399
855258368 855258378
855268091 855268101
855312459 855312469
855414402 855414412
855461357 855461367
855476959 855476969
855526477 855526487
855544102 855544112
855620226 855620236
855689324 855689334
855706438 855706448
855778730 855778740
855783260 855783270
855809720 855809730
855824225 855824235
855862433 855862443
855867701 855867711
855869760 855869770
855901526 855901536
855907800 855907810
855943444 855943454
855949020 855949030
855953838 855953848
855954969 855954979
855987167 855987177
856006447 856006457
856067900 856067910
856075782 856075792
856105821 856105831
856127815 856127825
856133539 856133549
856135768 856135778
856142935 856142945
856150233 856150243
856167368 856167378
856210347 856210357
856218070 856218080
856223833 856223843
856233104 856233114
856258805 856258815
856276898 856276908
856294328 856294338
856320427 856320437
856331099 856331109
856383000 856383010
856396269 856396279
856401854 856401864
856411002 856411012
856414766 856414776
856436339 856436349
856451156 856451166
856466325 856466335
856471175 856471185
856500898 856500908
856527708 856527718
856536428 856536438
856544296 856544306
856571522 856571532
856583610 856583620
856591053 856591063
856613469 856613479
856698645 856698655
856703017 856703027
856718676 856718686
856727670 856727680
856728795 856728805
856778886 856778896
856826548 856826558
856876840 856876850
856900926 856900936
856908871 856908881
856912808 856912818
856922494 856922504
856928234 856928244
856987265 856987275
857007028 857007038
857094665 857094675
857131822 857131832
857258004 857258014
857262628 857262638
857268806 857268816
857334913 857334923
857362640 857362650
857366110 857366120
857402370 857402380
857406449 857406459
857435210 857435220
857436355 857436365
857445586 857445596
857461688 857461698
857502328 857502338
857505408 857505418
857507490 857507500
857509762 857509772
857516518 857516528
857531050 857531060
857544368 857544378
857559162 857559172
857582000 857582010
857592075 857592085
857596916 857596926
857632788 857632798
857636332 857636342
857639329 857639339
857645436 857645446
857652036 857652046
857667272 857667282
857673243 857673253
857678590 857678600
857682027 857682037
857686185 857686195
857695465 857695475
857706566 857706576
857715499 857715509
857735286 857735296
857739010 857739020
857743026 857743036
857755021 857755031
857763708 857763718
857790238 857790248
857862308 857862318
857898526 857898536
857932503 857932513
857940934 857940944
857946457 857946467
857949055 857949065
857995237 857995247
858024620 858024630
858031500 858031510
858107573 858107583
858115524 858115534
858132583 858132593
858165022 858165032
858184999 858185009
858207170 858207180
858217003 858217013
858219640 858219650
858268973 858268983
858291793 858291803
858377797 858377807
858390351 858390361
858465394 858465404
858467822 858467832
858470030 858470040
858489766 858489776
858532042 858532052
858535252 858535262
858556062 858556072
858594462 858594472
858607767 858607777
858617698 858617708
858620381 858620391
858626650 858626660
858643074 858643084
858693363 858693373
858724949 858724959
858741271 858741281
858765989 858765999
858785008 858785018
858797943 858797953
858805153 858805163
858819200 858819210
858885525 858885535
858892097 858892107
858951732 858951742
858961262 858961272
858963328 858963338
858964075 858964082
858966260 858966270
858973797 858973807
859068984 859068994
859075129 859075139
859082342 859082352
859082790 859082800
859084712 859084722
859093681 859093691
859094939 859094949
859095883 859095893
859123615 859123625
859127656 859127666
859140890 859140900
859145856 859145866
859155433 859155443
859182071 859182081
859231923 859231933
859242785 859242795
859281362 859281372
859312553 859312563
859320129 859320139
859348548 859348558
859399941 859399951
859431746 859431756
859474810 859474820
859477533 859477543
859495998 859496008
859551344 859551354
859576017 859576027
859591360 859591370
859607393 859607403
859704488 859704498
859720434 859720444
859751623 859751633
859761477 859761487
859781278 859781288
859831598 859831608
859848844 859848854
859898974 859898984
859934487 859934497
860000749 860000759
860010991 860011001
860060481 860060491
860091130 860091140
860149691 860149701
860160351 860160361
860162613 860162623
860166852 860166862
860168683 860168693
860284325 860284335
860292936 860292946
860341488 860341498
860342989 860342999
860357878 860357888
860364236 860364246
860366153 860366163
860371196 860371206
860440191 860440201
860453996 860454006
860478565 860478575
860489466 860489476
860497447 860497457
860506935 860506945
860509664 860509674
860527299 860527309
860543524 860543534
860550846 860550856
860552182 860552192
860585209 860585219
860624068 860624078
860675495 860675505
860710808 860710818
860759704 860759714
860789298 860789308
860796792 860796802
860857375 860857385
860879019 860879029
860894435 860894445
860921067 860921077
860944694 860944704
860947984 860947994
860970705 860970715
861038236 861038246
861040890 861040900
861044658 861044668
861055428 861055438
861064794 861064804
861071819 861071829
861073822 861073832
861084195 861084197
861089135 861089145
861111709 861111719
861131206 861131216
861133836 861133846
861141020 861141030
861175520 861175530
861214946 861214956
861278792 861278802
861306864 861306874
861315716 861315726
861390952 861390962
861398710 861398720
861424462 861424472
861428460 861428470
861489561 861489571
861495223 861495233
861501242 861501252
861504690 861504700
861544083 861544093
861566197 861566207
861577256 861577266
861616378 861616388
861625591 861625601
861629584 861629594
861641345 861641355
861644409 861644419
861647525 861647535
861650105 861650115
861652899 861652909
861654555 861654565
861739767 861739777
861750693 861750703
861824193 861824203
861843043 861843053
861866590 861866600
861886157 861886167
861919904 861919914
861924508 861924518
861931760 861931770
861946265 861946275
861992528 861992538
861996879 861996889
862009908 862009918
862139813 862139823
862158446 862158456
862163224 862163234
862167822 862167832
862177029 862177039
862179435 862179445
862187305 862187315
862207602 862207612
862258334 862258344
862262547 862262557
862278833 862278843
862312805 862312815
862324859 862324869
862351892 862351902
862381096 862381106
862384724 862384734
862404449 862404459
862408492 862408502
862462607 862462617
862521805 862521815
862524762 862524772
862533380 862533390
862543207 862543217
862556181 862556191
862565806 862565816
862568012 862568022
862583632 862583642
862599889 862599899
862605864 862605874
862646154 862646164
862668086 862668096
862689699 862689709
862698685 862698695
862701045 862701055
862704851 862704861
862705963 862705973
862716227 862716237
862732319 862732329
862768794 862768804
862773082 862773092
862813913 862813923
862855427 862855437
862858302 862858312
862870010 862870020
862880081 862880091
862897003 862897013
862942191 862942201
862944115 862944125
862947241 862947251
862948337 862948347
862954133 862954143
862976643 862976653
863034384 863034394
863052302 863052312
863073112 863073122
863091501 863091511
863119437 863119447
863201545 863201555
863202518 863202528
863205201 863205211
863216953 863216963
863295678 863295688
863301798 863301808
863317376 863317386
863371786 863371796
863377894 863377904
863457765 863457775
863539874 863539884
863547529 863547539
863635497 863635507
863637342 863637352
863669766 863669776
863683949 863683959
863713660 863713670
863734107 863734117
863770793 863770803
863805583 863805593
863830583 863830593
863848315 863848325
863931136 863931146
863945545 863945555
863979279 863979289
863982945 863982955
863984367 863984377
863993746 863993756
864014652 864014662
864058984 864058994
864069319 864069329
864131980 864131990
864146465 864146475
864149868 864149878
864158794 864158804
864168560 864168570
864253430 864253440
864280524 864280534
864305749 864305759
864314460 864314470
864325507 864325517
864328182 864328192
864339197 864339207
864340124 864340134
864416212 864416222
864434086 864434096
864436594 864436604
864464142 864464152
864585217 864585227
864592274 864592284
864594237 864594247
864604551 864604561
864606924 864606934
864612155 864612165
864628201 864628211
864673447 864673457
864678543 864678553
864751167 864751177
864761258 864761268
864777338 864777348
864778535 864778545
864859053 864859063
864921831 864921841
864963094 864963104
864969403 864969413
865019915 865019925
865029059 865029069
865030605 865030615
865055963 865055973
865085844 865085854
865129584 865129594
865134175 865134185
865181806 865181816
865183435 865183445
865196748 865196758
865198281 865198291
865199396 865199406
865345186 865345196
865364605 865364615
865374024 865374032
865397987 865397997
865465050 865465060
865474634 865474644
865490973 865490983
865542462 865542472
865557036 865557046
865613976 865613986
865625901 865625911
865668370 865668380
865684197 865684207
865695516 865695526
865720711 865720721
865743322 865743332
865795308 865795318
865798647 865798657
865808663 865808673
865824190 865824200
865828737 865828747
865829360 865829370
865853739 865853749
865864237 865864247
865876521 865876531
865893511 865893521
865947211 865947221
865971916 865971926
865982206 865982216
866032210 866032220
866075661 866075671
866078353 866078363
866110354 866110364
866123132 866123142
866150396 866150406
866159754 866159764
866160693 866160703
866162807 866162817
866164156 866164166
866183543 866183553
866209936 866209946
866231541 866231551
866235990 866236000
866259340 866259344
866325902 866325912
866333479 866333489
866410905 866410915
866524479 866524489
866583660 866583670
866593668 866593678
866600579 866600589
866601318 866601328
866603973 866603983
866605053 866605063
866672703 866672713
866698417 866698427
866711279 866711289
866736408 866736418
866762351 866762361
866770952 866770962
866774054 866774064
866776171 866776181
867056196 867056206
867120019 867120029
867143114 867143124
867206347 867206357
867212080 867212090
867246615 867246625
867275331 867275341
867285591 867285601
867298962 867298972
867319760 867319770
867364086 867364096
867378790 867378800
867449552 867449562
867501128 867501138
867558671 867558681
867628383 867628393
867687402 867687412
867708190 867708200
867710106 867710116
867771679 867771689
867795619 867795629
867815997 867816007
868045687 868045697
868054780 868054790
868060779 868060789
868114705 868114712
868143064 868143074
868144470 868144480
868213008 868213018
868216382 868216392
868232603 868232613
868236185 868236195
868247662 868247672
868253676 868253686
868262637 868262647
868300763 868300773
868305171 868305181
868391914 868391924
868399313 868399323
868472286 868472296
868527526 868527536
868540484 868540494
868584288 868584298
868602706 868602716
868608379 868608389
868612599 868612609
868631319 868631329
868651844 868651854
868661466 868661476
868701165 868701175
868745025 868745035
868753247 868753257
868851570 868851580
868909133 868909143
868919354 868919364
868987988 868987998
869006684 869006694
869020197 869020207
869060234 869060244
869068020 869068030
869164318 869164328
869177767 869177777
869233999 869234009
869255653 869255663
869282796 869282806
869342347 869342357
869367613 869367623
869442633 869442643
869464563 869464573
869505230 869505240
869524297 869524307
869535586 869535596
869540712 869540722
869600603 869600613
869604863 869604873
869613885 869613895
869616262 869616272
869617365 869617375
869648696 869648706
869661182 869661191
869720575 869720585
869773252 869773262
869858199 869858209
869868638 869868648
869871449 869871459
869922591 869922601
869954378 869954388
869986912 869986922
869992030 869992040
870024110 870024120
870038682 870038692
870058120 870058130
870060555 870060565
870067986 870067996
870071461 870071471
870103410 870103420
870122289 870122299
870214720 870214730
870261896 870261906
870273264 870273274
870289998 870290008
870292486 870292496
870342114 870342124
870453092 870453102
870467409 870467419
870526853 870526863
870560010 870560020
870568808 870568818
870578143 870578153
870629011 870629021
870645638 870645648
870716144 870716154
870788353 870788363
870813953 870813963
870815190 870815200
870824945 870824955
870891404 870891414
870905941 870905951
870939906 870939916
870956300 870956310
870980996 870981006
870991913 870991923
871061226 871061236
871075835 871075845
871105564 871105574
871236630 871236640
871243427 871243437
871257140 871257150
871272634 871272644
871277322 871277332
871289566 871289576
871293919 871293929
871300088 871300098
871312986 871312996
871352662 871352672
871356228 871356238
871392587 871392597
871404357 871404367
871409395 871409405
871414312 871414322
871441440 871441450
871522459 871522469
871590271 871590281
871597089 871597099
871619293 871619303
871653649 871653659
871672013 871672023
871679609 871679619
871685672 871685682
871695395 871695405
871718969 871718979
871803502 871803512
871920979 871920989
871933673 871933683
872015151 872015161
872049096 872049106
872092900 872092910
872103990 872104000
872129957 872129967
872142127 872142137
872167777 872167787
872183076 872183086
872201829 872201839
872299571 872299581
872304712 872304722
872315352 872315362
872331577 872331587
872345469 872345479
872367559 872367569
872373264 872373274
872419752 872419762
872442798 872442808
872461194 872461204
872635357 872635367
872643796 872643806
872704668 872704678
872712948 872712958
872731125 872731135
872816906 872816916
872871891 872871901
872885761 872885771
872894724 872894734
872918010 872918020
872979794 872979804
872997218 872997228
873039666 873039676
873060193 873060203
873137069 873137079
873141105 873141115
873222853 873222863
873245569 873245579
873257941 873257951
873274721 873274731
873318427 873318437
873413475 873413485
873424744 873424754
873489655 873489665
873583008 873583018
873618097 873618107
873631781 873631791
873645659 873645669
873648735 873648745
873651419 873651429
873657115 873657125
873665968 873665978
873670123 873670133
873677291 873677301
873689398 873689408
873690881 873690891
873713259 873713269
873733472 873733482
873736109 873736119
873745610 873745620
873769279 873769289
873786059 873786069
873806615 873806625
873814251 873814261
873834760 873834770
873844505 873844515
873903828 873903838
873964103 873964113
873995555 873995565
874015302 874015312
874023761 874023771
874087551 874087561
874189114 874189124
874272864 874272874
874275425 874275435
874313429 874313439
874347692 874347702
874352747 874352757
874354134 874354144
874360660 874360670
874436871 874436881
874439967 874439977
874478787 874478797
874501478 874501488
874514084 874514094
874524803 874524813
874526301 874526311
874530197 874530207
874536281 874536291
874567557 874567567
874622906 874622916
874650112 874650122
874687186 874687196
874695971 874695981
874706765 874706775
874802175 874802185
874817609 874817619
874846210 874846220
874867617 874867627
874878330 874878340
874901672 874901682
874952424 874952434
874959068 874959078
874977369 874977379
874979357 874979367
874985576 874985586
874987915 874987925
875022642 875022652
875041710 875041720
875056051 875056061
875104041 875104051
875109324 875109334
875120293 875120303
875154080 875154090
875166370 875166380
875167228 875167238
875182054 875182064
875200557 875200567
875230306 875230316
