837446957 837446958
837446981 837446982
837446983 837446985
837447202 837447204
837447374 837447375
837447385 837447386
837447389 837447390
837447401 837447403
837447530 837447534
837447788 837447790
837447935 837447937
837447977 837447978
837448016 837448017
837448055 837448056
837448180 837448182
837448185 837448189
837448242 837448244
837448259 837448260
837448480 837448481
837448593 837448597
837448606 837448618
837448703 837448706
837449368 837449369
837449391 837449392
837449453 837449454
837449527 837449528
837449617 837449618
837449752 837449756
837449825 837449828
837449841 837449861
837449868 837449875
837449877 837449882
837449883 837449884
837449979 837449989
837449996 837449998
837449999 837450001
837450035 837450036
837450070 837450075
837450078 837450082
837450087 837450091
837450101 837450108
837450121 837450127
837450129 837450137
837450139 837450141
837450231 837450239
837450240 837450242
837450252 837450254
837450271 837450277
837450315 837450326
837450591 837450606
837450607 837450614
837450803 837450809
837450813 837450822
837450870 837450871
837450912 837450917
837450918 837450924
837450925 837450926
837450994 837450996
837450997 837451003
837451043 837451044
837451058 837451061
837451066 837451069
837451071 837451076
837451091 837451093
837451101 837451103
837451105 837451108
837451140 837451142
837451144 837451145
837451157 837451162
837451178 837451180
837451188 837451189
837451190 837451199
837451201 837451204
837451221 837451228
837451256 837451263
837451264 837451265
837451267 837451270
837451282 837451287
837451300 837451302
837451303 837451304
837451306 837451307
837451318 837451327
837451414 837451421
837451452 837451454
837451569 837451585
837451599 837451606
837451617 837451622
837451657 837451658
837451663 837451664
837451854 837451864
837451887 837451890
837451896 837451899
837451906 837451907
837451981 837451983
837452231 837452232
