838066816 838066848
861477134 861477140
861479315 861479322
861483146 861483154
861541892 861541899
861546490 861546497
861551319 861551323
861559271 861559278
861562044 861562047
861567275 861567281
861593695 861593702
861632769 861632775
861635995 861636000
861653673 861653681
861717736 861717741
861720608 861720616
861748902 861748909
861774478 861774486
861796688 861796696
861816621 861816627
861818512 861818514
861971437 861971444
861997568 861997576
862002985 862002991
862006898 862006905
862094758 862094765
862141578 862141585
862170976 862170983
862239567 862239574
862274211 862274218
862276332 862276335
862309628 862309634
862329136 862329144
862394262 862394270
862401038 862401046
862491643 862491651
862576591 862576598
862595801 862595809
862598461 862598467
862733236 862733244
862751091 862751098
862755776 862755783
862758221 862758229
862759216 862759218
862760045 862760052
862764855 862764862
862777605 862777612
862821454 862821462
862825855 862825862
862831686 862831693
862841923 862841930
862843095 862843102
862844761 862844768
862851221 862851229
862852287 862852294
862853322 862853324
862859388 862859395
862877369 862877377
862883192 862883199
862898614 862898622
862900945 862900953
862906367 862906374
862907780 862907782
862925156 862925163
862926788 862926795
862927489 862927497
862930505 862930512
862940689 862940696
862943128 862943135
862945786 862945789
863031113 863031120
863096248 863096256
863123883 863123890
863181976 863182016
863294582 863294590
863305955 863305963
863344902 863344910
863361250 863361257
863379801 863379808
863434485 863434493
863435987 863435995
863437127 863437132
863449358 863449365
863533288 863533294
863539861 863539867
863563114 863563122
863629844 863629852
863632274 863632282
863642946 863642954
863708531 863708539
863791535 863791542
863813257 863813264
863817306 863817313
863819652 863819659
863907282 863907290
863913086 863913094
863931476 863931483
863963322 863963329
863965500 863965506
863977088 863977096
863978759 863978767
864047798 864047805
864054039 864054056
864057432 864057440
864060000 864060008
864064736 864064744
864069649 864069656
864077017 864077025
864127650 864127658
864133442 864133449
864136528 864136536
864138820 864138828
864140326 864140329
864143839 864143847
864145953 864145955
864146848 864146855
864149185 864149192
864150737 864150738
864154728 864154736
864244548 864244555
864246035 864246037
864331691 864331699
864481696 864481704
864486126 864486134
864498748 864498754
864513131 864513139
864563466 864563474
864565734 864565737
864593040 864593047
864597957 864597958
864661881 864661889
864670344 864670351
864676418 864676426
864722849 864722856
864727684 864727692
864742157 864742165
864750130 864750138
864758530 864758538
864767450 864767454
864776643 864776646
864785922 864785930
864787269 864787272
864806419 864806427
864834967 864834974
864843572 864843580
864859355 864859362
864863798 864863802
864887098 864887106
864992743 864992751
865010991 865010999
865014386 865014393
865105532 865105540
865177194 865177202
865180760 865180768
865198772 865198780
865214109 865214116
865251321 865251329
865282766 865282769
865344976 865344983
865356021 865356029
865429583 865429591
865547927 865547934
865596916 865596924
865605361 865605368
865626960 865626967
865630293 865630300
865687575 865687583
865693812 865693819
865724249 865724253
865736481 865736489
865772685 865772686
865780257 865780265
865798429 865798437
865875782 865875789
865952354 865952362
865963066 865963074
866210880 866210888
866262287 866262295
866297882 866297890
866338020 866338026
866340223 866340227
866392668 866392674
866396596 866396604
866407022 866407029
866435159 866435167
866437089 866437091
866462596 866462604
866554517 866554525
866558145 866558153
866567180 866567187
866569093 866569094
866578690 866578696
866606158 866606166
866660928 866660936
866661716 866661719
866683795 866683803
866736258 866736266
866813801 866813809
866824266 866824274
866833880 866833888
866894480 866894488
866900991 866900997
866984992 866985000
866993948 866993954
867006781 867006788
867065411 867065419
867070738 867070745
867076024 867076031
867088819 867088825
867155706 867155713
867269475 867269482
867416896 867416903
867426449 867426457
867434783 867434790
867443608 867443616
867487551 867487559
867503559 867503567
867507134 867507142
867533561 867533569
867536029 867536037
867550325 867550332
867615215 867615223
867618804 867618812
867675517 867675525
867690216 867690224
867691896 867691904
867700400 867700404
867719566 867719573
867915060 867915068
867963574 867963580
868034687 868034695
868055545 868055552
868114480 868114488
868157954 868157962
868203701 868203709
868207672 868207679
868219915 868219923
868254140 868254148
868280641 868280649
868288873 868288879
868299915 868299922
868320786 868320794
868372650 868372658
868401092 868401098
868463095 868463103
868530432 868530440
868585486 868585494
868627436 868627444
868655824 868655832
868681504 868681512
868703872 868703880
868714298 868714305
868718315 868718320
868792426 868792434
868817161 868817169
868819439 868819442
868820885 868820893
868821496 868821501
868834100 868834104
868862767 868862774
868866583 868866584
868884114 868884121
868902364 868902369
868909771 868909774
868910450 868910458
868916356 868916364
868970511 868970519
868996870 868996876
869060063 869060071
869068331 869068337
869144523 869144531
869206594 869206602
869245243 869245251
869253135 869253143
869258225 869258233
869265417 869265425
869297318 869297325
869324556 869324564
869380161 869380169
869464991 869464999
869492199 869492206
869502807 869502814
869509236 869509244
869511408 869511412
869536664 869536672
869586114 869586122
869619010 869619018
869668573 869668581
869711011 869711019
869722459 869722467
869855767 869855774
869909769 869909777
869916849 869916856
869960083 869960091
870024502 870024510
870045348 870045356
870058920 870058928
870115936 870115944
870180209 870180217
870273695 870273702
870385284 870385292
870435165 870435173
870440430 870440437
870483962 870483970
870615896 870615904
870716842 870716850
870727950 870727957
870736989 870736990
870873797 870873804
870892539 870892546
870985962 870985970
870987152 870987153
871037020 871037028
871044778 871044784
871060583 871060590
871066125 871066133
871075043 871075051
871107010 871107018
871131127 871131134
871229673 871229680
871244380 871244387
871306540 871306548
871320277 871320285
871359431 871359439
871381181 871381189
871393113 871393121
871441712 871441720
871479974 871479982
871495771 871495778
871523469 871523477
871621641 871621649
871627920 871627928
871656466 871656474
871675237 871675241
871804834 871804842
871849311 871849319
871919466 871919473
871922479 871922487
871956750 871956757
871996181 871996189
871997712 871997716
871998894 871998901
872005945 872005952
872018134 872018142
872150523 872150531
872253041 872253049
872452871 872452878
872513703 872513710
872524479 872524486
872527268 872527274
872530983 872530990
872533968 872533975
872563896 872563904
872575235 872575243
872580724 872580732
872600497 872600504
872603811 872603819
872643173 872643181
872683200 872683208
872697342 872697350
872709524 872709532
872728118 872728126
872731484 872731491
872767034 872767041
872819691 872819699
872873878 872873886
872975080 872975088
872997595 872997603
873033232 873033239
873058066 873058074
873070014 873070022
873086585 873086593
873120956 873120963
873130134 873130142
873136318 873136326
873140277 873140284
873184336 873184344
873216477 873216485
873230784 873230791
873302046 873302054
873311209 873311217
873390400 873390408
873419720 873419728
873424544 873424552
873465279 873465286
873472416 873472423
873486956 873486964
873496694 873496702
873501803 873501810
873547393 873547401
873551624 873551632
873611134 873611142
873631840 873631848
873653796 873653803
873659578 873659584
873665009 873665016
873676089 873676095
873715894 873715901
873787092 873787100
873822000 873822008
873887650 873887658
874024082 874024089
874052286 874052294
874103745 874103753
874157122 874157130
874163281 874163288
874185432 874185434
874242271 874242278
874247725 874247733
874252314 874252322
874263028 874263035
874329240 874329248
874343221 874343228
874346898 874346904
874348743 874348751
874349254 874349258
874349278 874349286
874352045 874352052
874353531 874353539
874354878 874354880
874355365 874355372
874356374 874356376
874379832 874379839
874422276 874422283
874432913 874432920
874433686 874433689
874516557 874516564
874616568 874616576
874617152 874617160
874700320 874700327
874761968 874761976
874847229 874847236
874933346 874933350
874947063 874947070
874952112 874952120
874955951 874955959
874961505 874961513
874978232 874978240
875015197 875015204
875023104 875023112
875036245 875036247
875047408 875047416
875084576 875084584
875133998 875134006
875154866 875154873
875182725 875182733
