848591648 848591665
848600076 848600093
849197351 849197368
849631926 849631943
850333847 850333864
850417079 850417096
853351637 853351654
853770929 853770946
856722499 856722516
856970154 856970171
857147968 857147985
857227730 857227747
857314108 857314125
857322236 857322253
857401926 857401943
857497311 857497328
857574658 857574675
857752910 857752927
858189045 858189062
858268701 858268718
858352308 858352325
858535964 858535981
860767561 860767578
861045114 861045131
861135132 861135149
861741526 861741543
861992074 861992091
