847870596 847870613
848060212 848060229
848073221 848073238
848123993 848124010
848151508 848151525
848188004 848188021
848213028 848213045
848213095 848213112
848213122 848213139
848213130 848213147
848213390 848213407
848213849 848213866
848213977 848213994
848213987 848214004
848214053 848214070
848214221 848214238
848214459 848214476
848214516 848214534
848214594 848214611
848214626 848214643
848214669 848214686
848214675 848214692
848214713 848214732
848214806 848214823
848214810 848214827
848240489 848240506
848245612 848245629
848247070 848247087
848247136 848247153
848363407 848363424
848365644 848365661
848423436 848423453
848442062 848442079
848493562 848493579
848512684 848512701
848665166 848665183
848686343 848686361
848693658 848693675
848701235 848701253
848757570 848757587
848820613 848820630
848951792 848951809
849072680 849072697
849086458 849086475
849086463 849086480
849097959 849097976
849098058 849098075
849098065 849098082
849357948 849357965
849477419 849477436
849540508 849540525
849541978 849541995
849624891 849624908
849627632 849627649
849631635 849631652
849633558 849633575
849669529 849669546
849732117 849732134
849733209 849733226
849891079 849891096
849891363 849891380
850051091 850051108
850146776 850146794
850147799 850147817
850158003 850158020
850230945 850230962
850232753 850232770
850341085 850341102
850449691 850449708
850509756 850509773
850593469 850593486
850656544 850656561
850678489 850678507
850787324 850787341
850846993 850847010
851261815 851261833
851354532 851354549
851356519 851356536
851384063 851384081
851441318 851441336
851457164 851457181
851461329 851461346
851666066 851666083
851686643 851686660
851686724 851686741
851686735 851686752
851686848 851686865
851759871 851759888
851782223 851782240
851782315 851782332
851805041 851805059
851809169 851809187
851871238 851871255
851898188 851898205
851963246 851963263
852087022 852087039
852134400 852134417
852269746 852269763
852281694 852281711
852288231 852288248
852371701 852371718
852433784 852433801
852437602 852437619
852454406 852454423
852470190 852470207
852472505 852472522
852539652 852539669
852551117 852551134
852572519 852572536
852575446 852575463
852577065 852577082
852577132 852577149
852580487 852580504
852580939 852580956
852584259 852584276
852612736 852612753
852640991 852641008
852658277 852658294
852665165 852665183
852665206 852665224
852733850 852733868
852733921 852733938
852779551 852779568
852908895 852908912
853677721 853677738
853679683 853679700
853750152 853750169
853757343 853757360
853765426 853765443
853768421 853768438
853769674 853769691
853770053 853770070
853838174 853838191
853842451 853842468
853842943 853842960
853843039 853843056
853845670 853845687
853845732 853845749
853847024 853847041
853847926 853847943
853850161 853850178
853851043 853851060
853851196 853851213
853852456 853852473
853857425 853857442
853857501 853857518
853857516 853857535
853862588 853862605
854352544 854352561
854398188 854398205
854400805 854400822
854474327 854474345
854546208 854546225
854799263 854799281
854806832 854806849
854925086 854925103
854925170 854925187
854934234 854934251
854955576 854955593
854982515 854982532
854982565 854982583
854982589 854982606
855003308 855003325
855038500 855038517
855162124 855162141
855322754 855322771
855326404 855326421
855326452 855326469
855337247 855337266
855418039 855418056
855698883 855698900
855699929 855699946
855702146 855702163
855702170 855702190
855717297 855717314
855718177 855718194
855718695 855718712
855718985 855719002
855720054 855720071
855720091 855720108
855720097 855720114
855720216 855720233
855720846 855720863
855721143 855721160
855721150 855721167
855721190 855721207
855721207 855721224
855721953 855721970
855722009 855722026
855722023 855722040
855722073 855722090
855722084 855722101
855723616 855723633
855728069 855728086
855728181 855728198
855729211 855729228
855729807 855729824
855729920 855729937
855730121 855730138
855730146 855730163
855730272 855730289
855730287 855730304
855730372 855730389
855730824 855730841
855730846 855730863
855730962 855730979
855730983 855731000
855730987 855731004
855731219 855731236
855731251 855731268
855731361 855731378
855731452 855731469
855732197 855732214
855732273 855732290
855732285 855732302
855732340 855732357
855732611 855732628
855732781 855732798
855733181 855733198
855733925 855733942
855733966 855733983
855734004 855734021
855734021 855734038
855734037 855734054
855734424 855734441
855734490 855734509
855735169 855735186
855735181 855735198
855743912 855743929
855744845 855744862
855744865 855744882
855744875 855744892
855744922 855744939
855745043 855745060
855745065 855745082
855745093 855745110
855746208 855746225
855746697 855746714
855747148 855747165
855749617 855749634
855749622 855749639
855749637 855749654
855749652 855749669
855749673 855749690
855749689 855749706
855749694 855749711
855749705 855749722
855749724 855749741
855749780 855749797
855749790 855749807
855749815 855749832
855749836 855749853
855749884 855749901
855749898 855749915
855749919 855749937
855749929 855749948
855750057 855750074
855750080 855750097
855750086 855750103
855750197 855750214
855750780 855750797
855751208 855751225
855751427 855751444
855753856 855753873
855754969 855754986
855755022 855755039
855755678 855755695
855755710 855755727
855756760 855756778
855774325 855774342
855774376 855774393
855790933 855790954
855860270 855860287
855921526 855921543
855921617 855921634
855921622 855921639
855939049 855939066
855952203 855952223
855958564 855958581
855958569 855958586
855959712 855959729
856012572 856012589
856021681 856021701
856023046 856023065
856041951 856041968
856094628 856094645
856124646 856124663
856194257 856194276
856296889 856296906
856296959 856296976
856297307 856297324
856306768 856306785
856307491 856307508
856354649 856354666
856373586 856373603
856374083 856374100
856374159 856374176
856553467 856553484
856553495 856553512
856578353 856578370
856579893 856579910
856689899 856689916
856722242 856722259
856722500 856722517
856780780 856780797
856810191 856810208
856810243 856810260
856810269 856810286
856821929 856821946
856822006 856822023
856865987 856866004
856907796 856907813
856953542 856953559
856953600 856953617
856970155 856970172
856971402 856971419
857035345 857035362
857062470 857062487
857132743 857132760
857140281 857140298
857141348 857141365
857142817 857142834
857144115 857144132
857147006 857147023
857147969 857147986
857164014 857164032
857166174 857166191
857169472 857169489
857227731 857227748
857248869 857248886
857248873 857248892
857250146 857250163
857252564 857252581
857306736 857306753
857310986 857311003
857314108 857314125
857336289 857336306
857336333 857336350
857376922 857376939
857400375 857400393
857401926 857401943
857420041 857420058
857420063 857420080
857427530 857427547
857492194 857492211
857497871 857497888
857530768 857530785
857574437 857574455
857675712 857675729
857683440 857683457
857731902 857731919
857731960 857731977
857757423 857757440
857767826 857767843
857819509 857819527
857819599 857819616
857824879 857824896
857919959 857919976
857919992 857920009
857924406 857924423
857926363 857926380
857926578 857926595
857927685 857927702
857927788 857927807
857927797 857927814
857941447 857941464
857941498 857941515
857941516 857941533
858014727 858014745
858014794 858014811
858093198 858093215
858093297 858093314
858093620 858093637
858104407 858104425
858163794 858163812
858293548 858293565
858296604 858296621
858296705 858296722
858296776 858296793
858306935 858306952
858311199 858311216
858311341 858311358
858311507 858311524
858346339 858346356
858346387 858346404
858432210 858432227
858451612 858451629
858451645 858451662
858531345 858531362
858539830 858539847
858541538 858541555
858602114 858602131
858620736 858620753
858621436 858621453
858621449 858621466
858621466 858621483
858624117 858624134
858624345 858624362
858628222 858628239
858633636 858633654
858682816 858682833
858684013 858684030
858686428 858686445
858686625 858686642
858687461 858687478
858689988 858690005
858690012 858690029
858690021 858690038
858714403 858714420
858955227 858955244
858962178 858962195
859063324 859063341
859065016 859065033
859065070 859065087
859065172 859065191
859131347 859131364
859156537 859156554
859214144 859214161
859230651 859230668
859235130 859235147
859236452 859236469
859236464 859236481
859287183 859287201
859299231 859299248
859299469 859299486
859299500 859299518
859299524 859299541
859309034 859309051
859321494 859321511
859321578 859321596
859323423 859323440
859330936 859330955
859543966 859543983
859563532 859563549
859567178 859567195
859571477 859571494
859571989 859572006
859572388 859572405
859572452 859572469
859572462 859572479
859573166 859573183
859646744 859646761
859719843 859719860
859740233 859740250
859756904 859756921
859756917 859756934
859828597 859828615
859993223 859993241
860173686 860173705
860245097 860245114
860245116 860245133
860245210 860245229
860337149 860337166
860497090 860497107
860497095 860497112
860522908 860522925
860523248 860523265
860585153 860585170
860701827 860701844
860707847 860707864
860708094 860708111
860712724 860712741
860713701 860713718
860715125 860715142
860716264 860716281
860717075 860717092
860719500 860719517
860720987 860721004
860722676 860722693
860724406 860724423
860725303 860725320
860726673 860726690
860727370 860727387
860727486 860727503
860739062 860739079
860741427 860741444
860742216 860742233
860744114 860744131
860744278 860744295
860747823 860747840
860749217 860749234
860751839 860751856
860761445 860761462
860761615 860761632
860762106 860762123
860762421 860762438
860767561 860767578
860776787 860776804
860776824 860776841
860776893 860776910
860788581 860788598
860796281 860796298
860797328 860797345
860797389 860797406
860798488 860798506
860802140 860802157
860803889 860803906
860907272 860907289
860963779 860963797
861037468 861037485
861037792 861037809
861050906 861050923
861111367 861111384
861123463 861123481
861123515 861123532
861123544 861123561
861128341 861128358
861370297 861370314
861372154 861372171
861375244 861375261
861376073 861376090
861387556 861387574
861387578 861387595
861387629 861387646
861387650 861387667
861388610 861388627
861391921 861391939
861437079 861437096
861457263 861457281
861533352 861533369
861553975 861553992
861555744 861555761
861642518 861642537
861653044 861653061
861717233 861717250
861745500 861745519
861793255 861793272
861846403 861846420
861993800 861993817
861995657 861995674
861995736 861995753
861995782 861995801
862002639 862002656
862040364 862040381
862040737 862040754
862044777 862044794
