817736334 817736352
817824105 817824123
817911859 817911877
818073835 818073852
818159105 818159122
818425997 818426015
818507463 818507480
818511498 818511516
818515494 818515512
818684253 818684270
819002189 819002207
819036719 819036736
819160187 819160205
819211043 819211061
819257177 819257195
819384803 819384821
819386144 819386161
819673737 819673754
820394430 820394448
820595196 820595213
821270669 821270687
821459487 821459504
823009415 823009433
823355064 823355082
825082547 825082565
825170433 825170451
826119801 826119819
827089504 827089522
827506067 827506085
827592230 827592248
828112258 828112275
828319850 828319867
828324700 828324718
828405514 828405531
828888928 828888946
830129186 830129204
830532992 830533009
832034857 832034874
832035856 832035874
832037106 832037123
832037637 832037655
832115567 832115584
832116393 832116411
832116645 832116663
832117061 832117079
832161373 832161391
832460261 832460279
832882818 832882835
832884938 832884956
832885922 832885940
832886346 832886364
832886558 832886575
832887245 832887263
832888146 832888164
832888210 832888227
832889582 832889599
833582197 833582215
833992268 833992285
834009834 834009851
834191517 834191535
834197284 834197302
834199243 834199261
834230640 834230657
834243800 834243818
834439585 834439602
834786762 834786780
835029470 835029488
835045259 835045277
835481489 835481506
835823787 835823804
835920192 835920210
835968987 835969004
836033495 836033512
836035647 836035665
836116354 836116372
836116779 836116796
836117244 836117262
836118277 836118294
836120166 836120184
836169633 836169651
836213605 836213623
836215611 836215628
836880495 836880513
836968239 836968257
837182816 837182834
837242337 837242355
837401046 837401064
837442509 837442527
837626826 837626843
837792980 837792997
838052093 838052110
838966557 838966575
839008008 839008026
839045256 839045274
839046363 839046380
839047093 839047111
839050418 839050435
839106952 839106970
839189057 839189074
839626461 839626478
839714936 839714954
839768808 839768826
839920081 839920098
840407185 840407203
840824163 840824180
841093955 841093973
841491253 841491270
841580195 841580213
841681484 841681501
841762905 841762923
842911045 842911063
844605283 844605300
846403505 846403523
846683953 846683971
847116529 847116546
847807488 847807506
848241488 848241506
848668113 848668130
849251513 849251531
849361794 849361812
849368127 849368144
849536089 849536106
849705467 849705484
850195568 850195585
850420707 850420724
851782389 851782406
852304331 852304349
852907086 852907103
853589802 853589819
853767472 853767489
854115801 854115819
854811660 854811677
854913448 854913466
855233681 855233699
855241045 855241063
855608417 855608435
856130947 856130965
856269799 856269817
856618087 856618105
856791982 856791999
857309954 857309972
857395946 857395963
857486436 857486454
857996645 857996663
858514633 858514651
858898244 858898262
859126192 859126210
859200854 859200872
859291985 859292003
859422401 859422419
859422613 859422631
859897993 859898011
859930074 859930092
859930517 859930535
860252013 860252031
861279969 861279987
861713021 861713038
861972045 861972063
862060110 862060127
862168773 862168790
862350519 862350537
862355172 862355190
862571330 862571348
862620865 862620883
863586076 863586093
864608379 864608397
865044554 865044571
865044708 865044726
865045182 865045200
865045785 865045802
865046294 865046312
865047979 865047997
865048079 865048097
865055466 865055484
865056508 865056526
865057458 865057476
865361358 865361375
865370607 865370624
867079626 867079644
867678324 867678342
867855074 867855092
867946261 867946279
868366794 868366812
868383719 868383736
868386129 868386146
868386258 868386275
868386850 868386868
868387796 868387814
868388133 868388151
868388475 868388493
868388740 868388759
868389054 868389072
868389857 868389876
868390372 868390389
868392884 868392901
868549935 868549952
868643703 868643720
868751221 868751238
868793870 868793888
868874226 868874244
869073916 869073934
869177036 869177054
869344875 869344893
869522659 869522676
869605506 869605523
870119649 870119666
870300135 870300153
870455138 870455155
871110348 871110365
871243099 871243116
871330633 871330651
871349416 871349433
871931434 871931452
872281660 872281677
872462047 872462065
872535432 872535449
872568510 872568527
872568815 872568833
872569196 872569214
872569925 872569942
872600844 872600862
872612738 872612756
872804707 872804725
873217534 873217552
