815201438 815201455
815205008 815205025
815213726 815213743
815235464 815235481
815236320 815236337
815237491 815237508
815241851 815241868
815252434 815252451
815301549 815301566
815302526 815302543
815310621 815310638
815310843 815310860
815310848 815310866
815314544 815314561
815314865 815314882
815320556 815320573
815321656 815321673
815323906 815323923
815327403 815327420
815328942 815328959
815387178 815387195
815388541 815388558
815388946 815388963
815389730 815389747
815394224 815394241
815397755 815397772
815399723 815399740
815401917 815401934
815402002 815402019
815402757 815402774
815403126 815403143
815405988 815406005
815406607 815406624
815406648 815406665
815407780 815407797
815411100 815411117
815411206 815411223
815413366 815413383
815413487 815413504
815413603 815413620
815466926 815466943
815467222 815467239
815467398 815467415
815467958 815467975
815468062 815468079
815468136 815468153
815468283 815468300
815468993 815469010
815469269 815469286
815469322 815469339
815469530 815469547
815469704 815469721
815469747 815469764
815469784 815469801
815469917 815469934
815470356 815470373
815470411 815470428
815470509 815470526
815474269 815474286
815476996 815477013
815477527 815477544
815477602 815477619
815545067 815545084
816036544 816036561
816789401 816789418
817068258 817068275
817082592 817082609
817254470 817254487
817554471 817554488
818687205 818687222
818945604 818945621
819162657 819162674
819228489 819228506
819392416 819392434
819600261 819600278
819600691 819600708
819802030 819802047
819929608 819929625
819968541 819968558
819968561 819968578
819968565 819968590
820142073 820142090
820147341 820147358
820362107 820362124
820367487 820367504
820624671 820624688
820647632 820647649
821043140 821043157
821046111 821046128
821046211 821046228
821047689 821047706
821047956 821047973
821049077 821049094
821098683 821098700
821098709 821098726
821182398 821182415
822003395 822003412
822092525 822092542
822375739 822375756
822384728 822384745
822527221 822527238
822541497 822541514
822544519 822544536
822546604 822546621
822546632 822546649
822609843 822609860
822612163 822612180
822650533 822650550
822714129 822714146
822723566 822723583
822731611 822731628
822795976 822795993
822804560 822804577
822827434 822827451
822846274 822846291
822855446 822855463
822860703 822860720
823019033 823019050
823090709 823090726
823090916 823090933
823784418 823784435
823878471 823878488
823878692 823878709
823880150 823880167
823883603 823883620
824043382 824043399
824203903 824203920
824204089 824204106
824208910 824208927
824208932 824208949
824209249 824209266
824210710 824210727
824211757 824211774
824218695 824218712
824219783 824219800
824221026 824221043
824222655 824222672
824223034 824223051
824383002 824383019
824383911 824383928
824386718 824386735
824386976 824386993
824473307 824473324
824668722 824668739
824895201 824895218
824899484 824899501
824901711 824901728
825100406 825100423
825170496 825170513
825176939 825176956
825220295 825220312
825281679 825281696
825290122 825290139
825290128 825290145
825290134 825290151
825290140 825290157
825290156 825290174
825290164 825290184
825290178 825290195
825290182 825290199
825290186 825290203
825291232 825291249
825291244 825291261
825291251 825291272
825291262 825291283
825291273 825291290
825291281 825291301
825291290 825291308
825291295 825291312
825291888 825291905
825291896 825291913
825291906 825291923
825291913 825291931
825291927 825291944
825291933 825291950
825294748 825294766
825294755 825294778
825294765 825294782
825294773 825294793
825296276 825296293
825326747 825326764
825343369 825343386
825345449 825345466
825348148 825348165
825628673 825628690
825628725 825628742
825652495 825652512
825956539 825956556
825968461 825968478
825969459 825969476
825969870 825969887
825970139 825970156
825974447 825974464
825975481 825975498
825977182 825977199
825977321 825977338
826010809 826010826
826042572 826042589
826050053 826050070
826070628 826070645
826101053 826101070
826118662 826118679
826150632 826150649
826180562 826180579
826193794 826193811
826200649 826200666
826202740 826202757
826203049 826203066
826209364 826209381
826210857 826210874
826263071 826263088
826313510 826313527
826362525 826362542
826431133 826431150
826474073 826474090
826475544 826475561
826501495 826501512
826568628 826568645
826569081 826569098
826579695 826579712
826586743 826586760
826648085 826648102
826666974 826666991
826671029 826671051
826722206 826722224
826727486 826727503
826926583 826926600
826926727 826926744
827258390 827258407
827332350 827332367
827424030 827424047
827459087 827459104
827514957 827514977
827526018 827526035
827571149 827571166
827591070 827591087
828056093 828056110
828344055 828344072
828592613 828592630
828839086 828839103
828879291 828879308
828891472 828891489
828891485 828891502
828891498 828891516
828899319 828899336
828930279 828930296
829013744 829013761
829080186 829080203
829081769 829081786
829081857 829081882
829197124 829197141
829220009 829220026
829220015 829220032
829223877 829223894
829223899 829223916
829316623 829316640
829317877 829317894
829381292 829381315
829381302 829381322
829381310 829381327
829381319 829381336
829381324 829381342
829381329 829381350
829381337 829381356
829381345 829381366
829381353 829381370
829381359 829381378
829381367 829381384
829381374 829381399
829436302 829436319
829439336 829439353
829439343 829439360
829439352 829439369
829439962 829439979
829441078 829441095
829445485 829445502
829770418 829770435
829944543 829944560
830099602 830099619
830110805 830110822
830129186 830129203
830196115 830196132
830196191 830196208
830196299 830196316
830196324 830196341
830656019 830656036
831162016 831162033
831206930 831206947
831237845 831237862
831239211 831239228
831240152 831240169
