817018545 817018562
817417407 817417424
817841630 817841647
820446927 820446944
820614721 820614738
820615455 820615472
821227028 821227045
821227180 821227197
821465172 821465189
821732164 821732181
821748018 821748035
822948643 822948660
823034613 823034630
823523105 823523122
823871702 823871719
824131133 824131150
824815751 824815768
824837223 824837240
824839525 824839542
825014701 825014718
825240631 825240648
825579038 825579055
825700105 825700122
825700848 825700865
825713993 825714010
825717405 825717422
825850311 825850328
825869731 825869748
825887355 825887372
825910624 825910641
825913202 825913219
825963016 825963033
825975587 825975604
825979425 825979442
825980950 825980967
826045746 826045763
826054002 826054019
826087312 826087329
826090975 826090992
826092230 826092247
826223528 826223545
826273980 826273997
826302594 826302611
826303689 826303706
826310184 826310201
826310686 826310703
826312887 826312904
826334443 826334460
826353068 826353085
826368316 826368333
826386504 826386521
826446904 826446921
826450602 826450619
826463231 826463248
826485017 826485034
826485185 826485202
826487715 826487732
826574343 826574360
826577748 826577765
826584528 826584545
826588932 826588949
826648909 826648926
826654705 826654722
826656826 826656843
826662097 826662114
826666385 826666402
826695659 826695676
826733634 826733652
826735287 826735304
826747468 826747485
826766799 826766816
826771080 826771097
826822021 826822038
826824689 826824706
826837345 826837362
826869172 826869189
826883412 826883429
826911391 826911408
826920043 826920060
826970878 826970895
826983105 826983122
827032372 827032389
827065289 827065306
827082807 827082824
827088961 827088978
827101407 827101424
827156876 827156893
827189438 827189455
827250622 827250639
827430934 827430951
827436962 827436979
827458065 827458082
827458078 827458095
827458090 827458107
827460233 827460250
827462388 827462405
827510714 827510731
827526875 827526892
827683603 827683620
827691852 827691869
827696518 827696535
827696900 827696917
827971446 827971463
828038107 828038124
828169965 828169982
828276692 828276709
828460410 828460427
828889464 828889481
828904735 828904752
828908408 828908425
828970694 828970711
829240914 829240931
829260632 829260649
829324153 829324170
829328746 829328763
829347153 829347170
829499245 829499262
829501592 829501609
829504785 829504802
829512395 829512412
829582911 829582928
829584368 829584385
829587115 829587132
829590423 829590440
829597711 829597728
829606878 829606895
829672671 829672688
829686344 829686361
829688816 829688833
829696697 829696714
829755792 829755809
829758204 829758221
829761988 829762005
829766324 829766341
829772031 829772048
829793543 829793560
829848289 829848306
830009274 830009291
830101970 830101987
830107310 830107327
830186689 830186706
830193424 830193441
830209835 830209852
830213373 830213390
830242738 830242755
830268483 830268500
830273394 830273411
830274908 830274925
830277204 830277221
830281880 830281897
830286490 830286507
830295620 830295637
830360599 830360616
830362722 830362739
830445910 830445927
830467566 830467583
830536807 830536824
830538428 830538445
830607519 830607536
830704688 830704705
830723233 830723250
830723246 830723263
830790316 830790333
830792176 830792193
830799065 830799082
830885729 830885746
830890221 830890238
830920970 830920987
830967272 830967289
831062052 831062069
831086639 831086656
831142165 831142182
831142245 831142262
831142467 831142484
831149982 831149999
831151229 831151246
831163887 831163904
831164534 831164551
831165370 831165387
831310274 831310292
