816110942 816111514
816112475 816113050
816113333 816113653
816113812 816114389
816114643 816115636
816115665 816116273
816133127 816133447
816183178 816183498
816183652 816183972
816185382 816185702
816189802 816190122
816192436 816192756
816195477 816195797
816196980 816197300
816200802 816201122
816203318 816203638
816203868 816204188
816205415 816205918
816208481 816208801
816209603 816209923
816212536 816212856
816214240 816214560
816215786 816216106
816216877 816217197
816232478 816233403
816234392 816234712
816238609 816238929
816244706 816245026
816271632 816271952
816272183 816272503
816277090 816277410
816280872 816281858
816285035 816285355
816285529 816285849
816286009 816286329
816286548 816286868
816287672 816287992
816289425 816289745
816291542 816291862
816293527 816293847
816293856 816294176
816296678 816296998
816302887 816303207
816303310 816303630
816304773 816305093
816305122 816305442
816305564 816306080
816306395 816306715
816307466 816307786
816311883 816312203
816312302 816312622
816312687 816313007
816314196 816314516
816314864 816315184
816315530 816315850
816316165 816316485
816326347 816326667
816353608 816353928
816355787 816356107
816360291 816360611
816363854 816364174
816369013 816369333
816372448 816372768
816373075 816373395
816373449 816373769
816377071 816377391
816377630 816377950
816379686 816380006
816381542 816381862
816384423 816384743
816390285 816390605
816391337 816391657
816391750 816392070
816392141 816392461
816394498 816395059
816395416 816395736
816430815 816431335
816439304 816439624
816445766 816446086
816448816 816449348
816449586 816449906
816457632 816457952
816469860 816470180
816471721 816472041
816481458 816481778
816493560 816494067
816494286 816494606
816526753 816527073
816535099 816535419
816540879 816541199
816548594 816548914
816563164 816563484
816572166 816572486
816623319 816623639
816623904 816624224
816624771 816625091
816630171 816630491
816630931 816631251
816633674 816633994
816635143 816635463
816637705 816638025
816638311 816638631
816638664 816639169
816641690 816642010
816642032 816642352
816657891 816658211
816659053 816659373
816674851 816675171
816707740 816708060
816708370 816708690
816710447 816710767
816731780 816732100
816737236 816737839
816743249 816743569
816754396 816754716
816756221 816756541
816769617 816769937
816771696 816772016
816772310 816772630
816807221 816807541
816807582 816807902
816808341 816808661
816814184 816814766
816818414 816818734
816818833 816819153
816823620 816824154
816865186 816865574
816897928 816898248
816908924 816909244
816914007 816914327
816922500 816922820
816946970 816947290
816947329 816947649
816952152 816952472
816962643 816962963
816969475 816969795
816971149 816971469
816979082 816979402
816980725 816981045
816983161 816983481
816984568 816984923
816988806 816989126
816990463 816990783
817031504 817031824
817032594 817032914
817068247 817068567
817069517 817069837
817077845 817078165
817078258 817078578
817079192 817079512
817080514 817080834
817082141 817082461
817082577 817082897
817103831 817104151
817178300 817178620
817224052 817224372
817232009 817232329
817243351 817243671
817252441 817252761
817254004 817254324
817254443 817254763
817275429 817275749
817312604 817313169
817314532 817314852
817334272 817334592
817340730 817341050
817341394 817341714
817342382 817342702
817347016 817347336
817351038 817351358
817362460 817363019
817398833 817399153
817399438 817400049
817401987 817402307
817403462 817403782
817404983 817405303
817423365 817423685
817425735 817426055
817426130 817426677
817442417 817442737
817485270 817485713
817485868 817486380
817488683 817489023
817490803 817491123
817492550 817492870
817496150 817496470
817503224 817503544
817504492 817504812
817508369 817508689
817510263 817510583
817549471 817549791
817552731 817553256
817554444 817554764
817564354 817564674
817566657 817566977
817567140 817567460
817569536 817569856
817570694 817571014
817592566 817592886
817596489 817596809
817600269 817600589
817601982 817602302
817618181 817618501
817618768 817619088
817619619 817619939
817622112 817622432
817625209 817626085
817629665 817629985
817631477 817631979
817662182 817662502
817682938 817683258
817687080 817687400
817690964 817691284
817694187 817694507
817700291 817700611
817707356 817707676
817753237 817753557
817764709 817765029
817770781 817771101
817772027 817772347
817773423 817773743
817821586 817821906
817824441 817824761
817826724 817827567
817839344 817839664
817852398 817852718
817855167 817855487
817859405 817859725
817870622 817870942
817915201 817915521
817940304 817940624
817940672 817940992
817944092 817944412
817953322 817953642
817955233 817955553
817955805 817956125
818012969 818013289
818015037 818015357
818017380 818017700
818027700 818028200
818059278 818059598
818068472 818068792
818077195 818077515
818093527 818093847
818096071 818096391
818097113 818097433
818112825 818113145
818117002 818117322
818117767 818118087
818118852 818119172
818145078 818145398
818172839 818173159
818173230 818173550
818180089 818180547
818182082 818182402
818182439 818182914
818187810 818188130
818238909 818239229
818239724 818240044
818261505 818262273
818267536 818267856
818286909 818287404
818291452 818291772
818322374 818322694
818322915 818323235
818323477 818323797
818326528 818326848
818338821 818339647
818343176 818343496
818346850 818347170
818347456 818348060
818352297 818352617
818352716 818353192
818356305 818356625
818365809 818366129
818366341 818366661
818370711 818371031
818407392 818407827
818408299 818408790
818426527 818427307
818427368 818427688
818438987 818439307
818439519 818439839
818440475 818441029
818442496 818443226
818444004 818444324
818444342 818444662
818444667 818444987
818446020 818446340
818446627 818446947
818454100 818454420
818460074 818460394
818479714 818480034
818483940 818484260
818484713 818485033
818524788 818525108
818575870 818576190
818604199 818604519
818604568 818604888
818619174 818619494
818619999 818620584
818635029 818635349
818636564 818636884
818645221 818645541
818646644 818646964
818654684 818655004
818677617 818677937
818678217 818678537
818687189 818687509
818687937 818688257
818715331 818715878
818718043 818718363
818719616 818720141
818720169 818720489
818723632 818723952
818728422 818728742
818728747 818729215
818734868 818735188
818768742 818769062
818769389 818769709
818793801 818794121
818794538 818794858
818800600 818800920
818805527 818805847
818808484 818809361
818812568 818812888
818813690 818814010
818814982 818815302
818817018 818817338
818831837 818832157
818860239 818860559
818860748 818861068
818878570 818878890
818885396 818885716
818888281 818888601
818893980 818894300
818917847 818918167
818918177 818918497
818945592 818945912
818952369 818952689
818954303 818954623
818960972 818961292
818969165 818969485
819028033 819028353
819043417 819043737
819050034 819050354
819060205 819060525
819066623 819066943
819067615 819067935
819075702 819076022
819076997 819077317
819094487 819094807
819113450 819113770
819130000 819130320
819131488 819131808
819136250 819136570
819137572 819137892
819138306 819138626
819139190 819139510
819140179 819140499
819140823 819141143
819144590 819144910
819145072 819145392
819148004 819148324
819148490 819149048
819154393 819154713
819185276 819185596
819187045 819187535
819191375 819191695
819201794 819202290
819204088 819204408
819211299 819211619
819211712 819212032
819216099 819216419
819216561 819216881
819226602 819226922
819228481 819228801
819229167 819229487
819251261 819251581
819269443 819269763
819269840 819270336
819295061 819295381
819299743 819300229
819317098 819317418
819317639 819317959
819318463 819318783
819318859 819319179
819322304 819322624
819362626 819363116
819370147 819370467
819377915 819378235
819380129 819380449
819392360 819392680
819395379 819395997
819396185 819396505
819400750 819401070
819401364 819401684
819404697 819405017
819409226 819409546
819418783 819419244
819424095 819424415
819480745 819481065
819555918 819556238
819557361 819557681
819573190 819573510
819579910 819580230
819600222 819600542
819600666 819600986
819604128 819604448
819640844 819641344
819657966 819658286
819661329 819661649
819729076 819729396
819751884 819752204
819752482 819752802
819756295 819756842
819760363 819760683
819760914 819761234
819790016 819790336
819801982 819802302
819802825 819803145
819825390 819825710
819829969 819830289
819837745 819838065
819842638 819842958
819849458 819849778
819881456 819881776
819887399 819887719
819887874 819888431
819901735 819902055
819922493 819922813
819927304 819927624
819929226 819929546
819929581 819929901
819968520 819968840
819975182 819975502
819976399 819976719
819977535 819978061
819979280 819979600
819983917 819984237
819984540 819984860
820002939 820003259
820003586 820003906
820004155 820005278
820006016 820006380
820007715 820008035
820008365 820008685
820009735 820010055
820010378 820010772
820011485 820011805
820011910 820012353
820012436 820013143
820014381 820014701
820015010 820015330
820015990 820016310
820016859 820017179
820017743 820018063
820018696 820019016
820020283 820020867
820021033 820021353
820022029 820022349
820023353 820023673
820049750 820050283
820051620 820051940
820052959 820053279
820054701 820055021
820056805 820057125
820057393 820057713
820060512 820061282
820062986 820063306
820063436 820063756
820063789 820064109
820087087 820087407
820087814 820088631
820100962 820101282
820101857 820102177
820103350 820103670
820106716 820107036
820107878 820108198
820109461 820109781
820110532 820110852
820111784 820112104
820114349 820114669
820115170 820115490
820115580 820115900
820142050 820142370
820147271 820147591
820150983 820151303
820157097 820157417
820171990 820172310
820175705 820176025
820194248 820194568
820199660 820199980
820200051 820200371
820200804 820201231
820201612 820202618
820214091 820214411
820214575 820214895
820215517 820215837
820218659 820218979
820224804 820225124
820226207 820226982
820250473 820250793
820275913 820276233
820278763 820279083
820284778 820285098
820321178 820321498
820327222 820327542
820341159 820341479
820342013 820342333
820357004 820357324
820364678 820364998
820365201 820365521
820372185 820372505
820380182 820380502
820380604 820380924
820399014 820399334
820404481 820404801
820406733 820407242
820424377 820424697
820429992 820430312
820430599 820430919
820433742 820434062
820443244 820443564
820443916 820444236
820450972 820451292
820479575 820479895
820507964 820508284
820510659 820510979
820523858 820524178
820524499 820525093
820528746 820529066
820531470 820531790
820531900 820532220
820533688 820534008
820536774 820537094
820537315 820537635
820539754 820540170
820544841 820545161
820554540 820554860
820554974 820555294
820557403 820557723
820562881 820563201
820626122 820626442
820635234 820635554
820636303 820636623
820695665 820695985
820700101 820700421
820713059 820713379
820716180 820716500
820732021 820732341
820733837 820734157
820741524 820741844
820748978 820749298
820752469 820752789
820756074 820756394
820757571 820757891
820758414 820759132
820805033 820805353
820828114 820828434
820847408 820847728
820854508 820854828
820855718 820856038
820858179 820858680
820861660 820861980
820863824 820864144
820867134 820867454
820873199 820873519
820879061 820879381
820879685 820880005
820884357 820884677
820886965 820887285
820889432 820889752
820894138 820894458
820894608 820894928
820895037 820895357
820909856 820910176
820921559 820921879
820921937 820922257
820922512 820922832
820942903 820943223
820943320 820943640
820944459 820944779
820951775 820952095
820953145 820953465
820967235 820967555
820973660 820973980
820974792 820975112
820981483 820981803
820993822 820994142
820995779 820996099
820996609 820996929
820998678 820998998
821017281 821017601
821017662 821017982
821020290 821021086
821023139 821023702
821027482 821027802
821028245 821028565
821028590 821029239
821031104 821031424
821034892 821035212
821036208 821036528
821037917 821038237
821039714 821040034
821040458 821040778
821045376 821045696
821046365 821046685
821046828 821047148
821047702 821048022
821049942 821050262
821053180 821053500
821056337 821056657
821056922 821057242
821060853 821061173
821063300 821063620
821074938 821075258
821076022 821076342
821084648 821084968
821088802 821089122
821098669 821098989
821100377 821100697
821133544 821133864
821136850 821137170
821182382 821182702
821183078 821183398
821186071 821186391
821216987 821217307
821217823 821218143
821222093 821222413
821232446 821232766
821239353 821239673
821287786 821288106
821307713 821308033
821344174 821344494
821344772 821345092
821363140 821363460
821388560 821388880
821456822 821457142
821460591 821460911
821467671 821467991
821477444 821477764
821480139 821480459
821483382 821483702
821484670 821484990
821486581 821486901
821496284 821496604
821514247 821514915
821515120 821515440
821520398 821520718
821522827 821523147
821536045 821536605
821536891 821537211
821543844 821544383
821548692 821549012
821551048 821551368
821553079 821553399
821560473 821560793
821561951 821562271
821564951 821565271
821566686 821567006
821568957 821569277
821569837 821570157
821582810 821583130
821583491 821583811
821584339 821584884
821584991 821585481
821586078 821586398
821587857 821588177
821588596 821589207
821589778 821590098
821590307 821590627
821592281 821592601
821592749 821593069
821597443 821597763
821597885 821598205
821600258 821600578
821600861 821601404
821601931 821602251
821602329 821602842
821602855 821603307
821603399 821603974
821612944 821613264
821619766 821620086
821621446 821621766
821622027 821622347
821622409 821623011
821629349 821629669
821635226 821635546
821635693 821636013
821641526 821641846
821648108 821648428
821648489 821648809
821653458 821653984
821659674 821659994
821663981 821664301
821664379 821664699
821664747 821665067
821681674 821681994
821684637 821684957
821726267 821726587
821738161 821738481
821738636 821739153
821742795 821743115
821743481 821743801
821746970 821747290
821781382 821781702
821783050 821783370
821785168 821785488
821787267 821787587
821787607 821787927
821797062 821797382
821798760 821799080
821801976 821802296
821802570 821802890
821805125 821805445
821806121 821806441
821807632 821807952
821808897 821809217
821820753 821821073
821822408 821822728
821824741 821825061
821826622 821826942
821831445 821831765
821833083 821833403
821834441 821834761
821840693 821841013
821872833 821873153
821873412 821873732
821909488 821909808
821915118 821915438
821969292 821969612
821990688 821991008
822003378 822003698
822012107 822012427
822032173 822032493
822077747 822078323
822081042 822081697
822085219 822085539
822088193 822088513
822088741 822089061
822089752 822090072
822090597 822090917
822092514 822092992
822094544 822094864
822174167 822174613
822175180 822175500
822175541 822175861
822182941 822183261
822185010 822185330
822282896 822283216
822290428 822290748
822290785 822291105
822323903 822324223
822327674 822327994
822352995 822353315
822353455 822354068
822394003 822394323
822422569 822422889
822423563 822424153
822425264 822425584
822426365 822426685
822427709 822428029
822428448 822428993
822429040 822429857
822430150 822430470
822435569 822435889
822483385 822483705
822484747 822485067
822527261 822527581
822529537 822529857
822535322 822535642
822544513 822544833
822546603 822546923
822567088 822567408
822612063 822612383
822635662 822635982
822636736 822637056
822668364 822668684
822697323 822697643
822737925 822738245
822738788 822739108
822759175 822759495
822777742 822778062
822813836 822814156
822816083 822816403
822817873 822818306
822819327 822819647
822827929 822828249
822842642 822843065
822873316 822873636
822874099 822874635
822874779 822875266
822890250 822890570
822890743 822891241
822892095 822892415
822914985 822915305
822915742 822916062
822916307 822916627
822920407 822920727
822951989 822952309
822952458 822952778
822966510 822966830
822971033 822971353
823012346 823012666
823012905 823013225
823018341 823018661
823019019 823019339
823019685 823020005
823029624 823029944
823033085 823033405
823080394 823080714
823080813 823081133
823082703 823083721
823083897 823084368
823084397 823084717
823084757 823085077
823085316 823086130
823088534 823089001
823089792 823090112
823090565 823090909
823091303 823091623
823091943 823092263
823092781 823093101
823100276 823100596
823101273 823101780
823101856 823102176
823103210 823103530
823104530 823104850
823336855 823337175
823337614 823338225
823387032 823387352
823388306 823388626
823390608 823390928
823401782 823402102
823424024 823424708
823452370 823452868
823452907 823453745
823460694 823461014
823461126 823461446
823488951 823489271
823493628 823493948
823493977 823494592
823495141 823495461
823495869 823496945
823497050 823497635
823499560 823499880
823505653 823505973
823506209 823506529
823506984 823507304
823509123 823509443
823509690 823510163
823512603 823512923
823513217 823513537
823516038 823516358
823532187 823532507
823536301 823536621
823539237 823539557
823547458 823547778
823548093 823548413
823548990 823549310
823553215 823553535
823554264 823554584
823556977 823557297
823557891 823558211
823559667 823559987
823562123 823562443
823564863 823565183
823567394 823567714
823568361 823568681
823569685 823570005
823615171 823615491
823633979 823634299
823726902 823727222
823734749 823735069
823735827 823736147
823741720 823742040
823760497 823760817
823761348 823761900
823764342 823764662
823764700 823765020
823808140 823808460
823811907 823812227
823819085 823819405
823819817 823820137
823823411 823823731
823850975 823851492
823853011 823853469
823854029 823854349
823856089 823856409
823862407 823862727
823863054 823863374
823876278 823876598
823926641 823927271
823927647 823928120
823928130 823928879
823999787 824000107
824008084 824008404
824053823 824054143
824054439 824056180
824056974 824057490
824066966 824067433
824068708 824069028
824069111 824069431
824071175 824071495
824071815 824072135
824091533 824091853
824118798 824119118
824143639 824144069
824155733 824156053
824157345 824158000
824159793 824160162
824163428 824164568
824186884 824187204
824187451 824187771
824217432 824217752
824217955 824218290
824220414 824220734
824225426 824225746
824226068 824226388
824226972 824227292
824227648 824229315
824230315 824230635
824279203 824279523
824286424 824286744
824286858 824287178
824334479 824334799
824340852 824341172
824341325 824341645
824341995 824342315
824352566 824352886
824354603 824354923
824359666 824360081
824397907 824398227
824430559 824430879
824431526 824431846
824502065 824502385
824502724 824503044
824503317 824503637
824512292 824512612
824512831 824513151
824513241 824513874
824514021 824514341
824514505 824514825
824514915 824515235
824515286 824515606
824568959 824569279
824570965 824571285
824582873 824583193
824589264 824589584
824591733 824592053
824592688 824593008
824596584 824596904
824597295 824597615
824629448 824629768
824662925 824663245
824668709 824669431
824669626 824669946
824669950 824670686
824674542 824674862
824684385 824684705
824686461 824686781
824690267 824690587
824695490 824695810
824768821 824769141
824773433 824773753
824775494 824775814
824777668 824777988
824827693 824828013
824844879 824845199
824992622 824992942
825101862 825102307
825114608 825114928
825170486 825170806
825170936 825171360
825171982 825172302
825174046 825174366
825213921 825214241
825215716 825216036
825216303 825216623
825246089 825246409
825250105 825250425
825250559 825250879
825253632 825253952
825255862 825256182
825257036 825257356
825258958 825259278
825259288 825259608
825260313 825260633
825261917 825262237
825263607 825263927
825263940 825264260
825264968 825265288
825265560 825265880
825266518 825266838
825268486 825268806
825277521 825278076
825279969 825280289
825280411 825280731
825280983 825281829
825282023 825282343
825283079 825283625
825284799 825285119
825285493 825285813
825286055 825286375
825286397 825286717
825287675 825287995
825288510 825288830
825290094 825290414
825291214 825291534
825291869 825292649
825292729 825293049
825293856 825294242
825294728 825295048
825295211 825295589
825296255 825296575
825296791 825297384
825297465 825297785
825307128 825307518
825307564 825308127
825309091 825309411
825309841 825310458
825312894 825313214
825313329 825313649
825318837 825319307
825321266 825321757
825322314 825322634
825323086 825323406
825323422 825323742
825324285 825324605
825325684 825326158
825328534 825328854
825329289 825329819
825329872 825330192
825337969 825338289
825355047 825355367
825372770 825373090
825379228 825379548
825383019 825383339
825383556 825383876
825383918 825384474
825384492 825384812
825385137 825385457
825396397 825396717
825396736 825397056
825397682 825398002
825482220 825482540
825530574 825530894
825539998 825540318
825545874 825546194
825592261 825592581
825593541 825593861
825594132 825594452
825616174 825616494
825654175 825654495
825739615 825739935
825744527 825744847
825747592 825747912
825764362 825764896
825770413 825771293
825795669 825795989
825800058 825800378
825810666 825811118
825815685 825816005
825822804 825823124
825875711 825876031
825876037 825876357
825889603 825889923
825890890 825891210
825891441 825891761
825916354 825916674
825956690 825957010
825958634 825958954
826064741 826065061
826066831 826067151
826070603 826071098
826071142 826071618
826071907 826072227
826072609 826073027
826176783 826177103
826177808 826178128
826178369 826179108
826179506 826179826
826180538 826180858
826181050 826181370
826189239 826189559
826190720 826191040
826191164 826191484
826230251 826230571
826230774 826231094
826232430 826232974
826317977 826318297
826322645 826322965
826322980 826323300
826328303 826328623
826356781 826357101
826360436 826360756
826362318 826362638
826363000 826363320
826380824 826381144
826382980 826383300
826387538 826387858
826404207 826404527
826406521 826406841
826407002 826407322
826407390 826407710
826407718 826408038
826409492 826409812
826409842 826410162
826410431 826410751
826410855 826411175
826411348 826411668
826412280 826412600
826412654 826412974
826413752 826414072
826415867 826416187
826416433 826416753
826416838 826417158
826417243 826417563
826417763 826418340
826418584 826418904
826420021 826420341
826420538 826420858
826421226 826421546
826422288 826422608
826423296 826423616
826428077 826428397
826428620 826429151
826469877 826470197
826479281 826479601
826489462 826489782
826547954 826548274
826549298 826549706
826549792 826550609
826551106 826551426
826643608 826643928
826666820 826667140
826667257 826667577
826669961 826670281
826671010 826671330
826730488 826730808
826731506 826731826
826810524 826810844
826812892 826813212
826814475 826814795
826854156 826854715
826855059 826855379
826855406 826855821
826858071 826858391
826920645 826920965
826922641 826922961
826923694 826924014
826924744 826925064
826925197 826925517
826926709 826927029
826958928 826959444
826966010 826966330
826966666 826966986
826992724 826993044
827006194 827006514
827013515 827013835
827015234 827015554
827016296 827016616
827018878 827019198
827019826 827020146
827020929 827021409
827021563 827021959
827022349 827022669
827023039 827023359
827042590 827042910
827093575 827093895
827161497 827161817
827175138 827175458
827237170 827237490
827238538 827238858
827267778 827268098
827268408 827268728
827292586 827292906
827293140 827293460
827294140 827294460
827354282 827354602
827355923 827356243
827513062 827513382
827514171 827514491
827514936 827515256
827516352 827516952
827784114 827784434
827819327 827819647
827849229 827849549
827853195 827853515
827987306 827987626
827987982 827988302
828116272 828116592
828121322 828121642
828123665 828124193
828130337 828130657
828153399 828153719
828154216 828154671
828157647 828157967
828220520 828220840
828225626 828225946
828226835 828227155
828284939 828285259
828290714 828291034
828298738 828299058
828304789 828305109
828306368 828306688
828306935 828307345
828309032 828309352
828311391 828311711
828312197 828312517
828313215 828313535
828314590 828314910
828323983 828324303
828337487 828337807
828338432 828338752
828342797 828343117
828344029 828344349
828360968 828361288
828362269 828362589
828362706 828363026
828368447 828368767
828369134 828369731
828371237 828371557
828372459 828372871
828378893 828379213
828381548 828381868
828384362 828384682
828387716 828388036
828388685 828389005
828396869 828397189
828400631 828400951
828426981 828427301
828427686 828428006
828428589 828428909
828429445 828429765
828432604 828432924
828437604 828437924
828462093 828462413
828475673 828475993
828485511 828485831
828488785 828489105
828490983 828491303
828504830 828505150
828551754 828552074
828556129 828556449
828561680 828562000
828573475 828573795
828578383 828578703
828582818 828583138
828585566 828585886
828587802 828588122
828619884 828620204
828621592 828621912
828623473 828623793
828623947 828624750
828625090 828625410
828625593 828625913
828626611 828626931
828673184 828673504
828673708 828674028
828674221 828674541
828677704 828678094
828680110 828680652
828680828 828681383
828682157 828682477
828682495 828682815
828683023 828683343
828683642 828683962
828683991 828684740
828684890 828685210
828685742 828686062
828686122 828686442
828687599 828687919
828688057 828688377
828689056 828689376
828694243 828694563
828698851 828699171
828701713 828702033
828716447 828716767
828718313 828718633
828719946 828721560
828721614 828721934
828721936 828722256
828722396 828722870
828723988 828724308
828730982 828731302
828732234 828732554
828746635 828746955
828749359 828749679
828751953 828752273
828807071 828807391
828808979 828809754
828811222 828811542
828891260 828891580
828896137 828896457
828921956 828922520
828924003 828924323
828926908 828927228
828978578 828978898
828982884 828983204
828983971 828984291
828985260 828985580
828985745 828986065
828987947 828988267
828997444 828997764
828998460 828998780
829002270 829002590
829013687 829014007
829023504 829023824
829024512 829024832
829067434 829067754
829069669 829069989
829070134 829070454
829071053 829071373
829075098 829075418
829075912 829076232
829079171 829079491
829081740 829082060
829086882 829087202
829099619 829099939
829114650 829114970
829117687 829118007
829118513 829118833
829174674 829174994
829178278 829178837
829178931 829179251
829179936 829180349
829180374 829180694
829180730 829181050
829181964 829182284
829182967 829183287
829184408 829184728
829186299 829186801
829190764 829191084
829192849 829193169
829198652 829198972
829214643 829214963
829217336 829217656
829217765 829218085
829218866 829219186
829219979 829220299
829223849 829224169
829225871 829226191
829229180 829229500
829234147 829234604
829248318 829248638
829249052 829249372
829335957 829336277
829336889 829337209
829338288 829338608
829339437 829339757
829340644 829340964
829341890 829342210
829342753 829343073
829380198 829380518
829380634 829380954
829381270 829381590
829382782 829383102
829395368 829395688
829397045 829397365
829399832 829400152
829401871 829402191
829410392 829410712
829411202 829411522
829413434 829413754
829414762 829415082
829419397 829419717
829420989 829421309
829424750 829425070
829425119 829425439
829425761 829426081
829437821 829438141
829439312 829439632
829439914 829440234
829440367 829440687
829457552 829457872
829458990 829459310
829497233 829497553
829601378 829601698
829611183 829611503
829634644 829635177
829654956 829655276
829726198 829726518
829727551 829727871
829744749 829745069
829860172 829860492
829890242 829890562
829950054 829950374
829950822 829951142
829981962 829982282
829982848 829983168
829983467 829983787
830036653 830036973
830039108 830039428
830044414 830044734
830044881 830045201
830096727 830097047
830097211 830097722
830099575 830099895
830114813 830115133
830117415 830117735
830127766 830128086
830140724 830141044
830155741 830156061
830187209 830187763
830188019 830188339
830196089 830196409
830342804 830343124
830365571 830365891
830368193 830368513
830387256 830387576
830401572 830401892
830428688 830429008
830452098 830452418
830462650 830462970
830463345 830463665
830465160 830465480
830490876 830491196
830639483 830639803
830643906 830644445
830645581 830646411
830646788 830647108
830647802 830648122
830648377 830649081
830650421 830650741
830652519 830652839
830653169 830653489
830653626 830653946
830654448 830654768
830655768 830656088
830656723 830657043
830657638 830657958
830659131 830659451
830660214 830660534
830661827 830662147
830663262 830663582
830664016 830664336
830695865 830696185
830697153 830697473
830705940 830706260
830716193 830716513
830718191 830718511
830727289 830727609
830815437 830815757
830827837 830828157
830833506 830833826
830845761 830846081
830869447 830869767
830881229 830881549
830892696 830893016
830895910 830896230
830904857 830905177
830985441 830985761
831056849 831057169
831057466 831057786
831064990 831065310
831065328 831065648
831096925 831097245
831104665 831104985
831134417 831134737
831134776 831135096
831135124 831135751
831135821 831136141
831136438 831136758
831147054 831147374
831147689 831148009
831173614 831173934
831242138 831242458
831412645 831412965
831419074 831419394
831420985 831421305
831454717 831455037
831495670 831495990
831498825 831499145
831501491 831501811
831508006 831508326
831510538 831510858
831511310 831511630
831582602 831582922
831591470 831591790
831611258 831611578
831616678 831616998
831621224 831621544
831689442 831689762
831695921 831696419
831696838 831697158
831742841 831743161
831765194 831765514
831766118 831766438
831811958 831812278
831852393 831852713
831934027 831934347
831935147 831935467
831956318 831956638
831982716 831983036
832008887 832009207
832019049 832019369
832029749 832030069
832030809 832031129
832100537 832100995
832109367 832109687
832128793 832129113
832130780 832131100
832131607 832131927
832133020 832133340
832141497 832142245
832142475 832142795
832144691 832145011
832145398 832145718
832148185 832148505
832165881 832166201
832170329 832170649
832171026 832171346
832171711 832172031
832172469 832172789
832175278 832175598
832179205 832179525
832180495 832180815
832182290 832182610
832185294 832185614
832197067 832197387
832197680 832198000
832198359 832198679
832199202 832199696
832200305 832200625
832200919 832201239
832201791 832202111
832202488 832202808
832273525 832273845
832277361 832277747
832331747 832332067
832335967 832336287
832341411 832341731
832343824 832344144
832347656 832347976
832348360 832348680
832351755 832352075
832353628 832353948
832360626 832360946
832364218 832364538
832365501 832365821
832366987 832367307
832373191 832373511
832375135 832375455
832376403 832376723
832404322 832404642
832406519 832406839
832423150 832423470
832424189 832424509
832424629 832424949
832435617 832435937
832443872 832444192
832448550 832448870
832454591 832454911
832455427 832455747
832479838 832480158
832530176 832530496
832534976 832535296
832535353 832535673
832542550 832542870
832603287 832603607
832605222 832605738
832615021 832615341
832622017 832622337
832650605 832650925
832651262 832651582
832652834 832653154
832653419 832653739
832682545 832682865
832683034 832683354
832684123 832684443
832685975 832686295
832699719 832700039
832713989 832714309
832717159 832717479
832718865 832719185
832719301 832719621
832725256 832725576
832802668 832802988
832803241 832803561
832804960 832805280
832806866 832807186
832807588 832807908
832812537 832812857
832813600 832813920
832822989 832823309
832823816 832824372
832837241 832837561
832882966 832883286
832923567 832923887
832926139 832926459
832950582 832950902
832951073 832951393
832953045 832953365
833007591 833007911
833035618 833036093
833036825 833037145
833040157 833040477
833051351 833051671
833051754 833052074
833057906 833058226
833058395 833058715
833059004 833059324
833060147 833060467
833061543 833061863
833062153 833062473
833069173 833069493
833089645 833089965
833091164 833091484
833122107 833122427
833140803 833141123
833147255 833147575
833227912 833228232
833228439 833228759
833235203 833235523
833292360 833292680
833292753 833293073
833304650 833304970
833317921 833318241
833318808 833319128
833320135 833320455
833324044 833324364
833393800 833394120
833398074 833398394
833412442 833412762
833418045 833418365
833425439 833425759
833430809 833431129
833433235 833433555
833451118 833451438
833480320 833480640
833576858 833577178
833578450 833578770
833654275 833654595
833656665 833656985
833659322 833659642
833663484 833663804
833681848 833682168
833731303 833731623
833742338 833742658
833743100 833743420
833752314 833752634
833753675 833753995
833771856 833772176
833794778 833795098
833795873 833796193
833811829 833812149
833847375 833847695
833869624 833869944
833917751 833918071
833920062 833920382
833923440 833923760
833936835 833937155
833947546 833947866
833949484 833949804
834037321 834037641
834047971 834048291
834051727 834052047
834069549 834069869
834091993 834092313
834092986 834093306
834094350 834094670
834097711 834098031
834098239 834098559
834105138 834105458
834106639 834106959
834117413 834117733
834126723 834127043
834178769 834179089
834183072 834183392
834189219 834189539
834193584 834193904
834206167 834206487
834206911 834207231
834218894 834219214
834261293 834261613
834262391 834262711
834270519 834270839
834282037 834282357
834282712 834283032
834283334 834283654
834294394 834294714
834297861 834298181
834301935 834302721
834307674 834307994
834308129 834308449
834312197 834312517
834312705 834313025
834314760 834315080
834323745 834324065
834325194 834325514
834327352 834327672
834329035 834329355
834345815 834346368
834347393 834347713
834351600 834351920
834368512 834368832
834374697 834375017
834420983 834421303
834421312 834421632
834424285 834424605
834435515 834435835
834437786 834438106
834442483 834442803
834509312 834509632
834510798 834511118
834511554 834511874
834515756 834516076
834520129 834520449
834524274 834524594
834544142 834544462
834546650 834546970
834548237 834548557
834549645 834550188
834550394 834550714
834550748 834551068
834551359 834551943
834553312 834553632
834553723 834554043
834554635 834554955
834568186 834568506
834571200 834571520
834572029 834572349
834596630 834596950
834614937 834615257
834617141 834617461
834622848 834623168
834623752 834624072
834624426 834624746
834631938 834632258
834634719 834635039
834636601 834636921
834642546 834642866
834646503 834646823
834649765 834650085
834656922 834657242
834660818 834661138
834665150 834665470
834667179 834667499
834676229 834676549
834676912 834677232
834687733 834688053
834691100 834691420
834707485 834707805
834707820 834708520
834715909 834716229
834723892 834724212
834727102 834727422
834731710 834732030
834733090 834733410
834744432 834744752
834778641 834778961
834781879 834782199
834787777 834788351
834795908 834796228
834803567 834803887
834833060 834833380
834841024 834841344
834844475 834844795
834846555 834846875
834851121 834851441
834852525 834852845
834860801 834861121
834863046 834863366
834865658 834865978
834873833 834874153
834878078 834878398
834896168 834896488
834906090 834906410
834930398 834930718
834932813 834933133
834950356 834950676
834950850 834951416
834952383 834952703
834953252 834953572
834960417 834960737
834963563 834963883
835005681 835006001
835009398 835009718
835020250 835020570
835039721 835040041
835041307 835041627
835042299 835042619
835047590 835047910
835102089 835102409
835103028 835103348
835149546 835149866
835212343 835212663
835250276 835250596
835253915 835254235
835260826 835261356
835264274 835264594
835265948 835266268
835275744 835276064
835392178 835392498
835397896 835398216
835401049 835401369
835404394 835404714
835412444 835413341
835414285 835414605
835450023 835450343
835450538 835450858
835456220 835456540
835458963 835460368
835460382 835461027
835461082 835462467
835466835 835467155
835470341 835470661
835470666 835470986
835472323 835473265
835473503 835473823
835475067 835475387
835475555 835475875
835476324 835476644
835480040 835480360
835480983 835481303
835482877 835483197
835486604 835486924
835498876 835499196
835503714 835504034
835505935 835506255
835508629 835508949
835517113 835517433
835518498 835518818
835551553 835551873
835555590 835555910
835565657 835565977
835567474 835567794
835643689 835644009
835648019 835648339
835669396 835669716
835696807 835697127
835697666 835697986
835721838 835722158
835770743 835771063
835804324 835804644
835814416 835814736
835818136 835818456
835888399 835888719
835888860 835889180
835895139 835895459
835954329 835954649
835958886 835959741
835961442 835961762
835978783 835979103
835984116 835984436
836063473 836063793
836080676 836080996
836081346 836081666
836081972 836082292
836097890 836098210
836163638 836163958
836165683 836166003
836170078 836170398
836172382 836172702
836183857 836184177
836188656 836188976
836197393 836197713
836198755 836199075
836202422 836202742
836221960 836222280
836234592 836234912
836247761 836248081
836259712 836260032
836306121 836306441
836331634 836331954
836333565 836333885
836335197 836335517
836352727 836353047
836354191 836354511
836356467 836356787
836361837 836362157
836379075 836379395
836391267 836391587
836395952 836396272
836412523 836412843
836426845 836427165
836453909 836454229
836459668 836459988
836465112 836465432
836468325 836468645
836472313 836472633
836478295 836478615
836502298 836502618
836514008 836514328
836578703 836579023
836579784 836580104
836583440 836583760
836593986 836594306
836603736 836604056
836604966 836605286
836607240 836607560
836609978 836610298
836616848 836617168
836632761 836633081
836649085 836649405
836664944 836665519
836709927 836710247
836740721 836741041
836762287 836762607
836766361 836766681
836769072 836769392
836771116 836771436
836771602 836771922
836771989 836772309
836776342 836776662
836782076 836782396
836793060 836793380
836800481 836800801
836858146 836858466
836861767 836862087
836862326 836862646
836929006 836929326
836932092 836932412
836943259 836943579
836948857 836949177
836953315 836953635
836958102 836958422
836965096 836965416
836965930 836966250
837025889 837026209
837033725 837034045
837038068 837038388
837070852 837071172
837071248 837071568
837078622 837078942
837080800 837081120
837085887 837086207
837093161 837093481
837109052 837109372
837124910 837125230
837135027 837135347
837155998 837156318
837162864 837163184
837163365 837163938
837163949 837164996
837167383 837169296
837176690 837177010
837188538 837188858
837193507 837193827
837194262 837194582
837202180 837202626
837204707 837205027
837222278 837222598
837223433 837223753
837322025 837322345
837330201 837330521
837330720 837331040
837344611 837344931
837347058 837347378
837369534 837369854
837442140 837442460
837444000 837444320
837446606 837446926
837474677 837474997
837479671 837479991
837505911 837506231
837509566 837509886
837510859 837511179
837511822 837512491
837512936 837513256
837515526 837515846
837516949 837517269
837523998 837524318
837553939 837554259
837555742 837556062
837556893 837557213
837560493 837560813
837561929 837562249
837562506 837563071
837564870 837565190
837565452 837565772
837569252 837569572
837573236 837573556
837600188 837600508
837601416 837601736
837628312 837628632
837628858 837629178
837636320 837636640
837641680 837642000
837644036 837644356
837651942 837652262
837667936 837668256
837723737 837724057
837766521 837766841
837778266 837778586
837787268 837787588
837788904 837789224
837815471 837815791
837832387 837832707
837833506 837833826
837834272 837834592
837835907 837836227
837843243 837843563
837865943 837866263
837872564 837872997
837873132 837873775
837893836 837894156
837899005 837899325
837900762 837901082
837909281 837909601
837924290 837924610
837924875 837925195
837959919 837960467
837961257 837961577
837961657 837961977
837961987 837962307
837962429 837963044
837963943 837964482
837964718 837965038
837965389 837965709
837965817 837966840
837967057 837967377
837967866 837968186
837969654 837969974
837970156 837970476
837970602 837970922
837972674 837972994
837978544 837978864
837979059 837979379
838041805 838042125
838042469 838042789
838064554 838064874
838065024 838065344
838071505 838071825
838078957 838079277
838087172 838087492
838088175 838088495
838088704 838089024
838108401 838108721
838150982 838151302
838153972 838154292
838160233 838160553
838225050 838225683
838225866 838226186
838226784 838227104
838227291 838227611
838228559 838228879
838229776 838230096
838230822 838231142
838231332 838231652
838231858 838232429
838233301 838233621
838233662 838233982
838234878 838235443
838235856 838236176
838238561 838238881
838257947 838258267
838292723 838293043
838293189 838293509
838293781 838294101
838294157 838294477
838297065 838297385
838297708 838298028
838298128 838298448
838298542 838298862
838300457 838300777
838301220 838301540
838301789 838302704
838302973 838303293
838303751 838304343
838304459 838304954
838304987 838305692
838309104 838309424
838310081 838310401
838310671 838311252
838373677 838373997
838399504 838399824
838406353 838406673
838406869 838407189
838407964 838408284
838410391 838410711
838415427 838415747
838416953 838417544
838417640 838418119
838419172 838419492
838469765 838470085
838480310 838480630
838482861 838483181
838483870 838484190
838487752 838488072
838569424 838569744
838609826 838610146
838610948 838611576
838629601 838629921
838635760 838636080
838663079 838663399
838664368 838664688
838822617 838822937
838823230 838823653
838823663 838824047
838824916 838825351
838844153 838844473
838925180 838925500
838925621 838925941
838926108 838926507
839021600 839021920
839022766 839023086
839025065 839025385
839033929 839034249
839065069 839065389
839084565 839084885
839121427 839121747
839124884 839125204
839127728 839128048
839184652 839184972
839185866 839186186
839193190 839193510
839201760 839202080
839229072 839229392
839247710 839248030
839248399 839248719
839254578 839254898
839256368 839256688
839267099 839267419
839297705 839298025
839300105 839300425
839305651 839305971
839337921 839338241
839361300 839361620
839363614 839363934
839384799 839385119
839531950 839532587
839605206 839605526
839626492 839626812
839629585 839629905
839645016 839645336
839680431 839680751
839690773 839691093
839718669 839718989
839721963 839722283
839801313 839801633
839808207 839808527
839848807 839849127
839863869 839864189
839956953 839957273
839964516 839964836
839965383 839965703
839977649 839977969
840039681 840040001
840049261 840049581
840083822 840085198
840085204 840085773
840085819 840086139
840206444 840206764
840243987 840244307
840305967 840306287
840319135 840319455
840327180 840327500
840327885 840328205
840332313 840332633
840336335 840336655
840337183 840337503
840339426 840339746
840342167 840342487
840344342 840344662
840347079 840347399
840348132 840348452
840348986 840349306
840354104 840354424
840363247 840363567
840366487 840366807
840370648 840370968
840373106 840373426
840405128 840405448
840416556 840416876
840417627 840417947
840418510 840418830
840491993 840492313
840502622 840502942
840514489 840514809
840516463 840516783
840543267 840543587
840544616 840545153
840576646 840576966
840580783 840581103
840648617 840648937
840649467 840649862
840671281 840671601
840737668 840737988
840740745 840741065
840836510 840836830
840857930 840858250
840859785 840860105
840872238 840872558
840872836 840873156
840873549 840873869
840873907 840874227
840874240 840874560
840882629 840882949
840890005 840890325
840890821 840891141
840892079 840892399
840894992 840895312
840896486 840896806
840897972 840898292
840914772 840915092
840915502 840915822
840916116 840916436
840919267 840919587
840926703 840927023
840927025 840927947
840928172 840928492
840928635 840928955
840929138 840929458
840933249 840933569
840940776 840941096
840942735 840943055
840944937 840945257
840946099 840946622
840946640 840946960
840963750 840964956
840966055 840966375
840996442 840996762
840996933 840997253
841019189 841019509
841020838 841021158
841025181 841025501
841026354 841026674
841029291 841029611
841035354 841035674
841043538 841043858
841046781 841047101
841050481 841050801
841053602 841053922
841066958 841067278
841068487 841068807
841069008 841069328
841069679 841069999
841070381 841070701
841071706 841072026
841073014 841073334
841074483 841074803
841075518 841075838
841077839 841078159
841084459 841084779
841084804 841085124
841086461 841086781
841094368 841094688
841098260 841098580
841143780 841144100
841147828 841148148
841148510 841149045
841153781 841154101
841160069 841160389
841171566 841171886
841176867 841177187
841236724 841237044
841262320 841262640
841342880 841343200
841503904 841504224
841513737 841514057
841519793 841520113
841522029 841522349
841525703 841526023
841554514 841554834
841555828 841556148
841768846 841769166
841792440 841792760
841934594 841934914
842037027 842037347
842048451 842048771
842103814 842104134
842115859 842116179
842117053 842117373
842118749 842119069
842123492 842123812
842128578 842128898
842131735 842132055
842133987 842134307
842134808 842135128
842135587 842135978
842136274 842136594
842137102 842137422
842200336 842200656
842202417 842202737
842202935 842203255
842205436 842205756
842219593 842219913
842309448 842309768
842385172 842385492
842396936 842397256
842409246 842409566
842492069 842492389
842511426 842511746
842728111 842728431
842729858 842730178
842730756 842731595
842733157 842733477
842803534 842803854
842816152 842816472
842817147 842817467
842821911 842822231
842831223 842831543
842884481 842884801
842903601 842903921
842913575 842913895
842916923 842917243
842921445 842921765
842928259 842928579
842973268 842973588
842973710 842974030
842987094 842987414
842997982 842998302
843167726 843168046
843331422 843331742
843414256 843414576
843421647 843421967
843427549 843427869
843460449 843460769
843461478 843461798
843461800 843462262
843506089 843506409
843506874 843507194
843507932 843508252
843512810 843513130
843514487 843514807
843571106 843571426
843572997 843573317
843589789 843590109
843590783 843591103
843593665 843594201
843604905 843605225
843721516 843721836
843729369 843729689
843735703 843736023
843742524 843742844
843744526 843744846
843745021 843746033
843753455 843753775
843860118 843860438
843887065 843887385
844097060 844097380
844201159 844201479
844310931 844311251
844510270 844510590
844526453 844526773
844967723 844968043
845065031 845065351
845222947 845223267
845398948 845399268
845400063 845400383
845406862 845407182
845410573 845410893
845421367 845421687
845429780 845430100
845430805 845431125
845504058 845504378
845540415 845540735
845590644 845590964
845669185 845669505
845735034 845735354
845744374 845744694
845745746 845746977
845752891 845753211
845754533 845754853
845765334 845765654
845765727 845766047
845766624 845766944
845770766 845771226
845773462 845774720
845775517 845776716
845776864 845777466
845784608 845785219
845795783 845796103
845811373 845811939
845823596 845823916
845827658 845827978
845838957 845839277
845840950 845841270
845849123 845849443
845849669 845849989
845850420 845850740
845850898 845851290
845852156 845853266
845886457 845886777
845890367 845890687
845895279 845895599
845900770 845901090
845926285 845926605
845929712 845930032
845931083 845931403
845942677 845942997
845959882 845960202
846024014 846024334
846025844 846026164
846026420 846026740
846095557 846095877
846106889 846107209
846173360 846173680
846345377 846345697
846377820 846378321
846540010 846540330
846641638 846641958
846646183 846646503
846826553 846826873
846880298 846880618
846896677 846896997
846903881 846904201
846908452 846908772
846909098 846909418
846916192 846916512
846918112 846918432
846922584 846922904
846929718 846930038
846935373 846935693
846940020 846940340
846942370 846942690
846946408 846946728
846961558 846961878
846965651 846965971
846969412 846969732
846976992 846977312
846979767 846980087
846985552 846985872
846993888 846994208
847000616 847000936
847016552 847016872
847035968 847036288
847052488 847052808
847054621 847054941
847059098 847059418
847062863 847063183
847068079 847068399
847089901 847090963
847091461 847092554
847093341 847094600
847134082 847135321
847136942 847137262
847137357 847137677
847155630 847156172
847162137 847162692
847163650 847163970
847164357 847164714
847165605 847165925
847166057 847166377
847166883 847167203
847171904 847172482
847240666 847240986
847243870 847244190
847244751 847245071
847245336 847246073
847247939 847248259
847249070 847249427
847249436 847249882
847250332 847250793
847261771 847262516
847262712 847263167
847263446 847264057
847337692 847338012
847340555 847340916
847342778 847343246
847343654 847343974
847344466 847344786
847344794 847345444
847345821 847346141
847347024 847347344
847347451 847347771
847417109 847417429
847469283 847469603
847583361 847583852
847584306 847584626
847590370 847590690
847599189 847599509
847601025 847601345
847604949 847605269
847636258 847637477
847639180 847639500
847733718 847734038
847753417 847753737
847770709 847771029
847771466 847771786
847772486 847772806
847887202 847887522
847901780 847902100
847915364 847915684
847955144 847955464
848087030 848087350
848087626 848088503
848095930 848096250
848330584 848330904
848629995 848630315
848765117 848765437
848781193 848781513
848795911 848796231
848797670 848797990
848799059 848799379
848855633 848855953
848856006 848856326
848858819 848859399
848878290 848878610
848897231 848897551
848944307 848944627
848963735 848964055
849050333 849050653
849053459 849053779
849112162 849112482
849213030 849213350
849214785 849215105
849304486 849304806
849376349 849376669
849376821 849377141
849391988 849392799
849394231 849394866
849396483 849397027
849427490 849427810
849554410 849554730
849711499 849711819
849729304 849729624
849750997 849751317
849792529 849793646
849793649 849794224
849903522 849904209
849904389 849905000
849905519 849906311
849906560 849906880
849908401 849908721
849908751 849909071
849911690 849912256
849912375 849913493
849913779 849914099
849914120 849914995
849915067 849916071
849916153 849917352
849918799 849919495
849919509 849920747
849920876 849921196
849921328 849922867
849922957 849923365
849923450 849924223
849927269 849927724
849927755 849928965
849929196 849930110
849998434 849998946
850097597 850097917
850097929 850098249
850098500 850099239
850099426 850099771
850099924 850100411
850112258 850112776
850112877 850113321
850113535 850114439
850114705 850115399
850115516 850116381
850137768 850138088
850161563 850161883
850188884 850189204
850189934 850190575
850190824 850191144
850193954 850194616
850194620 850195640
850195712 850196494
850196504 850196824
850197229 850197750
850278280 850279002
850279315 850279635
850279669 850279989
850280450 850280770
850514485 850514805
850517990 850518310
850582862 850583182
850595543 850595863
850643019 850643339
850679371 850679691
850692242 850692562
850715813 850716133
850718510 850719410
850723174 850723714
850723848 850724398
850725580 850725900
850729160 850730023
850730385 850733533
850733534 850734561
850735565 850736072
850736760 850737080
850737166 850737917
850737989 850738518
850738527 850739436
850739761 850740566
850740677 850741963
850742051 850743063
850743139 850745118
850746527 850749700
850750325 850754308
850754337 850755510
850755607 850756200
850756205 850756971
850756981 850757321
850758055 850758904
850759137 850760199
850767755 850768753
850768845 850769207
850770631 850771144
850771258 850773581
850773970 850774290
850774955 850775860
850776005 850776543
850776565 850777219
850778369 850778689
850784264 850784707
850856873 850857193
851038862 851039182
851083082 851084634
851111319 851111639
851210055 851210375
851210546 851211172
851211638 851212066
851212094 851212414
851213464 851213784
851215829 851217127
851217212 851219330
851219340 851220420
851220931 851223521
851223572 851224035
851224053 851224503
851224780 851229214
851229235 851229780
851229829 851230163
851230722 851231159
851231234 851231554
851231670 851231990
851232459 851234427
851234575 851235152
851235512 851235946
851236066 851237233
851237556 851237876
851237877 851238736
851238887 851239359
851240084 851240404
851241338 851241658
851242250 851243281
851243680 851244283
851244484 851245616
851249221 851250150
851250180 851250593
851251312 851252937
851253000 851253781
851253821 851254421
851254524 851255199
851255275 851255749
851255918 851256238
851256576 851257354
851257416 851257930
851258209 851258834
851266758 851267078
851267080 851267943
851268824 851271935
851272139 851272894
851273027 851273347
851273403 851274476
851274515 851275321
851278172 851278492
851285074 851285431
851285613 851285933
851286372 851286948
851288164 851288484
851288992 851289312
851300928 851301248
851308975 851309295
851310113 851310433
851310632 851310952
851333678 851333998
851334132 851334700
851334856 851335176
851338581 851338901
851341488 851341808
851348471 851348791
851351924 851352244
851354359 851354679
851358974 851359294
851361061 851361381
851369366 851369686
851514806 851515296
851864205 851864525
851865076 851865396
851939975 851940295
851940512 851940832
851942307 851943903
851944628 851945120
851982152 851982472
852019238 852020182
852020296 852020966
852021603 852021976
852022026 852022346
852047789 852048109
852054843 852055163
852216078 852216398
852323438 852323758
852393210 852393530
852427818 852428138
852429464 852429784
852440076 852440396
852441735 852442185
852493268 852493588
852566245 852566565
852644877 852645197
852646371 852646939
852648661 852649115
852697986 852698306
852828261 852828581
852920954 852921274
852923240 852923560
852998238 852998558
853196716 853197036
853197372 853197941
853197993 853198313
853198530 853198850
853264001 853264321
853272966 853273286
853315995 853316315
853420830 853423109
853483072 853483392
853604525 853604845
853604849 853605169
853688626 853688946
853700983 853701303
853701905 853702827
853721616 853721936
853747180 853747500
853796253 853796573
853838685 853839005
853918002 853918322
853918902 853919733
853933061 853933381
853993499 853993819
853993921 853994241
853994266 853994586
853995272 853995592
854054917 854055439
854056227 854056547
854123068 854123388
854171866 854172186
854172227 854172725
854172811 854173131
854173148 854173626
854173951 854174271
854198229 854198549
854228987 854229307
854231608 854231928
854234660 854235409
854236240 854236560
854236696 854237374
854288367 854288687
854293119 854293439
854311862 854312182
854313630 854314182
854314376 854314929
854315644 854315964
854658313 854658633
854662046 854662715
854663387 854663707
854666471 854666791
854813407 854813727
854817767 854818087
854919403 854919723
854923985 854924305
855120335 855120655
855121276 855121596
855122213 855122533
855122683 855123003
855243384 855243704
855312452 855312772
855354067 855354387
855354591 855354911
855355087 855355407
855356370 855356816
855414393 855414713
855445420 855445974
855449713 855450187
855558150 855558470
855707576 855708260
855709203 855709523
855712852 855713172
855901509 855901829
855953603 855953923
855987045 855987365
855988210 855988530
856058204 856058524
856201767 856202087
856322017 856322511
856396766 856397086
856451148 856451468
856471165 856471485
856528705 856529025
856529401 856529721
856572596 856573256
856573476 856574261
856574386 856574812
856639231 856640729
856641083 856642188
856650904 856651224
856653425 856653745
856778880 856779200
856780600 856780920
856903092 856903412
856904817 856905137
856910863 856911183
856911824 856912144
857169268 857169815
857248835 857249155
857249192 857249512
857366744 857367064
857406416 857406736
857673231 857673551
857737116 857737436
857852493 857852813
857853073 857853481
857854110 857854566
857854604 857854924
857855312 857855632
857857076 857857889
857857928 857858248
857858506 857859023
857859084 857859404
857860089 857860409
857995228 857995548
858024374 858024694
858184991 858185311
858274360 858274680
858777090 858777410
858792780 858793100
858886395 858886715
858964065 858964385
858966246 858966566
858985549 858985869
859127647 859127967
859155425 859155745
859399931 859400251
859647895 859648215
859722635 859723211
859723630 859724020
859758226 859758546
859758742 859759062
859759375 859759969
859762292 859762612
859766971 859767291
859782831 859783361
859852101 859852421
859865382 859865702
859922101 859922421
859922669 859922989
859924757 859925077
859925145 859925465
859937555 859937875
859965667 859965987
860280078 860280674
860341481 860341801
860342981 860343301
860366145 860366465
860371188 860371508
860440988 860441308
860543408 860543728
860789291 860789611
860888742 860889731
860944687 860945007
860988136 860988709
861025261 861025581
861124314 861124634
861125831 861126151
861128309 861128629
861130540 861130860
861134549 861134869
861135295 861135615
861136103 861136423
861137531 861138163
861138959 861139342
861140943 861141263
861142902 861143222
861158534 861158854
861159885 861160205
861162730 861163050
861164885 861165205
861173529 861173849
861320399 861320719
861330494 861330814
861357102 861357422
861357709 861358029
861369625 861369945
861391599 861391919
861652887 861653207
861764601 861764921
861780126 861780446
861824192 861824512
861919897 861920217
862067996 862068316
862081174 862081599
862085325 862085768
862086123 862086739
862086981 862087409
862130464 862130784
862158436 862158756
862356130 862356450
862385030 862385389
862673497 862673817
862685738 862686474
862688104 862688671
862870998 862871318
862957976 862958296
863216946 863217266
863276957 863277277
863277368 863277688
863344394 863344714
863344738 863345503
863532177 863532497
863534874 863535194
863573034 863574067
863771133 863771688
863884237 863884557
863982938 863983258
863984360 863984680
864257748 864258068
864612145 864612465
865015536 865015856
865019908 865020228
865034977 865035297
865035522 865035842
865036269 865036589
865057146 865057466
865079294 865079614
865079751 865080946
865081021 865082353
865083074 865083530
865083982 865084302
865084874 865085194
865085553 865086119
865086935 865087255
865088859 865089179
865092924 865093244
865094945 865095265
865115039 865115359
865269740 865270060
865354769 865355351
865361877 865362492
865373663 865373983
865376275 865376789
865383827 865384208
865645707 865646027
865743314 865743634
865864230 865864550
865885231 865885551
865894575 865895101
865895429 865895836
865895952 865896458
865896671 865897221
866134907 866135227
866300558 866300878
866301051 866301371
866386575 866386895
866447382 866447702
866468976 866469296
866497414 866497734
866651490 866651810
866656072 866656392
866775207 866775789
866775943 866776263
866776734 866777054
866778311 866778631
866778649 866778969
866778975 866779295
866779303 866779904
866780053 866780579
866780655 866781508
866781961 866782281
866782383 866783067
866783505 866783825
866838737 866839057
866906632 866906952
867036678 867037601
867037901 867038221
867170829 867171149
867353129 867353532
867354370 867354791
867354910 867355230
867355408 867355990
867356040 867356702
867538946 867539266
867539443 867539793
867545606 867545926
867549666 867549986
867550221 867550657
867550950 867551291
867551417 867551737
867689589 867689909
867690253 867690573
867690591 867690945
867693422 867693742
867694275 867694595
867695906 867697208
867697289 867697746
867697770 867698243
867698262 867699398
867699469 867699861
867699910 867700268
867700708 867701028
867701184 867701504
867701852 867702260
867705651 867705971
867706584 867706904
867707554 867707874
867707908 867708445
867709179 867710372
867711059 867712075
867712705 867713025
867714852 867715172
867716212 867716792
867717822 867718142
867721535 867721855
867721863 867722309
867722542 867723188
867724021 867724341
867724541 867725093
867725129 867725598
867726252 867726837
867727892 867728212
867729344 867729821
867736822 867737142
867766546 867766939
867836849 867837329
867837398 867837718
867838152 867838472
867838621 867838941
867841230 867841550
867853993 867854313
867855477 867855797
867858787 867859107
867859239 867859695
867860510 867860830
867861092 867861412
867862257 867862676
867862751 867863262
867863299 867863619
867864015 867864335
868114697 868115017
868120830 868121150
868137879 868138199
868399192 868399512
868726959 868727279
868835632 868835952
868836456 868836776
868839190 868839510
868839689 868840009
868840155 868840475
868840893 868841213
868864963 868865283
869051365 869051754
869325453 869325773
869326058 869326686
869326720 869327040
869343035 869343468
869343548 869343868
869343981 869344301
869344941 869345261
869345486 869345806
869346305 869346625
869466217 869466618
869466782 869467855
869831477 869831797
870007495 870007815
870059865 870060185
870177883 870178203
870274326 870274936
870403856 870404176
870542050 870542370
870543330 870543650
870545847 870546167
870548338 870548658
870560000 870560320
870568225 870568545
870743015 870743335
870743994 870744314
870763678 870763998
870815182 870815502
870905933 870906253
870980983 870981303
871016628 871016948
871032505 871032979
871075827 871076147
871150800 871151120
871291502 871291822
871291929 871293006
871293017 871293541
871295108 871295976
871329498 871329818
871673374 871673694
871677349 871677930
872016641 872016961
872129931 872130251
872242587 872242907
872515632 872516644
872517195 872517825
872534380 872534700
872539236 872539556
872564682 872565002
872626246 872626566
872712347 872712918
872714015 872714335
872737735 872738055
873081651 873081971
873103478 873103798
873119786 873120106
873145492 873145812
873147559 873147879
873149606 873150139
873150354 873150674
873179433 873179753
873482094 873482414
873482833 873483153
873507391 873507711
873509767 873510087
873558992 873559312
873642312 873642632
873642676 873643071
873643092 873644272
873645296 873645812
873670103 873670423
873759413 873759733
873959120 873959440
873994927 873995247
874132550 874132870
874162761 874163081
874347684 874348004
874349507 874349924
874779420 874779740
874780678 874780998
874781343 874781663
874781666 874782100
874782759 874783628
874847992 874848312
874848460 874849520
874849679 874849999
874857665 874857985
874864969 874865289
874867466 874867786
874935219 874935636
874945763 874946083
874947675 874947995
874948256 874949145
874949278 874949598
874950283 874950603
874950972 874951292
874951405 874951918
