815201438 815201455
815203261 815203278
815205008 815205025
815213639 815213656
815213726 815213743
815235464 815235481
815236320 815236337
815237491 815237508
815241851 815241868
815252434 815252451
815301549 815301566
815302526 815302543
815310621 815310638
815310843 815310860
815310849 815310866
815314544 815314561
815314865 815314882
815320556 815320573
815321656 815321673
815322621 815322638
815323906 815323923
815327403 815327420
815328942 815328959
815329379 815329396
815367629 815367646
815387178 815387195
815388101 815388118
815388541 815388558
815388946 815388963
815389730 815389747
815393049 815393066
815394224 815394241
815397755 815397772
815399723 815399740
815401917 815401934
815402002 815402019
815403126 815403143
815405988 815406005
815406607 815406624
815406648 815406665
815407780 815407797
815413366 815413383
815413487 815413504
815413603 815413620
815413653 815413670
815466926 815466943
815467222 815467239
815467398 815467415
815467958 815467975
815468062 815468079
815468136 815468153
815468283 815468300
815468993 815469010
815469269 815469286
815469322 815469339
815469530 815469547
815469704 815469721
815469747 815469764
815469784 815469801
815469889 815469906
815469917 815469934
815470356 815470373
815470411 815470428
815470509 815470526
815474269 815474286
815474434 815474451
815476996 815477013
815477457 815477474
815477527 815477544
815477602 815477619
815545067 815545084
815596696 815596713
816034998 816035015
816036544 816036561
816052490 816052507
816281271 816281288
816281404 816281421
816289322 816289339
816789401 816789418
816899043 816899060
817068258 817068275
817082592 817082609
817254470 817254487
817335941 817335958
817554471 817554488
817870643 817870660
817870653 817870670
818357121 818357138
818687205 818687222
818885411 818885428
818945604 818945621
818965430 818965448
819068923 819068940
819193004 819193021
819228496 819228513
819392410 819392427
819392416 819392433
819392491 819392508
819424103 819424122
819600682 819600699
819600691 819600708
819666043 819666060
819802030 819802047
819842672 819842689
819914967 819914985
819918223 819918240
819929608 819929625
819968541 819968558
819968561 819968578
819968565 819968582
819968570 819968590
819969100 819969118
820142073 820142090
820147341 820147358
820359787 820359804
820360251 820360268
820360315 820360332
820362107 820362124
820367487 820367504
820377178 820377195
820384893 820384910
820624671 820624688
820647632 820647649
820778894 820778911
820782773 820782790
820894184 820894201
821043140 821043157
821046111 821046128
821046211 821046228
821047689 821047706
821049077 821049094
821098683 821098700
821098708 821098726
821182398 821182415
821340222 821340239
821602343 821602360
822003395 822003412
822089766 822089783
822092525 822092542
822384728 822384745
822430202 822430219
822434182 822434199
822435592 822435609
822527221 822527238
822541497 822541514
822544519 822544536
822546604 822546621
822546611 822546628
822546631 822546649
822612163 822612180
822714129 822714146
822714137 822714154
822723566 822723585
822795976 822795993
822798647 822798664
822804560 822804577
822827434 822827451
822846274 822846291
822855446 822855463
822860703 822860720
822942947 822942964
822946521 822946538
823019033 823019050
823090872 823090889
823090916 823090933
823092852 823092869
823410999 823411016
823878103 823878120
823881586 823881603
824203736 824203753
824203903 824203920
824203908 824203925
824204089 824204106
824205026 824205043
824207338 824207355
824208932 824208949
824209249 824209266
824210281 824210298
824210710 824210727
824218617 824218634
824219267 824219284
824219684 824219701
824222400 824222417
824222655 824222672
824223556 824223573
824386718 824386735
824396401 824396418
824473307 824473324
824499945 824499962
824513566 824513583
824667675 824667692
824668722 824668739
824782148 824782165
825100406 825100423
825176939 825176956
825290122 825290139
825290134 825290151
825290140 825290157
825290178 825290195
825290186 825290203
825291232 825291249
825291252 825291269
825291262 825291280
825291281 825291301
825291291 825291308
825291906 825291923
825291914 825291931
825291927 825291944
825291933 825291950
825294748 825294766
825294761 825294778
825294773 825294790
825343369 825343386
825345449 825345466
825628725 825628742
825652495 825652512
825956539 825956556
825968461 825968478
825969459 825969476
825970139 825970156
825975481 825975498
825977680 825977697
826010809 826010826
826045560 826045577
826070623 826070640
826070628 826070645
826101053 826101070
826150632 826150649
826180562 826180579
826202740 826202757
826209364 826209381
826309288 826309305
826362525 826362542
826410716 826410733
826434514 826434531
826474073 826474090
826475544 826475561
826579695 826579712
826586743 826586760
826666974 826666991
826671029 826671046
826671034 826671051
826722207 826722224
826727486 826727503
826926727 826926744
826989188 826989205
827258390 827258407
827332350 827332367
827424030 827424047
827514960 827514977
827591070 827591087
828056093 828056110
828344055 828344072
828592613 828592630
828752095 828752112
828891472 828891489
828891485 828891502
828891498 828891516
828931680 828931697
829013744 829013761
829081763 829081780
829081769 829081786
829081857 829081882
829220009 829220026
829223877 829223894
829223899 829223916
829316623 829316640
829317877 829317894
829381292 829381315
829381302 829381319
829381310 829381329
829381319 829381336
829381324 829381342
829381329 829381350
829381337 829381356
829381347 829381366
829381353 829381370
829381359 829381378
829381367 829381384
829381374 829381391
829381380 829381399
829439336 829439353
829439352 829439369
829439962 829439979
829543567 829543584
829770418 829770435
829944543 829944560
830099602 830099619
830110805 830110822
830129186 830129203
830196115 830196132
830196123 830196140
830196324 830196341
830497711 830497728
830530881 830530898
831237845 831237862
831240152 831240169
