862090395 862090412
862115502 862115519
862169711 862169728
862173663 862173680
862240994 862241011
862242826 862242843
862245526 862245543
862245557 862245574
862246243 862246260
862246705 862246722
862326458 862326475
862328148 862328165
862330179 862330196
862351898 862351915
862412392 862412409
862414151 862414168
862417348 862417365
862442277 862442294
862501797 862501814
862503477 862503494
862505387 862505404
862509859 862509876
862513314 862513331
862587483 862587500
862608386 862608403
862693726 862693743
862759897 862759914
862763062 862763079
862766193 862766210
862772309 862772326
862846515 862846532
862849016 862849033
862851646 862851663
862855656 862855673
862933484 862933501
862935537 862935554
862937677 862937695
862946970 862946987
862955452 862955469
863018426 863018443
863019793 863019810
863023056 863023073
863025867 863025884
863037221 863037238
863038352 863038369
863105966 863105983
863120472 863120489
863191922 863191939
863193770 863193787
863195889 863195907
863203899 863203916
863212678 863212695
863298138 863298155
863366709 863366726
863368713 863368730
863454876 863454893
863537686 863537703
863544075 863544092
863627196 863627213
863808567 863808584
863820660 863820677
863830862 863830879
863906491 863906508
863968609 863968626
863971287 863971304
863974601 863974618
863981909 863981926
864056083 864056100
864058263 864058280
864076191 864076208
864077330 864077347
864231646 864231663
864402522 864402539
864572857 864572874
864574789 864574806
864579472 864579489
864581873 864581890
864585362 864585379
864595766 864595783
864663956 864663973
864666293 864666310
864668245 864668262
864669781 864669798
864681198 864681215
864747268 864747285
864747888 864747905
864749342 864749359
864754342 864754359
864766056 864766073
864771380 864771397
864835516 864835533
864837102 864837119
864842100 864842117
864848828 864848845
864907383 864907400
864921169 864921186
864923687 864923704
864926744 864926761
864936784 864936801
864995169 864995186
864999292 864999309
865014847 865014864
865015102 865015119
865015431 865015449
865076578 865076595
865122198 865122215
865199771 865199788
865200654 865200671
865288844 865288861
865455250 865455267
865455302 865455319
865487239 865487256
865544468 865544485
865605891 865605908
865612112 865612129
865632128 865632145
865796917 865796934
865806996 865807013
865872548 865872565
865874658 865874675
865875110 865875127
865875199 865875216
865883676 865883693
865883806 865883823
866049557 866049574
866053472 866053489
866131751 866131769
866139295 866139312
866183972 866183989
866184581 866184598
866197305 866197322
866221892 866221909
866225237 866225254
866226240 866226257
866236109 866236127
866237058 866237075
866238188 866238205
866238208 866238225
866256355 866256372
866261329 866261348
866295826 866295843
866298648 866298665
866391813 866391831
866394857 866394874
866404359 866404376
866474969 866474986
866491744 866491761
866518272 866518289
866559153 866559170
866601661 866601678
866648378 866648395
866762369 866762386
866771114 866771131
866823067 866823084
866847925 866847943
866848805 866848823
866848853 866848871
866848912 866848929
866852077 866852094
866866806 866866823
867089627 867089644
867247123 867247140
867292316 867292333
867309062 867309079
867340593 867340610
867373637 867373654
867470526 867470543
867471584 867471601
867476542 867476559
867480874 867480891
867488187 867488204
867510958 867510976
867599772 867599789
867601455 867601472
867613998 867614015
867659210 867659227
867685053 867685070
867685061 867685078
867685364 867685381
867776405 867776422
867777214 867777231
867777245 867777262
867777435 867777452
867778646 867778663
867944958 867944975
867953560 867953577
868028992 868029009
868030943 868030960
868039929 868039946
868040363 868040380
868046304 868046321
868046537 868046555
868049346 868049363
868052067 868052084
868203160 868203177
868210670 868210687
868211421 868211438
868216248 868216265
868295475 868295492
868307886 868307903
868378484 868378501
868381127 868381145
868388202 868388219
868467362 868467379
868468743 868468761
868474337 868474354
868478625 868478642
868491069 868491086
868551400 868551417
868561616 868561633
868647795 868647812
868770559 868770576
868793903 868793920
868844034 868844051
868909154 868909171
869088778 869088795
869151441 869151458
869156203 869156220
869171252 869171269
869388969 869388986
869441207 869441224
869442337 869442354
869444037 869444054
869469270 869469287
869498754 869498771
869501321 869501338
869501458 869501475
869503360 869503377
869508610 869508627
869509244 869509261
869519692 869519709
869522712 869522729
869522923 869522940
869528235 869528252
869530348 869530365
869557732 869557749
869588451 869588468
869590331 869590348
869596302 869596319
869821447 869821464
869837368 869837385
869847143 869847161
869853734 869853751
869853750 869853769
869865021 869865038
869879408 869879425
869882533 869882550
869882544 869882561
869919782 869919799
869925579 869925596
869925592 869925609
869947441 869947458
869950391 869950408
869951900 869951917
869952182 869952199
869952926 869952943
870019591 870019608
870127549 870127566
870192633 870192650
870197498 870197515
870216513 870216530
870314637 870314654
870372800 870372817
870456600 870456617
870553068 870553085
870617316 870617333
870626321 870626338
870627196 870627213
870642459 870642476
870651283 870651300
870720671 870720688
870785720 870785737
870794292 870794309
870798130 870798147
870883157 870883174
871047234 871047251
871062455 871062472
871067544 871067561
871073969 871073986
871094347 871094364
871164499 871164516
871304788 871304805
871320334 871320351
871346193 871346210
871346452 871346469
871492807 871492824
871615146 871615163
871657260 871657277
871713282 871713299
871713390 871713407
871760780 871760797
871761825 871761842
871764745 871764762
871774753 871774770
871814072 871814089
871834385 871834402
871836640 871836658
871837588 871837605
871842656 871842673
871842907 871842924
871846605 871846622
871847847 871847864
871918611 871918628
871920108 871920125
871927335 871927352
871928982 871928999
871936797 871936814
872000427 872000444
872008133 872008150
872010538 872010555
872014312 872014329
872020621 872020638
872021847 872021864
872021976 872021993
872022036 872022053
872027598 872027615
872030687 872030704
872033793 872033810
872043073 872043091
872092940 872092957
872094135 872094153
872100168 872100185
872128623 872128640
872180317 872180334
872185483 872185500
872266086 872266103
872266660 872266677
872267895 872267913
872268979 872268996
872269499 872269516
872269543 872269560
872269558 872269575
872270094 872270111
872275377 872275394
872286810 872286827
872290458 872290475
872343073 872343090
872343742 872343759
872381636 872381653
872415554 872415571
872436582 872436599
872438865 872438882
872441214 872441231
872443408 872443425
872446407 872446425
872446598 872446615
872448013 872448030
872452567 872452584
872458957 872458974
872458973 872458990
872519116 872519134
872525013 872525030
872526210 872526227
872532463 872532480
872544360 872544377
872544637 872544654
872632008 872632026
872697388 872697405
872699295 872699312
872705104 872705121
872720179 872720196
872784006 872784023
872785735 872785752
872869721 872869738
872875565 872875583
872883208 872883225
872977759 872977776
873045210 873045227
873053030 873053047
873066453 873066470
873133953 873133970
873143775 873143792
873214441 873214458
873216483 873216500
873218139 873218156
873219931 873219948
873224349 873224366
873224378 873224395
873229215 873229232
873229949 873229966
873230688 873230707
873231933 873231950
873239425 873239443
873262660 873262679
873274736 873274753
873274752 873274769
873299998 873300015
873305204 873305221
873313812 873313829
873322094 873322111
873489202 873489219
873557844 873557861
873578467 873578484
873578572 873578589
873579217 873579234
873579929 873579946
873581961 873581978
873586587 873586604
873587168 873587185
873594047 873594064
873650416 873650433
873652541 873652558
873657116 873657136
873657302 873657319
873668649 873668666
873668733 873668751
873668844 873668861
873669893 873669910
873669967 873669985
873731217 873731234
873735239 873735256
873735572 873735590
873736608 873736625
873748521 873748538
873748542 873748559
873748713 873748730
873758196 873758213
873758496 873758513
873823734 873823751
873825971 873825988
873999410 873999427
874008664 874008681
874079537 874079554
874083298 874083315
874087688 874087706
874087705 874087722
874099526 874099543
874100640 874100657
874101154 874101171
874160583 874160600
874183214 874183231
874190413 874190430
874252707 874252724
874254721 874254738
874270643 874270660
874271922 874271939
874271942 874271959
874343295 874343312
874358467 874358484
874428114 874428131
874452194 874452211
874510230 874510247
874510242 874510259
874511143 874511160
874827736 874827753
874832986 874833003
874851096 874851113
874851545 874851562
874851559 874851576
874870916 874870933
874874426 874874443
874874440 874874457
874874533 874874550
874875978 874875995
874875994 874876011
874937649 874937666
874942031 874942048
874945032 874945049
874954763 874954780
874955694 874955711
874958940 874958957
874960567 874960584
874965498 874965515
874965544 874965563
874999615 874999632
875000182 875000199
875022250 875022267
875022281 875022300
875038307 875038324
875043937 875043954
875063705 875063722
875116903 875116920
875119443 875119460
875121285 875121302
875181097 875181114
