% list of Swift GRB triggers from S5 VSR1
% Created by E. Thrane
% GRB GPS RA(DEG) DEC(DEG) DURATION
GRB051109B 815560792 345.468 38.666 14.3
GRB051111 815723994 348.134 18.365 46.1
GRB051113 815930568 187.267 -26.387 93.3
GRB051114 815976703 226.266 60.156 2.2
GRB051117B 816268987 85.187 -19.280 9
GRB051213 818493197 252.078 -59.229 71.1
GRB051221B 819230613 312.359 53.040 39.9
GRB051227 819742049 125.230 31.953 114.6
GRB060102 820271862 328.834 -1.838 19
GRB060105 820478982 297.488 46.359 54.4
GRB060108 820766365.760 147.016 31.933 14.3
GRB060109 820860895 282.739 32.009 115.4
GRB060110 820915291 72.738 28.427 26.0
GRB060111B 821045757 286.460 70.382 58.8
GRB060115 821365694 54.005 17.336 139.6
GRB060116 821435861 84.699 -5.449 105.9
GRB060117 821515815 327.917 -59.967 16.9
GRB060123 822090174 179.750 45.513 900
GRB060202 822904869 35.822 38.381 198.9
GRB060203 823046149 103.502 71.838 68.2
GRB060204B 823098878 211.812 27.675 139.4
GRB060206 823236427 202.932 35.050 7.6
GRB060210 823582744 57.729 27.024 255
GRB060211B 823708529 75.076 14.954 27.7
GRB060219 824424499 241.841 32.305 62.1
GRB060223B 824758878 254.240 -30.820 10.3
GRB060306 825641364 41.096 -2.155 61.2
GRB060312 826162586 45.777 12.825 50.6
GRB060319 826764956 176.366 60.041 10.6
GRB060322 827103635 274.235 -36.821 221.5
GRB060323 827159570 174.412 50.003 25.4
GRB060403 828105151 282.336 8.328 30.1
GRB060413 828988838 291.288 13.746 147.7
GRB060418 829364782 236.428 -3.642 103.1
GRB060421 829615177 343.627 62.730 12.2
GRB060424 829887393 7.354 36.789 37.5
GRB060427 830173404 124.175 62.654 64
GRB060428B 830249692 235.378 62.027 57.9
GRB060501 830506512 328.383 43.993 21.9
GRB060505 830846175 331.776 -27.825 4
GRB060507 831002006 89.935 75.243 183.3
GRB060510B 831284548 239.215 78.597 275.2
GRB060512 831510814 195.746 41.209 8.5
GRB060515 831695286 127.295 73.562 52
GRB060516 831797028 71.167 -18.096 161.6
GRB060522 832299092 322.953 2.889 71.1
GRB060526 832696124 232.838 0.292 298.2
GRB060604 833480354 337.233 -10.937 95
GRB060605 833566558 322.157 -6.046 79.1
GRB060607B 833758378 42.048 14.749 31.1
GRB060614 834324242 320.880 -53.035 108.7
GRB060707 836343033 357.073 -17.908 66.2
GRB060708 836396173 7.830 -33.752 10.2
GRB060712 836773677 184.065 35.539 26.3
GRB060714 836925134 227.854 -6.545 115
GRB060717 837162472 170.851 28.970 3.0
GRB060719 837327050 18.418 -48.383 66.9
GRB060728 838160684 16.646 -41.390 60
GRB060729 838235563 95.288 -62.221 115.3
GRB060804 838711713 112.216 -27.228 17.8
GRB060807 838996909 252.505 31.597 54
GRB060813 839544636 111.890 -29.844 16.1
GRB060814 839631753 221.336 20.593 145.3
GRB060825 840510011 18.130 55.796 8.0
GRB060904B 841372277 58.218 -0.729 171.5
GRB060906 841566780 40.710 30.356 43.5
GRB060908 841741056 31.820 0.330 19.3
GRB060919 842687332 276.900 -50.994 9.1
GRB060923B 843046700 238.193 -30.907 8.6
GRB060923C 843053596 346.122 3.943 75.8
GRB060926 843324535 263.925 13.039 8.0
GRB060927 843401269 329.547 5.369 22.5
GRB060929 843594915 263.158 29.846 554
GRB061002 843786223 220.356 48.726 17.6
GRB061004 844026644 97.795 -45.903 6.2
GRB061006 844188364 110.998 -79.195 129.9
GRB061007 844250902 46.299 -50.496 75.3
GRB061019 845266760 91.631 29.545 183.8
GRB061021 845480361 145.146 -21.953 46.2
GRB061027 845979316 270.992 -82.239 150
GRB061028 846033996 97.193 46.290 106.2
GRB061102 846464445 148.393 -17.000 45.6
GRB061110B 847231139 323.916 6.870 134
GRB061121 848157763 147.228 -13.188 81.3
GRB061126 848566090 86.615 64.201 70.8
GRB061202 849082318 105.180 -74.587 91.2
GRB061210 849788453 144.521 15.613 85.3
GRB061218 850449919 149.238 -35.221 6.5
GRB061222B 850795876 105.352 -25.865 40
GRB070103 851892413.410 352.582 26.823 18.6
GRB070107 852206732 159.422 -53.202 347.3
GRB070110 852448975 0.934 -52.978 88.4
GRB070126 853814020 33.579 -73.532 51
GRB070129 854148924 37.001 11.730 460.6
GRB070208 854961048 197.896 61.946 47.7
GRB070219 855882630 260.219 69.345 16.6
GRB070220 855981887 34.800 68.800 129
GRB070223 856228514 153.453 43.132 88.5
GRB070224 856384092 178.987 -13.356 34.5
GRB070227 856650133 120.566 -46.305 7
GRB070306 857234502 148.097 10.477 209.5
GRB070318 858238150 48.486 -42.950 74.6
GRB070326 858961766 40.337 -66.989 17.3
GRB070328 859089247 65.110 -34.077 75.3
GRB070330 859330305 269.533 -63.799 9.0
GRB070411 860357567 107.345 1.052 121.5
GRB070412 860376437 181.525 40.133 33.8
GRB070419B 861014659 315.709 -31.266 236.4
GRB070420 861085107 121.245 -45.564 76.5
GRB070427 861697882 28.871 -27.603 11.1
GRB070506 862464972 347.203 10.711 4.3
GRB070508 862633111 312.832 -78.382 20.9
GRB070509 862714121 237.874 -78.657 7.7
GRB070517 863436072 277.603 -62.297 7.6
GRB070518 863533595 254.221 55.285 5.5
GRB070520B 863718307 121.886 57.588 65.8
GRB070521 863765484 242.659 30.261 37.9
GRB070529 864478122 283.725 20.648 109.2
GRB070531 864612631 6.722 74.316 44.5
GRB070611 865562247 2.003 -29.758 12.2
GRB070612B 865664491 261.716 -8.747 13.5
GRB070616 866046587 32.096 56.946 402.4
GRB070621 866503073 323.806 -24.809 33.3
GRB070628 867076876 115.271 -20.281 39.1
GRB070704 867614771 354.707 66.257 380
GRB070714B 868424383 57.853 28.294 64
GRB070721B 869049242 33.128 -2.198 340
GRB070731 869909616 328.581 -15.740 2.9
GRB070802 870073659 36.903 -55.517 16.4
GRB070805 870378959 245.057 -59.957 31.0
GRB070808 870632894 6.761 1.180 32
GRB070911 873525478 25.819 -33.484 162
GRB070913 873679017 228.737 -24.278 3.2
GRB070917 874049650 293.923 2.420 7.3
GRB070920B 874357486 0.127 -34.844 20.2
