862130481 862130482
862158453 862158454
862167832 862167833
862177048 862177049
862179452 862179453
862258345 862258346
862521815 862521816
862599906 862599907
862668097 862668098
862698698 862698699
862947251 862947252
862957993 862957995
863053276 863053278
863202529 863202531
863216964 863216965
863344411 863344413
863377907 863377908
863669776 863669777
864058997 864058999
864253445 864253446
864257765 864257766
864434097 864434099
864592284 864592285
864594250 864594252
864606934 864606935
864777348 864777349
864778547 864778549
865034994 865034995
865057164 865057165
865185448 865185450
865345198 865345199
865490999 865491001
865645724 865645725
865668380 865668382
865743331 865743333
865864247 865864248
865876537 865876538
865885248 865885250
865893522 865893523
866168708 866168709
866169995 866169996
866223872 866223874
866413924 866413926
866447400 866447401
866497431 866497433
866583669 866583671
866736424 866736425
866738365 866738367
866958188 866958190
867036681 867036683
867121310 867121311
867170846 867170847
867191170 867191172
867353147 867353148
867689606 867689607
867766564 867766565
867795637 867795638
867836866 867836867
868054801 868054802
868631330 868631331
868662761 868662762
868745036 868745037
868864980 868864981
869051382 869051383
869234027 869234028
869413837 869413838
869466234 869466236
869831494 869831496
870007512 870007514
870059882 870059883
870177900 870177901
870273275 870273276
870274343 870274345
870342133 870342134
870403873 870403874
870467421 870467422
870568242 870568243
870743032 870743033
870763696 870763697
870815200 870815201
870905951 870905952
870939918 870939919
870960081 870960082
871016645 871016646
871032523 871032524
871075844 871075845
871243439 871243440
871272694 871272696
871291520 871291521
871329515 871329516
871392602 871392603
871597100 871597101
871685684 871685685
872104001 872104003
872242604 872242605
872367581 872367582
872373274 872373275
872515649 872515650
872564699 872564700
872626263 872626264
872635370 872635371
872709124 872709126
872731826 872731828
872885773 872885774
873081668 873081670
873103495 873103496
873119803 873119805
873141123 873141124
873147577 873147578
873179450 873179451
873424756 873424758
873631800 873631802
873645313 873645314
873745623 873745625
873959137 873959139
873994944 873994945
874132567 874132569
874275439 874275440
874313464 874313466
874316938 874316940
874347702 874347703
874352760 874352761
874436901 874436903
874514096 874514097
874622926 874622927
874706781 874706783
874817620 874817621
874848009 874848011
874979375 874979376
874984892 874984893
875022654 875022655
875041725 875041726
875104061 875104062
875167232 875167234
875184833 875184836
