831421454 831421471
831425020 831425037
831427273 831427290
831429997 831430014
831432308 831432325
831435273 831435290
831435528 831435545
831441889 831441906
831444536 831444553
831444804 831444821
831447174 831447191
831447440 831447457
831449998 831450015
831450266 831450283
831452597 831452614
831452862 831452879
831455064 831455081
831455332 831455349
831457664 831457681
831457929 831457946
831460260 831460277
831460526 831460543
831463480 831463497
831463660 831463677
831465832 831465849
831470205 831470222
831472419 831472436
831474572 831474589
831476716 831476733
831479047 831479064
831481426 831481443
831486494 831486511
831489150 831489167
831491945 831491962
831513844 831513861
831519590 831519607
831521872 831521889
831524163 831524180
831528560 831528577
831530713 831530730
831532856 831532873
831535018 831535035
831539355 831539372
831541478 831541495
831545864 831545881
831548007 831548024
831550298 831550315
831552552 831552569
831554853 831554870
831557194 831557211
831559317 831559334
831561678 831561695
831564135 831564152
831566814 831566831
831605965 831605982
831608711 831608728
831611357 831611374
831614102 831614119
831617115 831617132
831619436 831619453
831621807 831621824
831624079 831624096
831626410 831626427
831632997 831633014
831635113 831635130
831637265 831637283
831639407 831639424
831641521 831641538
831643684 831643701
831645926 831645943
831648533 831648550
831689236 831689253
831693386 831693403
831696437 831696454
831701426 831701443
831703728 831703745
831706175 831706192
831708506 831708523
831710857 831710874
831713190 831713207
831715372 831715389
831722156 831722173
831724487 831724504
831726691 831726708
831729032 831729049
831731193 831731210
831733336 831733353
831758553 831758570
831768726 831768743
831772343 831772360
831775710 831775727
831780293 831780310
831782386 831782403
831784608 831784625
831786752 831786769
831788923 831788940
831795563 831795580
831800225 831800242
831802573 831802590
831804985 831805002
831809617 831809634
831864315 831864332
831864552 831864569
831866774 831866791
831867831 831867848
831868926 831868943
831871120 831871137
831877728 831877745
831879959 831879976
831882161 831882178
831884386 831884403
831886845 831886862
831889155 831889172
831891594 831891611
831894034 831894051
831896524 831896541
831901432 831901449
831903872 831903889
831931369 831931386
831933758 831933775
831945726 831945743
831947976 831947993
831950180 831950197
831952403 831952420
831954634 831954651
831956907 831956924
831959108 831959125
831961330 831961347
831963553 831963570
831965765 831965782
831970190 831970207
831976858 831976875
831981441 831981458
831983722 831983739
831986072 831986089
831988531 831988548
832038073 832038090
832040830 832040847
832043469 832043486
832045828 832045845
832048464 832048481
832050717 832050734
832055675 832055692
832060653 832060670
832062946 832062963
832065582 832065599
832067882 832067899
832072368 832072385
832074687 832074704
832141583 832141600
832146888 832146905
832149535 832149552
832151836 832151853
832154277 832154294
832156863 832156880
832157165 832157182
832159027 832159044
832161348 832161365
832163530 832163547
832170099 832170116
832219732 832219749
832222446 832222463
832224818 832224835
832227503 832227520
832232116 832232133
832234300 832234317
832236650 832236667
832238802 832238819
832241064 832241081
832243217 832243234
832245342 832245359
832249648 832249665
832251939 832251956
832254595 832254612
832308969 832308986
832312533 832312550
832318184 832318201
832320859 832320876
832323428 832323445
832325750 832325767
832328091 832328108
832397011 832397028
832400290 832400307
832402848 832402865
832405526 832405543
832408250 832408267
832410811 832410828
832413219 832413236
832415530 832415547
832417891 832417908
832420183 832420200
832486319 832486336
832489332 832489349
832489427 832489444
832489431 832489448
832494191 832494208
832494614 832494635
832496610 832496627
832497349 832497366
832499059 832499076
832501430 832501447
832503722 832503739
832565846 832565863
832568554 832568572
832570846 832570863
832574054 832574071
832579408 832579425
832584140 832584157
832586540 832586557
832588900 832588917
832652161 832652178
832654839 832654856
832657427 832657444
832663125 832663142
832665536 832665553
832665781 832665798
832668408 832668425
832670700 832670717
832673061 832673078
832675304 832675321
832677654 832677671
832740491 832740508
832743256 832743273
832745568 832745585
832750467 832750484
832753124 832753141
832755444 832755461
832757945 832757962
832760402 832760419
832762654 832762671
832762903 832762920
832765283 832765300
832767573 832767590
832767859 832767876
832770419 832770436
832788909 832788926
832789137 832789154
832793883 832793900
832794149 832794166
832820662 832820679
832833718 832833735
832836435 832836452
832839072 832839089
832841384 832841401
832844110 832844127
832846668 832846685
832849266 832849283
832851675 832851692
832853986 832854003
832856604 832856621
832880340 832880357
832880785 832880802
832882892 832882909
832882940 832882957
832883010 832883027
832883024 832883041
832883083 832883100
832883119 832883136
832883205 832883222
832883284 832883301
832883355 832883372
832883591 832883608
832883702 832883719
832883748 832883765
832883930 832883947
832883993 832884010
832884242 832884259
832884272 832884289
832884309 832884326
832884533 832884550
832884641 832884658
832884732 832884749
832884747 832884764
832884778 832884795
832884798 832884815
832884814 832884831
832884826 832884843
832884849 832884866
832884865 832884882
832884882 832884899
832884900 832884917
832884914 832884932
832884941 832884958
832884958 832884977
832884974 832884991
832884999 832885016
832885025 832885042
832885050 832885067
832885063 832885080
832885075 832885092
832885094 832885111
832885113 832885130
832885126 832885143
832885145 832885162
832885171 832885188
832885176 832885193
832885187 832885204
832885204 832885221
832885233 832885250
832889548 832889565
832890186 832890203
832891817 832891834
832896853 832896870
832900389 832900406
832903371 832903388
832905682 832905699
832908331 832908348
832910710 832910727
832913060 832913077
832915728 832915745
832918099 832918116
832920557 832920574
832922858 832922875
832925219 832925236
832927501 832927518
832929870 832929887
832932468 832932485
832934850 832934867
832937317 832937334
832937567 832937584
832942258 832942275
832944953 832944970
832952389 832952406
832953928 832953945
832996134 832996151
832999969 832999986
833002378 833002395
833005064 833005081
833010062 833010079
833012777 833012794
833015079 833015096
833017461 833017478
833019721 833019738
833022349 833022366
833024769 833024786
833060087 833060104
833060162 833060179
833060389 833060406
833061368 833061385
833061709 833061726
833061831 833061848
833061889 833061906
833061923 833061940
833071471 833071488
833074136 833074153
833076745 833076762
833079056 833079073
833081327 833081344
833083906 833083923
833086621 833086638
833089013 833089030
833091639 833091656
833094226 833094243
833099125 833099142
833099362 833099379
833101704 833101721
833104103 833104120
833104350 833104367
833106999 833107016
833109416 833109433
833165696 833165713
833169508 833169525
833172481 833172498
833174763 833174780
833177174 833177191
833179790 833179807
833182447 833182464
833187436 833187453
833189935 833189952
833192235 833192252
833194666 833194683
833197015 833197032
833250252 833250269
833254084 833254101
833259980 833259997
833262649 833262666
833264958 833264975
833267319 833267336
833272279 833272296
833277334 833277351
833279951 833279968
833282263 833282280
833284792 833284809
833287103 833287120
833342166 833342183
833346661 833346678
833349674 833349691
833351965 833351982
833356864 833356881
833359223 833359240
833361999 833362016
833362247 833362264
833364845 833364862
833367274 833367291
833367522 833367539
833370119 833370136
833370364 833370381
833375017 833375034
833377359 833377376
833380055 833380072
833420837 833420854
833423119 833423136
833426525 833426542
833426773 833426790
833429490 833429507
833431870 833431887
833434278 833434295
833436493 833436510
833436758 833436775
833439140 833439157
833439395 833439412
833441746 833441763
833442014 833442031
833445519 833445536
833445776 833445793
833448809 833448826
833449064 833449081
833451840 833451857
833452108 833452125
833455397 833455414
833455652 833455669
833458063 833458080
833458321 833458338
833460690 833460707
833460937 833460954
833463309 833463326
833465678 833465695
833468464 833468481
833506797 833506814
833510885 833510902
833513560 833513577
833515913 833515930
833518383 833518400
833520742 833520759
833525284 833525301
833527706 833527723
833527961 833527978
833530282 833530299
833530539 833530556
833532752 833532769
833533010 833533027
833535351 833535368
833535606 833535623
833538986 833539003
833541266 833541283
833541524 833541541
833543667 833543684
833543922 833543939
833594877 833594894
833597446 833597463
833599768 833599785
833603204 833603221
833605546 833605563
833608014 833608031
833610325 833610342
833615174 833615191
833617369 833617386
833619758 833619775
833620015 833620032
833622149 833622166
833622404 833622421
833624735 833624752
833624992 833625009
833633921 833633938
833636143 833636160
833638553 833638570
833679088 833679105
833681380 833681397
833684007 833684024
833686515 833686532
833688776 833688793
833691039 833691056
833693273 833693290
833695622 833695639
833697725 833697742
833699839 833699856
833701964 833701981
833706289 833706306
833708392 833708409
833710488 833710505
833712611 833712628
833714753 833714770
833768288 833768305
833771557 833771574
833774283 833774300
833776851 833776868
833779526 833779543
833781788 833781805
833784109 833784126
833786351 833786368
833788658 833788675
833790911 833790928
833793290 833793307
833795403 833795420
833797685 833797702
833799788 833799805
833801922 833801939
833804055 833804072
833806367 833806384
833857372 833857389
833860878 833860895
833863546 833863563
833865885 833865902
833868187 833868204
833872739 833872756
833874973 833874990
833877264 833877281
833879358 833879375
833881650 833881667
833883843 833883860
833885966 833885983
833888098 833888115
833892522 833892539
833894843 833894860
833933497 833933515
833937237 833937254
833942402 833942419
833944733 833944750
833946974 833946991
833951557 833951574
833953820 833953837
833962532 833962549
833964654 833964671
833966787 833966804
833968913 833968930
833971045 833971062
833973158 833973175
833975313 833975330
833977446 833977463
833979716 833979733
833982048 833982065
834040983 834041000
834044212 834044229
834049112 834049129
834051404 834051421
834053041 834053058
834053715 834053732
834056016 834056033
834058288 834058305
834060589 834060606
834062860 834062877
834065181 834065198
834065695 834065712
834067977 834067994
834117560 834117577
834120543 834120560
834122804 834122821
834125460 834125477
834130290 834130307
834132592 834132609
834134833 834134850
834137145 834137162
834139408 834139425
834141679 834141696
834143922 834143939
834146224 834146241
834148464 834148481
834148834 834148852
834153127 834153144
834184462 834184479
834190523 834190540
834190758 834190775
834190823 834190840
834191316 834191333
834217771 834217788
834221791 834221808
834225158 834225175
834227459 834227476
834230186 834230203
834235753 834235773
834235825 834235842
834284286 834284303
834286892 834286909
834289173 834289190
834291229 834291246
834293471 834293488
834308148 834308165
834310221 834310238
834312336 834312353
834314379 834314396
834316493 834316510
834318537 834318554
834320642 834320659
834324859 834324876
834327010 834327027
834370914 834370931
834373609 834373626
834376198 834376215
834378508 834378525
834380967 834380984
834383515 834383532
834385758 834385775
834388058 834388075
834390291 834390308
834398815 834398832
834401016 834401033
834403100 834403117
834405205 834405222
834407280 834407297
834409372 834409389
834411644 834411661
834414194 834414211
834467665 834467682
834470529 834470546
834472820 834472837
834475092 834475109
834477640 834477657
834482163 834482180
834484044 834484061
834484415 834484432
834486686 834486703
834488951 834488968
834491479 834491496
834493750 834493767
834496298 834496315
834499012 834499029
834509434 834509451
834509709 834509726
834509770 834509787
834509867 834509884
834510140 834510157
834510546 834510563
834510877 834510894
834510997 834511014
834511102 834511119
834511193 834511210
834511286 834511303
834511337 834511354
834511363 834511383
834511380 834511397
834511384 834511401
834511411 834511428
834511432 834511449
834511461 834511479
834511495 834511512
834511517 834511534
834511532 834511549
834511550 834511567
834511604 834511622
834511618 834511635
834511636 834511653
834511677 834511694
834511692 834511710
834511720 834511737
834511733 834511750
834511760 834511777
834511776 834511793
834547586 834547603
834551665 834551682
834556001 834556018
834560347 834560364
834568130 834568147
834570698 834570715
834573345 834573362
834575853 834575870
834578431 834578448
834580693 834580710
834583389 834583406
834643113 834643130
834645802 834645819
834648487 834648504
834653573 834653590
834655835 834655852
834658373 834658390
834660625 834660642
834662916 834662933
834665158 834665175
834667449 834667466
834669977 834669994
834700764 834700781
834700808 834700825
834700875 834700892
834700921 834700938
834701082 834701099
834701104 834701121
834701203 834701220
834701260 834701277
834701321 834701338
834701528 834701545
834701975 834701992
834702000 834702017
834702026 834702043
834702037 834702054
834702127 834702144
834702223 834702240
834702312 834702329
834702375 834702392
834702463 834702480
834702865 834702882
834702902 834702919
834702988 834703005
834713031 834713048
834716686 834716703
834719193 834719210
834722138 834722155
834724744 834724761
834727045 834727062
834729644 834729661
834731945 834731962
834734502 834734519
834736793 834736810
834739361 834739378
834741643 834741660
834744181 834744198
834746454 834746471
834748745 834748762
834750968 834750985
834755540 834755557
834758235 834758252
834787782 834787799
834788222 834788239
834788411 834788428
834789150 834789167
834789211 834789228
834789292 834789309
834789327 834789344
834789446 834789463
834789531 834789548
834789619 834789636
834789681 834789698
834789741 834789758
834789749 834789766
834789880 834789897
834789926 834789943
834789947 834789964
834789959 834789976
834789974 834789991
834790005 834790022
834790013 834790030
834790034 834790051
834790058 834790075
834790091 834790108
834790115 834790132
834790121 834790138
834790195 834790212
834790204 834790221
834790226 834790243
834790277 834790294
834790296 834790313
834790322 834790339
834790362 834790379
834790408 834790425
834790426 834790443
834790492 834790509
834790531 834790548
834790565 834790582
834790619 834790636
834790725 834790742
834790742 834790759
834790755 834790772
834806564 834806581
834809190 834809207
834813704 834813721
834815944 834815961
834818475 834818492
834820696 834820713
834825250 834825267
834827512 834827529
834829634 834829651
834831906 834831923
834845596 834845613
834895555 834895572
834899150 834899167
834902429 834902446
834904770 834904787
834907170 834907187
834909471 834909488
834914036 834914053
834916347 834916364
834918537 834918554
834920878 834920895
834923002 834923019
834927448 834927465
835069665 835069682
835072628 835072645
835075532 835075549
835078514 835078531
835080816 835080833
835086042 835086059
835088343 835088360
835090919 835090936
835093202 835093219
835095523 835095540
835097794 835097811
835100412 835100429
835101471 835101488
835135345 835135362
835137205 835137222
835137281 835137298
835137319 835137336
835137398 835137415
835140021 835140038
835158102 835158119
835160739 835160756
835163318 835163335
835165896 835165913
835165920 835165937
835168157 835168174
835170735 835170752
835173363 835173380
835175665 835175682
835180445 835180462
835182834 835182851
835185086 835185103
835212042 835212059
835228520 835228537
835228636 835228653
835228672 835228689
835228897 835228914
835228991 835229008
835229227 835229244
835232224 835232241
835240753 835240770
835244763 835244780
835247478 835247495
835250047 835250064
835260004 835260021
835262630 835262647
835264991 835265008
835267302 835267319
835269643 835269660
835271924 835271941
835274602 835274619
835277319 835277336
835330602 835330619
835333892 835333909
835336420 835336437
835338763 835338780
835341033 835341050
835343395 835343412
835345716 835345733
835348095 835348112
835350416 835350433
835352697 835352714
835354863 835354880
835359445 835359462
835365282 835365299
835402451 835402468
835421994 835422011
835424286 835424303
835426646 835426663
835428958 835428975
835431616 835431633
835433955 835433972
835436335 835436352
835438656 835438673
835445473 835445490
835494352 835494369
835499064 835499081
835499202 835499219
835501189 835501206
835503380 835503397
835505424 835505441
835507459 835507476
835509524 835509541
835511529 835511546
835513563 835513580
835515538 835515555
835519550 835519567
835521565 835521582
835523579 835523596
835525563 835525580
835527588 835527605
835529563 835529580
835531589 835531606
835533604 835533621
835537761 835537778
835540082 835540099
835542452 835542469
835545170 835545187
835548921 835548938
835554491 835554508
835578818 835578835
835581031 835581048
835583471 835583488
835585604 835585621
835589801 835589818
835591806 835591823
835593850 835593867
835595836 835595853
835597880 835597897
835599865 835599882
835601890 835601907
835603895 835603912
835611954 835611971
835613939 835613956
835617970 835617987
835622058 835622075
835624191 835624208
835694712 835694729
835696737 835696754
835698800 835698817
835700825 835700842
835702859 835702876
835704904 835704921
835706830 835706847
835706967 835706984
835709112 835709129
835711710 835711727
835755553 835755570
835758435 835758452
835761003 835761020
835763216 835763233
835765417 835765434
835767561 835767578
835769586 835769603
835771630 835771647
835775859 835775876
835777893 835777910
835779978 835779995
835781983 835782000
835784046 835784063
835786071 835786088
835788115 835788132
835790150 835790167
835792215 835792232
835794435 835794452
835796716 835796733
835799385 835799402
835838623 835838640
835841171 835841188
835843809 835843826
835845991 835846008
835848462 835848479
835855050 835855067
835857240 835857257
835859306 835859323
835861498 835861515
835863571 835863588
835865586 835865603
835867800 835867817
835869854 835869871
835872066 835872083
835874120 835874137
835876327 835876344
835878187 835878204
835878520 835878537
835881058 835881075
835883596 835883613
835887242 835887259
835887248 835887265
835887267 835887285
835887290 835887307
835887316 835887333
835887340 835887357
835887351 835887368
835887376 835887393
835887403 835887420
835887441 835887458
835887491 835887508
835887553 835887570
835887687 835887704
835887784 835887801
835887919 835887936
835888552 835888569
835888639 835888656
835888761 835888778
835888856 835888873
835888918 835888935
835889315 835889333
835889390 835889407
835890435 835890452
835890601 835890618
835890659 835890676
835891159 835891176
835891784 835891801
835893237 835893254
835895846 835895863
835902985 835903002
835903078 835903095
835903227 835903244
835909405 835909422
835914115 835914132
835918374 835918391
835921859 835921876
835924536 835924553
835927046 835927063
835929317 835929334
835931528 835931545
835933711 835933728
835935925 835935942
835938155 835938172
835940241 835940258
835942441 835942458
835946572 835946589
835948664 835948681
835950703 835950720
835952918 835952935
835954991 835955008
835957074 835957091
835959158 835959175
835961352 835961369
835963425 835963442
835965668 835965685
835967888 835967905
835970469 835970486
835973391 835973408
835976478 835976495
835976605 835976622
835977246 835977263
835977525 835977542
835977681 835977698
835977762 835977779
835977931 835977948
835978059 835978076
835978092 835978109
835978175 835978192
835978293 835978310
835978322 835978339
835978414 835978431
835978503 835978520
835978575 835978592
835981100 835981117
835981173 835981190
835981268 835981285
835981376 835981393
835981501 835981518
835981850 835981867
835982200 835982217
835982585 835982602
835983651 835983668
835984576 835984593
835986202 835986219
835995045 835995062
836007919 836007936
836010834 836010851
836013341 836013358
836014667 836014684
836015583 836015600
836017777 836017794
836020010 836020027
836022240 836022257
836024710 836024727
836026924 836026941
836029154 836029171
836031240 836031257
836033480 836033497
836035702 836035719
836037955 836037972
836040156 836040173
836044591 836044608
836046844 836046861
836049074 836049091
836051318 836051335
836053569 836053586
836053791 836053808
836053912 836053929
836053951 836053968
836054002 836054019
836054060 836054077
836054966 836054983
836056504 836056521
836059475 836059492
836063481 836063498
836064279 836064297
836064380 836064397
836064495 836064512
836066443 836066460
836066532 836066549
836067651 836067668
836069886 836069903
836075239 836075256
836078735 836078752
836078944 836078961
836079031 836079048
836079165 836079182
836079299 836079316
836084650 836084667
836085082 836085099
836085097 836085114
836085318 836085335
836085851 836085868
836089739 836089756
836089839 836089856
836089875 836089892
836092247 836092264
836095170 836095187
836097679 836097696
836100207 836100224
836102421 836102438
836104661 836104678
836106843 836106860
836109096 836109113
836113818 836113835
836116001 836116018
836118302 836118319
836120483 836120500
836125235 836125252
836127764 836127781
836129848 836129865
836132138 836132155
836134350 836134367
836136661 836136678
836138864 836138881
836141223 836141240
836141471 836141488
836143715 836143732
836154164 836154181
836156390 836156407
836156506 836156523
836156637 836156654
836156647 836156664
836156841 836156858
836156914 836156931
836157275 836157292
836157281 836157298
836157700 836157717
836157773 836157790
836157791 836157808
836157883 836157900
836157968 836157985
836158059 836158076
836158247 836158264
836158700 836158717
836158809 836158826
836158914 836158931
836159070 836159087
836159748 836159765
836160040 836160057
836160168 836160185
836160560 836160577
836161767 836161784
836163686 836163703
836163901 836163918
836164325 836164342
836169359 836169376
836169523 836169540
836172264 836172281
836172538 836172555
836172889 836172906
836173802 836173819
836174092 836174109
836174740 836174757
836174856 836174873
836175123 836175140
836175196 836175213
836178548 836178565
836181927 836181944
836186173 836186190
836188406 836188423
836191388 836191405
836193610 836193627
836196218 836196235
836200969 836200986
836205464 836205481
836207656 836207673
836209966 836209983
836212168 836212185
836214489 836214506
836216545 836216562
836218835 836218852
836223202 836223219
836225414 836225431
836228022 836228039
836230292 836230309
836233364 836233381
836267350 836267367
836267499 836267516
836270472 836270489
836273424 836273441
836276061 836276078
836277188 836277205
836279174 836279191
836281642 836281659
836284604 836284621
836286826 836286843
836289542 836289559
836291725 836291742
836303992 836304009
836306176 836306193
836308831 836308848
836311055 836311072
836314065 836314082
836319282 836319299
836322176 836322193
836363439 836363456
836366028 836366045
836368636 836368653
836371143 836371160
836373681 836373698
836375954 836375971
836380437 836380454
836382699 836382716
836384922 836384939
836387185 836387202
836389416 836389433
836391687 836391704
836396151 836396168
836398403 836398420
836402976 836402993
836426835 836426852
836426940 836426957
836516911 836516928
836516956 836516973
836517082 836517099
836517326 836517343
836517355 836517372
836517432 836517449
836517475 836517492
836517490 836517507
836517541 836517558
836517669 836517686
836517726 836517743
836517802 836517819
836517826 836517843
836517886 836517903
836517953 836517970
836518004 836518021
836518032 836518049
836518073 836518090
836518097 836518114
836518113 836518130
836518136 836518153
836518161 836518178
836518178 836518195
836518191 836518208
836518207 836518224
836518221 836518238
836518239 836518256
836518264 836518281
836518304 836518321
836518328 836518345
836518340 836518357
836518354 836518371
836518362 836518379
836518405 836518422
836518410 836518427
836518439 836518456
836518458 836518475
836518516 836518534
836518569 836518586
836518635 836518652
836518679 836518697
836518719 836518736
836518742 836518759
836518760 836518777
836518805 836518823
836518832 836518849
836518910 836518927
836518947 836518964
836518994 836519012
836519008 836519025
836519041 836519058
836519062 836519079
836519078 836519095
836519087 836519104
836519119 836519138
836519140 836519157
836519152 836519169
836519166 836519183
836519182 836519199
836519215 836519232
836519227 836519244
836519244 836519261
836519276 836519293
836519303 836519321
836519324 836519341
836519352 836519369
836519365 836519382
836519383 836519401
836519427 836519444
836519452 836519469
836519470 836519487
836519494 836519511
836519498 836519516
836519513 836519530
836519537 836519554
836519562 836519579
836519604 836519624
836519708 836519725
836519820 836519837
836519868 836519885
836519904 836519921
836519958 836519975
836520016 836520033
836520287 836520304
836520309 836520326
836520519 836520536
836520542 836520559
836520589 836520606
836520628 836520645
836520658 836520675
836520737 836520754
836520790 836520807
836520808 836520825
836520836 836520853
836520907 836520924
836532651 836532668
836534815 836534832
836537759 836537776
836539932 836539949
836544761 836544778
836547288 836547305
836549452 836549469
836554163 836554180
836556642 836556659
836558726 836558743
836560999 836561016
836565363 836565380
836569956 836569973
836572189 836572206
836574027 836574044
836574265 836574282
836574297 836574314
836574337 836574354
836574427 836574444
836574553 836574571
836574964 836574981
836575036 836575053
836575854 836575871
836575893 836575910
836576156 836576173
836576229 836576246
836576325 836576342
836576359 836576376
836576406 836576423
836576490 836576507
836576617 836576634
836576675 836576692
836576727 836576744
836576842 836576859
836576868 836576885
836576942 836576959
836576998 836577015
836577100 836577117
836577187 836577204
836578459 836578476
836581086 836581103
836584623 836584640
836621304 836621321
836624464 836624481
836628721 836628738
836630936 836630953
836633947 836633964
836636148 836636165
836638757 836638774
836640911 836640928
836643457 836643474
836645512 836645529
836647775 836647792
836649848 836649865
836652109 836652126
836654154 836654171
836656416 836656433
836658677 836658694
836661652 836661669
836707806 836707823
836707961 836707978
836711577 836711594
836715588 836715605
836717779 836717796
836720397 836720414
836722579 836722596
836725246 836725263
836727429 836727446
836729987 836730004
836732169 836732186
836734709 836734726
836736772 836736789
836815837 836815854
836818383 836818400
836820545 836820562
836823085 836823102
836825131 836825148
836832586 836832603
836862993 836863010
836863435 836863452
836863479 836863496
836863731 836863748
836863775 836863792
836864233 836864250
836864576 836864593
836864756 836864773
836864982 836864999
836878473 836878490
836885939 836885956
836888488 836888505
836890700 836890717
836893405 836893422
836895569 836895586
836900301 836900318
836902561 836902578
836904725 836904742
836906986 836907003
836909052 836909069
836910387 836910404
836911312 836911329
836913456 836913473
836915946 836915963
836918168 836918185
836951918 836951935
836964668 836964685
836967540 836967557
836970395 836970412
836972904 836972921
836977901 836977918
836980371 836980388
836982601 836982618
836987285 836987302
836989515 836989532
836991699 836991716
836993912 836993929
836996096 836996113
836998198 836998215
837000242 837000259
837002723 837002740
837004925 837004942
837049978 837049995
837050466 837050483
837050725 837050742
837051020 837051037
837064787 837064804
837067700 837067717
837074653 837074670
837077665 837077682
837080193 837080210
837082771 837082788
837085242 837085259
837105605 837105622
837105939 837105956
837106012 837106029
837106271 837106288
837107559 837107576
837107601 837107618
837107630 837107647
837107713 837107730
837107756 837107773
837107883 837107900
837107935 837107952
837107986 837108003
837108050 837108067
837108202 837108219
837108315 837108332
837108411 837108428
837108483 837108500
837108871 837108889
837108961 837108978
837109023 837109040
837109239 837109256
837109263 837109280
837113606 837113623
837114283 837114300
837114341 837114358
837114389 837114406
837114450 837114467
837114512 837114529
837120393 837120410
837120430 837120447
837120653 837120670
837120741 837120758
837120872 837120889
837120965 837120982
837121048 837121065
837121573 837121590
837121640 837121657
837121758 837121775
837121847 837121864
837122083 837122100
837128698 837128715
837134328 837134345
837134438 837134455
837135688 837135705
837137201 837137218
837141360 837141377
837143849 837143866
837146505 837146522
837151306 837151323
837153508 837153525
837156058 837156075
837207412 837207429
837230075 837230092
837230655 837230672
837230804 837230821
837233738 837233755
837237125 837237142
837239642 837239659
837242182 837242199
837244650 837244667
837247141 837247158
837249351 837249368
837251790 837251807
837253993 837254010
837256217 837256234
837258419 837258436
837260670 837260687
837262894 837262911
837320237 837320254
837323565 837323582
837327722 837327739
837330162 837330179
837335801 837335818
837338351 837338368
837340563 837340580
837379028 837379045
837379290 837379307
837379422 837379439
837379764 837379781
837379951 837379968
837379984 837380001
837380009 837380026
837384872 837384889
837396197 837396214
837398994 837399011
837406281 837406298
837408256 837408273
837410756 837410773
837412928 837412945
837415409 837415426
837419666 837419683
837421689 837421706
837423902 837423919
837426096 837426113
837428268 837428285
837430332 837430349
837464823 837464840
837465104 837465121
837465155 837465172
837465264 837465281
837465331 837465348
837465416 837465433
837465713 837465730
837465762 837465779
837465796 837465813
837465845 837465862
837465928 837465945
837466004 837466021
837466040 837466057
837466298 837466315
837466380 837466397
837466597 837466614
837466805 837466822
837466849 837466866
837466895 837466912
837466959 837466976
837467058 837467075
837467114 837467131
837467169 837467186
837467201 837467218
837467265 837467282
837467315 837467332
837467463 837467480
837467523 837467540
837467633 837467650
837467727 837467744
837467786 837467803
837468116 837468133
837468304 837468321
837468359 837468376
837468394 837468411
837468441 837468458
837468495 837468512
837481502 837481519
837481651 837481668
837485029 837485046
837487527 837487544
837490145 837490162
837492297 837492314
837494835 837494852
837497010 837497027
837499250 837499267
837501393 837501410
837503666 837503683
837505840 837505857
837508060 837508077
837510106 837510123
837512240 837512257
837514392 837514409
837516526 837516543
837518578 837518595
837523015 837523032
837526303 837526320
837570876 837570893
837571025 837571042
837575468 837575485
837580190 837580207
837582700 837582717
837585256 837585273
837587449 837587466
837590323 837590340
837592773 837592790
837595331 837595348
837595581 837595601
837597573 837597590
837600506 837600523
837602690 837602707
837603167 837603184
837605367 837605384
837607557 837607574
837638944 837638961
837639056 837639073
837639099 837639116
837639148 837639165
837639181 837639198
837639456 837639473
837639523 837639540
837639609 837639626
837639767 837639784
837639911 837639928
837640321 837640338
837640445 837640462
837640997 837641014
837643309 837643326
837643341 837643358
837643462 837643479
837643493 837643510
837643529 837643546
837643560 837643577
837643600 837643617
837643640 837643657
837643672 837643689
837643676 837643693
837643713 837643730
837643725 837643742
837643733 837643750
837643773 837643790
837643791 837643808
837643821 837643838
837643840 837643857
837643859 837643876
837643881 837643898
837643927 837643944
837644030 837644047
837656962 837656979
837657298 837657315
837657425 837657442
837657790 837657807
837658238 837658255
837658306 837658324
837658525 837658542
837658897 837658914
837659045 837659062
837659779 837659796
837662580 837662597
837665110 837665127
837668033 837668050
837670206 837670223
837672784 837672801
837677494 837677511
837679706 837679723
837682314 837682331
837684537 837684554
837687055 837687072
837689217 837689234
837693998 837694015
837696657 837696674
837698869 837698886
837702640 837702657
837704562 837704579
837705038 837705055
837705554 837705571
837705918 837705935
837709729 837709746
837712042 837712059
837737452 837737469
837743905 837743922
837746453 837746470
837749319 837749336
837751936 837751953
837754820 837754837
837757061 837757078
837764280 837764297
837766492 837766509
837768994 837769011
837771224 837771241
837773762 837773779
837776005 837776022
837789294 837789312
837796330 837796347
837796344 837796361
837796514 837796531
837796585 837796602
837796645 837796662
837796676 837796693
837796726 837796743
837796806 837796823
837796928 837796945
837797033 837797050
837797194 837797212
837797269 837797286
837797374 837797391
837797640 837797657
837797655 837797672
837797684 837797701
837797700 837797717
837797721 837797738
837797738 837797755
837797771 837797788
837797808 837797825
837797840 837797857
837797871 837797888
837797902 837797919
837797928 837797945
837797980 837797997
837798043 837798060
837798100 837798117
837798158 837798175
837798215 837798232
837798266 837798284
837798276 837798293
837798336 837798353
837798368 837798385
837798452 837798469
837798489 837798506
837798560 837798577
837798580 837798597
837798636 837798653
837798696 837798713
837798740 837798757
837800184 837800201
837800846 837800863
837804592 837804609
837825189 837825206
837827018 837827035
837827128 837827145
837828587 837828604
837828666 837828683
837829020 837829037
837832974 837832991
837835205 837835222
837840450 837840467
837843068 837843085
837847829 837847846
837850011 837850028
837852587 837852604
837854772 837854789
837857319 837857336
837859531 837859548
837861822 837861839
837864047 837864064
837866515 837866532
837868756 837868773
837916066 837916083
837918721 837918738
837926397 837926414
837928718 837928735
837931077 837931094
837933388 837933405
837940727 837940744
837943048 837943065
837945685 837945702
837948037 837948054
837950436 837950453
837952828 837952845
837956097 837956114
838015910 838015927
838019713 838019730
838023189 838023206
838027003 838027020
838029728 838029745
838033254 838033271
838035951 838035968
838045503 838045520
838100028 838100045
838105482 838105499
838110716 838110733
838118696 838118713
838122676 838122693
838124888 838124905
838159211 838159228
838159253 838159270
838159291 838159308
838159325 838159342
838159373 838159390
838159397 838159414
838159439 838159456
838159477 838159494
838159534 838159551
838159631 838159648
838159735 838159752
838159891 838159908
838160080 838160097
838160717 838160734
838161026 838161043
838161616 838161633
838161820 838161838
838161840 838161857
838161890 838161907
838163302 838163319
838172644 838172661
838172800 838172817
838176781 838176798
838182016 838182033
838184603 838184620
838187280 838187297
838189472 838189489
838192151 838192168
838194333 838194350
838197257 838197274
838199459 838199476
838204298 838204315
838206906 838206923
838209118 838209135
838211756 838211773
838214274 838214291
838245451 838245468
838245532 838245549
838245577 838245594
838245731 838245748
838245751 838245768
838245807 838245824
838245876 838245893
838245913 838245930
838245929 838245946
838245958 838245975
838246056 838246073
838246073 838246090
838246114 838246131
838246133 838246150
838246230 838246247
838246384 838246401
838246498 838246515
838246619 838246636
838246734 838246751
838247282 838247299
838247378 838247395
838247990 838248007
838248234 838248251
838268633 838268650
838270798 838270815
838273345 838273362
838275499 838275516
838277996 838278013
838280013 838280030
838282510 838282527
838284555 838284572
838286826 838286843
838288882 838288899
838291381 838291398
838293455 838293472
838295725 838295742
838297818 838297835
838300396 838300413
838302895 838302912
838326081 838326098
838326100 838326117
838326139 838326156
838327852 838327869
838327921 838327938
838328001 838328018
838328151 838328168
838353514 838353531
838356081 838356098
838360319 838360336
838362513 838362530
838365437 838365454
838367629 838367646
838370266 838370283
838372448 838372465
838374965 838374982
838377139 838377156
838379639 838379656
838381800 838381817
838384319 838384336
838386502 838386519
838414957 838414974
838415111 838415128
838415147 838415164
838415195 838415212
838415271 838415288
838415308 838415325
838415469 838415486
838415597 838415614
838415697 838415714
838415920 838415937
838416021 838416038
838416060 838416077
838416103 838416120
838416141 838416158
838416170 838416187
838416206 838416223
838416240 838416257
838416276 838416293
838416363 838416380
838416432 838416449
838416629 838416646
838416780 838416797
838420321 838420338
838421584 838421601
838421608 838421625
838422380 838422397
838422882 838422899
838422981 838422998
838423029 838423046
838423257 838423274
838423389 838423406
838423605 838423622
838423731 838423748
838423761 838423778
838441270 838441287
838442691 838442708
838443113 838443130
838443836 838443853
838446154 838446171
838447017 838447034
838452428 838452445
838454928 838454945
838460410 838460427
838470149 838470166
838472695 838472712
838475283 838475300
838505902 838505919
838507502 838507519
838507550 838507567
838507616 838507633
838507648 838507665
838507680 838507697
838507743 838507760
838507954 838507971
838508094 838508111
838508276 838508293
838508627 838508644
838508660 838508677
838508694 838508711
838508741 838508758
838508782 838508799
838508805 838508822
838508840 838508857
838508913 838508930
838508979 838508996
838509037 838509054
838509165 838509182
838509200 838509217
838509208 838509225
838509242 838509259
838509259 838509276
838509272 838509289
838509282 838509299
838509292 838509309
838509326 838509343
838509349 838509366
838509365 838509382
838509379 838509396
838509390 838509407
838509423 838509440
838509476 838509493
838509767 838509784
838510008 838510025
838510186 838510203
838531665 838531682
838535360 838535377
838539320 838539337
838542828 838542845
838545513 838545530
838548220 838548237
838550918 838550935
838553436 838553453
838556190 838556207
838559469 838559486
838622692 838622709
838626465 838626483
838635117 838635134
838645508 838645525
838647876 838647893
838687425 838687442
838687445 838687462
838687469 838687486
838688725 838688742
838690853 838690870
838707002 838707019
838711496 838711513
838718597 838718614
838721194 838721211
838724247 838724264
838726963 838726980
838729609 838729626
838755588 838755605
838762894 838762911
838762996 838763013
838763055 838763072
838763119 838763137
838763232 838763249
838763335 838763352
838763398 838763415
838763732 838763749
838763755 838763772
838763830 838763847
838763894 838763911
838763916 838763933
838763942 838763959
838763984 838764001
838764032 838764049
838764056 838764073
838764158 838764175
838764198 838764215
838764208 838764225
838764283 838764300
838764339 838764356
838764365 838764382
838764376 838764393
838764402 838764419
838764414 838764431
838764424 838764441
838764438 838764455
838764460 838764477
838764468 838764485
838764490 838764507
838764521 838764538
838764535 838764552
838764552 838764569
838764567 838764584
838764580 838764597
838764605 838764622
838764621 838764638
838764632 838764649
838764654 838764671
838764690 838764707
838764695 838764712
838764720 838764737
838764742 838764759
838764768 838764785
838764784 838764801
838764799 838764816
838764813 838764830
838764837 838764854
838764847 838764864
838764874 838764891
838764884 838764901
838764902 838764919
838764910 838764927
838764940 838764957
838764962 838764979
838764978 838764995
838764994 838765011
838765005 838765022
838765052 838765069
838765067 838765084
838765092 838765109
838765108 838765125
838765131 838765148
838765151 838765168
838765161 838765178
838765207 838765224
838765230 838765247
838765255 838765272
838765303 838765320
838765324 838765341
838765336 838765353
838787281 838787298
838790749 838790766
838794334 838794351
838797957 838797974
838800565 838800582
838802947 838802964
838805909 838805926
838808210 838808227
838810877 838810894
838813218 838813235
838815568 838815585
838837158 838837175
838837487 838837504
838837783 838837800
838837895 838837912
838838058 838838075
838838075 838838092
838838129 838838146
838838152 838838169
838838199 838838216
838838214 838838231
838838228 838838245
838838243 838838260
838838280 838838297
838838299 838838316
838838320 838838337
838838340 838838357
838838361 838838378
838838382 838838399
838838399 838838416
838838419 838838436
838838441 838838458
838838468 838838485
838838499 838838516
838838537 838838554
838838574 838838591
838838602 838838619
838838619 838838636
838838631 838838648
838838648 838838665
838838655 838838672
838838677 838838694
838838723 838838740
838838741 838838758
838838776 838838793
838838798 838838815
838838850 838838867
838838919 838838936
838838965 838838982
838838980 838838997
838839046 838839063
838839119 838839136
838839180 838839197
838839233 838839250
838839289 838839308
838839332 838839349
838839368 838839385
838839409 838839426
838839427 838839444
838839479 838839496
838839492 838839509
838839522 838839539
838839526 838839543
838839558 838839577
838839603 838839620
838839651 838839670
838839699 838839716
838839732 838839749
838839760 838839777
838839799 838839816
838839813 838839830
838839871 838839888
838839888 838839905
838841704 838841721
838842003 838842020
838842438 838842455
838842695 838842712
838844589 838844606
838849956 838849973
838850752 838850769
838874150 838874167
838877962 838877979
838881231 838881248
838883523 838883540
838888490 838888507
838890921 838890938
838893547 838893564
838895926 838895943
838898257 838898274
838902949 838902966
838956830 838956847
838960996 838961013
838964444 838964461
838967021 838967038
838969758 838969775
838972394 838972411
838974715 838974732
838977383 838977400
838979695 838979712
838984473 838984490
838986638 838986655
838988968 838988985
838991327 838991344
838996162 838996179
839019240 839019257
839019288 839019305
839019391 839019408
839019697 839019714
839019780 839019797
839020048 839020065
839020126 839020143
839020185 839020202
839020557 839020574
839020656 839020673
839021192 839021209
839021354 839021371
839021389 839021406
839021463 839021480
839021476 839021493
839021512 839021529
839024140 839024157
839048902 839048919
839053020 839053037
839056536 839056553
839059113 839059130
839061820 839061837
839064547 839064564
839066868 839066885
839069563 839069580
839071874 839071891
839074513 839074530
839077183 839077200
839077218 839077235
839104109 839104126
839104168 839104185
839104757 839104774
839141231 839141248
839143692 839143709
839149153 839149170
839151692 839151709
839154151 839154168
839156670 839156687
839158882 839158899
839161409 839161426
839163997 839164014
839191397 839191414
839191473 839191490
839191677 839191694
839191854 839191871
839191994 839192011
839192073 839192090
839192436 839192453
839192530 839192547
839192877 839192894
839198732 839198749
839200432 839200449
839201871 839201888
839202352 839202369
839202450 839202467
839202707 839202724
839203374 839203391
839206120 839206137
839215702 839215719
839218596 839218613
839220788 839220805
839223376 839223393
839225558 839225575
839228136 839228153
839232849 839232866
839234892 839234909
839237420 839237437
839239486 839239503
839241973 839241990
839244039 839244056
839246290 839246307
839253272 839253289
839283505 839283522
839307230 839307247
839309639 839309656
839313146 839313163
839318164 839318181
839320612 839320629
839323210 839323227
839325412 839325429
839328011 839328028
839330450 839330467
839332720 839332737
839335110 839335127
839337708 839337725
839393629 839393646
839397275 839397292
839400100 839400117
839411812 839411829
839414027 839414044
839416297 839416314
839418479 839418496
839420004 839420024
839420732 839420749
839422677 839422694
839422916 839422933
839442800 839442817
839443712 839443729
839443807 839443824
839443968 839443985
839444040 839444057
839444131 839444148
839444197 839444214
839469670 839469687
839472486 839472503
839475438 839475455
839477966 839477983
839480494 839480511
839482698 839482715
839485217 839485234
839492151 839492168
839494411 839494428
839496614 839496631
839498886 839498903
839501108 839501125
839503379 839503396
839505591 839505608
839510313 839510330
839572221 839572238
839572368 839572385
839576141 839576158
839578720 839578737
839581633 839581650
839583855 839583872
839586720 839586737
839588931 839588948
839593780 839593797
839654966 839654983
839655115 839655132
839658583 839658600
839664815 839664832
839668280 839668297
839673328 839673345
839675934 839675951
839680478 839680495
839718388 839718405
839719630 839719647
839720306 839720323
839720353 839720370
839753754 839753772
839758286 839758303
839762148 839762165
839765764 839765781
839788052 839788069
839788134 839788151
839788190 839788207
839788228 839788245
839788292 839788309
839788368 839788385
839789285 839789302
839790339 839790356
839790344 839790361
839790386 839790403
839790469 839790486
839790732 839790749
839791193 839791210
839791235 839791252
839791254 839791271
839798824 839798841
839801890 839801907
839804557 839804575
839811454 839811471
839820462 839820479
839825133 839825150
839828690 839828707
839831377 839831394
839834042 839834059
839837282 839837299
839839879 839839896
839842467 839842484
839845096 839845113
839847366 839847383
839849232 839849249
839849667 839849684
839917238 839917255
839921434 839921451
839924910 839924927
839927547 839927564
839930560 839930577
839933246 839933263
839935558 839935575
839938294 839938311
839940950 839940967
840009151 840009168
840011867 840011884
840015610 840015627
840018584 840018601
840021162 840021179
840023867 840023884
840026901 840026918
840097866 840097883
840100435 840100452
840103199 840103216
840105501 840105518
840108176 840108193
840113361 840113378
840118498 840118515
840175339 840175356
840179528 840179545
840183518 840183535
840186984 840187001
840189592 840189609
840192517 840192534
840195478 840195495
840198145 840198162
840201100 840201117
840278109 840278126
840335874 840335891
840336030 840336047
840343528 840343545
840346907 840346924
840354322 840354339
840357228 840357245
840361236 840361253
840368793 840368810
840442482 840442499
840444694 840444711
840447113 840447130
840449356 840449373
840451500 840451517
840454007 840454024
840456182 840456199
840458563 840458580
840461039 840461056
840474555 840474572
840475061 840475078
840475388 840475405
840475855 840475872
840522699 840522716
840526769 840526786
840532964 840532981
840536023 840536040
840538127 840538144
840571738 840571755
840571938 840571955
840575216 840575233
840575254 840575271
840575441 840575458
840575500 840575517
840575506 840575523
840575546 840575563
840575663 840575680
840575694 840575711
840575829 840575846
840575930 840575947
840575956 840575973
840576001 840576018
840576067 840576084
840576315 840576332
840576831 840576848
840577009 840577026
840577059 840577076
840577088 840577105
840577186 840577203
840577197 840577214
840577297 840577314
840577311 840577328
840609575 840609592
840609723 840609740
840620143 840620160
840631719 840631736
840634219 840634236
840643376 840643393
840653414 840653431
840694110 840694127
840694258 840694275
840701320 840701337
840704815 840704832
840708381 840708398
840715472 840715489
840718396 840718413
840722189 840722206
840754274 840754291
840754728 840754745
840754765 840754782
840754803 840754820
840754973 840754990
840755280 840755297
840755339 840755356
840755363 840755380
840755532 840755551
840755675 840755692
840755829 840755846
840755946 840755963
840756052 840756069
840756150 840756167
840756180 840756197
840756250 840756267
840756367 840756384
840757199 840757216
840757237 840757254
840757370 840757387
840776828 840776845
840779375 840779392
840783722 840783739
840787030 840787047
840791364 840791381
840793865 840793882
840797665 840797682
840880227 840880244
840923425 840923442
840923850 840923867
840924935 840924952
840925362 840925379
840957952 840957969
840963711 840963728
840964054 840964071
840971178 840971195
841032148 841032165
841035150 841035167
841037965 841037982
841040069 841040086
841046728 841046745
841049690 841049707
841051773 841051790
841054024 841054041
841056089 841056106
841128656 841128673
841130691 841130708
841132804 841132821
841134849 841134866
841136964 841136981
841139076 841139093
841202733 841202750
841205391 841205408
841207582 841207599
841209776 841209793
841211956 841211973
841214031 841214048
841216225 841216242
841220591 841220608
841222733 841222750
841224907 841224924
841227138 841227155
841229253 841229270
841231366 841231383
841293309 841293326
841300726 841300743
841302987 841303004
841307325 841307342
841309350 841309367
841311561 841311578
841313605 841313622
841315730 841315747
841317763 841317780
841319887 841319904
841324106 841324123
841326316 841326333
841328570 841328587
841334790 841334810
841384721 841384738
841389806 841389823
841391922 841391939
841394202 841394219
841396275 841396292
841398528 841398545
841400581 841400598
841402696 841402713
841404749 841404766
841408908 841408925
841411031 841411048
841413096 841413113
841415367 841415384
841417540 841417557
841470194 841470211
841472348 841472365
841476653 841476670
841478708 841478725
841480999 841481016
841483044 841483061
841485276 841485293
841487322 841487339
841489425 841489442
841546850 841546867
841550900 841550917
841553765 841553782
841559996 841560013
841563553 841563570
841565605 841565622
841567719 841567736
841569843 841569860
841571928 841571945
841576331 841576348
841633317 841633334
841638728 841638745
841641584 841641601
841657812 841657829
841659835 841659852
841661861 841661878
841663846 841663863
841665870 841665887
841672004 841672021
841674214 841674231
841723786 841723803
841729041 841729058
841731638 841731655
841734198 841734215
841736211 841736228
841738315 841738332
841740290 841740307
841742364 841742381
841744341 841744358
841746465 841746482
841748419 841748436
841761199 841761216
841816271 841816288
841819068 841819085
841827816 841827833
841829911 841829928
841832352 841832369
841834434 841834451
841836639 841836656
841838692 841838709
841841261 841841278
841843235 841843252
841862421 841862438
841899296 841899313
841902540 841902557
841906035 841906052
841910331 841910348
841912465 841912482
841914569 841914586
841916751 841916768
841918865 841918882
841920950 841920967
841923074 841923091
841927477 841927494
841985690 841985707
841985840 841985857
841989344 841989361
841995875 841995892
841997959 841997976
842000179 842000196
842002747 842002764
842004772 842004789
842006858 842006875
842009058 842009075
842011154 842011171
842014392 842014409
842016525 842016542
842019114 842019131
842073129 842073146
842073278 842073295
842080932 842080949
842091608 842091625
842094967 842094984
842098788 842098805
842102096 842102113
842153872 842153889
842154028 842154045
842157259 842157276
842161703 842161720
842165910 842165927
842176963 842176980
842180103 842180120
842184626 842184643
842187323 842187340
842208807 842208824
842208910 842208927
842209055 842209072
842237328 842237345
842237477 842237494
842241357 842241374
842246029 842246046
842251343 842251360
842255926 842255943
842257882 842257899
842260036 842260053
842262010 842262027
842264125 842264142
842266079 842266096
842268173 842268190
842274247 842274264
842276360 842276377
842278358 842278375
842281053 842281070
842284934 842284951
842294594 842294611
842323384 842323401
842325853 842325870
842328480 842328497
842330426 842330443
842332509 842332526
842334476 842334493
842336539 842336556
842338494 842338511
842340589 842340606
842344628 842344645
842346573 842346590
842348668 842348685
842350633 842350650
842352697 842352714
842358732 842358749
842360836 842360853
842362831 842362848
842364934 842364951
842366931 842366948
842389738 842389755
842409017 842409034
842414853 842414870
842417390 842417407
842420777 842420794
842423305 842423322
842428530 842428547
842431090 842431107
842433598 842433615
842435562 842435579
842445844 842445861
842450565 842450582
842475117 842475134
842514963 842514980
842520660 842520677
842527544 842527561
842558210 842558227
842558340 842558357
842558702 842558719
842559155 842559172
842562151 842562168
842626833 842626850
842626868 842626885
842626894 842626911
842626948 842626965
842627031 842627048
842627129 842627146
842627172 842627189
842627331 842627348
842627403 842627420
842627436 842627453
842627468 842627485
842627529 842627546
842627685 842627702
842627995 842628012
842630663 842630680
842630719 842630736
842630788 842630805
842630900 842630917
842630909 842630926
842631084 842631101
842633249 842633266
842633895 842633912
842634124 842634141
842634573 842634590
842634802 842634819
842635029 842635046
842635344 842635361
842688277 842688294
842692534 842692551
842695429 842695446
842699249 842699266
842702518 842702535
842706242 842706259
842710627 842710644
842744593 842744610
842746737 842746754
842748830 842748847
842750915 842750932
842752988 842753005
842755043 842755060
842757107 842757124
842759182 842759199
842761286 842761303
842763439 842763456
842769788 842769805
842771913 842771930
842774045 842774062
842776239 842776256
842778353 842778370
842780506 842780523
842782638 842782655
842784782 842784799
842786915 842786932
842789029 842789046
842791143 842791160
842793276 842793293
842795479 842795496
842797642 842797659
842799804 842799821
842801949 842801966
842804120 842804137
842806264 842806281
842808566 842808583
842810768 842810785
842813385 842813402
842815737 842815754
842820398 842820415
842824944 842824961
842828606 842828623
842829188 842829205
842831245 842831262
842833416 842833433
842835610 842835627
842837664 842837681
842839719 842839736
842841832 842841849
842843965 842843982
842846029 842846046
842848143 842848160
842850326 842850343
842852429 842852446
842856695 842856712
842858800 842858817
842860922 842860939
842863068 842863085
842865200 842865217
842867344 842867361
842870169 842870186
842872313 842872330
842875116 842875133
842877251 842877268
842879353 842879370
842881457 842881474
842888026 842888043
842890169 842890186
842894693 842894710
842897311 842897328
842933607 842933624
842952452 842952469
842956255 842956272
842963583 842963600
843005103 843005120
843005485 843005502
843038255 843038272
843041650 843041667
843045404 843045421
843066721 843066738
843068033 843068050
843068622 843068639
843068696 843068713
843068759 843068776
843068893 843068910
843071163 843071180
843078196 843078213
843078373 843078390
843079682 843079699
843079979 843079996
843080013 843080030
843080428 843080445
843082700 843082717
843082740 843082757
843082873 843082890
843082971 843082988
843083115 843083132
843083180 843083197
843122721 843122738
843126326 843126343
843129438 843129455
843129796 843129813
843130414 843130431
843131620 843131637
843133961 843133978
843136618 843136635
843138760 843138777
843146514 843146531
843167021 843167038
843167339 843167356
843184783 843184800
843190419 843190436
843192560 843192577
843194735 843194752
843213885 843213902
843218142 843218159
843220295 843220312
843222420 843222437
843224631 843224648
843228898 843228915
843231040 843231057
843268099 843268116
843270173 843270190
843272258 843272275
843274341 843274358
843276445 843276462
843278550 843278567
843280672 843280689
843282788 843282805
843285018 843285035
843287181 843287198
843289285 843289302
843291409 843291426
843299914 843299931
843302036 843302053
843304171 843304188
843368589 843368606
843370819 843370836
843372952 843372969
843375036 843375053
843377120 843377137
843379245 843379262
843381367 843381384
843383491 843383508
843385644 843385661
843388479 843388496
843392983 843393000
843412638 843412655
843414862 843414879
843419680 843419697
843422298 843422315
843431967 843431984
843439583 843439600
843441734 843441751
843443910 843443927
843454348 843454365
843456432 843456449
843473441 843473458
843475574 843475591
843477766 843477783
843479880 843479897
843482003 843482020
843488344 843488361
843530341 843530358
843532564 843532581
843534746 843534763
843536859 843536876
843538973 843538990
843541096 843541113
843543210 843543227
843545336 843545353
843547556 843547573
843549680 843549697
843551773 843551790
843553868 843553885
843555990 843556007
843558105 843558122
843560348 843560365
843562628 843562645
843564891 843564908
843566076 843566093
843567143 843567160
843569306 843569323
843580101 843580118
843582254 843582271
843584396 843584413
843586522 843586539
843595303 843595320
843597514 843597531
843608380 843608397
843610473 843610490
843612567 843612584
843614592 843614609
843616677 843616694
843618760 843618777
843623016 843623033
843625090 843625107
843627194 843627211
843629298 843629315
843631381 843631398
843633505 843633522
843637693 843637710
843639827 843639844
843641950 843641967
843644074 843644091
843646206 843646224
843648340 843648357
843650533 843650550
843652648 843652665
843654791 843654808
843656993 843657010
843659126 843659143
843661278 843661295
843666662 843666679
843668660 843668677
843706623 843706640
843709805 843709822
843713607 843713624
843719357 843719374
843725785 843725802
843727839 843727856
843730043 843730060
843747080 843747097
843759769 843759786
843798084 843798101
843801484 843801501
843803545 843803562
843805729 843805746
843807784 843807801
843809936 843809953
843811981 843811998
843814163 843814180
843816228 843816245
843818382 843818399
843820506 843820523
843824752 843824769
843826886 843826903
843828939 843828956
843831063 843831080
843865309 843865326
843884576 843884593
843888280 843888297
843966030 843966047
843971650 843971667
843974177 843974194
843977556 843977573
843980083 843980100
843992543 843992560
843996623 843996640
843998616 843998633
844040078 844040095
844055429 844055446
844059161 844059178
844063240 844063257
844070558 844070575
844073077 844073094
844075143 844075160
844077453 844077470
844079459 844079476
844081551 844081568
844083577 844083594
844087665 844087682
844139952 844139969
844143172 844143189
844147133 844147150
844149622 844149639
844151734 844151751
844156289 844156306
844158383 844158400
844160387 844160404
844162452 844162469
844164466 844164483
844166540 844166557
844170630 844170647
844172653 844172670
844174737 844174754
844176744 844176761
844178848 844178865
844180980 844180997
844183104 844183121
844217938 844217955
844219953 844219970
844222018 844222035
844224032 844224049
844226106 844226123
844228111 844228128
844230205 844230222
844232241 844232258
844234323 844234340
844236399 844236416
844238481 844238498
844240528 844240545
844244664 844244681
844246768 844246785
844248822 844248839
844250935 844250952
844253009 844253026
844255134 844255151
844257229 844257246
844259330 844259347
844261484 844261501
844263580 844263597
844265633 844265650
844267756 844267773
844268494 844268511
844269830 844269847
844274047 844274064
844276131 844276148
844278226 844278243
844280320 844280337
844282424 844282441
844284626 844284643
844286700 844286717
844288863 844288880
844290946 844290963
844293121 844293138
844295225 844295242
844297536 844297553
844299539 844299556
844301536 844301553
844303569 844303586
844305584 844305601
844307539 844307556
844309574 844309591
844311569 844311586
844319845 844319862
844324173 844324190
844330573 844330590
844332684 844332701
844334848 844334865
844336944 844336961
844339085 844339102
844341149 844341166
844343282 844343299
844345417 844345434
844347530 844347547
844349614 844349631
844351727 844351744
844358058 844358075
844360152 844360169
844362266 844362283
844362459 844362478
844364390 844364407
844366463 844366480
844368596 844368613
844370710 844370727
844372875 844372892
844375127 844375144
844377438 844377455
844379559 844379576
844381822 844381839
844383886 844383903
844385949 844385966
844387974 844387991
844390020 844390037
844391995 844392012
844394058 844394075
844398137 844398154
844400193 844400210
844402266 844402283
844404341 844404358
844406434 844406451
844408480 844408497
844410593 844410610
844412687 844412704
844414770 844414787
844418987 844419004
844421082 844421099
844423185 844423202
844425289 844425306
844444401 844444418
844446513 844446530
844463520 844463537
844475641 844475658
844478050 844478067
844480192 844480209
844482306 844482323
844484370 844484387
844486475 844486492
844488607 844488624
844490683 844490700
844492726 844492743
844496893 844496910
844499009 844499026
844501062 844501079
844503176 844503193
844505259 844505276
844507345 844507362
844509427 844509444
844511522 844511539
844513586 844513603
844515690 844515707
844517773 844517790
844519869 844519886
844562157 844562174
844566986 844567003
844569120 844569137
844571226 844571243
844573377 844573394
844575610 844575627
844577882 844577899
844580034 844580051
844582139 844582156
844588449 844588466
844590523 844590540
844592659 844592676
844594790 844594807
844599007 844599024
844603305 844603322
844620659 844620676
844650359 844650376
844652442 844652459
844654526 844654543
844656611 844656628
844658753 844658770
844660869 844660886
844663060 844663077
844665174 844665191
844669460 844669477
844671603 844671620
844673727 844673744
844675860 844675877
844677985 844678002
844680107 844680124
844682242 844682259
844684365 844684382
844688583 844688600
844690726 844690743
844692860 844692877
844694953 844694970
844767311 844767328
844769414 844769431
844771528 844771545
844773710 844773727
844775814 844775831
844777930 844777947
844780022 844780039
844782147 844782164
844811993 844812010
844816241 844816258
844818276 844818293
844820351 844820368
844822571 844822588
844824696 844824713
844826888 844826905
844829149 844829166
844831391 844831408
844833605 844833622
844835816 844835833
844840202 844840219
844842434 844842451
844844638 844844655
844849012 844849029
844851236 844851253
844853466 844853483
844855701 844855718
844857893 844857910
844860103 844860120
844866711 844866728
844868876 844868893
844873259 844873276
844875413 844875430
844877645 844877662
844879789 844879806
844886238 844886255
844888383 844888400
844892885 844892902
844895167 844895184
844897400 844897417
844899494 844899511
844901597 844901614
844903680 844903697
844905735 844905752
844909864 844909881
844912027 844912044
844914141 844914158
844916264 844916281
844918378 844918395
844920540 844920557
844926873 844926890
844928996 844929013
844933214 844933231
844935347 844935364
844937481 844937498
844939594 844939611
844941728 844941745
844943851 844943868
844945983 844946000
844948195 844948212
844950390 844950407
844952611 844952628
844954834 844954851
844957007 844957024
844959209 844959226
844961381 844961398
844963594 844963611
844965737 844965754
844983892 844983909
844986153 844986170
844988297 844988314
844990646 844990663
844992792 844992809
844995269 844995286
844997462 844997479
844999605 844999622
845001669 845001686
845003921 845003938
845006067 845006084
845007762 845007779
845007778 845007796
845007797 845007815
845008112 845008129
845008466 845008483
845012939 845012956
845271665 845271682
845278895 845278912
845285996 845286013
845294027 845294044
845304543 845304560
845305651 845305668
845305702 845305719
845306052 845306069
845306095 845306112
845306677 845306694
845306740 845306757
845306847 845306864
845306973 845306990
845306998 845307015
845307017 845307034
845307120 845307137
845312378 845312395
845312486 845312503
845312985 845313002
845316653 845316670
845321515 845321532
845329366 845329383
845333524 845333541
845336260 845336277
845339845 845339862
845343215 845343232
845345556 845345573
845347717 845347734
845349899 845349916
845352025 845352042
845354099 845354116
845356221 845356238
845358384 845358401
845360527 845360544
845362682 845362699
845366959 845366976
845369072 845369089
845371176 845371193
845373319 845373336
845375451 845375468
845393200 845393217
845401647 845401664
845410159 845410176
845412292 845412309
845418554 845418571
845420579 845420596
845422673 845422690
845424708 845424725
845426821 845426838
845428976 845428993
845431129 845431146
845433243 845433260
845435424 845435441
845437586 845437603
845439711 845439728
845441823 845441840
845443890 845443907
845448156 845448173
845452403 845452420
845454526 845454543
845456630 845456647
845458743 845458760
845460877 845460894
845462972 845462989
845465104 845465121
845469371 845469388
845471474 845471491
845475731 845475748
845477875 845477892
845480037 845480054
845486527 845486544
845488691 845488708
845504424 845504441
845508167 845508184
845510236 845510253
845510390 845510407
845511078 845511095
845512207 845512224
845513844 845513861
845516000 845516017
845516360 845516377
845518017 845518034
845518562 845518579
845520454 845520471
845522560 845522577
845524881 845524898
845527003 845527020
845529146 845529163
845531389 845531406
845533671 845533688
845535135 845535152
845535982 845535999
845538292 845538309
845540603 845540620
845542856 845542873
845545106 845545123
845547280 845547297
845553681 845553698
845555784 845555801
845557858 845557875
845559923 845559940
845562026 845562043
845564090 845564107
845566155 845566172
845568248 845568265
845570312 845570329
845572418 845572435
845574619 845574636
845575930 845575948
845576703 845576720
845578788 845578805
845580942 845580959
845583054 845583071
845583267 845583284
845585207 845585224
845587311 845587328
845589376 845589393
845591499 845591516
845593573 845593590
845595737 845595754
845597929 845597946
845600062 845600079
845602244 845602261
845604419 845604436
845606552 845606569
845608686 845608703
845610946 845610963
845613128 845613145
845615294 845615311
845617475 845617492
845619648 845619665
845626284 845626301
845628528 845628545
845630740 845630757
845632953 845632970
845635145 845635162
845637347 845637364
845641743 845641760
845643935 845643952
845646157 845646174
845648351 845648368
845652735 845652752
845654920 845654937
845663601 845663618
845671975 845671992
845674060 845674077
845688954 845688971
845691148 845691165
845693350 845693367
845695562 845695579
845697775 845697792
845700026 845700043
845702299 845702316
845704511 845704528
845706714 845706731
845708906 845708923
845711127 845711144
845713342 845713359
845715533 845715550
845717715 845717732
845719898 845719915
845722062 845722079
845724254 845724271
845726427 845726444
845728609 845728626
845730772 845730789
845730794 845730811
845768300 845768317
845770255 845770272
845772321 845772338
845774364 845774381
845776440 845776457
845778571 845778588
845780745 845780762
845782838 845782855
845784972 845784989
845787087 845787104
845789268 845789285
845791343 845791360
845793475 845793492
845797793 845797810
845799906 845799923
845802020 845802037
845804122 845804139
845806217 845806234
845808322 845808339
845812508 845812525
845814602 845814619
845816685 845816702
845854663 845854680
845856814 845856831
845858938 845858955
845863205 845863222
845865329 845865346
845867453 845867470
845869597 845869614
845871738 845871755
845873871 845873888
845875995 845876012
845878139 845878156
845880242 845880259
845884540 845884557
845888825 845888842
845890998 845891015
845893132 845893149
845895296 845895313
845899541 845899558
845901617 845901634
845905802 845905819
845911967 845911984
846080729 846080746
846082851 846082868
846087158 846087175
846089310 846089327
846091443 846091460
846095730 846095747
846097865 846097882
846121262 846121279
846130099 846130116
846132310 846132327
846134532 846134549
846136775 846136792
846138987 846139004
846145692 846145709
846147896 846147913
846150118 846150135
846152330 846152347
846154543 846154560
846156726 846156743
846158928 846158945
846161151 846161168
846163353 846163370
846165555 846165572
846167867 846167884
846169971 846169988
846174256 846174273
846178506 846178523
846180667 846180684
846182731 846182748
846184834 846184851
846186980 846186997
846189122 846189139
846191197 846191214
846193319 846193336
846195393 846195410
846197467 846197484
846199552 846199569
846201616 846201633
846203729 846203746
846205904 846205921
846207996 846208013
846210249 846210266
846212401 846212418
846214684 846214701
846216964 846216981
846219168 846219185
846221390 846221407
846223582 846223599
846225774 846225791
846227957 846227974
846230200 846230217
846232402 846232419
846234733 846234750
846236956 846236973
846241341 846241358
846243543 846243560
846245728 846245745
846247988 846248005
846267742 846267759
846269876 846269893
846276423 846276440
846278676 846278693
846292286 846292303
846294458 846294475
846296562 846296579
846298648 846298665
846300801 846300818
846302904 846302921
846305026 846305043
846307160 846307177
846309234 846309251
846311368 846311385
846313530 846313547
846315685 846315702
846320020 846320037
846322143 846322160
846324247 846324264
846326410 846326427
846328534 846328551
846330657 846330674
846332822 846332839
846334924 846334941
846389189 846389206
846391351 846391368
846393514 846393531
846395658 846395675
846397771 846397788
846399933 846399950
846402108 846402125
846404281 846404298
846406423 846406440
846412833 846412850
846414967 846414984
846417100 846417117
846419263 846419280
846421406 846421423
846423560 846423577
846425793 846425810
846427954 846427971
846430088 846430105
846438466 846438483
846462386 846462403
846464995 846465012
846467472 846467489
846469716 846469733
846471869 846471886
846474060 846474077
846478376 846478393
846480561 846480578
846482742 846482759
846484904 846484921
846487058 846487075
846489272 846489289
846491416 846491433
846493568 846493585
846497776 846497793
846499890 846499907
846502160 846502177
846504332 846504349
846506518 846506535
846508034 846508051
846508680 846508697
846510852 846510869
846539198 846539215
846541322 846541339
846543545 846543562
846545669 846545686
846549945 846549962
846552117 846552134
846554289 846554306
846556483 846556500
846558685 846558702
846560889 846560906
846563130 846563147
846565352 846565369
846567634 846567651
846569846 846569863
846572109 846572126
846574320 846574337
846576535 846576552
846578727 846578744
846580919 846580936
846581925 846581942
846583071 846583088
846585234 846585251
846585480 846585497
846587555 846587572
846589720 846589737
846591873 846591890
846594017 846594034
846596198 846596215
846598340 846598357
846607635 846607652
846609827 846609844
846611951 846611968
846614135 846614152
846616268 846616285
846618372 846618389
846620534 846620551
846622647 846622664
846626940 846626957
846629033 846629050
846631058 846631075
846633147 846633164
846635330 846635347
846637544 846637561
846639774 846639791
846641986 846642003
846644190 846644207
846646382 846646399
846648594 846648611
846650809 846650826
846652990 846653007
846655162 846655179
846657296 846657313
846659459 846659476
846661644 846661661
846663836 846663853
846666057 846666074
846668230 846668247
846670383 846670400
846672545 846672562
846674701 846674718
846676883 846676900
846679036 846679053
846679272 846679289
846681395 846681412
846683519 846683536
846685742 846685759
846687915 846687932
846694405 846694422
846696529 846696546
846698690 846698707
846700824 846700841
846704982 846704999
846707066 846707083
846709121 846709138
846711244 846711261
846713289 846713306
846715382 846715399
846717456 846717473
846719473 846719490
846721595 846721612
846723700 846723717
846725803 846725820
846727917 846727934
846730147 846730164
846732372 846732389
846734613 846734630
846736836 846736853
846738979 846738996
846741171 846741188
846743333 846743350
846745548 846745565
846747779 846747796
846749991 846750008
846754426 846754443
846756669 846756686
846758852 846758869
846761062 846761079
846763287 846763304
846765489 846765506
846767680 846767697
846769923 846769940
846772067 846772084
846774220 846774237
846776364 846776381
846778506 846778523
846780766 846780783
846782902 846782919
846785103 846785120
846787258 846787275
846789401 846789418
846791514 846791531
846793636 846793653
846795751 846795768
846797863 846797880
846799989 846800006
846802142 846802159
846804244 846804261
846806349 846806366
846808442 846808459
846810516 846810533
846812621 846812638
846814694 846814711
846816808 846816825
846817273 846817290
846818894 846818911
846821046 846821063
846823199 846823216
846825302 846825319
846827446 846827463
846829618 846829635
846831782 846831799
846836146 846836163
846838312 846838329
846840474 846840491
846846912 846846929
846849046 846849063
846851199 846851216
846853404 846853421
846859851 846859868
846861975 846861992
846862063 846862080
846864098 846864115
846865056 846865073
846866212 846866229
846868484 846868501
846870646 846870663
846871317 846871334
846872762 846872779
846876061 846876078
846876116 846876133
846876638 846876655
846876843 846876860
846876950 846876967
846877010 846877027
846877080 846877097
846877146 846877163
846877197 846877214
846877258 846877275
846877338 846877355
846877409 846877426
846877469 846877486
846877619 846877636
846877649 846877666
846877691 846877708
846877722 846877739
846877760 846877777
846877832 846877849
846877857 846877874
846877929 846877946
846878051 846878068
846878140 846878157
846878233 846878250
846878626 846878643
846878706 846878723
846878875 846878892
846878950 846878967
846879110 846879127
846879244 846879263
846879400 846879417
846879442 846879459
846879519 846879536
846879668 846879685
846879822 846879839
846880032 846880049
846880209 846880227
846880358 846880375
846880498 846880515
846881620 846881637
846882878 846882895
846883715 846883732
846885778 846885795
846887963 846887980
846892306 846892323
846894500 846894517
846896662 846896679
846898896 846898913
846900999 846901016
846903123 846903140
846905275 846905292
846907418 846907435
846943925 846943942
846975148 846975165
846979149 846979166
846981133 846981150
846983197 846983214
846985300 846985317
846987414 846987431
846989508 846989525
846991611 846991628
846993735 846993752
846995878 846995895
846998043 846998060
847000187 847000204
847002319 847002336
847004462 847004479
847006624 847006641
847008796 847008813
847013113 847013130
847015247 847015264
847017369 847017386
847019513 847019530
847021646 847021663
847023790 847023807
847025922 847025939
847028007 847028024
847032314 847032331
847034419 847034436
847073854 847073871
847075840 847075857
847079989 847080006
847082093 847082110
847084185 847084202
847086289 847086306
847088395 847088412
847090527 847090544
847092671 847092688
847097006 847097023
847099158 847099175
847101242 847101259
847103386 847103403
847105529 847105546
847107653 847107670
847109795 847109812
847111919 847111936
847114022 847114039
847124711 847124728
847128986 847129003
847131111 847131128
847133441 847133458
847153757 847153774
847155694 847155711
847157570 847157587
847159467 847159484
847161401 847161418
847163336 847163353
847165304 847165321
847167309 847167326
847169411 847169428
847171475 847171492
847173460 847173477
847175455 847175472
847177540 847177557
847179604 847179621
847181610 847181627
847183713 847183730
847185807 847185824
847187892 847187909
847189905 847189922
847191970 847191987
847193995 847194012
847196097 847196114
847198182 847198199
847200248 847200265
847208503 847208520
847212614 847212631
847217383 847217400
847233057 847233074
847236217 847236234
847242518 847242535
847250509 847250526
847252484 847252501
847256574 847256591
847258716 847258733
847260721 847260738
847262716 847262733
847264681 847264698
847266648 847266665
847268779 847268796
847274943 847274960
847276938 847276955
847280928 847280945
847282933 847282950
847284870 847284887
847286895 847286912
847289019 847289036
847303769 847303786
847305871 847305888
847307976 847307993
847310070 847310087
847312124 847312141
847314197 847314214
847318386 847318403
847320480 847320497
847322545 847322562
847324639 847324656
847326731 847326748
847339483 847339500
847341646 847341663
847343818 847343835
847348242 847348259
847350467 847350484
847352619 847352636
847354762 847354779
847356894 847356911
847359058 847359075
847361200 847361217
847363374 847363391
847365527 847365544
847367689 847367706
847369823 847369840
847371958 847371975
847374080 847374097
847380492 847380509
847382624 847382641
847384738 847384755
847386822 847386840
847388904 847388921
847390968 847390985
847393033 847393050
847401231 847401248
847403248 847403265
847405311 847405328
847407374 847407391
847409389 847409406
847411483 847411500
847413635 847413652
847415800 847415817
847424413 847424430
847426614 847426631
847428885 847428902
847431079 847431096
847433243 847433260
847435385 847435402
847437517 847437534
847443976 847443993
847446100 847446117
847448244 847448261
847450367 847450384
847454643 847454660
847456768 847456785
847458883 847458900
847465310 847465327
847481913 847481931
847492185 847492202
847494200 847494217
847496264 847496281
847498342 847498359
847500473 847500490
847502584 847502601
847504649 847504666
847506753 847506770
847508856 847508873
847510970 847510987
847513094 847513111
847521627 847521644
847523819 847523836
847532502 847532519
847536837 847536854
847539021 847539038
847541173 847541190
847543288 847543305
847547564 847547581
847549697 847549714
