847651127 847651144
847827107 847827124
847998119 847998136
848011273 848011290
848345320 848345337
848764399 848764416
848812603 848812621
848823118 848823135
849018042 849018059
849463503 849463520
849465591 849465608
850010104 850010121
850738933 850738950
851291738 851291755
851295648 851295665
851706201 851706218
852064714 852064731
852587088 852587105
852838640 852838657
853116772 853116789
853349305 853349322
853424903 853424920
853518599 853518616
853601652 853601669
854475208 854475225
854837190 854837207
856200682 856200699
856659371 856659388
856724618 856724635
856725849 856725866
856828455 856828472
857169276 857169293
857735179 857735196
857746748 857746765
857748803 857748820
858111116 858111133
858191278 858191295
858204073 858204090
858271901 858271918
858274329 858274346
858358639 858358656
858615759 858615776
858615928 858615945
858714631 858714648
859519273 859519290
859758235 859758252
859926072 859926089
859926200 859926217
860340947 860340964
860341166 860341183
860367291 860367308
860441417 860441434
860447857 860447874
860774249 860774266
860968204 860968221
861118437 861118454
861121003 861121020
861219134 861219151
861377688 861377705
861386363 861386380
861679298 861679315
861997934 861997951
