862169710 862169727
862240994 862241011
862242826 862242843
862246243 862246260
862326458 862326475
862328148 862328165
862417348 862417365
862501797 862501814
862505387 862505404
862509859 862509876
862587483 862587500
862608386 862608403
862765083 862765100
862846515 862846532
862933484 862933501
862937677 862937695
862946970 862946987
863018425 863018442
863025868 863025885
863037221 863037238
863105966 863105983
863120472 863120489
863193770 863193787
863195889 863195906
863366709 863366726
863718374 863718391
863830862 863830879
864572857 864572874
864574789 864574806
864579472 864579489
864581873 864581890
864661884 864661901
864663956 864663973
864666293 864666310
864668245 864668262
864669781 864669798
864766056 864766073
864837102 864837119
864848828 864848845
864923687 864923704
865015102 865015119
865044019 865044036
865062746 865062763
865076578 865076595
865288844 865288861
865455250 865455267
865487239 865487256
865612112 865612129
865632128 865632145
865825820 865825837
865873250 865873267
865874658 865874675
866053471 866053488
866131751 866131768
866139295 866139312
866197305 866197322
866221892 866221909
866226240 866226257
866230318 866230335
866236110 866236127
866237058 866237075
866256355 866256372
866261329 866261348
866491744 866491761
866518272 866518289
866685935 866685952
866733392 866733409
866762369 866762386
866771114 866771131
866847926 866847943
866848853 866848870
867089627 867089644
867292316 867292333
867309062 867309079
867340593 867340610
867373637 867373654
867480874 867480891
867510959 867510976
867599772 867599789
867613998 867614015
867659210 867659227
867663384 867663401
867685053 867685070
867685061 867685078
867685364 867685381
867777214 867777231
867778646 867778663
867944958 867944975
867953560 867953577
868046304 868046321
868178660 868178677
868203160 868203177
868467362 868467379
868468744 868468761
868474337 868474354
868478625 868478642
868561616 868561633
868770559 868770576
868793903 868793920
868909154 868909171
868958777 868958794
869151441 869151458
869156203 869156220
869171252 869171269
869388969 869388986
869498754 869498771
869501321 869501338
869501458 869501475
869509244 869509261
869528404 869528421
869557732 869557749
869590331 869590348
869596301 869596318
869598907 869598924
869821447 869821464
869847143 869847160
869853752 869853769
869882544 869882561
869919782 869919799
869925579 869925596
869925592 869925609
869951900 869951917
869952926 869952943
870085707 870085724
870192633 870192650
870369938 870369955
870372800 870372817
870394869 870394886
870394911 870394928
870553068 870553085
870627196 870627213
870651283 870651300
870720671 870720688
870785720 870785737
871067544 871067561
871304788 871304805
871320334 871320351
871615146 871615163
871713282 871713299
871760780 871760797
871761825 871761842
871768954 871768971
871774753 871774770
871834385 871834402
871836641 871836658
871842656 871842673
871846605 871846622
871918611 871918628
871920108 871920125
872008133 872008150
872014312 872014329
872020621 872020638
872021847 872021864
872022036 872022053
872028213 872028230
872032307 872032324
872033793 872033810
872043073 872043090
872047413 872047430
872092940 872092957
872094135 872094152
872128623 872128640
872180317 872180334
872267896 872267913
872268979 872268996
872269499 872269516
872269558 872269575
872343742 872343759
872415554 872415571
872436582 872436599
872443408 872443425
872446407 872446425
872448013 872448030
872519116 872519133
872532463 872532480
872720179 872720196
872785735 872785752
872977759 872977776
873045210 873045227
873133953 873133970
873218139 873218156
873224349 873224366
873224378 873224395
873230688 873230705
873239425 873239442
873274736 873274753
873274752 873274769
873299998 873300015
873322094 873322111
873414320 873414337
873489202 873489219
873557844 873557861
873578572 873578589
873579217 873579234
873586587 873586604
873603471 873603488
873657118 873657136
873668649 873668666
873668844 873668861
873669967 873669985
873731217 873731234
873748521 873748538
873999410 873999427
874087688 874087705
874183214 874183231
874190413 874190430
874300689 874300706
874510242 874510259
874827736 874827753
874874426 874874443
874874532 874874549
874954763 874954780
874965544 874965561
874999615 874999632
875022283 875022300
875063705 875063722
875108594 875108611
875119443 875119460
875121286 875121303
875181097 875181114
