815388534 815388551
815787813 815787830
815904677 815904694
816077011 816077028
816204257 816204274
816390874 816390891
816398976 816398993
816578872 816578889
816622877 816622894
816778868 816778885
816834976 816834993
816986170 816986187
817144757 817144774
817163702 817163719
817231768 817231785
817231827 817231844
817252533 817252550
817420291 817420308
817692154 817692171
817808108 817808125
817876580 817876597
817949877 817949894
817968960 817968977
818111426 818111443
818111467 818111484
818225813 818225830
818284314 818284331
818284373 818284390
818284480 818284497
818284553 818284570
818284642 818284659
818284716 818284733
818285833 818285850
818285895 818285913
818286002 818286019
818286077 818286094
818286183 818286201
818286249 818286266
818286343 818286360
818286402 818286419
818286683 818286700
818286747 818286764
818286849 818286866
818286923 818286940
818287014 818287031
818287059 818287076
818287145 818287162
818287228 818287245
818287334 818287351
818287382 818287399
818287973 818287990
818288023 818288041
818288163 818288180
818288192 818288209
818288690 818288707
818288743 818288761
818288998 818289015
818289065 818289082
818289496 818289513
818289560 818289577
818289837 818289854
818289887 818289904
818289967 818289984
818290045 818290062
818290354 818290371
818290402 818290419
818290521 818290538
818290584 818290601
818290856 818290873
818290909 818290926
818290997 818291014
818291086 818291103
818291179 818291196
818291262 818291279
818291360 818291377
818291415 818291433
818291498 818291515
818291576 818291593
818291637 818291654
818291720 818291737
818291816 818291833
818291858 818291875
818292316 818292333
818292348 818292365
818292974 818292991
818293016 818293033
818293143 818293161
818293185 818293202
818294005 818294022
818294072 818294089
818294169 818294186
818294238 818294255
818294347 818294364
818294402 818294419
818294652 818294669
818294707 818294724
818295338 818295355
818295405 818295422
818295657 818295674
818295709 818295726
818295852 818295869
818295879 818295897
818349007 818349024
818365651 818365668
818367416 818367433
818367683 818367700
818383037 818383054
818384799 818384816
818385888 818385905
818386764 818386781
818387012 818387029
818413528 818413545
818414120 818414137
818415845 818415862
818415906 818415924
818416322 818416340
818417561 818417578
818418303 818418320
818418712 818418729
818419837 818419854
818421190 818421207
818449945 818449962
818449982 818449999
818450264 818450281
818450337 818450354
818450424 818450441
818450504 818450521
818464121 818464138
818464152 818464169
818464263 818464280
818464343 818464360
818464413 818464430
818464501 818464518
818517454 818517471
818799603 818799620
818860065 818860082
819149682 819149699
819183996 819184013
819274530 819274547
819344804 819344821
819346422 819346439
819347586 819347603
819347689 819347706
819351872 819351890
819352632 819352649
819626525 819626542
819677444 819677461
819679861 819679878
819780323 819780340
819802619 819802636
819829603 819829620
819859126 819859143
819987043 819987060
820175315 820175332
820175553 820175570
820181263 820181280
820190884 820190901
820207922 820207939
820218529 820218546
820333562 820333579
820394430 820394447
820476455 820476472
820476512 820476529
820476958 820476975
820477023 820477040
820477138 820477155
820477186 820477203
820477457 820477474
820477535 820477552
820477596 820477613
820477658 820477675
820643762 820643779
820672053 820672070
820716056 820716073
820890631 820890648
821109659 821109676
821141683 821141700
821347222 821347239
821474263 821474280
821474399 821474416
821476162 821476179
821498019 821498036
821506887 821506904
821514604 821514621
821568205 821568222
821678162 821678179
821796977 821796994
822045996 822046013
822280888 822280905
822299441 822299458
822299622 822299639
822597063 822597080
822742342 822742359
822745460 822745477
823080430 823080447
823197428 823197445
823266956 823266973
823701816 823701833
823701870 823701888
823701959 823701976
823702033 823702050
823702134 823702151
823702248 823702265
823702306 823702323
823702403 823702420
823702489 823702506
823702572 823702589
823702692 823702709
823702727 823702744
823702886 823702903
823702926 823702944
823703050 823703067
823703096 823703113
823703211 823703228
823703254 823703271
823703346 823703363
823703445 823703462
823703486 823703503
823703774 823703791
823703849 823703866
823703936 823703953
823704011 823704028
823704100 823704117
823704192 823704209
823704248 823704265
823704371 823704388
823704430 823704448
823704534 823704551
823704601 823704618
823704691 823704708
823704767 823704784
823704842 823704859
823704921 823704938
823705006 823705024
823705078 823705095
823705180 823705197
823705261 823705278
823705297 823705314
823705398 823705415
823705465 823705482
823705566 823705584
823705624 823705641
823708050 823708067
823708093 823708110
823710769 823710786
824367545 824367562
824374764 824374781
824381487 824381504
824381582 824381599
824387852 824387869
824458635 824458652
824465583 824465600
826965752 826965769
828060423 828060440
828090410 828090427
830837387 830837404
830855335 830855352
