847973203 847973220
848183005 848183022
848184131 848184148
848184198 848184215
848184335 848184352
848184404 848184421
848493562 848493579
848571582 848571599
848583198 848583215
848583255 848583272
848583305 848583322
849265901 849265918
849266243 849266260
849266382 849266399
849266421 849266438
849266901 849266918
849266987 849267004
849267787 849267804
849267827 849267844
849268178 849268196
849268456 849268473
849268643 849268660
849268694 849268711
849270458 849270476
849270522 849270539
849270549 849270566
849270561 849270578
849270579 849270596
849270609 849270626
849270721 849270738
849270952 849270969
849271050 849271067
849271118 849271135
849271159 849271176
849271601 849271618
849271734 849271751
849271762 849271779
849271794 849271811
849271830 849271847
849272015 849272032
849272043 849272060
849272302 849272319
849272579 849272596
849272722 849272739
849272804 849272821
849273288 849273305
849273858 849273875
849274640 849274657
849274740 849274757
849361282 849361299
850147799 850147817
850678490 850678507
850987700 850987717
851144394 851144412
851230495 851230512
851384064 851384081
851441318 851441336
851589966 851589983
851759871 851759888
851805041 851805059
852269746 852269763
852733850 852733867
852733921 852733938
852997951 852997968
853375091 853375108
853494860 853494877
856245856 856245873
856373586 856373603
856575717 856575734
856576937 856576954
856578353 856578370
856579893 856579910
856581756 856581773
857035006 857035023
857166180 857166197
857248875 857248893
857497771 857497788
858163794 858163811
860245211 860245228
860963779 860963796
861123542 861123561
861597972 861597989
