Channel Name
H2_PEM-CS_ACC_EBAY_FLOOR_Z_DQ
Loudest SNR
78.182802
Start GPS
49.000000
48.000000
50.000000
54.000000
53.000000
51.000000
57.000000
49.000000
51.000000
57.000000
End GPS
49.00000048.00000050.00000054.00000053.00000052.00000050.00000055.00000051.00000057.000000