817412700 817412760
817430280 817430340
817499340 817499400
817580640 817580700
817587900 817587960
817590960 817591020
817591200 817591320
817600200 817600260
817661940 817662000
817946160 817946220
818110860 818110920
819832920 819832980
819834720 819834780
819837060 819837120
819844260 819844320
819918420 819918480
820422060 820422180
820436400 820436460
820612140 820612200
820613460 820613520
820730040 820730100
820942140 820942200
821290500 821290560
822064140 822064200
822069960 822070020
822082800 822082920
822414420 822414480
822860280 822860340
822886320 822886380
822954600 822954660
823055700 823055820
825086460 825086520
825096600 825096660
825097860 825097920
825695040 825695100
825702480 825702540
825707940 825708000
825779460 825779520
825866040 825866100
825871200 825871260
825970560 825970620
826052460 826052580
826576260 826576380
827165340 827165460
827172060 827172120
827249460 827249520
827264460 827264520
827352120 827352180
827547180 827547240
827695080 827695140
827778300 827778420
827795940 827796000
827945700 827945760
827953680 827953740
828284820 828284880
828455640 828455700
828461100 828461160
828461220 828461280
828461760 828461820
828885420 828885480
828885660 828885720
828886560 828886620
828886800 828886860
828886980 828887040
828887280 828887340
828888600 828888660
828889920 828890040
828890580 828890640
828900360 828900420
828900660 828900720
828900780 828900900
828903300 828903360
828905040 828905100
828905280 828905340
828905400 828905460
828906360 828906420
828907560 828907620
828907680 828907740
828907980 828908040
828908220 828908280
828908760 828908820
828910440 828910500
828974280 828974340
828993840 828993900
829345680 829345800
829405980 829406040
829516980 829517040
829788960 829789020
829789860 829789920
829920720 829920780
829923300 829923360
829960140 829960200
830006220 830006280
830011680 830011800
830102400 830102460
830104440 830104500
830121360 830121420
830227800 830227860
830276880 830276940
830284380 830284500
830291160 830291280
830532720 830532780
830787900 830787960
830806380 830806440
830903040 830903100
830939100 830939160
830958120 830958240
831254040 831254100
831263280 831263340
831305220 831305280
831323100 831323160
831335520 831335580
831394560 831394620
831400740 831400800
831414720 831414780
831426480 831426540
831436740 831436860
831477720 831477780
831482640 831482700
831482760 831482820
831515940 831516000
831757080 831757140
832094940 832095000
832544520 832544580
832623840 832623900
832959480 832959600
833032980 833033040
833307960 833308020
833565060 833565180
833638920 833638980
833668800 833668860
833737260 833737380
833764140 833764260
833816160 833816220
833838060 833838120
833859720 833859780
834155460 834155520
834243180 834243240
834279960 834280020
834287640 834287760
834345300 834345360
834428280 834428340
834501240 834501300
834505800 834505860
834517620 834517680
834786180 834786300
834972660 834972720
835022700 835022760
835133340 835133400
835547580 835547640
835549020 835549080
835639440 835639500
836242260 836242320
836273880 836274000
836349240 836349300
836387280 836387340
836589360 836589420
836751900 836751960
837011520 837011580
837219360 837219420
837266340 837266400
837352800 837352860
837380340 837380400
837439560 837439620
837613920 837613980
837954600 837954660
838128060 838128120
838142280 838142340
838524240 838524300
838561080 838561140
838744080 838744140
839117160 839117220
839181000 839181060
839442600 839442660
839598960 839599020
839621520 839621580
840043560 840043620
840216060 840216120
840555180 840555240
840932220 840932280
840993420 840993480
841006920 841006980
841007160 841007220
841093680 841093740
841544700 841544760
841594560 841594620
841670520 841670580
841688940 841689000
842378580 842378640
842452740 842452800
