816065665
816065665.5
816065666
816065666.5
816065667
816065667.5
816065668
816065668.5
816065669
816065669.5
816065670
816065670.5
816065671
816065671.5
816065672
816065672.5
816065673
816065673.5
816065674
816065674.5
816065675
816065675.5
816065676
816065676.5
816065677
816065677.5
816065678
816065678.5
816065679
816065679.5
816065680
816065680.5
816065681
816065681.5
816065682
816065682.5
816065683
816065683.5
816065684
816065684.5
816065685
816065685.5
816065686
816065686.5
816065687
816065687.5
816065688
816065688.5
816065689
816065689.5
816065690
816065690.5
816065691
816065691.5
816065692
816065692.5
816065693
816065693.5
816065694
816065694.5
816065695
816065695.5
816065696
816065696.5
816065697
816065697.5
816065698
816065698.5
816065699
816065699.5
816065700
816065700.5
816065701
816065701.5
816065702
816065702.5
816065703
816065703.5
816065704
816065704.5
816065705
816065705.5
816065706
816065706.5
816065707
816065707.5
816065708
816065708.5
816065709
816065709.5
816065710
816065710.5
816065711
816065711.5
816065712
816065712.5
816065713
816065713.5
816065714
816065714.5
816065715
816065715.5
816065716
816065716.5
816065717
816065717.5
816065718
816065718.5
816065719
816065719.5
816065720
816065720.5
816065721
816065721.5
816065722
816065722.5
816065723
816065723.5
816065724
816065724.5
816065725
816065725.5
816065726
816065726.5
816065727
816065727.5
816065728
816065728.5
816065729
816065729.5
816065730
816065730.5
816065731
816065731.5
816065732
816065732.5
816065733
816065733.5
816065734
816065734.5
816065735
816065735.5
816065736
816065736.5
816065737
816065737.5
816065738
816065738.5
816065739
816065739.5
816065740
816065740.5
816065741
816065741.5
816065742
816065742.5
816065743
816065743.5
816065744
816065744.5
816065745
816065745.5
816065746
816065746.5
816065747
816065747.5
816065748
816065748.5
816065749
816065749.5
816065750
816065750.5
816065751
816065751.5
816065752
816065752.5
816065753
816065753.5
816065754
816065754.5
816065755
816065755.5
816065756
816065756.5
816065757
816065757.5
816065758
816065758.5
816065759
816065759.5
816065760
816065760.5
816065761
816065761.5
816065762
816065762.5
816065763
816065763.5
816065764
816065764.5
816065765
816065765.5
816065766
816065766.5
816065767
816065767.5
816065768
816065768.5
816065769
816065769.5
816065770
816065770.5
816065771
816065771.5
816065772
816065772.5
816065773
816065773.5
816065774
816065774.5
816065775
816065775.5
816065776
816065776.5
816065777
816065777.5
816065778
816065778.5
816065779
816065779.5
816065780
816065780.5
816065781
816065781.5
816065782
816065782.5
816065783
816065783.5
816065784
816065784.5
816065785
816065785.5
816065786
816065786.5
816065787
816065787.5
816065788
816065788.5
816065789
816065789.5
816065790
816065790.5
816065791
816065791.5
816065792
816065792.5
816065793
816065793.5
816065794
816065794.5
816065795
816065795.5
816065796
816065796.5
816065797
816065797.5
816065798
816065798.5
816065799
816065799.5
816065800
816065800.5
816065801
816065801.5
816065802
816065802.5
816065803
816065803.5
816065804
816065804.5
816065805
816065805.5
816065806
816065806.5
816065807
816065807.5
816065808
816065808.5
816065809
816065809.5
816065810
816065810.5
816065811
816065811.5
816065812
816065812.5
816065813
816065813.5
816065814
816065814.5
816065815
816065815.5
816065816
816065816.5
816065817
816065817.5
816065818
816065818.5
816065819
816065819.5
816065820
816065820.5
816065821
816065821.5
816065822
816065822.5
816065823
816065823.5
816065824
816065824.5
816065825
816065825.5
816065826
816065826.5
816065827
816065827.5
816065828
816065828.5
816065829
816065829.5
816065830
816065830.5
816065831
816065831.5
816065832
816065832.5
816065833
816065833.5
816065834
816065834.5
816065835
816065835.5
816065836
816065836.5
816065837
816065837.5
816065838
816065838.5
816065839
816065839.5
816065840
816065840.5
816065841
816065841.5
816065842
816065842.5
816065843
816065843.5
816065844
816065844.5
816065845
816065845.5
816065846
816065846.5
816065847
816065847.5
816065848
816065848.5
816065849
816065849.5
816065850
816065850.5
816065851
816065851.5
816065852
816065852.5
816065853
816065853.5
816065854
816065854.5
816065855
816065855.5
816065856
816065856.5
816065857
816065857.5
816065858
816065858.5
816065859
816065859.5
816065860
816065860.5
816065861
816065861.5
816065862
816065862.5
816065863
816065863.5
816065864
816065864.5
816065865
816065865.5
816065866
816065866.5
816065867
816065867.5
816065868
816065868.5
816065869
816065869.5
816065870
816065870.5
816065871
816065871.5
816065872
816065872.5
816065873
816065873.5
816065874
816065874.5
816065875
816065875.5
816065876
816065876.5
816065877
816065877.5
816065878
816065878.5
816065879
816065879.5
816065880
816065880.5
816065881
816065881.5
816065882
816065882.5
816065883
816065883.5
816065884
816065884.5
816065885
816065885.5
816065886
816065886.5
816065887
816065887.5
816065888
816065888.5
816065889
816065889.5
816065890
816065890.5
816065891
816065891.5
816065892
816065892.5
816065893
816065893.5
816065894
816065894.5
816065895
816065895.5
816065896
816065896.5
816065897
816065897.5
816065898
816065898.5
816065899
816065899.5
816065900
816065900.5
816065901
816065901.5
816065902
816065902.5
816065903
816065903.5
816065904
816065904.5
816065905
816065905.5
816065906
816065906.5
816065907
816065907.5
816065908
816065908.5
816065909
816065909.5
816065910
816065910.5
816065911
816065911.5
816065912
816065912.5
816065913
816065913.5
816065914
816065914.5
816065915
816065915.5
816065916
816065916.5
816065917
816065917.5
816065918
816065918.5
816065919
816065919.5
816065920
816065920.5
816065921
816065921.5
816065922
816065922.5
816065923
816065923.5
816065924
816065924.5
816065925
816065925.5
816065926
816065926.5
816065927
816065927.5
816065928
816065928.5
816065929
816065929.5
816065930
816065930.5
816065931
816065931.5
816065932
816065932.5
816065933
816065933.5
816065934
816065934.5
816065935
816065935.5
816065936
816065936.5
816065937
816065937.5
816065938
816065938.5
816065939
816065939.5
816065940
816065940.5
816065941
816065941.5
816065942
816065942.5
816065943
816065943.5
816065944
816065944.5
816065945
816065945.5
816065946
816065946.5
816065947
816065947.5
816065948
816065948.5
816065949
816065949.5
816065950
