862090395 862090412
862169711 862169728
862240994 862241011
862242826 862242843
862246243 862246260
862246705 862246722
862328148 862328165
862330179 862330196
862414151 862414168
862417348 862417365
862442277 862442294
862501797 862501814
862503477 862503494
862505387 862505404
862508548 862508565
862509859 862509876
862513314 862513331
862585702 862585719
862587483 862587500
862592803 862592820
862606340 862606357
862608386 862608403
862693726 862693743
862706835 862706852
862759896 862759913
862763062 862763079
862766193 862766210
862772309 862772326
862846515 862846532
862849016 862849033
862851646 862851663
862855656 862855673
862935537 862935554
862937677 862937695
862946970 862946987
862955452 862955469
863018425 863018442
863023056 863023073
863025868 863025885
863037221 863037238
863105966 863105983
863120472 863120489
863191922 863191939
863193770 863193787
863195889 863195906
863298138 863298155
863301705 863301722
863366709 863366726
863390592 863390609
863394424 863394441
863452176 863452193
863544075 863544092
863627196 863627213
863695492 863695509
863718374 863718391
863742834 863742851
863808567 863808584
863818424 863818441
863820660 863820677
863830862 863830879
863974601 863974618
864056083 864056100
864077330 864077347
864402522 864402539
864508137 864508154
864572857 864572874
864574789 864574806
864579472 864579489
864581873 864581890
864585362 864585379
864661884 864661901
864663956 864663973
864666293 864666310
864668245 864668262
864669781 864669798
864681198 864681215
864747268 864747285
864747888 864747905
864749342 864749359
864766056 864766073
864771380 864771397
864837102 864837119
864839405 864839422
864842100 864842117
864848828 864848845
864921169 864921186
864923687 864923704
864936784 864936801
864999292 864999309
865014847 865014864
865015102 865015119
865015431 865015448
865019664 865019681
865044019 865044036
865076578 865076595
865129578 865129595
865177882 865177899
865193622 865193639
865199771 865199788
865200654 865200671
865277827 865277844
865288844 865288861
865455250 865455267
865455302 865455319
865467211 865467228
865467260 865467277
865487239 865487256
865544468 865544485
865612112 865612129
865632128 865632145
865796917 865796934
865806996 865807013
865825820 865825837
865873250 865873267
865874658 865874675
865875199 865875216
865883676 865883693
866049557 866049574
866053471 866053488
866123154 866123171
866131751 866131769
866139295 866139312
866160136 866160153
866181611 866181628
866183972 866183989
866197305 866197322
866226240 866226257
866230318 866230335
866236110 866236127
866236128 866236145
866237058 866237075
866238208 866238225
866240033 866240050
866256355 866256372
866261329 866261348
866295826 866295843
866391814 866391831
866404359 866404376
866474969 866474986
866491744 866491761
866518272 866518289
866532387 866532404
866559153 866559170
866685935 866685952
866733392 866733409
866762369 866762386
866771114 866771131
866823067 866823084
866847925 866847943
866848805 866848822
866848853 866848870
866850592 866850609
867089627 867089644
867292316 867292333
867309062 867309079
867340593 867340610
867373637 867373654
867439143 867439160
867471584 867471601
867480874 867480891
867510959 867510976
867599772 867599789
867601455 867601472
867613998 867614015
867633286 867633303
867663384 867663401
867680902 867680919
867685053 867685070
867685061 867685078
867685364 867685381
867777214 867777231
867777435 867777452
867778645 867778662
867944958 867944975
867953560 867953577
868039929 868039946
868046304 868046321
868046537 868046555
868049346 868049363
868178660 868178677
868203160 868203177
868210671 868210688
868216248 868216265
868295475 868295492
868378483 868378500
868388242 868388259
868467362 868467379
868468743 868468761
868474337 868474354
868478625 868478642
868491069 868491086
868561616 868561633
868647795 868647812
868770559 868770576
868793903 868793920
868909154 868909171
868958777 868958794
869088778 869088795
869151441 869151458
869156203 869156220
869156687 869156704
869171252 869171269
869388969 869388986
869469270 869469287
869491549 869491566
869498754 869498771
869501130 869501147
869501321 869501338
869501458 869501475
869503360 869503377
869509243 869509260
869517713 869517730
869519692 869519709
869522712 869522729
869522923 869522940
869527139 869527156
869530348 869530365
869590331 869590348
869596301 869596318
869598907 869598924
869760645 869760662
869821447 869821464
869845074 869845091
869847143 869847161
869853734 869853751
869853750 869853769
869882534 869882551
869882544 869882561
869919782 869919799
869925579 869925596
869925592 869925609
869950391 869950408
869951900 869951917
869952182 869952199
869952926 869952943
870018568 870018585
870019591 870019608
870085707 870085724
870209586 870209603
870314131 870314148
870372800 870372817
870394869 870394886
870456600 870456617
870553068 870553085
870627188 870627205
870651283 870651300
870713661 870713678
870720671 870720688
870785720 870785737
871047234 871047251
871067544 871067561
871073969 871073986
871236623 871236640
871236627 871236644
871304788 871304805
871320334 871320351
871346452 871346469
871522488 871522505
871615146 871615163
871713282 871713299
871761825 871761842
871768954 871768971
871774753 871774770
871836641 871836658
871837547 871837564
871837588 871837605
871842165 871842182
871842656 871842673
871842907 871842924
871846605 871846622
871847895 871847913
871851135 871851152
871918611 871918628
871920108 871920125
871927335 871927352
871928982 871928999
871936640 871936657
871936797 871936814
872000427 872000444
872008133 872008150
872010538 872010555
872014312 872014329
872020621 872020638
872021847 872021864
872021976 872021993
872022036 872022053
872022792 872022809
872023155 872023172
872027598 872027615
872028213 872028230
872030687 872030704
872032307 872032324
872033793 872033810
872043073 872043091
872092940 872092957
872094135 872094152
872100168 872100185
872128623 872128640
872180317 872180334
872266085 872266103
872267895 872267913
872268979 872268996
872269499 872269516
872269558 872269575
872270094 872270111
872273551 872273568
872275377 872275394
872286810 872286827
872290458 872290475
872343073 872343090
872343742 872343759
872415554 872415571
872436582 872436599
872438865 872438882
872441214 872441231
872443408 872443425
872446407 872446425
872448013 872448030
872451766 872451783
872452567 872452584
872458957 872458974
872458973 872458990
872519116 872519133
872525013 872525030
872532463 872532480
872548152 872548169
872632009 872632026
872699295 872699312
872705104 872705121
872720179 872720196
872785735 872785752
872875565 872875582
872977759 872977776
873045210 873045227
873133953 873133970
873216483 873216500
873218139 873218156
873219931 873219948
873224349 873224366
873224378 873224395
873230688 873230707
873231933 873231950
873234846 873234863
873239425 873239443
873262660 873262677
873274736 873274753
873274752 873274769
873299998 873300015
873305204 873305221
873322094 873322111
873414320 873414337
873489700 873489717
873557844 873557861
873578572 873578589
873579217 873579234
873586587 873586604
873587168 873587185
873594047 873594064
873603471 873603488
873655963 873655980
873657116 873657136
873657772 873657789
873668649 873668666
873668844 873668861
873669893 873669910
873669967 873669985
873731217 873731234
873735239 873735256
873735573 873735590
873748521 873748538
873748542 873748559
873748713 873748730
873758196 873758213
873825971 873825988
873851098 873851115
873999410 873999427
874044360 874044377
874087688 874087706
874087705 874087722
874087928 874087945
874099526 874099543
874101154 874101171
874183214 874183231
874190413 874190430
874254721 874254738
874271922 874271939
874342951 874342968
874358467 874358484
874510242 874510259
874827736 874827753
874851545 874851562
874874426 874874443
874874440 874874457
874874533 874874550
874875489 874875506
874942031 874942048
874945032 874945049
874954763 874954780
874955694 874955711
874958940 874958957
874960602 874960619
874965544 874965561
874999615 874999632
875000182 875000199
875022250 875022267
875022283 875022300
875063705 875063722
875084698 875084715
875108594 875108611
875116903 875116920
875119443 875119460
875121286 875121303
875181097 875181114
