831360070 831360087
832460285 832460302
832545074 832545091
832545088 832545105
832545709 832545726
832624186 832624203
832957282 832957299
833056326 833056343
833749751 833749768
836765893 836765910
836836513 836836530
836841254 836841271
836843831 836843848
836873302 836873319
836967202 836967219
837449518 837449535
837451444 837451461
837535937 837535954
837539719 837539736
837539955 837539972
837550507 837550524
838572606 838572623
838573109 838573126
838573947 838573964
838574740 838574757
838657240 838657257
838660810 838660827
839106114 839106131
839608588 839608605
839609286 839609303
839609304 839609321
839609338 839609355
839772868 839772885
839952286 839952303
840205925 840205942
841540248 841540265
841599275 841599292
842168471 842168488
842811361 842811378
842980118 842980135
843239211 843239228
843452092 843452109
843586227 843586244
843595945 843595962
843597694 843597711
843862177 843862194
844122495 844122512
844468743 844468760
845671881 845671898
846313258 846313275
846317297 846317314
846517607 846517624
846548744 846548761
847119839 847119856
847123459 847123476
