847657882 847657899
847745695 847745712
847751501 847751518
847775990 847776007
847812911 847812928
847813607 847813624
847864573 847864590
847915268 847915285
847927438 847927455
848042265 848042282
848050173 848050190
848320205 848320222
848325628 848325645
848570457 848570474
848655990 848656007
848684392 848684409
848684913 848684930
848684987 848685004
848685009 848685026
848685037 848685054
848734338 848734355
848745663 848745680
848794633 848794650
848949432 848949450
848949442 848949459
848949925 848949942
848952680 848952697
849045338 849045355
849070711 849070728
849207927 849207944
849237951 849237968
849307929 849307946
849309501 849309518
849309734 849309751
849478770 849478787
849561313 849561330
850001211 850001228
850004393 850004410
850005570 850005587
850166512 850166529
850338897 850338914
850417539 850417556
850457899 850457916
850495025 850495042
850500435 850500452
850603124 850603141
850666369 850666386
850672912 850672929
850672927 850672944
850690615 850690632
851703773 851703790
851894082 851894099
852143433 852143450
852177269 852177286
852316679 852316696
852392974 852392991
852484966 852484983
852490046 852490063
852491189 852491206
852495241 852495260
852500298 852500316
852505407 852505424
852626044 852626061
852632923 852632940
852861874 852861891
852872284 852872301
852993702 852993719
853041246 853041263
853360451 853360468
854114568 854114585
854483447 854483464
854653388 854653405
854744366 854744383
854834089 854834106
854836810 854836827
854837190 854837208
854837372 854837389
854837430 854837447
855000505 855000522
855004722 855004739
855067980 855067997
855136512 855136529
855337718 855337735
855345613 855345630
855345735 855345752
855347956 855347973
855642849 855642866
855696987 855697004
855747275 855747292
855766927 855766944
855769087 855769105
855782197 855782214
855800325 855800342
855917679 855917696
856112284 856112301
856114550 856114567
856197348 856197365
856214867 856214884
856269644 856269661
856289351 856289368
856292008 856292025
856372257 856372274
856561158 856561175
856659117 856659135
856721269 856721286
856814073 856814090
856820302 856820319
856828456 856828473
856917426 856917443
857021363 857021380
857073625 857073642
857168106 857168124
857168984 857169002
857325327 857325344
857345048 857345065
857349359 857349376
857406259 857406276
857406300 857406317
857430938 857430955
857431776 857431793
857431856 857431873
857432029 857432046
857432275 857432292
857432567 857432584
857433182 857433199
857548667 857548684
857588155 857588172
857748803 857748820
857755114 857755131
857763137 857763154
857769987 857770004
857849569 857849586
857850587 857850604
857863356 857863373
857866047 857866064
857877612 857877629
857935644 857935661
857939628 857939645
857994620 857994637
858012855 858012872
858085635 858085652
858197561 858197578
858358138 858358155
858504785 858504802
858505268 858505285
858531592 858531609
858539788 858539805
858540046 858540063
858541505 858541523
858563162 858563179
858568539 858568556
858615759 858615776
858615925 858615944
858625220 858625237
858632933 858632950
858637457 858637474
858701092 858701109
858704222 858704239
858714631 858714648
858714648 858714665
858901038 858901055
858957887 858957904
858971764 858971781
859064349 859064366
859066383 859066400
859095589 859095606
859136939 859136956
859137772 859137789
859139317 859139334
859145473 859145490
859147599 859147616
859155274 859155291
859221074 859221091
859225412 859225429
859230414 859230431
859236941 859236958
859307377 859307394
859311967 859311984
859396686 859396703
859490555 859490572
859564225 859564242
859565298 859565315
859567434 859567451
859573849 859573866
859664348 859664365
859726896 859726913
859747137 859747154
859747464 859747481
859752914 859752931
859826261 859826278
859829040 859829057
859834992 859835009
859877364 859877381
859913723 859913740
859948975 859948992
860012707 860012724
860330794 860330811
860340478 860340495
860341166 860341185
860350006 860350023
860447578 860447595
860451719 860451736
860514069 860514086
860575662 860575679
860673095 860673112
860772082 860772099
860772339 860772356
860773078 860773095
860777799 860777816
860882810 860882827
860884971 860884988
860886375 860886392
860946345 860946362
860972927 860972944
860975367 860975384
861040792 861040809
861041962 861041979
861116863 861116880
861226434 861226451
861227285 861227302
861239027 861239044
861240507 861240524
861306367 861306384
861503435 861503452
861640778 861640795
861644293 861644310
861647167 861647184
861730469 861730486
861739624 861739641
861775021 861775038
861903663 861903680
861904887 861904904
861985159 861985176
861988224 861988241
861994114 861994131
862000134 862000151
862000536 862000553
862115502 862115519
862240994 862241011
862242826 862242843
862246243 862246260
862265304 862265321
862328149 862328166
862330179 862330196
862414151 862414168
862417348 862417365
862482699 862482716
862513314 862513331
862585702 862585719
862587483 862587500
862693156 862693173
862693726 862693743
862759897 862759914
862933484 862933501
862935537 862935554
862937677 862937694
862946970 862946987
862955451 862955469
863019793 863019810
863025867 863025884
863037221 863037238
863120472 863120489
863191923 863191940
863193769 863193786
863195889 863195906
863203899 863203916
863216463 863216480
863413420 863413437
863413923 863413940
863666152 863666169
863695492 863695509
863742833 863742850
863905813 863905830
863967998 863968015
863968609 863968626
864363186 864363203
864376753 864376770
864389374 864389391
864579472 864579489
864600622 864600639
864755851 864755868
864923687 864923704
864975079 864975096
865015102 865015119
865015430 865015448
865028236 865028253
865044019 865044036
865062746 865062763
865076578 865076595
865119135 865119152
865140531 865140548
865193622 865193639
865199771 865199788
865224496 865224513
865276778 865276795
865279241 865279258
865288844 865288861
865318389 865318406
865361522 865361539
865479246 865479263
865487239 865487256
865518747 865518764
865544468 865544485
865573040 865573057
865641477 865641494
865873250 865873267
865874646 865874663
865874658 865874675
865883676 865883693
865907566 865907583
866098650 866098667
866131751 866131769
866139295 866139312
866146736 866146753
866221893 866221910
866225233 866225250
866230508 866230525
866233703 866233720
866233730 866233747
866248955 866248972
866254541 866254558
866261329 866261347
866409198 866409215
866420042 866420059
866518272 866518289
866562391 866562408
866583106 866583123
866601664 866601681
866604204 866604221
866685935 866685952
866733392 866733409
866762361 866762378
866762369 866762386
866819338 866819355
866848805 866848822
867086655 867086672
867292316 867292333
867309062 867309079
867422005 867422022
867439143 867439160
867510349 867510366
867510959 867510976
867663384 867663401
867685053 867685070
867988224 867988241
867991222 867991239
868046537 868046555
868178660 868178677
868211144 868211161
868467362 868467379
868474337 868474354
868478676 868478693
868491069 868491086
868630578 868630595
868647795 868647812
868770559 868770576
868958777 868958794
869007082 869007099
869151441 869151458
869156203 869156220
869166589 869166606
869171252 869171269
869354318 869354335
869388969 869388986
869441306 869441323
869442338 869442355
869444037 869444054
869469271 869469288
869498754 869498771
869501458 869501475
869506870 869506887
869522671 869522688
869522712 869522729
869526703 869526720
869527139 869527156
869528235 869528252
869528311 869528328
869528404 869528421
869557732 869557749
869590331 869590348
869596302 869596319
869596645 869596662
869597284 869597301
869598907 869598924
869602917 869602934
869729853 869729870
869821447 869821464
869847143 869847160
869862102 869862119
869882544 869882561
869919782 869919799
869948694 869948711
870019248 870019265
870085707 870085724
870174101 870174118
870192005 870192022
870369938 870369955
870372800 870372817
870394869 870394886
870394911 870394928
870481091 870481108
870553068 870553085
870651283 870651300
870676422 870676439
870718770 870718787
870819333 870819350
870883157 870883174
870952016 870952033
871002876 871002893
871073969 871073986
871080232 871080249
871228357 871228374
871304788 871304805
871348810 871348827
871402248 871402265
871419526 871419543
871488080 871488097
871615146 871615163
871713282 871713299
871760481 871760498
871768954 871768971
871772384 871772401
871776344 871776361
871777416 871777433
871779366 871779383
871789010 871789027
871836640 871836657
871842940 871842957
871844604 871844621
871845726 871845743
871847861 871847878
871883901 871883918
871927335 871927352
871936640 871936657
871945422 871945439
872008133 872008150
872010538 872010555
872014312 872014329
872020621 872020638
872021847 872021864
872021976 872021993
872022036 872022053
872023155 872023172
872028212 872028229
872030687 872030704
872032307 872032324
872033793 872033810
872043073 872043091
872047413 872047430
872094135 872094153
872128623 872128640
872136768 872136785
872180317 872180334
872266085 872266102
872267895 872267913
872269558 872269575
872343742 872343760
872415255 872415272
872415554 872415571
872436582 872436599
872438865 872438882
872441214 872441231
872443408 872443425
872446407 872446425
872458957 872458974
872458973 872458990
872526426 872526443
872527170 872527187
872587359 872587376
872632008 872632025
872720179 872720196
872785735 872785752
872972539 872972556
872977759 872977776
873053084 873053101
873217594 873217611
873226583 873226600
873239421 873239438
873268212 873268229
873274736 873274753
873274752 873274769
873322094 873322111
873414320 873414337
873557844 873557861
873594047 873594064
873603471 873603488
873619308 873619325
873651509 873651526
873657116 873657136
873668226 873668243
873668649 873668666
873668733 873668750
873669968 873669985
873739130 873739147
873799452 873799469
873823733 873823750
873825971 873825988
873851098 873851115
873895978 873895995
873999410 873999427
874046817 874046834
874079537 874079554
874081746 874081763
874087689 874087706
874087705 874087722
874087928 874087945
874151713 874151730
874183214 874183231
874243354 874243371
874252707 874252724
874300689 874300706
874413145 874413162
874424643 874424660
874431791 874431808
874510242 874510259
874583341 874583358
874601157 874601174
874617284 874617301
874661321 874661338
874670810 874670827
874672463 874672480
874685926 874685943
874721686 874721703
874826843 874826860
874874440 874874457
874874533 874874550
874921066 874921083
874954763 874954780
874958940 874958957
874999615 874999632
875022250 875022267
875022283 875022300
875063705 875063722
875068525 875068542
875099463 875099480
875108594 875108611
875119443 875119460
875121285 875121303
875142322 875142340
875181097 875181114
