816075873 816075890
816235523 816235540
816274818 816274835
816313444 816313461
816316246 816316263
816316256 816316273
816316485 816316502
816317350 816317367
816317456 816317473
816317490 816317507
816322298 816322315
816332816 816332833
816340114 816340131
816346626 816346643
816352901 816352918
816354685 816354702
816354771 816354788
816354786 816354803
816358699 816358716
816363411 816363428
816436378 816436395
816443379 816443397
816445588 816445605
816445879 816445896
816461218 816461236
816476776 816476793
816495401 816495418
816500566 816500583
816590495 816590512
816593475 816593492
816593617 816593634
816651500 816651517
816651591 816651608
816654401 816654418
816656618 816656635
816657982 816657999
816664198 816664215
816664525 816664542
816691766 816691783
816691781 816691798
816691795 816691812
816744008 816744025
816744043 816744060
816744096 816744113
816744146 816744163
816744187 816744204
816744214 816744231
816747502 816747519
816747613 816747630
816748039 816748056
816761376 816761393
816761951 816761968
816762209 816762226
816762812 816762829
816764088 816764105
816780539 816780556
816780820 816780837
816782898 816782915
816782918 816782935
816782961 816782978
816827363 816827380
816827397 816827414
816827451 816827468
816827487 816827504
816828606 816828623
816828653 816828670
816828776 816828793
816828985 816829002
816828995 816829012
816829018 816829035
816829046 816829063
816829076 816829093
816829446 816829463
816829453 816829470
816829530 816829547
816829939 816829956
816830087 816830104
816840897 816840914
816842195 816842212
816842231 816842248
816842244 816842261
816844565 816844582
816844611 816844628
816844784 816844803
816844930 816844947
816845101 816845118
816846048 816846065
816846160 816846177
816846616 816846633
816846621 816846638
816847648 816847665
816847685 816847702
816847703 816847720
816847760 816847780
816847773 816847790
816847785 816847802
816847798 816847815
816847858 816847875
816847962 816847979
816847981 816847998
816848042 816848059
816848052 816848069
816848567 816848584
816848584 816848601
816849384 816849401
816850565 816850582
816851279 816851299
816851318 816851335
816851407 816851424
816852753 816852770
816852787 816852804
816852820 816852837
816852950 816852967
816853015 816853032
816853174 816853191
816853194 816853211
816853464 816853481
816853502 816853519
816853691 816853708
816853697 816853714
816853739 816853756
816853830 816853847
816853910 816853927
816856416 816856435
816856467 816856484
816858388 816858405
816859083 816859100
816859844 816859861
816859998 816860015
816860375 816860392
816861120 816861139
816862071 816862088
816924735 816924752
816927950 816927967
816930001 816930018
816940168 816940185
816951544 816951561
816959228 816959245
816961126 816961143
816961531 816961549
816972141 816972158
816975532 816975549
816975551 816975568
816981357 816981374
816981438 816981455
816985430 816985447
816985439 816985456
816987350 816987367
816987753 816987770
816992420 816992437
817014550 817014567
817017295 817017312
817018873 817018890
817020836 817020853
817020889 817020906
817022552 817022569
817022609 817022626
817022635 817022652
817022642 817022659
817022760 817022777
817022778 817022795
817022787 817022804
817022908 817022925
817023404 817023421
817023452 817023469
817023563 817023580
817023602 817023619
817023625 817023642
817024634 817024651
817026856 817026873
817027146 817027163
817031549 817031566
817031567 817031584
817031773 817031790
817033076 817033093
817050266 817050283
817061239 817061256
817061423 817061440
817141276 817141293
817141296 817141313
817142240 817142257
817162995 817163012
817164217 817164234
817203417 817203434
817260903 817260920
817260962 817260979
817260970 817260987
817261117 817261134
817261126 817261143
817261231 817261248
817261257 817261274
817261709 817261726
817262346 817262363
817262603 817262620
817263416 817263433
817263420 817263437
817263962 817263979
817265311 817265328
817270240 817270257
817270336 817270353
817271714 817271731
817272932 817272949
817272936 817272953
817273004 817273021
817276636 817276653
817277224 817277241
817277286 817277303
817278461 817278478
817278960 817278977
817281012 817281029
817281484 817281501
817282703 817282720
817283229 817283246
817284651 817284668
817290545 817290562
817290620 817290637
817291990 817292007
817292019 817292036
817292036 817292053
817292206 817292223
817292303 817292320
817292373 817292393
817292435 817292452
817292500 817292517
817292504 817292521
817292538 817292555
817292592 817292609
817292615 817292632
817292684 817292701
817292713 817292730
817292747 817292764
817292863 817292880
817292885 817292902
817293032 817293049
817293365 817293382
817293599 817293616
817293616 817293633
817293906 817293923
817293985 817294002
817294035 817294052
817294195 817294212
817294722 817294739
817294736 817294753
817294821 817294838
817303777 817303794
817303880 817303897
817304549 817304566
817305647 817305664
817306150 817306167
817306233 817306250
817306940 817306957
817306968 817306985
817307199 817307216
817307556 817307573
817353457 817353474
817354440 817354457
817354462 817354479
817354528 817354545
817354905 817354922
817358232 817358249
817359405 817359422
817361036 817361053
817364424 817364441
817366695 817366712
817370654 817370671
817373548 817373565
817374059 817374076
817374517 817374534
817376133 817376150
817376549 817376566
817382048 817382065
817392788 817392805
817392978 817392995
817394644 817394661
817420368 817420385
817421707 817421724
817422076 817422093
817422080 817422097
817423400 817423417
817425771 817425788
817425807 817425824
817425830 817425847
817426166 817426183
817426203 817426222
817426232 817426249
817426243 817426260
817431720 817431737
817439928 817439946
817443176 817443195
817443186 817443203
817443227 817443244
817443668 817443685
817443680 817443697
817443694 817443711
817444253 817444270
817444386 817444403
817444448 817444465
817444514 817444531
817444572 817444589
817444708 817444725
817444745 817444762
817444872 817444889
817444996 817445013
817445101 817445118
817447352 817447369
817447497 817447514
817453276 817453293
817453287 817453304
817453347 817453364
817460487 817460504
817466827 817466844
817466909 817466926
817516637 817516654
817539264 817539281
817558230 817558247
817585688 817585705
817607633 817607650
817615284 817615301
817616947 817616964
817628649 817628666
817649579 817649596
817649723 817649740
817696207 817696224
817705512 817705529
817711000 817711019
817711625 817711642
817714186 817714203
817714944 817714961
817715869 817715886
817722350 817722367
817723144 817723161
817727646 817727663
817729559 817729576
817731584 817731601
817737222 817737239
817737251 817737268
817740790 817740807
817742293 817742310
817744618 817744635
817745283 817745300
817746049 817746066
817756791 817756808
817758933 817758950
817760217 817760234
817763847 817763864
817764477 817764494
817765481 817765498
817765577 817765594
817765667 817765684
817765838 817765855
817766466 817766483
817766498 817766515
817766689 817766706
817766972 817766989
817767358 817767375
817767449 817767466
817767582 817767599
817768465 817768482
817768539 817768556
817774861 817774878
817775447 817775464
817775639 817775656
817775656 817775673
817778591 817778608
817786249 817786266
817787336 817787353
817787510 817787527
817796969 817796986
817799369 817799386
817799385 817799402
817800259 817800276
817800698 817800715
817800801 817800818
817801815 817801832
817802544 817802561
817802555 817802572
817802575 817802592
817802909 817802927
817805233 817805250
817812301 817812318
817812998 817813015
817813036 817813053
817813040 817813057
817813694 817813711
817813709 817813726
817813741 817813758
817813831 817813848
817815782 817815799
817860171 817860188
817862285 817862302
817862386 817862403
817863044 817863061
817863048 817863065
817865031 817865048
817865184 817865201
817865212 817865229
817865228 817865245
817865267 817865284
817865315 817865332
817869755 817869772
817869857 817869874
817873054 817873071
817873182 817873199
817877218 817877235
817877414 817877431
817877425 817877442
817877452 817877469
817877484 817877501
817878010 817878027
817878020 817878037
817878064 817878081
817878169 817878186
817878291 817878308
817878355 817878372
817878373 817878390
817878676 817878693
817878709 817878730
817878733 817878750
817878815 817878833
817878914 817878931
817878918 817878936
817886733 817886750
817888561 817888578
817888630 817888647
817888804 817888821
817888966 817888983
817889097 817889114
817890239 817890256
817890419 817890436
817890517 817890534
817890794 817890811
817893096 817893113
817894946 817894963
817895136 817895153
817895222 817895241
817895792 817895809
817895801 817895818
817895868 817895885
817896559 817896576
817897173 817897190
817897184 817897201
817897718 817897735
817897740 817897757
817906154 817906171
817982055 817982072
817982192 817982209
817984373 817984390
817987021 817987038
817987175 817987192
817988992 817989009
817990285 817990302
817990319 817990336
818049862 818049879
818050917 818050934
818051611 818051628
818051903 818051920
818053133 818053150
818053724 818053741
818062556 818062573
818063495 818063512
818067801 818067818
818070637 818070654
818213673 818213690
818222623 818222640
818244343 818244360
818302993 818303010
818369797 818369814
818380653 818380670
818383619 818383636
818386180 818386197
818416755 818416772
818417381 818417398
818427078 818427095
818494320 818494337
818507828 818507845
818554554 818554571
818557027 818557044
818560378 818560395
818573593 818573610
818589007 818589024
818620457 818620474
818812096 818812113
818812788 818812805
818814132 818814149
818814945 818814962
818815813 818815830
818817540 818817557
818818011 818818028
818820287 818820304
818823239 818823256
818830404 818830421
818842222 818842239
818915768 818915785
819015167 819015184
819033957 819033974
819033970 819033987
819069483 819069500
819069499 819069516
819069619 819069636
819069798 819069815
819069885 819069902
819069917 819069934
819069950 819069967
819070106 819070123
819070259 819070276
819070356 819070373
819070576 819070593
819070634 819070651
819070684 819070701
819070716 819070733
819070820 819070837
819070898 819070915
819071225 819071242
819071404 819071421
819071808 819071825
819071864 819071881
819072150 819072167
819072211 819072228
819072312 819072329
819072352 819072369
819072521 819072538
819072765 819072782
819072951 819072968
819073069 819073086
819073386 819073403
819073621 819073638
819073651 819073668
819074415 819074432
819083035 819083052
819083562 819083579
819084080 819084097
819086112 819086129
819086709 819086726
819088621 819088638
819091216 819091233
819091422 819091439
819092215 819092232
819095823 819095840
819095957 819095974
819108720 819108737
819111395 819111412
819112583 819112600
819116779 819116796
819196125 819196142
819196185 819196202
819196253 819196270
819196301 819196318
819196327 819196344
819196743 819196760
819196896 819196913
819196907 819196924
819197107 819197124
819197173 819197190
819197187 819197204
819197391 819197408
819197511 819197528
819197784 819197801
819197809 819197826
819197822 819197839
819197913 819197930
819198332 819198349
819198428 819198445
819198556 819198573
819198735 819198752
819198767 819198784
819198870 819198887
819198925 819198942
819199140 819199157
819199172 819199189
819199238 819199255
819199591 819199608
819200173 819200190
819200558 819200575
819200767 819200784
819200804 819200821
819201331 819201348
819201642 819201659
819201756 819201773
819201843 819201860
819202345 819202362
819202710 819202727
819202875 819202892
819202950 819202967
819203540 819203557
819204264 819204281
819204428 819204445
819204663 819204680
819204801 819204818
819204927 819204944
819204994 819205011
819205294 819205311
819246687 819246704
819246701 819246718
819246706 819246723
819246721 819246738
819246810 819246827
819246823 819246840
819246905 819246922
819246930 819246947
819246939 819246956
819246954 819246971
819247043 819247060
819247145 819247162
819247209 819247226
819247270 819247287
819247274 819247291
819247322 819247339
819247527 819247544
819247580 819247597
819247606 819247623
819247621 819247638
819247819 819247836
819247857 819247874
819247903 819247920
819247925 819247942
819247939 819247956
819248036 819248053
819248065 819248082
819248076 819248093
819248130 819248147
819248153 819248170
819248184 819248201
819248242 819248259
819248323 819248340
819248482 819248499
819248490 819248507
819248504 819248521
819248614 819248631
819248671 819248688
819248702 819248719
819248729 819248746
819248835 819248852
819248975 819248992
819249001 819249018
819249091 819249108
819249126 819249143
819249312 819249329
819249475 819249492
819249530 819249547
819249595 819249612
819249673 819249690
819253722 819253739
819253920 819253937
819254319 819254336
819254666 819254683
819254760 819254777
819255366 819255383
819256285 819256302
819256322 819256339
819257252 819257269
819257334 819257351
819257923 819257940
819257962 819257979
819257969 819257986
819259095 819259112
819259472 819259489
819259558 819259575
819260277 819260294
819261804 819261821
819262311 819262328
819262846 819262863
819263050 819263067
819263452 819263469
819264028 819264045
819264801 819264818
819266206 819266223
819267704 819267721
819267929 819267946
819268239 819268256
819269923 819269940
819270843 819270860
819271849 819271866
819284996 819285013
819285143 819285160
819315295 819315312
819340891 819340908
819369190 819369207
819440929 819440946
819553769 819553786
819685740 819685757
819697999 819698016
819705820 819705837
819722395 819722412
820046843 820046860
820192423 820192440
820268756 820268773
820300523 820300540
820316532 820316549
820318011 820318028
820358585 820358602
820358606 820358623
820358664 820358681
820358696 820358713
820358716 820358733
820358765 820358782
820358818 820358835
820358971 820358988
820359114 820359131
820359169 820359186
820359270 820359287
820359292 820359309
820359315 820359332
820359333 820359350
820359351 820359368
820359375 820359392
820359533 820359550
820359600 820359617
820359672 820359689
820359708 820359725
820359800 820359817
820359928 820359945
820360110 820360127
820360407 820360424
820360435 820360452
820360466 820360483
820360518 820360535
820360536 820360553
820360937 820360954
820361180 820361197
820361595 820361612
820362283 820362300
820362956 820362973
820363786 820363803
820363989 820364006
820364435 820364452
820365000 820365017
820366000 820366017
820366292 820366309
820366386 820366403
820368714 820368731
820368780 820368797
820369292 820369309
820369631 820369648
820369898 820369915
820370419 820370437
820371674 820371691
820377455 820377472
820379337 820379354
820384423 820384440
820395535 820395552
820449559 820449576
820480734 820480751
820480935 820480952
820487551 820487568
820543961 820543978
820566916 820566933
820665052 820665069
820671953 820671970
820674930 820674947
820676205 820676222
820676541 820676558
820682514 820682531
820687753 820687770
820695371 820695388
820695691 820695708
820695916 820695933
820699454 820699471
820703803 820703820
820768630 820768647
820803737 820803754
820972056 820972073
820977793 820977810
820982244 820982261
820985425 820985442
820991271 820991288
820994499 820994516
820994930 820994947
821002113 821002130
821093580 821093597
821246762 821246779
821348834 821348851
821373580 821373597
821388057 821388074
821389773 821389790
821408210 821408227
821516875 821516892
821917460 821917477
821947094 821947111
821949512 821949529
821955823 821955840
821974264 821974281
821977435 821977452
822077878 822077895
822100267 822100284
822120086 822120103
822181273 822181290
822195922 822195939
822205034 822205051
822206933 822206950
822216969 822216986
822220728 822220745
822221047 822221064
822221963 822221980
822223081 822223098
822223929 822223946
822227513 822227530
822239630 822239647
822266193 822266210
822326033 822326050
822371130 822371147
822416101 822416118
822444604 822444621
822449719 822449736
822482200 822482217
822516582 822516599
822552143 822552160
822559518 822559535
822643683 822643700
822950610 822950627
822973876 822973893
823005608 823005625
823066388 823066405
823076393 823076410
823076796 823076813
823077700 823077717
823079576 823079593
823088744 823088761
823089106 823089123
823092096 823092113
823095418 823095435
823126004 823126021
823152559 823152576
823198277 823198294
823241144 823241161
823249740 823249757
823254071 823254088
823290118 823290135
823342873 823342890
823399800 823399817
823402947 823402964
823407744 823407761
823410637 823410654
823414303 823414320
823428047 823428064
823428228 823428245
823434477 823434494
823483017 823483034
823574124 823574141
823602862 823602879
823610008 823610025
823610251 823610268
823657937 823657954
823748442 823748459
823827823 823827840
823829690 823829707
823851270 823851287
823867074 823867091
823867967 823867984
823872926 823872943
823881571 823881588
823927951 823927968
823929448 823929465
824009706 824009723
824145440 824145457
824179170 824179187
824182977 824182994
824186806 824186823
824262985 824263002
824280239 824280256
824283068 824283085
824300568 824300585
824301055 824301072
824327765 824327782
824328662 824328679
824334518 824334535
824346575 824346592
824350788 824350805
824357557 824357574
824364687 824364704
824367262 824367279
824371454 824371471
824383522 824383539
824385319 824385336
824393109 824393126
824394649 824394666
824452519 824452536
824452976 824452993
824461570 824461587
824463841 824463858
824470522 824470539
824472918 824472935
824501701 824501718
824501974 824501991
824504234 824504251
824504910 824504927
824508019 824508036
824508642 824508659
824509410 824509427
824510044 824510061
824514829 824514846
824517424 824517441
824518482 824518499
824519283 824519300
824522819 824522836
824523113 824523130
824524105 824524122
824525612 824525629
824535773 824535790
824539693 824539710
824547490 824547507
824550125 824550142
824550492 824550509
824555953 824555970
824601421 824601438
824601438 824601455
824601584 824601601
824601886 824601903
824602113 824602130
824602488 824602505
824602530 824602547
824603329 824603346
824603437 824603454
824603878 824603895
824604001 824604018
824604179 824604196
824604409 824604426
824604517 824604534
824604526 824604543
824604713 824604730
824604898 824604915
824604946 824604963
824605766 824605783
824605775 824605792
824606355 824606372
824609134 824609151
824609289 824609306
824609432 824609449
824610008 824610025
824610103 824610120
824610551 824610568
824610591 824610608
824610955 824610972
824611156 824611173
824611498 824611515
824611877 824611894
824612220 824612237
824612253 824612270
824612865 824612882
824613512 824613529
824614670 824614687
824614727 824614744
824615196 824615213
824616650 824616667
824617749 824617766
824622069 824622086
824623716 824623733
824624016 824624033
824624111 824624128
824628890 824628907
824630729 824630746
824630750 824630767
824631714 824631731
824634262 824634279
824636049 824636066
824637009 824637026
824642079 824642096
824643848 824643865
824711675 824711692
824727823 824727840
824746338 824746355
824747612 824747629
824747767 824747784
824751726 824751743
824753478 824753495
824761602 824761619
824763470 824763487
824769562 824769579
824780599 824780616
824781401 824781418
824786865 824786882
824787921 824787938
824796571 824796588
824796589 824796606
824802977 824802994
824811553 824811570
824814901 824814918
824819017 824819034
824830367 824830384
824844433 824844450
824844988 824845005
824847463 824847480
824849360 824849377
824870189 824870206
824873462 824873479
824877650 824877667
824881523 824881540
824881547 824881564
824887200 824887217
824889855 824889872
824891915 824891932
824892886 824892903
824894115 824894132
824894255 824894272
824895338 824895355
824896286 824896303
824900238 824900255
824901540 824901557
824911692 824911709
824913027 824913044
824913719 824913736
824913777 824913794
824921356 824921373
824922001 824922018
824923752 824923769
824928593 824928610
824929175 824929192
824932212 824932229
824934045 824934062
824981475 824981492
824983087 824983104
824987230 824987247
824999800 824999817
825001402 825001419
825003676 825003693
825003866 825003883
825024858 825024875
825031028 825031045
825067909 825067926
825068806 825068823
825074487 825074504
825080211 825080228
825081915 825081932
825090821 825090838
825223289 825223306
825229594 825229611
825249036 825249053
825312489 825312506
825316353 825316370
825321507 825321524
825324954 825324971
825330244 825330261
825331144 825331161
825384924 825384941
825395601 825395618
825399935 825399952
825461045 825461062
825479601 825479618
825482165 825482182
825488114 825488131
825489566 825489583
825505057 825505074
825505856 825505873
825513859 825513876
825523327 825523344
825527324 825527341
825528265 825528282
825530472 825530489
825532565 825532582
825539408 825539425
825547653 825547670
825554417 825554434
825557094 825557111
825557278 825557295
825558871 825558888
825598289 825598306
825599718 825599735
825602759 825602776
825603090 825603107
825608277 825608294
825609171 825609188
825609454 825609471
825609505 825609522
825613846 825613863
825613992 825614009
825614066 825614083
825615194 825615211
825615735 825615752
825615875 825615892
825617686 825617703
825618635 825618652
825619053 825619070
825621467 825621484
825622392 825622409
825624023 825624040
825625135 825625152
825625313 825625330
825627180 825627197
825629286 825629303
825629694 825629711
825631721 825631738
825634324 825634341
825634536 825634553
825636507 825636524
825637147 825637164
825637362 825637379
825638567 825638584
825640582 825640599
825651545 825651562
825653948 825653965
825657055 825657072
825660446 825660463
825661629 825661646
825665107 825665124
825668411 825668428
825673720 825673737
825676436 825676453
825677520 825677537
825679592 825679609
825717688 825717705
825730318 825730335
825767341 825767358
825865362 825865379
825865559 825865576
825865816 825865833
825866105 825866122
825869692 825869709
825872319 825872336
825873354 825873371
825875122 825875139
825875488 825875505
825895130 825895147
825895277 825895294
825895512 825895529
825895705 825895722
825896159 825896176
825896335 825896352
825896441 825896458
825896958 825896975
825902731 825902748
825903245 825903262
825904015 825904032
825904039 825904056
825904239 825904256
825904903 825904920
825904932 825904949
825905135 825905152
825905242 825905259
825905514 825905531
825907090 825907107
825907250 825907267
825907343 825907360
825907467 825907484
825907877 825907894
825909813 825909830
825911905 825911922
825919492 825919509
825919765 825919782
825920332 825920349
825925620 825925637
825942965 825942982
826002264 826002281
826068887 826068904
826104781 826104798
826115920 826115937
826117878 826117895
826151646 826151663
826186493 826186510
826199034 826199051
826202810 826202827
826205819 826205836
826211835 826211852
826238645 826238662
826260977 826260994
826268808 826268825
826287703 826287720
826287770 826287787
826293154 826293171
826302590 826302607
826328024 826328041
826331627 826331644
826348460 826348477
826348696 826348713
826348726 826348743
826349063 826349080
826349553 826349570
826350578 826350595
826351092 826351109
826351158 826351175
826351163 826351180
826351181 826351198
826351242 826351259
826351289 826351306
826351422 826351441
826351453 826351470
826421784 826421801
826424440 826424457
826442382 826442399
826444786 826444803
826446779 826446796
826451448 826451465
826456985 826457002
826460119 826460136
826467382 826467399
826479551 826479568
826502712 826502729
826504334 826504351
826504594 826504611
826525247 826525264
826548356 826548373
826551368 826551385
826577621 826577638
826596465 826596482
826635523 826635540
826654417 826654434
826678719 826678736
826690322 826690339
826690384 826690401
826693175 826693192
826693934 826693951
826695748 826695765
826697262 826697279
826829059 826829076
826830305 826830322
826858907 826858924
826861663 826861680
826867440 826867457
826868307 826868324
826887812 826887829
826915527 826915544
826934019 826934036
826941615 826941632
826961127 826961144
826975473 826975490
826976470 826976487
827013929 827013946
827018505 827018522
827023834 827023851
827028348 827028365
827030733 827030750
827031304 827031321
827036070 827036087
827037844 827037861
827083006 827083023
827086544 827086561
827116160 827116177
827128357 827128374
827133560 827133577
827134182 827134199
827147114 827147131
827165443 827165460
827171003 827171020
827188951 827188968
827200615 827200632
827206932 827206949
827207392 827207409
827209153 827209170
827210798 827210815
827211895 827211912
827214033 827214050
827214353 827214370
827220363 827220380
827220385 827220402
827220925 827220942
827221074 827221091
827221395 827221412
827223140 827223157
827225315 827225332
827225764 827225782
827225817 827225837
827225824 827225841
827225828 827225845
827225844 827225863
827225853 827225870
827226537 827226554
827227101 827227118
827256603 827256620
827281174 827281191
827309130 827309147
827321554 827321571
827323024 827323041
827323108 827323125
827325071 827325088
827329507 827329524
827332328 827332345
827337099 827337116
827337600 827337617
827341221 827341238
827375934 827375951
827377039 827377056
827382999 827383016
827385160 827385177
827388088 827388105
827388881 827388898
827402018 827402035
827403277 827403294
827409427 827409444
827435643 827435660
827436821 827436838
827463332 827463349
827468010 827468027
827481509 827481526
827481581 827481598
827503134 827503151
827516029 827516046
827542865 827542882
827544604 827544624
827545245 827545262
827545268 827545285
827545309 827545326
827636097 827636114
827637238 827637255
827644674 827644691
827645326 827645343
827645663 827645680
827660904 827660921
827661050 827661067
827661202 827661219
827662665 827662682
827663303 827663320
827663362 827663379
827668230 827668247
827668237 827668254
827669080 827669097
827674517 827674534
827710301 827710318
827710951 827710968
827714894 827714911
827716852 827716869
827718970 827718987
827731151 827731168
827798451 827798468
827798795 827798812
827799163 827799180
827803919 827803936
827804015 827804032
827804233 827804250
827804700 827804717
827821300 827821317
827821602 827821619
827827020 827827037
827837184 827837201
827838300 827838317
827883740 827883757
827883806 827883823
827890860 827890877
827898137 827898154
827900177 827900194
827916636 827916653
827916856 827916873
827917005 827917022
827917153 827917170
827917307 827917324
827918321 827918338
827918472 827918489
827918491 827918508
827920636 827920653
827920973 827920990
827921493 827921510
827922146 827922163
827931727 827931744
827931957 827931974
827932051 827932068
827932353 827932370
827932450 827932467
827932687 827932704
827932871 827932888
827933860 827933877
827933889 827933906
827934947 827934964
827936169 827936186
827942567 827942584
827945156 827945173
827946124 827946141
827946227 827946244
827946723 827946740
827946803 827946820
827946941 827946958
827949104 827949121
827949303 827949320
827949316 827949333
827949609 827949626
827949618 827949635
827950484 827950501
827950558 827950575
827952363 827952380
827953576 827953593
827955089 827955106
827967738 827967755
827968800 827968817
827972063 827972080
827978369 827978386
827979279 827979296
827983904 827983921
827986141 827986158
828003869 828003886
828009439 828009456
828010137 828010154
828024747 828024764
828033125 828033142
828039050 828039067
828040643 828040660
828042286 828042304
828042374 828042391
828046781 828046798
828049468 828049485
828052126 828052143
828053051 828053068
828053406 828053423
828054829 828054846
828064343 828064360
828064676 828064693
828064699 828064716
828064712 828064729
828064720 828064739
828077113 828077130
828079931 828079948
828080262 828080279
828082031 828082048
828090478 828090496
828090724 828090741
828091571 828091588
828091649 828091666
828091690 828091707
828091696 828091713
828091867 828091884
828337904 828337921
828427223 828427240
828433907 828433924
828434000 828434020
828434064 828434083
828434578 828434595
828434582 828434599
828434674 828434691
828434686 828434703
828518778 828518796
828518971 828518988
828519132 828519149
828519288 828519305
828519535 828519552
828519610 828519627
828521564 828521581
828521576 828521593
828521699 828521716
828521906 828521923
828525593 828525610
828525968 828525986
828527520 828527537
828527599 828527616
828528129 828528146
828528185 828528202
828528190 828528207
828528438 828528456
828954583 828954600
828964394 828964411
828972379 828972396
828972557 828972574
828973084 828973101
828973597 828973614
828976692 828976709
829036414 829036431
829037351 829037368
829038263 829038280
829042583 829042600
829055989 829056006
829056103 829056120
829056310 829056327
829134384 829134401
829135884 829135901
829150655 829150672
829152936 829152953
829154128 829154145
829154573 829154590
829154868 829154885
829155374 829155391
829155847 829155864
829168142 829168159
829168160 829168177
829173459 829173476
829174314 829174331
829208470 829208487
829208483 829208500
829213408 829213425
829217319 829217336
829220244 829220261
829220460 829220477
829221765 829221782
829222591 829222608
829225284 829225301
829225363 829225381
829227009 829227026
829227362 829227379
829228036 829228053
829233020 829233037
829233368 829233385
829239173 829239190
829250189 829250206
829253493 829253511
829278954 829278971
829282297 829282314
829283746 829283763
829288466 829288483
829292905 829292922
829302848 829302865
829309257 829309274
829310260 829310277
829321115 829321132
829321471 829321488
829327927 829327944
829331584 829331601
829337893 829337910
829339746 829339763
829340705 829340722
829352095 829352112
829363950 829363967
829364020 829364037
829364059 829364077
829364292 829364309
829368179 829368196
829368918 829368935
829368969 829368986
829370186 829370203
829370388 829370406
829370393 829370410
829371060 829371077
829371079 829371096
829371451 829371468
829371578 829371595
829384558 829384575
829389063 829389080
829390159 829390176
829390666 829390683
829391821 829391838
829393983 829394000
829399329 829399346
829401341 829401358
829401386 829401403
829401789 829401806
829402813 829402830
829402862 829402879
829403015 829403032
829403450 829403467
829415767 829415785
829415782 829415799
829415786 829415803
829415816 829415833
829415830 829415847
829415849 829415866
829415861 829415878
829415873 829415890
829415889 829415906
829415897 829415914
829415907 829415924
829415936 829415953
829415948 829415965
829415990 829416007
829416002 829416019
829416022 829416039
829416034 829416051
829416067 829416084
829416082 829416099
829416121 829416138
829416147 829416164
829416187 829416204
829416201 829416218
829416226 829416243
829416267 829416287
829416301 829416318
829416343 829416360
829416354 829416371
829416367 829416384
829416371 829416388
829416394 829416411
829416414 829416431
829416423 829416440
829416463 829416480
829416529 829416546
829416556 829416573
829416583 829416603
829416605 829416622
829416629 829416646
829416637 829416654
829416642 829416659
829416662 829416679
829416670 829416687
829416683 829416700
829416741 829416758
829416770 829416787
829416819 829416836
829416831 829416848
829416855 829416872
829416865 829416882
829416953 829416970
829417034 829417051
829417052 829417069
829417057 829417074
829417077 829417094
829417109 829417129
829417127 829417144
829417152 829417169
829417166 829417183
829417181 829417198
829417248 829417265
829417260 829417277
829417297 829417314
829417316 829417333
829417343 829417360
829417363 829417380
829417372 829417389
829417415 829417432
829417460 829417477
829417472 829417489
829417543 829417560
829417554 829417572
829417562 829417579
829417591 829417608
829417597 829417614
829417629 829417646
829417651 829417668
829417659 829417676
829417709 829417726
829417754 829417771
829417776 829417793
829417786 829417803
829417803 829417820
829418020 829418037
829418071 829418088
829418085 829418102
829418112 829418129
829418128 829418145
829418147 829418164
829418156 829418173
829418177 829418194
829418198 829418215
829418255 829418272
829418291 829418308
829418304 829418321
829418340 829418357
829418374 829418391
829418456 829418473
829418462 829418479
829418501 829418518
829418509 829418526
829418540 829418557
829418571 829418588
829418612 829418629
829418638 829418655
829418688 829418705
829418733 829418750
829418739 829418756
829418823 829418840
829418852 829418869
829418967 829418984
829418973 829418990
829418987 829419004
829419021 829419038
829419053 829419070
829419086 829419103
829419140 829419157
829419210 829419227
829419276 829419293
829419348 829419365
829419403 829419420
829419432 829419449
829419477 829419494
829419522 829419539
829419570 829419587
829419604 829419621
829419636 829419653
829419688 829419707
829419725 829419742
829419762 829419779
829419788 829419805
829419854 829419871
829419875 829419892
829419931 829419948
829419958 829419975
829420004 829420021
829420079 829420096
829420131 829420148
829420165 829420182
829420191 829420208
829420233 829420250
829420269 829420286
829420318 829420335
829420386 829420403
829420415 829420432
829420472 829420489
829420511 829420528
829420671 829420688
829420680 829420697
829420723 829420740
829420809 829420826
829420890 829420907
829420930 829420947
829421051 829421068
829421164 829421181
829421182 829421199
829421230 829421247
829421249 829421266
829421279 829421296
829421399 829421416
829421455 829421472
829421571 829421588
829421628 829421645
829421707 829421724
829421847 829421864
829421852 829421869
829421934 829421951
829422226 829422243
829422275 829422292
829422369 829422386
829422402 829422419
829422453 829422470
829427508 829427525
829427583 829427600
829427667 829427684
829427702 829427719
829427896 829427913
829428204 829428221
829428396 829428413
829428418 829428435
829428821 829428838
829429241 829429258
829429253 829429270
829429307 829429324
829429367 829429384
829429415 829429432
829431114 829431131
829431495 829431512
829431506 829431523
829431588 829431605
829431648 829431665
829431690 829431707
829431715 829431732
829431782 829431799
829431804 829431821
829431869 829431886
829431997 829432014
829432585 829432602
829432894 829432911
829432968 829432985
829433030 829433047
829433037 829433054
829433047 829433064
829433186 829433203
829433204 829433221
829433250 829433267
829433297 829433314
829433727 829433744
829433872 829433889
829433891 829433908
829433926 829433943
829433932 829433949
829434061 829434078
829434073 829434090
829434297 829434314
829434802 829434819
829434928 829434945
829435041 829435058
829435406 829435423
829436145 829436162
829436199 829436216
829437062 829437079
829437256 829437273
829437896 829437913
829438118 829438135
829439064 829439081
829439107 829439124
829439254 829439271
829439388 829439405
829439581 829439598
829439720 829439737
829440251 829440268
829440528 829440545
829441069 829441086
829441314 829441331
829442099 829442116
829442373 829442390
829442377 829442394
829442412 829442429
829443293 829443310
829443989 829444006
829444262 829444279
829445574 829445591
829446314 829446331
829449350 829449367
829450297 829450314
829450431 829450448
829451182 829451199
829451199 829451216
829451359 829451376
829453346 829453363
829453555 829453572
829453689 829453706
829453741 829453758
829454288 829454305
829455037 829455054
829455539 829455556
829458117 829458134
829459262 829459279
829459281 829459298
829460187 829460204
829461006 829461023
829461509 829461526
829461957 829461974
829464017 829464034
829465170 829465187
829465239 829465256
829469767 829469784
829472621 829472638
829473258 829473275
829475103 829475120
829475697 829475714
829477645 829477662
829492865 829492882
829492875 829492892
829494088 829494108
829494123 829494140
829494134 829494154
829494146 829494163
829494168 829494185
829494306 829494323
829494349 829494366
829494984 829495001
829495948 829495965
829496663 829496680
829496919 829496936
829497183 829497200
829498259 829498276
829498949 829498966
829498954 829498971
829499479 829499496
829499666 829499683
829499806 829499823
829500434 829500451
829500720 829500737
829501524 829501541
829501534 829501551
829501669 829501686
829502621 829502638
829502750 829502767
829513201 829513218
829530715 829530732
829531131 829531148
829534585 829534602
829540836 829540853
829542150 829542167
829543418 829543435
829550752 829550769
829551353 829551370
829552272 829552289
829553020 829553037
829553041 829553058
829558863 829558880
829560232 829560249
829560243 829560260
829560319 829560338
829560428 829560445
829560510 829560527
829561167 829561187
829561934 829561951
829562203 829562220
829562298 829562315
829562308 829562325
829562322 829562339
829563585 829563603
829563591 829563608
829563622 829563640
829565389 829565406
829565489 829565506
829565502 829565519
829565521 829565538
829565534 829565551
829565549 829565566
829565579 829565596
829565632 829565649
829565638 829565655
829565657 829565674
829565667 829565684
829565698 829565717
829565744 829565761
829565778 829565795
829565919 829565936
829565926 829565943
829565957 829565974
829565972 829565989
829566007 829566024
829566057 829566074
829566069 829566086
829566095 829566112
829566101 829566118
829569048 829569065
829569477 829569494
829569572 829569589
829569678 829569695
829570168 829570185
829571311 829571328
829577103 829577120
829578040 829578057
829578437 829578454
829586528 829586545
829586558 829586575
829586629 829586646
829586656 829586673
829586679 829586699
829586697 829586715
829586709 829586728
829586728 829586745
829586734 829586754
829586746 829586763
829586906 829586923
829588510 829588527
829588594 829588611
829588735 829588752
829589186 829589203
829589245 829589262
829589405 829589425
829589682 829589699
829593188 829593205
829597658 829597675
829597662 829597679
829598236 829598253
829598936 829598953
829598982 829598999
829599003 829599020
829599015 829599032
829599032 829599049
829599122 829599139
829599772 829599789
829600712 829600731
829600746 829600763
829600777 829600794
829600836 829600853
829600845 829600862
829600867 829600884
829600905 829600922
829600917 829600934
829600927 829600944
829600952 829600971
829600959 829600976
829600976 829600998
829600989 829601006
829601008 829601025
829601028 829601045
829601039 829601056
829601061 829601079
829601079 829601096
829601087 829601104
829601119 829601139
829601136 829601153
829601153 829601170
829601211 829601228
829601215 829601232
829601239 829601256
829601255 829601272
829601268 829601287
829601661 829601678
829601986 829602003
829602895 829602912
829602928 829602945
829603453 829603470
829603509 829603526
829603530 829603547
829603671 829603688
829603802 829603819
829603815 829603832
829603889 829603906
829603900 829603917
829603908 829603925
829603930 829603947
829603995 829604012
829603999 829604016
829604020 829604037
829645272 829645289
829645475 829645492
829645912 829645929
829646093 829646110
829646104 829646122
829646118 829646135
829646133 829646150
829646144 829646164
829646370 829646387
829646655 829646672
829646664 829646681
829646715 829646732
829647669 829647686
829647697 829647714
829647824 829647841
829648163 829648180
829648366 829648383
829648548 829648565
829671705 829671722
829672072 829672089
829672147 829672164
829672477 829672494
829672834 829672851
829672842 829672860
829672948 829672965
829673014 829673032
829673733 829673750
829674608 829674626
829674855 829674872
829674868 829674885
829675082 829675099
829675104 829675123
829675709 829675726
829675817 829675834
829684790 829684807
829685695 829685712
829686137 829686154
829689483 829689501
829690937 829690954
829690969 829690986
829691121 829691138
829691309 829691326
829691780 829691800
829691832 829691849
829691853 829691870
829692701 829692718
829692708 829692725
829692713 829692730
829692733 829692751
829692740 829692757
829692758 829692775
829692794 829692813
829695856 829695873
829700403 829700420
829702244 829702261
829703592 829703609
829704375 829704395
829704387 829704404
829704423 829704440
829705009 829705026
829705024 829705041
829705058 829705075
829705097 829705114
829705121 829705138
829705310 829705327
829705553 829705572
829705560 829705577
829705580 829705597
829705663 829705680
829705795 829705812
829706051 829706068
829706392 829706412
829706432 829706449
829706623 829706640
829706652 829706669
829706659 829706677
829706705 829706725
829706773 829706790
829706831 829706848
829706835 829706852
829706889 829706906
829706945 829706962
829707111 829707128
829707123 829707140
829707144 829707161
829707161 829707178
829707195 829707212
829707231 829707249
829707247 829707264
829707251 829707268
829707281 829707298
829707286 829707306
829707298 829707315
829707307 829707324
829707327 829707345
829707333 829707350
829707345 829707362
829707532 829707549
829707558 829707575
829707564 829707581
829707601 829707618
829707886 829707903
829707930 829707947
829707936 829707953
829707948 829707965
829708178 829708198
829708191 829708208
829708336 829708353
829708583 829708600
829708858 829708875
829708879 829708896
829708965 829708982
829709000 829709017
829709329 829709346
829709391 829709408
829709458 829709475
829709514 829709531
829709519 829709541
829709609 829709626
829709636 829709653
829709685 829709702
829709780 829709797
829710081 829710098
829711096 829711113
829711180 829711197
829711734 829711751
829711815 829711832
829711999 829712016
829712051 829712068
829712102 829712119
829714257 829714274
829714262 829714279
829714333 829714350
829714854 829714871
829714879 829714896
829716289 829716306
829716368 829716385
829716391 829716408
829716480 829716498
829716508 829716525
829716679 829716696
829716842 829716859
829716860 829716877
829716884 829716901
829716993 829717010
829717169 829717186
829718129 829718146
829718141 829718158
829718450 829718469
829718781 829718798
829720778 829720795
829720806 829720823
829720822 829720839
829720945 829720962
829720952 829720969
829737566 829737583
829741060 829741077
829741744 829741761
829745483 829745500
829761212 829761229
829763326 829763343
829769040 829769057
829771904 829771921
829772298 829772315
829772983 829773000
829776611 829776628
829777323 829777340
829777351 829777368
829777509 829777526
829777524 829777542
829777643 829777660
829777664 829777683
829777677 829777694
829778424 829778441
829778439 829778456
829778589 829778606
829778673 829778691
829779029 829779047
829779043 829779060
829779190 829779208
829779284 829779301
829779760 829779777
829780154 829780171
829780190 829780209
829780203 829780220
829780214 829780231
829780230 829780247
829780238 829780255
829780286 829780306
829780323 829780342
829780382 829780399
829780418 829780438
829780529 829780546
829780540 829780557
829780959 829780977
829780997 829781014
829781036 829781055
829781055 829781072
829781127 829781144
829781133 829781150
829781144 829781161
829781159 829781176
829781164 829781181
829782452 829782469
829782855 829782872
829782902 829782919
829782948 829782965
829782954 829782973
829782963 829782980
829782973 829782990
829783228 829783245
829783810 829783827
829783826 829783843
829783953 829783970
829787358 829787375
829788575 829788592
829788633 829788650
829788639 829788656
829788670 829788687
829788973 829788992
829789085 829789102
829789245 829789262
829789731 829789748
829789990 829790008
829790080 829790097
829790316 829790333
829790421 829790438
829790881 829790898
829790985 829791002
829791280 829791297
829791505 829791522
829791733 829791750
829791761 829791778
829791774 829791791
829791778 829791795
829791808 829791825
829792014 829792032
829793025 829793042
829793081 829793098
829793091 829793108
829793280 829793297
829793686 829793703
829793892 829793909
829793899 829793916
829794030 829794049
829794945 829794963
829795084 829795102
829800056 829800073
829800137 829800154
829800163 829800181
829800376 829800393
829800448 829800465
829800454 829800471
829800463 829800480
829802262 829802279
829802292 829802309
829802305 829802322
829802321 829802339
829802712 829802729
829802733 829802750
829802919 829802936
829803014 829803031
829803024 829803041
829803085 829803102
829803090 829803107
829803100 829803117
829803164 829803181
829803184 829803201
829803194 829803211
829803242 829803259
829804074 829804091
829805111 829805129
829805823 829805840
829805848 829805865
829805899 829805916
829805918 829805935
829805937 829805954
829806170 829806188
829806200 829806217
829806205 829806222
829806270 829806287
829806294 829806311
829806298 829806315
829806315 829806332
829806439 829806456
829806448 829806465
829806507 829806524
829806523 829806540
829806541 829806558
829806564 829806581
829806803 829806820
829807072 829807089
829807088 829807105
829807093 829807110
829807135 829807152
829807186 829807204
829808102 829808119
829808601 829808619
829809251 829809268
829817631 829817648
829817782 829817799
829818387 829818404
829818923 829818940
829818937 829818954
829818978 829818995
829819347 829819364
829819360 829819377
829819369 829819386
829819781 829819798
829819799 829819816
829819966 829819983
829820040 829820057
829820187 829820204
829820255 829820272
829820480 829820497
829821854 829821871
829821874 829821892
829822485 829822503
829822657 829822674
829822691 829822708
829822711 829822728
829822762 829822779
829822768 829822790
829822817 829822834
829822909 829822926
829822961 829822978
829823036 829823053
829823189 829823206
829823450 829823467
829823479 829823496
829823556 829823573
829823598 829823618
829823633 829823650
829823865 829823882
829824437 829824454
829829192 829829209
829829198 829829215
829829216 829829233
829829315 829829332
829829331 829829348
829829476 829829493
829829494 829829511
829830106 829830123
829830122 829830139
829830713 829830731
829831234 829831251
829831423 829831440
829831617 829831634
829831625 829831642
829831655 829831672
829831678 829831695
829832432 829832451
829832990 829833007
829832997 829833014
829833312 829833329
829833434 829833451
829835047 829835064
829835198 829835215
829838499 829838517
829838521 829838538
829838619 829838636
829838686 829838703
829838747 829838764
829839115 829839133
829839157 829839174
829839165 829839182
829839329 829839346
829839335 829839352
829839342 829839359
829839387 829839404
829839394 829839411
829839399 829839418
829839408 829839426
829839416 829839433
829839432 829839449
829839469 829839486
829839495 829839512
829839515 829839532
829839534 829839551
829839569 829839587
829839619 829839636
829840586 829840603
829840938 829840955
829840942 829840962
829841698 829841715
829841709 829841726
829841719 829841736
829841743 829841760
829841787 829841805
829841986 829842003
829842039 829842056
829842048 829842065
829842060 829842077
829842196 829842213
829842568 829842585
829842589 829842606
829843082 829843099
829843296 829843313
829843302 829843319
829843335 829843352
829843397 829843414
829843403 829843420
829843454 829843471
829843466 829843483
829843478 829843495
829843548 829843565
829843594 829843611
829843629 829843646
829843684 829843701
829843694 829843711
829843742 829843759
829843771 829843789
829843874 829843893
829843996 829844013
829844025 829844042
829844087 829844104
829844097 829844114
829844490 829844508
829844791 829844809
829844802 829844819
829844848 829844865
829844892 829844909
829844924 829844941
829845153 829845170
829845207 829845224
829845245 829845262
829845315 829845334
829845683 829845700
829845688 829845705
829845990 829846007
829846011 829846028
829846077 829846094
829846340 829846357
829846386 829846403
829846817 829846834
829847127 829847144
829847416 829847433
829847666 829847683
829847791 829847808
829847966 829847983
829848011 829848028
829848147 829848164
829848283 829848300
829848289 829848306
829848356 829848373
829848375 829848394
829848486 829848503
829848948 829848965
829849303 829849321
829849333 829849350
829849643 829849660
829850140 829850157
829851100 829851117
829851153 829851170
829851249 829851266
829851312 829851329
829851463 829851480
829852583 829852600
829854139 829854156
829854143 829854160
829854334 829854351
829854363 829854380
829854370 829854387
829854446 829854463
829854474 829854491
829854557 829854574
829854595 829854612
829854615 829854635
829854622 829854639
829854796 829854813
829854811 829854828
829855602 829855619
829858823 829858840
829859429 829859446
829860121 829860138
829860265 829860282
829860286 829860303
829860292 829860309
829860319 829860336
829860351 829860368
829860987 829861004
829861501 829861518
829861525 829861542
829862192 829862209
829862196 829862213
829862210 829862227
829862215 829862232
829862223 829862240
829862237 829862260
829862256 829862273
829862282 829862299
829862290 829862307
829862305 829862322
829862315 829862334
829862348 829862365
829862352 829862369
829862376 829862393
829862390 829862407
829862399 829862417
829862430 829862447
829862437 829862454
829864519 829864536
829864524 829864541
829864554 829864571
829864624 829864641
829864652 829864669
829864720 829864740
829864727 829864744
829864756 829864773
829864768 829864785
829864875 829864892
829864943 829864961
829864973 829864990
829865191 829865208
829865233 829865250
829865275 829865292
829865345 829865362
829871198 829871215
829871766 829871783
829872022 829872039
829872379 829872396
829872550 829872567
829872607 829872624
829873577 829873594
829874917 829874934
829875440 829875457
829875518 829875535
829875756 829875773
829875928 829875945
829875969 829875986
829876212 829876229
829876499 829876516
829877086 829877103
829877159 829877176
829878666 829878683
829878784 829878801
829878799 829878816
829878967 829878984
829879179 829879197
829879547 829879564
829879585 829879602
829879601 829879618
829879608 829879625
829879726 829879743
829879747 829879764
829880243 829880260
829880749 829880766
829881562 829881579
829882413 829882430
829882744 829882761
829882806 829882823
829883346 829883363
829883433 829883450
829883615 829883632
829884507 829884524
829884548 829884565
829884569 829884586
829888896 829888915
829890044 829890061
829890842 829890859
829891138 829891155
829891291 829891308
829891857 829891874
829893752 829893769
829898738 829898755
829899494 829899511
829900757 829900774
829903284 829903301
829906816 829906833
829907845 829907862
829909400 829909417
829910884 829910901
829911983 829912000
829914867 829914884
829915081 829915098
829918590 829918607
829920802 829920819
829921903 829921920
829922570 829922587
829925363 829925380
829931245 829931262
829931419 829931436
829932010 829932027
829932481 829932498
829932570 829932587
829932587 829932604
829932616 829932633
829932659 829932676
829932839 829932856
829932849 829932866
829933990 829934007
829935766 829935783
829935770 829935787
829936070 829936087
829936430 829936447
829936480 829936497
829936875 829936892
829937753 829937770
829938485 829938505
829938496 829938513
829938513 829938530
829944312 829944329
829944937 829944954
829946182 829946199
829949617 829949634
829950510 829950527
829957982 829957999
829963004 829963021
829963852 829963869
829965674 829965691
829969776 829969793
829973816 829973833
829977236 829977253
829978145 829978162
829978168 829978185
829986778 829986796
829987261 829987278
829987339 829987356
829987372 829987389
829987416 829987433
829987434 829987451
829987502 829987519
829987671 829987688
829987679 829987696
829987762 829987779
829987766 829987783
829987770 829987787
829987778 829987795
829987792 829987809
829987805 829987822
829987822 829987839
829987830 829987847
829987864 829987881
829987878 829987895
829987887 829987907
829987907 829987924
829987958 829987975
829987982 829987999
829987995 829988012
829988028 829988045
829988065 829988082
829988088 829988105
829988102 829988119
829988119 829988138
829988136 829988153
829988171 829988188
829988190 829988207
829988205 829988222
829988223 829988243
829988289 829988308
829989856 829989873
829991855 829991872
829991930 829991948
829992525 829992542
829992540 829992557
829992561 829992578
829992617 829992634
829992626 829992643
829992630 829992647
829992635 829992656
829992652 829992669
829992782 829992799
829992804 829992821
829992865 829992882
829992945 829992962
829992962 829992979
829994986 829995003
829997072 829997089
830038825 830038842
830039093 830039110
830039204 830039221
830039634 830039651
830039677 830039694
830040064 830040081
830042217 830042234
830043437 830043454
830043677 830043694
830044679 830044696
830045006 830045023
830045144 830045167
830045160 830045178
830045564 830045581
830045658 830045675
830045663 830045680
830047670 830047687
830047709 830047726
830052419 830052436
830052769 830052786
830053699 830053716
830053955 830053972
830054901 830054918
830054921 830054938
830054995 830055012
830055307 830055324
830055322 830055339
830055326 830055344
830055420 830055437
830057135 830057152
830059444 830059461
830060064 830060081
830063173 830063190
830063770 830063787
830063952 830063969
830064274 830064291
830064597 830064614
830067694 830067711
830068845 830068862
830069332 830069349
830069794 830069811
830070337 830070354
830071702 830071719
830071796 830071813
830074851 830074868
830075123 830075140
830075260 830075277
830075526 830075543
830080676 830080693
830082437 830082454
830087586 830087604
830093522 830093539
830093530 830093547
830094101 830094118
830099097 830099114
830100443 830100461
830100461 830100478
830100569 830100586
830100580 830100597
830101305 830101322
830101462 830101479
830104113 830104130
830106498 830106515
830116437 830116454
830122136 830122154
830122154 830122171
830125378 830125395
830125461 830125481
830125596 830125613
830125672 830125691
830125713 830125730
830125763 830125780
830125835 830125852
830125843 830125860
830125894 830125911
830125899 830125916
830125928 830125947
830125944 830125961
830125951 830125968
830125966 830125983
830125980 830125997
830125992 830126009
830126018 830126035
830126022 830126039
830126026 830126043
830128997 830129014
830138220 830138237
830138999 830139016
830142044 830142061
830142109 830142127
830144602 830144619
830145031 830145048
830146312 830146329
830146418 830146435
830146455 830146472
830146507 830146527
830146615 830146634
830146622 830146639
830146635 830146652
830146656 830146673
830146840 830146857
830146940 830146957
830146976 830146993
830147955 830147972
830148130 830148147
830148137 830148154
830148206 830148223
830150088 830150105
830152632 830152649
830160552 830160569
830160658 830160675
830160674 830160691
830160689 830160706
830160702 830160720
830164103 830164120
830164221 830164238
830167362 830167379
830173302 830173319
830178893 830178910
830215761 830215778
830215767 830215784
830216733 830216750
830217587 830217604
830219044 830219061
830219696 830219713
830220290 830220307
830221028 830221045
830221979 830221996
830222266 830222283
830222859 830222876
830223183 830223200
830223433 830223450
830223567 830223584
830224275 830224292
830224536 830224553
830225384 830225401
830225432 830225449
830225517 830225534
830225898 830225915
830226334 830226351
830227275 830227293
830230649 830230666
830235912 830235929
830236130 830236147
830237456 830237473
830237956 830237973
830238424 830238441
830238584 830238601
830238632 830238649
830238646 830238663
830238674 830238691
830238689 830238706
830238727 830238744
830238784 830238801
830238811 830238828
830239248 830239265
830240578 830240595
830241437 830241454
830244974 830244995
830245672 830245692
830245683 830245700
830247388 830247405
830247394 830247411
830247445 830247462
830247550 830247567
830247563 830247580
830247634 830247651
830247669 830247686
830247676 830247693
830247680 830247697
830247697 830247714
830248498 830248515
830248909 830248926
830248938 830248955
830248974 830248992
830249101 830249118
830249950 830249967
830251107 830251124
830251126 830251144
830253662 830253679
830254666 830254683
830257001 830257018
830257005 830257022
830257462 830257479
830257512 830257529
830258437 830258454
830258460 830258477
830258473 830258490
830258480 830258497
830264268 830264285
830264309 830264327
830264337 830264354
830264485 830264502
830264598 830264615
830264614 830264631
830264619 830264637
830265148 830265165
830265379 830265396
830265840 830265857
830266271 830266289
830266861 830266878
830268276 830268293
830268708 830268725
830269800 830269817
830269807 830269824
830270753 830270770
830270814 830270832
830270824 830270841
830270910 830270928
830270924 830270942
830270945 830270962
830270951 830270968
830270963 830270980
830270969 830270986
830270991 830271012
830271102 830271119
830271143 830271160
830271622 830271639
830271819 830271836
830275981 830275998
830276077 830276094
830276087 830276104
830276098 830276115
830276115 830276132
830276137 830276154
830276151 830276170
830276180 830276197
830276223 830276240
830276340 830276357
830276395 830276412
830276404 830276421
830276575 830276592
830276624 830276641
830276773 830276790
830277252 830277269
830277730 830277747
830277736 830277753
830277887 830277904
830278045 830278062
830278052 830278069
830278075 830278092
830278117 830278134
830278149 830278167
830278246 830278263
830278256 830278273
830278292 830278312
830278305 830278322
830278315 830278332
830278332 830278351
830278366 830278383
830278437 830278454
830278450 830278467
830278463 830278480
830278485 830278502
830278491 830278508
830278503 830278520
830278665 830278682
830278687 830278709
830278916 830278933
830278944 830278961
830278955 830278972
830278976 830278993
830279036 830279053
830279127 830279144
830279137 830279156
830279211 830279228
830279269 830279286
830279310 830279327
830279396 830279413
830279484 830279502
830279489 830279506
830279512 830279529
830279573 830279590
830279614 830279631
830279624 830279641
830279650 830279667
830279743 830279760
830279751 830279768
830279765 830279782
830279878 830279895
830279904 830279921
830280028 830280046
830280033 830280050
830280091 830280108
830280107 830280130
830280136 830280153
830280155 830280172
830280160 830280177
830280191 830280208
830280197 830280214
830280210 830280227
830280239 830280256
830280305 830280322
830280365 830280383
830280501 830280518
830280577 830280594
830281772 830281789
830281789 830281806
830281993 830282010
830282010 830282027
830282071 830282088
830282087 830282104
830282101 830282118
830282118 830282135
830292802 830292819
830294975 830294992
830294992 830295009
830304633 830304650
830308529 830308546
830309982 830309999
830318481 830318498
830318510 830318527
830320941 830320958
830321020 830321037
830321054 830321073
830321083 830321100
830321308 830321325
830321350 830321367
830321712 830321729
830321747 830321764
830321838 830321855
830321872 830321889
830324087 830324104
830324704 830324721
830326280 830326297
830326368 830326385
830326489 830326506
830326693 830326710
830326700 830326724
830326728 830326746
830326737 830326754
830327438 830327455
830334164 830334181
830334219 830334238
830334261 830334281
830334281 830334298
830334294 830334311
830334358 830334375
830334364 830334381
830338595 830338612
830338617 830338634
830338630 830338647
830358288 830358305
830358396 830358413
830359294 830359311
830360764 830360781
830360808 830360825
830361133 830361150
830361365 830361382
830429931 830429948
830430157 830430175
830430175 830430192
830430308 830430325
830430767 830430784
830430908 830430925
830430916 830430933
830431396 830431413
830431550 830431567
830432015 830432032
830432049 830432066
830432631 830432648
830433015 830433032
830433067 830433084
830436037 830436054
830436278 830436295
830436467 830436485
830436688 830436705
830436742 830436759
830436854 830436871
830437096 830437113
830438335 830438356
830438663 830438680
830438688 830438705
830441063 830441080
830441111 830441128
830441130 830441148
830441184 830441201
830441279 830441296
830441313 830441330
830441383 830441400
830442280 830442297
830442578 830442595
830442683 830442700
830443091 830443108
830443254 830443271
830443328 830443345
830446598 830446615
830446606 830446623
830447099 830447117
830447331 830447348
830447441 830447458
830447601 830447618
830447792 830447812
830447826 830447843
830447878 830447896
830448143 830448160
830448329 830448346
830448488 830448505
830458310 830458327
830459672 830459689
830459799 830459817
830484157 830484174
830544663 830544680
830544900 830544917
830559750 830559767
830561422 830561439
830562320 830562337
830564982 830564999
830585219 830585236
830597267 830597284
830598749 830598766
830598813 830598830
830605919 830605936
831174703 831174720
831176764 831176781
831177493 831177510
831177503 831177523
831177537 831177554
831177615 831177632
831178304 831178321
831178578 831178595
831179803 831179820
831185123 831185142
831185594 831185611
831186858 831186875
831187093 831187110
831187663 831187680
831187733 831187750
831188256 831188274
831188407 831188424
831189120 831189137
831189194 831189212
831189536 831189553
831196000 831196017
831196851 831196868
831196951 831196968
831197255 831197272
831198159 831198176
831198398 831198416
831198419 831198436
831198424 831198441
831198440 831198459
831199337 831199354
831199657 831199674
831199722 831199739
831200007 831200024
831203963 831203980
831209171 831209188
831209455 831209472
831209461 831209478
831209529 831209546
831280312 831280329
831281183 831281200
831281241 831281258
831281518 831281535
831281541 831281558
831281706 831281723
831283111 831283128
831283133 831283150
831283148 831283165
831283241 831283258
831283576 831283594
831283618 831283636
831283624 831283641
831288675 831288692
831288896 831288913
831288953 831288970
831289005 831289022
831289018 831289035
831289024 831289041
831289119 831289136
831289488 831289505
831289524 831289543
831289759 831289776
831289821 831289838
831289829 831289846
831289846 831289863
831290091 831290109
831290140 831290157
831290145 831290162
831290150 831290167
831290154 831290171
831290170 831290188
831290184 831290201
831290204 831290221
831290209 831290226
831290220 831290239
831290231 831290248
831290250 831290269
831290287 831290306
831290326 831290343
831290401 831290418
831290709 831290726
831290779 831290796
831290806 831290823
831294176 831294194
831295355 831295372
831295381 831295398
831295385 831295402
831295477 831295497
831295486 831295503
831295574 831295591
831295912 831295929
831295926 831295943
831299388 831299405
831300121 831300138
831300161 831300178
831300178 831300195
831300323 831300340
831300332 831300349
831300357 831300374
831300388 831300408
831300433 831300450
831300453 831300472
831300477 831300495
831300501 831300519
831300516 831300537
831300528 831300545
831300564 831300582
831300576 831300593
831300582 831300599
831300625 831300642
831300635 831300655
831300653 831300676
831300674 831300691
831300679 831300696
831300719 831300736
831300772 831300790
831300802 831300821
831300847 831300865
831300855 831300872
831300867 831300884
831300883 831300900
831300887 831300905
831301669 831301688
831301680 831301697
831301686 831301703
831301746 831301763
831301759 831301778
831301884 831301906
831301898 831301915
831301910 831301927
831301921 831301938
831301983 831302000
831302006 831302023
831302013 831302030
831302023 831302040
831302045 831302062
831302065 831302082
831302084 831302103
831302107 831302124
831302111 831302128
831302157 831302175
831302167 831302184
831302550 831302567
831302572 831302589
831302622 831302639
831302685 831302702
831302700 831302718
831302741 831302758
831302756 831302773
831303131 831303148
831303336 831303353
831303356 831303375
831303366 831303385
831303373 831303390
831303407 831303424
831303433 831303450
831303514 831303531
831303537 831303554
831303548 831303565
831303559 831303576
831303837 831303854
831303841 831303858
831303895 831303912
831303940 831303957
831304014 831304031
831304039 831304056
831304421 831304438
831304595 831304612
831304623 831304640
831304779 831304796
831305125 831305142
831305237 831305254
831305362 831305379
831305408 831305425
831305453 831305470
831305519 831305536
831305528 831305545
831305681 831305698
831305771 831305788
831305801 831305818
831305807 831305824
831305855 831305872
831305924 831305941
831305941 831305960
831305992 831306009
831306020 831306040
831306033 831306050
831306049 831306066
831306066 831306083
831306083 831306100
831306091 831306108
831306101 831306118
831306105 831306122
831306141 831306158
831306183 831306200
831306198 831306215
831306251 831306268
831306273 831306290
831306285 831306302
831306419 831306436
831306434 831306451
831306445 831306462
831306497 831306514
831306505 831306522
831306569 831306587
831321643 831321660
831321647 831321664
831321690 831321707
831321721 831321738
831321781 831321798
831321788 831321805
831321944 831321961
831322172 831322189
831322407 831322424
831327909 831327926
831339381 831339398
831339466 831339483
831339610 831339627
831339756 831339773
831339779 831339796
831339880 831339897
831339932 831339949
831339936 831339953
831340020 831340037
831340026 831340043
831340058 831340075
831340072 831340089
831340080 831340097
831340095 831340114
831340141 831340158
831340157 831340174
831340470 831340487
831340487 831340504
831340525 831340542
831340567 831340584
831340588 831340605
831340593 831340610
831340608 831340625
831340630 831340647
831341109 831341126
831341313 831341330
831342847 831342864
831343191 831343208
831343384 831343401
831343790 831343807
831344195 831344212
831344679 831344696
831345472 831345489
831345662 831345679
831346060 831346077
831346502 831346519
831346672 831346689
831347076 831347093
831347586 831347603
831347621 831347638
831348186 831348203
831351862 831351879
831352487 831352504
831352937 831352954
831353398 831353415
831353447 831353464
831353673 831353690
831354029 831354046
831354256 831354274
831354300 831354317
831354606 831354623
831354698 831354715
831355254 831355271
