815208150 815208210
815208570 815208930
815208990 815209050
815209230 815209290
815209350 815209410
815209590 815209950
815210070 815210370
815210670 815210790
815210850 815210910
815211090 815211150
815211450 815211570
815212170 815212230
815214690 815214750
815216310 815216370
815221290 815221350
815222010 815222070
815230050 815230110
815236710 815236830
815237370 815237490
815237550 815237910
815238030 815238090
815239050 815239290
815239470 815239530
815239770 815239830
815239890 815239950
815241090 815241270
815241570 815241630
815242290 815242410
815244090 815244270
815245230 815245290
815247150 815247210
815250750 815250810
815265750 815265810
815266770 815266830
815267730 815267790
815268930 815268990
815270970 815271030
815298210 815299650
815299710 815299890
815300550 815300730
815300790 815300850
815300910 815301090
815301330 815301450
815301630 815301750
815302890 815302950
815303250 815303370
815303490 815303550
815303610 815303670
815304090 815304150
815304330 815304390
815304450 815304510
815304630 815304750
815307270 815307330
815310030 815310210
815310330 815310390
815312790 815312910
815315070 815315130
815332230 815332290
815341470 815341530
815394270 815394330
815403090 815403150
815450610 815450670
815467170 815467230
815544750 815544810
815546670 815546730
815571750 815571810
815580690 815580750
815590170 815590230
815592510 815592570
815610450 815610510
815620170 815620230
815663130 815663190
815695350 815695410
815699250 815699310
815700450 815700510
815706990 815707050
815709090 815709150
815763330 815763390
815776950 815777010
815785290 815785350
815785470 815785530
815787990 815788050
815788290 815788530
815788950 815789010
815790390 815790450
815791290 815791350
815798490 815798550
815799090 815799150
815799630 815799690
815805750 815805810
815842050 815842110
815845770 815845830
815890590 815890650
815905530 815905590
815914470 815914530
815918670 815918730
815921790 815921850
815927370 815927430
815928330 815928390
815933430 815933490
815935650 815935710
815963850 815963910
816002490 816002550
816008550 816008610
816021930 816021990
816035490 816035550
816040170 816040230
816103290 816103350
816158850 816158910
816192390 816192450
816195450 816195510
816200730 816200790
816205350 816205410
816208410 816208470
816215730 816215790
816216810 816216870
816217170 816217230
816244650 816244710
816277050 816277110
816284970 816285030
816307410 816307470
816360270 816360330
816369150 816369210
816379650 816379710
816390330 816390390
816391290 816391350
816439230 816439290
816445710 816445770
816448770 816448830
816469830 816469890
816471690 816471750
816572130 816572190
816630150 816630210
816630870 816630930
816638250 816638310
816641670 816641730
816657870 816657930
816674790 816674850
816807150 816807210
816818370 816818430
816865170 816865230
816908910 816908970
816922470 816922530
816946950 816947010
816952110 816952170
816969450 816969510
816988770 816988830
817031490 817031550
817068210 817068270
817082070 817082130
817103790 817103850
817178250 817178310
817243290 817243410
817252410 817252470
817340670 817340730
817346970 817347030
817423350 817423410
817425690 817425750
817496130 817496190
817504470 817504530
817508310 817508370
817549410 817549470
817552710 817552770
817562730 817562970
817563030 817563090
817568430 817568490
817569510 817569570
817592550 817592610
817596450 817596510
817600230 817600290
817618110 817618170
817687050 817687110
817700070 817700310
817707330 817707390
817718490 817718610
817722450 817722570
817753170 817753230
817770750 817770810
817773390 817773450
817781790 817781850
817821570 817821630
817824390 817824450
817859370 817859430
817915170 817915230
818077170 818077230
818093490 818093550
818096010 818096070
818097090 818097150
818112810 818112870
818172810 818172870
818182050 818182110
818261970 818262030
818267490 818267550
818291430 818291490
818338770 818338830
818343150 818343210
818356290 818356350
818370690 818370750
818438970 818439030
818460090 818460150
818479650 818479710
818604150 818604210
818636550 818636610
818645190 818645250
818677590 818677650
818687130 818687250
818715270 818715330
818719590 818719650
818723610 818723670
818793750 818793810
818805510 818805570
818814930 818814990
818878530 818878590
818885370 818885430
818888250 818888310
818945550 818945610
818969130 818969190
819027990 819028050
819162390 819162450
819185250 819185310
819211230 819211290
819226590 819226650
819228450 819228510
819251190 819251250
819269430 819269490
819294990 819295050
819317070 819317130
819325350 819325410
819362610 819362670
819377850 819377910
819392310 819392430
819400710 819400770
819409170 819409230
819424050 819424110
819453390 819453450
819480690 819480750
819573150 819573210
819600150 819600210
819697590 819697650
819729030 819729090
819756270 819756330
819760350 819760410
819789990 819790050
819825330 819825390
819842610 819842670
819901710 819901770
820049730 820049790
820054650 820054710
820056750 820056810
820062930 820062990
820087050 820087110
820089270 820089330
820103310 820103370
820106670 820106730
820147230 820147290
820175670 820175730
820196370 820196430
820214070 820214130
820321170 820321230
820364610 820364670
820432950 820433010
820528710 820528770
820544790 820544850
820562850 820562970
820626090 820626150
820626450 820626510
820717530 820717590
820717650 820717710
820718310 820718370
820718730 820718790
820731990 820732050
820732350 820732470
820732650 820732950
820733070 820733130
820736370 820736430
820752450 820752510
820756050 820756110
820873170 820873230
820878990 820879050
820884330 820884390
820909830 820909890
820997550 820997610
820997730 820997850
820997970 820998150
820998690 820998750
821021850 821021910
821040750 821040810
821041290 821041350
821041410 821041470
821041530 821041590
821041650 821041710
821042550 821042610
821042730 821042790
821042850 821042910
821043270 821043330
821043390 821043450
821043570 821043630
821044230 821044290
821044770 821044830
821045310 821045370
821046210 821046270
821047050 821047110
821047290 821047410
821047470 821047530
821047590 821048010
821048550 821048610
821048790 821048910
821048970 821049030
821049090 821049630
821049930 821049990
821056290 821056350
821084490 821084550
821287410 821287470
821460570 821460630
821467650 821467710
821480130 821480190
821483310 821483370
821486550 821486610
821527110 821527170
821536830 821536890
821564910 821564970
821582790 821582850
821592210 821592270
821621430 821621490
821635170 821635230
821641470 821641530
821663910 821663970
821681610 821681670
821684610 821684670
821738130 821738190
821742750 821742810
821787210 821787270
821798730 821798790
821801910 821801970
821803650 821803710
821805090 821805150
821824710 821824770
821834370 821834430
821909430 821909490
821969250 821969310
821990670 821990730
821992710 821992770
822012090 822012150
822085170 822085230
822089730 822089790
822104790 822104850
822116910 822116970
822175110 822175230
822176610 822176670
822177450 822177510
822182910 822182970
822184950 822185010
822192510 822192570
822205470 822205530
822208650 822208710
822282870 822282930
822317670 822317730
822318090 822318150
822321150 822321210
822393990 822394050
822413310 822413370
822424590 822424710
822427350 822427410
822427830 822427890
822481770 822481830
822483330 822483390
822493110 822493170
822494610 822494670
822495990 822496050
822496110 822496170
822496410 822496470
822496710 822496770
822496830 822497010
822497070 822497610
822497670 822497790
822511470 822511770
822520170 822520230
822520350 822520530
822521130 822521190
822521910 822522030
822522090 822522450
822522510 822523290
822523350 822523530
822523590 822523650
822523770 822523830
822523950 822524010
822524130 822524430
822524490 822524550
822524730 822524850
822525150 822525270
822525570 822525630
822525690 822525810
822525930 822526230
822526290 822526410
822526470 822526530
822526590 822527310
822530550 822530610
822535290 822535350
822539190 822539250
822540870 822540930
822542010 822542070
822542550 822542610
822544470 822544530
822546330 822546390
822576510 822576570
822605190 822605250
822606450 822606510
822612030 822612090
822636030 822636090
822650970 822651030
822654090 822654150
822665850 822665910
822666030 822666090
822666150 822666210
822666270 822666450
822667710 822668430
822695970 822696030
822725790 822725850
822777690 822777750
822804870 822804930
822806310 822806370
822820410 822820470
822822210 822822270
822823590 822823650
822825270 822825390
822826050 822826110
822826290 822826350
822826470 822826530
822826710 822826890
822826950 822827010
822827130 822827190
822827250 822827370
822827490 822828810
822845370 822845610
822845730 822845970
822846090 822846150
822846210 822846330
822846510 822847110
822847170 822847410
822847590 822847650
822847710 822847950
822848010 822848190
822848310 822848430
822848970 822849030
822849090 822849150
822849210 822849330
822849810 822849870
822849990 822850170
822850710 822850770
822851970 822852030
822852090 822852270
822852450 822852570
822852630 822852870
822852930 822853050
822854130 822854190
822854430 822854490
822854610 822854730
822854910 822854970
822855030 822855090
822855330 822855450
822855630 822855750
822855930 822856230
822857670 822857970
822858090 822858150
822858210 822858270
822858330 822858390
822858510 822859170
822860010 822860070
822861870 822861930
822869070 822869190
822870090 822870210
822873270 822873330
822884610 822884670
822884730 822884790
822884910 822885150
822885210 822885270
822885330 822885450
822885570 822885630
822888690 822888810
822890070 822890250
822890430 822890490
822891930 822892110
822892170 822892230
822892470 822892530
822899670 822899730
822909870 822909930
822910110 822910170
822910530 822910590
822910710 822910770
822914850 822914910
822914970 822915030
822916110 822916170
822916950 822917010
822944130 822944190
822947070 822947130
822964590 822964710
822964830 822964890
822966450 822966510
822967830 822967890
822969210 822969270
822970290 822970410
822970710 822970890
822971010 822971070
822971310 822971370
822985530 822985590
823012290 823012350
823018290 823018350
823029570 823029630
823032390 823032450
823086150 823086330
823101930 823101990
823104390 823104450
823104510 823104570
823223130 823223190
823245510 823245570
823255710 823255770
823280190 823280250
823336830 823336890
823615110 823615170
823788390 823788510
823800390 823800450
823876230 823876290
824208030 824208090
824209590 824209710
824209770 824209890
824210670 824210730
824211330 824211390
824211450 824211510
824214390 824214450
824217390 824217450
824219070 824219130
824219370 824219430
824397870 824397930
824524470 824524590
824618430 824618490
824631390 824631450
824668470 824668530
824671410 824671470
824674470 824674530
824676210 824676270
824682930 824682990
824684850 824684910
824694210 824694270
824710590 824710650
824778030 824778090
824825490 824825550
824833050 824833110
824855310 824855370
824858190 824858250
824996730 824996790
825014670 825014730
825105090 825105150
825109950 825110010
825114570 825114630
825150210 825150270
825174030 825174090
825208350 825208410
825213870 825213930
825246030 825246090
825262530 825262590
825288390 825288450
825319530 825319590
825326070 825326130
825331290 825331350
825482190 825482250
825546390 825546450
825578970 825579030
825615150 825615210
825702810 825702870
825719670 825719730
825748890 825748950
825810630 825810690
825877410 825877470
825877770 825877830
825877890 825877950
825880350 825880410
825883350 825883410
825883530 825883590
825884010 825884070
825884370 825884430
825891750 825891810
825898650 825898710
825909750 825909810
825909930 825909990
825910050 825910170
825962130 825962190
825975450 825975510
826062450 826062510
826078950 826079010
826092450 826092510
826127250 826127310
826152570 826152630
826172310 826172370
826237050 826237110
826264950 826265010
826315650 826315710
826316310 826316370
826326870 826326930
826346970 826347030
826368270 826368330
826468290 826468350
826478550 826478610
826487670 826487730
826489410 826489470
826580370 826580430
826582890 826582950
826585350 826585470
826602630 826602690
826640970 826641030
826642170 826642230
826643550 826643610
826658250 826658310
826666950 826667070
826667250 826667430
826709130 826709190
826718250 826718310
826724370 826724430
826744830 826744890
826829250 826829310
826913970 826914030
826920630 826920690
826923630 826923690
826965990 826966050
826992750 826992810
827041410 827041470
827092950 827093010
827115510 827115570
827121870 827121990
827156370 827156430
827173470 827173530
827189370 827189430
827233710 827233770
827236110 827236170
827236290 827236470
827249910 827250030
827250090 827250150
827267550 827267610
827267730 827267790
827291850 827291910
827352930 827352990
827373570 827373630
827378550 827378610
827459010 827459070
827459550 827459610
827517870 827517930
827588610 827588670
827596590 827596650
827615490 827615550
827615610 827615670
827616450 827616510
827617050 827617110
827617710 827617770
827618250 827618370
827619630 827619690
827621970 827622030
827681370 827681490
827686350 827686410
827698170 827698230
827702670 827702730
827706810 827706870
827769450 827769510
827770050 827770110
827771490 827771550
827781750 827781810
827782290 827782350
827782410 827782470
827782590 827782650
827784090 827784150
827787630 827787690
827790990 827791110
827791170 827791230
827791470 827791530
827794350 827794410
827794710 827794770
827808810 827808930
827847210 827847270
827855610 827855670
827859450 827859510
827865210 827865270
827865330 827865450
827865510 827865570
827874090 827874150
827874270 827874330
827876310 827876370
827915310 827915370
827971410 827971470
828112470 828112530
828117990 828118050
828128070 828128130
828167430 828167490
828178590 828178650
828182070 828182130
828185910 828185970
828186750 828186810
828191730 828191790
828233610 828233670
828281730 828281790
828282030 828282090
828283470 828283530
828291930 828291990
828335250 828335310
828357810 828357990
828358890 828358950
828360930 828360990
828361770 828361830
828365610 828366150
828388230 828388290
828399270 828399330
828425550 828425610
828434430 828434490
828555090 828555150
828557910 828557970
828563910 828563970
828564210 828564330
828564390 828564450
828576390 828576510
828622890 828622950
828839730 828839790
828916050 828916110
828917910 828917970
828973170 828973290
829067490 829067550
829067970 829068030
829074750 829074810
829075590 829075650
829076190 829076250
829082790 829082850
829083030 829083090
829083270 829083330
829085610 829085670
829187790 829187850
829198350 829198410
829200330 829200390
829201950 829202010
829202670 829202730
829204110 829204230
829206690 829206810
829207950 829208010
829320090 829320150
829320990 829321050
829349070 829349130
829355310 829355370
829396050 829396110
829552830 829552950
829701630 829701690
829710390 829710450
829718790 829718910
829862910 829862970
829981890 829981950
830124630 830124690
830379990 830380050
830391330 830391390
830392230 830392290
830392590 830392710
830393010 830393070
830393610 830393670
830416170 830416230
830533050 830533290
830534850 830534910
830546430 830546490
830551470 830551590
830581710 830581770
830583690 830583750
830585370 830585430
830789610 830789670
830985390 830985450
831086430 831086490
831098490 831098550
831141030 831141090
831175950 831176010
831392550 831392610
831479550 831479610
831491430 831491490
831525210 831525270
831847050 831847110
831903930 831903990
832006410 832006470
832012650 832012710
832036650 832036710
832037490 832037610
832049610 832049730
832053570 832053630
832061550 832061610
832064970 832065090
832065990 832066050
832069830 832069890
832082010 832082130
832097130 832097190
832137570 832137630
832137690 832137750
832141830 832141890
832142850 832142910
832151910 832151970
832155510 832155570
832160670 832160790
832161090 832161150
832161390 832161450
832167990 832168050
832170090 832170150
832170630 832170690
832172250 832172310
832172370 832172430
832172550 832172610
832173930 832173990
832178310 832178370
832182510 832182570
832183110 832183170
832183590 832183650
832184850 832184910
832185330 832185390
832185870 832185930
832187430 832187490
832190010 832190070
832190190 832190310
832191450 832191510
832193370 832193430
832198410 832198470
832198590 832198650
832200870 832200930
832201350 832201410
832201470 832201530
832202850 832202910
832203870 832203930
832204410 832204470
832205010 832205070
832205370 832205430
832205550 832205610
832208250 832208310
832208970 832209090
832209810 832209870
832210290 832210350
832210890 832211010
832211850 832211970
832212330 832212570
832212870 832212990
832214550 832214610
832214670 832214730
832215150 832215210
832215330 832215390
832215690 832215750
832215870 832215930
832217010 832217130
832219410 832219470
832219710 832219830
832220070 832220130
832220310 832220370
832223370 832223430
832224330 832224390
832224990 832225050
832226250 832226310
832226910 832226970
832227210 832227270
832228110 832228170
832228950 832229070
832229130 832229190
832229250 832229310
832229490 832229550
832229730 832229790
832229970 832230030
832230150 832230210
832231290 832231350
832231770 832231830
832232370 832232430
832232670 832232730
832233030 832233090
832233450 832233510
832233750 832233810
832233990 832234050
832234650 832234830
832235490 832235550
832235790 832235850
832235910 832235970
832236450 832236510
832236690 832236750
832237230 832237290
832240050 832240110
832241130 832241190
832242810 832242870
832243050 832243110
832245690 832245750
832246050 832246110
832246410 832246470
832247190 832247250
832247730 832247790
832248150 832248210
832248810 832248870
832249230 832249290
832251090 832251150
832251390 832251450
832251510 832251630
832251930 832251990
832252230 832252290
832252470 832252530
832252890 832252950
832253490 832253610
832254570 832254630
832255110 832255170
832255710 832255770
832255830 832255950
832256310 832256430
832257150 832257210
832257450 832257510
832259850 832259910
832260090 832260150
832260930 832261050
832261410 832261470
832262550 832262670
832263030 832263090
832263150 832263210
832263630 832263690
832264650 832264710
832265190 832265250
832268250 832268310
832270470 832270530
832271190 832271250
832274730 832274790
832277310 832277370
832279530 832279590
832280490 832280550
832281990 832282110
832283550 832283670
832286490 832286550
832286730 832286790
832287630 832287690
832288050 832288110
832289310 832289370
832290690 832290750
832302270 832302330
832303170 832303230
832303650 832303710
832303770 832303830
832304010 832304070
832304310 832304370
832305570 832305630
832306890 832306950
832308510 832308630
832308930 832308990
832309050 832309110
832309410 832309470
832309590 832309650
832309710 832309770
832309890 832309950
832310010 832310070
832310310 832310370
832310910 832310970
832311570 832311690
832311930 832311990
832312230 832312290
832312530 832312590
832312830 832312890
832313250 832313430
832313490 832313550
832313790 832313850
832314330 832314390
832315470 832315530
832315710 832315770
832316010 832316070
832316130 832316250
832316310 832316370
832317330 832317390
832317510 832317570
832318230 832318290
832318890 832318950
832319070 832319130
832319550 832319610
832320330 832320390
832320450 832320510
832320570 832320630
832320750 832320810
832321110 832321230
832321470 832321530
832322730 832322790
832324170 832324230
832324830 832324890
832325190 832325310
832326030 832326090
832326510 832326810
832327230 832327290
832327890 832327950
832328070 832328130
832328250 832328310
832329510 832329570
832329810 832329930
832330170 832330230
832330770 832330950
832331430 832331490
832331670 832331730
832372770 832372830
832375230 832375290
832378050 832378110
832380870 832380930
832382190 832382250
832382430 832382490
832382850 832382910
832384230 832384290
832403370 832403430
832403970 832404030
832406730 832406790
832414170 832414230
832423170 832423230
832424670 832424730
832465110 832465170
832466790 832466850
832474050 832474110
832474650 832474710
832478310 832478370
832479210 832479270
832479570 832479630
832481310 832481370
832482570 832482630
832483770 832483830
832484730 832484790
832486290 832486410
832488150 832488210
832489530 832489590
832489650 832489710
832491390 832491450
832494870 832494930
832499130 832499190
832500210 832500270
832500990 832501050
832502790 832502850
832503390 832503450
832503870 832503930
832512750 832512810
832541550 832541610
832542510 832542570
832548450 832548510
832549770 832549830
832550190 832550250
832551210 832551270
832551750 832551870
832554450 832554510
832554810 832554870
832559430 832559490
832560030 832560150
832561410 832561470
832574010 832574070
832579770 832579830
832583190 832583250
832590870 832590930
832592130 832592190
832592970 832593030
832593870 832593930
832596690 832596750
832601850 832601910
832640370 832640430
832713930 832713990
832720890 832720950
832739490 832739550
832765410 832765470
832767810 832767870
832767990 832768110
832769070 832769130
832769310 832769370
832769430 832769490
832769550 832769610
832771410 832771470
832780710 832780770
832791810 832791870
832805190 832805250
832866990 832867050
832871250 832871310
832882770 832882830
832888110 832888170
832974870 832974930
832990410 832990530
832992570 832992630
833013030 833013090
833013210 833013270
833015130 833015250
833023050 833023110
833025030 833025090
833028870 833028930
833081670 833081730
833497170 833497230
833547150 833547210
833617650 833617710
833667630 833667750
833681790 833681850
833688450 833688510
833700450 833700510
833702670 833702730
833703510 833703570
833703750 833703810
833710050 833710110
833718570 833718630
833719470 833719530
833744850 833744910
833749110 833749170
833753130 833753190
833776950 833777010
833781990 833782050
833811810 833811870
833836590 833836650
833837850 833837910
833839470 833839530
833848290 833848350
833855430 833855490
833868570 833868630
833877930 833877990
833883630 833883690
833884710 833884770
833885250 833885310
834015870 834015990
834017790 834017850
834018930 834018990
834019170 834019230
834024990 834025050
834025590 834025650
834027090 834027150
834030510 834030570
834033510 834033570
834034230 834034290
834038130 834038190
834040650 834040710
834041010 834041070
834044850 834044910
834045030 834045090
834046290 834046350
834046410 834046470
834049890 834049950
834058110 834058170
834061110 834061170
834061950 834062070
834065730 834065850
834066510 834066630
834069150 834069210
834073590 834073650
834084630 834084690
834086370 834086430
834095610 834095670
834104730 834104790
834139530 834139590
834142770 834142830
834183030 834183090
834270510 834270570
834281970 834282030
834302490 834302670
834319830 834319890
834322650 834322710
834326370 834326430
834339990 834340050
834341370 834341430
834359970 834360030
834374970 834375030
834418590 834418650
834439650 834439710
834439830 834439890
834458130 834458190
834458730 834458850
834459210 834459270
834459810 834459870
834463230 834463290
834464430 834464490
834470430 834470490
834475530 834475590
834529890 834529950
834609990 834610110
834635010 834635070
834691050 834691110
834744390 834744450
834779910 834779970
834781830 834781890
834792690 834792750
834810750 834810810
834811470 834811530
834827610 834827670
834833010 834833070
834839850 834839910
834846510 834846570
834874290 834874410
834884490 834884670
834963510 834963570
835042230 835042290
835049370 835049430
835099590 835099650
835100790 835100850
835126890 835126950
835247070 835247130
835392090 835392150
835393110 835393170
835410030 835410090
835479990 835480050
835498650 835498710
835545150 835545210
835643670 835643730
835738590 835738650
835770690 835770750
835954290 835954350
836038530 836038590
836038770 836038830
836038950 836039010
836039130 836039190
836039310 836039370
836080650 836080710
836096430 836096490
836188590 836188650
836199390 836199570
836246670 836246730
836247690 836247750
836251710 836251770
836272590 836272650
836272830 836272890
836375190 836375250
836426790 836426850
836484990 836485050
836534130 836534250
836601930 836601990
836651490 836651550
836664870 836664990
836706750 836706870
836709870 836709930
836769030 836769090
836776290 836776350
836778750 836778810
836780670 836780730
836853210 836853270
836932050 836932110
836943450 836943510
836948850 836948910
837037170 837037230
837038010 837038070
837110190 837110250
837160770 837160830
837164670 837164730
837206430 837206490
837209790 837209850
837223590 837223650
837227310 837227370
837245670 837245790
837333030 837333090
837344550 837344610
837378450 837378510
837456810 837456870
837474630 837474690
837810630 837810690
837815430 837815490
837832530 837832590
837834090 837834150
837834450 837834510
837834570 837834630
837834690 837834810
837836130 837836190
837867630 837867690
837924270 837924330
837986910 837986970
838014990 838015110
838064490 838064550
838108350 838108410
838153950 838154010
838174470 838174530
838238490 838238550
838291110 838291230
838325670 838325730
838410390 838410450
838419150 838419210
838469730 838469790
838536330 838536390
838609770 838609830
838629570 838629630
838678710 838678830
838683750 838683810
838688310 838688370
838713210 838713270
838736430 838736550
838756470 838756530
838907430 838907490
838910730 838910850
839017890 839018010
839020470 839020530
839102850 839103090
839127690 839127750
839201730 839201790
839267070 839267130
839295750 839295810
839296050 839296110
839296470 839296530
839296710 839296890
839297670 839297730
839299950 839300130
839301750 839301810
839301930 839302050
839302170 839302230
839303310 839303370
839303430 839303490
839304030 839304090
839305590 839305650
839375250 839375310
839441790 839441850
839480850 839480910
839618610 839618670
839712930 839712990
839796450 839796510
839801250 839801310
839808150 839808210
839848770 839848830
839853330 839853510
839869590 839869650
839953650 839953830
839963130 839963190
839977590 839977650
840039630 840039690
840078630 840078690
840144690 840144750
840188550 840188670
840196410 840196470
840200670 840200730
840231570 840231630
840238290 840238350
840243930 840243990
840287130 840287190
840317190 840317250
840500850 840500910
840576570 840576630
840671250 840671310
840734610 840734670
840736710 840736770
840737430 840737490
840737610 840737670
840739170 840739230
840739890 840739950
840819330 840819390
840834750 840834810
840835710 840835770
840836010 840836130
840837150 840837210
840857910 840857970
840882750 840882810
840887550 840887730
840926190 840926250
840930450 840930510
840932610 840932670
840995730 840995790
841005570 841005630
841022610 841022670
841085910 841085970
841109070 841109130
841143870 841143930
841178550 841178610
841305630 841305690
841471770 841471830
841585650 841585710
841691430 841691490
841767450 841767510
841769370 841769430
841792410 841792470
841811430 841811490
841857990 841858050
842036970 842037030
842048250 842048310
842205390 842205450
842219550 842219610
842236170 842236230
842295330 842295390
842309430 842309490
842385150 842385210
842409150 842409270
842458170 842458230
842561730 842561790
842652930 842652990
842814150 842814210
842816550 842816610
842821890 842821950
842839110 842839230
842915430 842915490
842916990 842917110
842988930 842988990
842997930 842997990
843025530 843025590
843040950 843041010
843108810 843108870
843174930 843174990
843367170 843367290
843427950 843428010
843429090 843429150
843443190 843443250
843571050 843571110
843604890 843604950
843642810 843642870
843656370 843656430
843709050 843709110
843710850 843710910
843721470 843721530
843722190 843722250
843742050 843742110
843801450 843801510
843802710 843802770
843836130 843836190
843906270 843906330
843921390 843921450
844007010 844007070
844015170 844015230
844017690 844017750
844024590 844024650
844457430 844457490
844485630 844485690
844497510 844497570
844508430 844508490
845398890 845398950
845476770 845476830
845478630 845478690
845504010 845504070
845590590 845590650
845636130 845636190
845700210 845700270
846013170 846013230
846016590 846016650
846020850 846020910
846095490 846095550
846106830 846106890
846188730 846188790
846188910 846188970
846191730 846191790
846457770 846457830
846471810 846471930
846544950 846545010
846689670 846689730
846689790 846689850
846691590 846691650
846692370 846692430
846698790 846698850
846705990 846706110
846826530 846826590
846833730 846833790
846845070 846845130
846917970 846918030
846918090 846918150
846918570 846918630
846920730 846920790
846923310 846923370
846923970 846924030
846924090 846924150
846924450 846924510
846930570 846930630
846936450 846936510
846941850 846941910
846950010 846950070
846950130 846950190
846951090 846951150
846951270 846951330
847120050 847120110
847131150 847131210
847132410 847133310
847230570 847230630
847314390 847314510
847371930 847371990
847381410 847381470
847421730 847421850
847469250 847469310
847637430 847637490
847639290 847639350
847654650 847654830
847659870 847659990
847660290 847660350
847660830 847660890
847731390 847731450
847734750 847734810
847744290 847744350
847797030 847797090
847820550 847820790
847837350 847837410
847844730 847844850
847900050 847900110
847922190 847922250
848219790 848219850
848219910 848219970
848229870 848229930
848244330 848244450
848244630 848244690
848244870 848245230
848245350 848246010
848248170 848248230
848290230 848290290
848308590 848308650
848309250 848309310
848315070 848315130
848317830 848317890
848318970 848319030
848348010 848348070
848418210 848418270
848458110 848458170
848581230 848581290
848623950 848624010
848637870 848637930
848638290 848638530
848638710 848638770
848648610 848648670
848684610 848684670
848691390 848691450
848699250 848699430
848699490 848699610
848699790 848699850
848700030 848700390
848744490 848744550
848750490 848750550
848755530 848755590
848785830 848785890
848842290 848842350
848865330 848865390
848918490 848918550
849036810 849036990
849037050 849037170
849039990 849040350
849040530 849041010
849041490 849041790
849089070 849089130
849122130 849122190
849214770 849214830
849251610 849251670
849396810 849396870
849564210 849564270
849741030 849741150
849750930 849750990
849786090 849786150
849870090 849870150
849901290 849901350
849961050 849961110
849961710 849961830
850056630 850056690
850101510 850101570
850111710 850111770
850111830 850111890
850112070 850112190
850112790 850112850
850112910 850112970
850113030 850113150
850137750 850137810
850161510 850161570
850172970 850173030
850182150 850182210
850197570 850197810
850271850 850271910
850275930 850275990
850282710 850282770
850317030 850317090
850317270 850317450
850330590 850330650
850405230 850405290
850511070 850511610
850512090 850512150
850512330 850513050
850514070 850514250
850602870 850602930
850674270 850674330
850677390 850677450
850692210 850692270
850715790 850715850
850749570 850749630
850777110 850777170
851262750 851262810
851276550 851276610
851286630 851286690
851577450 851577510
851646510 851646570
851670330 851670390
851697990 851698050
851729430 851729490
851787930 851787990
851892690 851892750
851934630 851934690
851970210 851970270
852063870 852063930
852064410 852064470
852212070 852212190
852212250 852212310
852358170 852358230
852427230 852427290
852427410 852427470
852435930 852435990
852489510 852489570
852493230 852493290
852497190 852497250
852573030 852573090
852574950 852575010
852679290 852679350
852715650 852715710
852745590 852745650
852920910 852920970
852931470 852931530
852953010 852953070
853196670 853196730
853315950 853316010
853414890 853414950
853478970 853479030
854041710 854041770
854249310 854249370
854306070 854306130
854408730 854408790
854427570 854427630
854476830 854476890
854705250 854705310
854706510 854706570
854751210 854751270
854926230 854926290
854987970 854988030
855030870 855030930
855101610 855101670
855199350 855199410
855220470 855220530
855258330 855258390
855312390 855312450
855461310 855461370
855526410 855526470
855706410 855706470
855724710 855724770
855862410 855862470
855901470 855901530
855953550 855953610
855953790 855953850
855987090 855987150
856006410 856006470
856072110 856072170
856122690 856122810
856127730 856127850
856135410 856135470
856135710 856135770
856142790 856142970
856150110 856150230
856167330 856167390
856203570 856203630
856203690 856203750
856203990 856204290
856210290 856210350
856217970 856218090
856223790 856223850
856232970 856233090
856276830 856276890
856294290 856294350
856320390 856320450
856323450 856323690
856330830 856330890
856331010 856331130
856436310 856436370
856466250 856466310
856481490 856481550
856500810 856500930
856527630 856527690
856536390 856536450
856583490 856583610
856590870 856591050
856613370 856613490
856620990 856621050
856695630 856695690
856702950 856703010
856710810 856710870
856718370 856718670
856725930 856726110
856728390 856728450
856728510 856728570
856728630 856728750
856748430 856748790
856826490 856826550
856845750 856845810
856912770 856912830
857006970 857007030
857334870 857334930
857406210 857406270
857502270 857502330
857505330 857505390
857509710 857509770
857514030 857514390
857516490 857516550
857521770 857521950
857529150 857529210
857536710 857536830
857544210 857544390
857551710 857551770
857559090 857559150
857574690 857574750
857616270 857616390
857632710 857632770
857670450 857670510
857672850 857673150
857680290 857680770
857681970 857682030
857695410 857695470
857725470 857725590
857732430 857732490
857732910 857732970
857733330 857733690
857733810 857733870
857733930 857733990
857734170 857734230
857734590 857734770
857735190 857735250
857738910 857739030
857741070 857741310
857742150 857742270
857742810 857742870
857763630 857763690
857790210 857790270
857802990 857803110
857932470 857932530
858107550 858107610
858132510 858132570
858163410 858163470
858164970 858165030
858216930 858216990
858291750 858291810
858367590 858367650
858372690 858372750
858373290 858373350
858377490 858377670
858380070 858380130
858380430 858380490
858380550 858380610
858380730 858380790
858381750 858381810
858390270 858390330
858422310 858422370
858426270 858426330
858427350 858427470
858430950 858431010
858436590 858436650
858437610 858437670
858437790 858437910
858437970 858438030
858465150 858465210
858467790 858467850
858555990 858556050
858594390 858594450
858607710 858607770
858617670 858617730
858622350 858622410
858742710 858742770
858745410 858745530
858765450 858765510
858765570 858765630
858765690 858765750
858766650 858766830
858767070 858767130
858767250 858767310
858767610 858767670
858767730 858767790
858783390 858783450
858783570 858783630
858783930 858784050
858784350 858784530
858784650 858785010
858792750 858792810
858797910 858797970
858803970 858804090
858805110 858805170
858810930 858810990
858811110 858811170
858811350 858811470
858961230 858961290
858963270 858963330
858970410 858970470
858973710 858973830
859082310 859082370
859084050 859084110
859084590 859084650
859094910 859094970
859095510 859095570
859095810 859095870
859155390 859155450
859231890 859231950
859281330 859281390
859312530 859312590
859348470 859348530
859477470 859477530
859495950 859496010
859704450 859704510
859751550 859751610
859781250 859781310
859831530 859831590
859851630 859851750
859934430 859934490
860067150 860067210
860115570 860115750
860147910 860147970
860151090 860151150
860151210 860151270
860161890 860161950
860162310 860162370
860162550 860162610
860166810 860166870
860168610 860168670
860208630 860208750
860341410 860341470
860342910 860342970
860357850 860357910
860366130 860366190
860367270 860367330
860563470 860563530
860585130 860585190
860624010 860624070
860710770 860710830
860789250 860789310
860796750 860796810
861055350 861055410
861219870 861219930
861390930 861390990
861424410 861424470
861495150 861495210
861501210 861501270
861544050 861544110
861566130 861566190
861616350 861616410
861629550 861629610
861739710 861739770
861750630 861750690
861824130 861824190
861924450 861924510
861992490 861992550
862009830 862009890
862139790 862139850
862163190 862163250
862189830 862189950
862191630 862191690
862203510 862203570
862209330 862209450
862262490 862262550
862278810 862278870
862351830 862351890
862431630 862431750
862467750 862467870
862526250 862526310
862567950 862568010
862583610 862583670
862621350 862621410
862705890 862705950
862716150 862716210
862773030 862773090
862896930 862896990
862954110 862954170
862968750 862968810
863117730 863117790
863202450 863202510
863216910 863216970
863226990 863227050
863295630 863295690
863301750 863301810
863425050 863425110
863511930 863511990
863576370 863576430
863635470 863635530
863734050 863734110
863770770 863770830
863830530 863830590
863929290 863929350
863984310 863984370
864014610 864014670
864081150 864081270
864149790 864149850
864328110 864328170
864339150 864339210
864419250 864419310
864425430 864425490
864464070 864464130
864606870 864606930
864670530 864670650
864673410 864673470
864678510 864678570
864761190 864761250
864858990 864859050
864969330 864969390
865055910 865055970
865183290 865183350
865196670 865196730
865199130 865199190
865199250 865199370
865220610 865220670
865361430 865361490
865361670 865361730
865490910 865490970
865542390 865542450
865547310 865547430
865684170 865684230
865743270 865743330
865795230 865795290
865808610 865808670
865828590 865828650
865828710 865828770
865853670 865853730
865864170 865864230
866078070 866078130
866078310 866078370
866160630 866160690
866183490 866183550
866427270 866427330
866430630 866430690
866432610 866432670
866441370 866441430
866593590 866593650
866601270 866601330
866603910 866603970
866604990 866605050
866672670 866672730
866736330 866736390
866762130 866762190
866762250 866762310
866766930 866766990
866769630 866769690
866770770 866770830
866770890 866770950
866881770 866881830
867438810 867438870
867501090 867501150
867628350 867628410
867851670 867851790
868212930 868212990
868216350 868216410
868232550 868232610
868249110 868249170
868300710 868300770
868385970 868386270
868388670 868388790
868391070 868391130
868399290 868399350
868420110 868420230
868484370 868484490
868540410 868540470
868584210 868584270
868618650 868618710
868651770 868651830
868794150 868794210
868909110 868909170
868917870 868917930
868987950 868988010
869020170 869020230
869154330 869154390
869164290 869164350
869177730 869177790
869255610 869255670
869266890 869266950
869342310 869342370
869367570 869367630
869442570 869442630
869464530 869464590
869477970 869478030
869600550 869600610
869604810 869604870
869616210 869616270
869683530 869683590
869823270 869823390
869868570 869868630
869900490 869900610
870289950 870290010
870341310 870341370
870453030 870453090
870568770 870568830
870578070 870578130
870645570 870645630
870788310 870788370
870805830 870805950
870813930 870813990
870991050 870991110
870991890 870991950
870994410 870994530
871043670 871043730
871204710 871204830
871233870 871233930
871234890 871234950
871236570 871236630
871243350 871243410
871277250 871277310
871300050 871300110
871319550 871319610
871320630 871320690
871352610 871352670
871356150 871356210
871619250 871619310
871671990 871672050
871814310 871814370
871860390 871860510
871933650 871933710
872129130 872129190
872129910 872129970
872215470 872215530
872223210 872223270
872229030 872229090
872308830 872308890
872315310 872315370
872331510 872331570
872442750 872442810
872515590 872515650
872567790 872567910
872639970 872640030
872704590 872704650
872712870 872712930
872997150 872997210
873060150 873060210
873071910 873071970
873222810 873222870
873350550 873350610
873435990 873436050
873582930 873582990
873657090 873657150
873665910 873665970
873670050 873670110
873698610 873698670
873733410 873733470
873745530 873745590
873757770 873757830
873764370 873764490
873792270 873792390
873964050 873964110
874075530 874075650
874145970 874146030
874183170 874183230
874281510 874281630
874295070 874295130
874332450 874332510
874347630 874347690
874439910 874439970
874468530 874468590
874478730 874478790
874501410 874501470
874530150 874530210
874613670 874613730
874615770 874615830
874650090 874650150
874665270 874665330
874959030 874959090
874977270 874977330
875059290 875059410
875167170 875167230
