1181863523 1181863526
1182056292 1182056293
1182056354 1182056356
1182056365 1182056367
1182056373 1182056374
1182056382 1182056383
1182056386 1182056387
1182056389 1182056392
1182056415 1182056417
1182056420 1182056421
1182056486 1182056488
1182056557 1182056558
1182056587 1182056588
1182056604 1182056608
1182056614 1182056615
1182056617 1182056620
1182056682 1182056684
1182056700 1182056702
1182056714 1182056715
1182056720 1182056722
1182056736 1182056738
1182056743 1182056745
1182056786 1182056788
1182056827 1182056829
1182056833 1182056836
1182056851 1182056853
1182056855 1182056856
1182056871 1182056873
1182056894 1182056896
1182056919 1182056921
1182056933 1182056935
1182056981 1182056982
1182057020 1182057022
1182057034 1182057035
1182057051 1182057053
1182057073 1182057074
1182057100 1182057102
1182057103 1182057105
1182057107 1182057108
1182057115 1182057116
1182057136 1182057137
1182057145 1182057146
1182057197 1182057198
1182057214 1182057216
1182057223 1182057227
1182057287 1182057288
1182057343 1182057345
1182057352 1182057355
1182057368 1182057369
1182057383 1182057384
1182057501 1182057502
1182057504 1182057506
1182057560 1182057561
1182057681 1182057682
1182057739 1182057741
1182057835 1182057836
1182058006 1182058008
1182058041 1182058042
1182058056 1182058057
1182058074 1182058076
1182058078 1182058080
1182058964 1182058965
1182059039 1182059041
1182059299 1182059302
1182059362 1182059363
1182059466 1182059467
1182059482 1182059484
1182059489 1182059491
1182134175 1182134176
1182134180 1182134181
1182134208 1182134210
1182134216 1182134217
1182134279 1182134282
1182134318 1182134320
1182134376 1182134377
1182134445 1182134447
1182134493 1182134495
1182134541 1182134542
1182135211 1182135214
1182135289 1182135291
1182135435 1182135437
1182135474 1182135475
1182135529 1182135530
1182135791 1182135793
1182137304 1182137305
1182137717 1182137719
1182137982 1182137984
1182138007 1182138008
1182138058 1182138059
1182138083 1182138087
1182138090 1182138094
1182138102 1182138104
1182138113 1182138115
1182138361 1182138362
1182138542 1182138544
1182138616 1182138617
1182138699 1182138700
1182138746 1182138748
1182138759 1182138762
1182138854 1182138857
1182139113 1182139115
1182139170 1182139172
1182139278 1182139279
1182139411 1182139412
1182139476 1182139478
1182139573 1182139574
1182139582 1182139583
1182139791 1182139792
1182140296 1182140297
1182140350 1182140352
1182140408 1182140409
1182140437 1182140438
1182140473 1182140475
1182140480 1182140481
1182140596 1182140597
1182140613 1182140614
1182140646 1182140648
1182140653 1182140654
1182140667 1182140669
1182140709 1182140710
1182140766 1182140768
1182140784 1182140785
1182140793 1182140794
1182140812 1182140815
1182140826 1182140827
1182140857 1182140858
1182140863 1182140864
1182140910 1182140912
1182140917 1182140919
1182140923 1182140925
1182141020 1182141021
1182141059 1182141060
1182141061 1182141064
1182141065 1182141067
1182141071 1182141074
1182141095 1182141096
1182141114 1182141116
1182141121 1182141123
1182141129 1182141130
1182141220 1182141223
1182141241 1182141242
1182141250 1182141252
1182141257 1182141258
1182141317 1182141318
1182141319 1182141321
1182141324 1182141325
1182141326 1182141329
1182141330 1182141331
1182141335 1182141338
1182141353 1182141354
1182141456 1182141457
1182141470 1182141471
1182141507 1182141510
1182141511 1182141514
1182141526 1182141529
1182141533 1182141536
1182141548 1182141551
1182141556 1182141557
1182141565 1182141568
1182141578 1182141580
1182141582 1182141584
1182141588 1182141591
1182141676 1182141678
1182141749 1182141752
1182141883 1182141885
1182141963 1182141964
1182141975 1182141977
1182142056 1182142057
1182142062 1182142064
1182142069 1182142071
1182142173 1182142174
1182142274 1182142275
1182142281 1182142283
1182142293 1182142295
1182142304 1182142306
1182142353 1182142354
1182142445 1182142446
1182142449 1182142450
1182142451 1182142454
1182142568 1182142569
1182142756 1182142757
1182142809 1182142810
1182142903 1182142904
1182142979 1182142981
1182143015 1182143018
1182143026 1182143028
1182143037 1182143038
1182143063 1182143064
1182143309 1182143311
1182143378 1182143379
1182143389 1182143391
1182143524 1182143526
1182143577 1182143578
1182143645 1182143646
1182143840 1182143842
1182143935 1182143937
1182143989 1182143991
1182143995 1182143997
1182144002 1182144003
1182144011 1182144015
1182144038 1182144039
1182144117 1182144118
1182144165 1182144166
1182144226 1182144227
1182144248 1182144249
1182144373 1182144375
1182144638 1182144639
1182144889 1182144890
1182144961 1182144963
1182145179 1182145180
1182145515 1182145518
1182145524 1182145526
1182145528 1182145529
1182145686 1182145688
1182145836 1182145838
1182145916 1182145919
1182146691 1182146694
1182146806 1182146807
1182146815 1182146816
1182146881 1182146883
1182147021 1182147023
1182147194 1182147196
1182147198 1182147200
1182147210 1182147212
1182147238 1182147240
1182147477 1182147478
1182147512 1182147513
1182147557 1182147561
1182147568 1182147569
1182147579 1182147580
1182147671 1182147672
1182147741 1182147742
1182147778 1182147780
1182147825 1182147826
1182147985 1182147987
1182148013 1182148015
1182148022 1182148026
1182148278 1182148279
1182148361 1182148362
1182148387 1182148388
1182148456 1182148457
1182148475 1182148476
1182148558 1182148561
1182148572 1182148575
1182148577 1182148578
1182148583 1182148586
1182148664 1182148665
1182148691 1182148692
1182148986 1182148988
1182149401 1182149402
1182149551 1182149552
1182149819 1182149820
1182150203 1182150206
1182150314 1182150317
1182150347 1182150348
1182151268 1182151270
1182152379 1182152380
1182170346 1182170356
1182450038 1182450040
1182450150 1182450151
1182450159 1182450160
1182450173 1182450175
1182450176 1182450178
1182450183 1182450185
1182450187 1182450188
1182450194 1182450201
1182450205 1182450211
1182450218 1182450223
1182450228 1182450231
1182450253 1182450254
1182450275 1182450278
1182450285 1182450289
1182450294 1182450297
1182450304 1182450311
1182450313 1182450321
1182450323 1182450331
1182450333 1182450341
1182450343 1182450351
1182450353 1182450361
1182450362 1182450371
1182450372 1182450380
1182450383 1182450390
1182450392 1182450398
1182450401 1182450408
1182450411 1182450418
1182450421 1182450427
1182450429 1182450437
1182450438 1182450445
1182450448 1182450455
1182450456 1182450464
1182450466 1182450473
1182450475 1182450482
1182450484 1182450491
1182450493 1182450500
1182450502 1182450509
1182450511 1182450519
1182450520 1182450527
1182450528 1182450537
1182450538 1182450544
1182450549 1182450553
1182450557 1182450561
1182450568 1182450571
1182450575 1182450578
1182450586 1182450587
1182450595 1182450596
1182450599 1182450600
1182450601 1182450602
1182450618 1182450621
1182450626 1182450629
1182450635 1182450639
1182450644 1182450647
1182450662 1182450664
1182450723 1182450724
1182450748 1182450751
1182450757 1182450759
1182450767 1182450768
1182450835 1182450836
1182450898 1182450899
1182450907 1182450909
1182450999 1182451002
1182451006 1182451009
1182451016 1182451019
1182451023 1182451026
1182451031 1182451036
1182451040 1182451044
1182451047 1182451052
1182451066 1182451067
1182451071 1182451075
1182451078 1182451083
1182451086 1182451091
1182451095 1182451099
1182451104 1182451108
1182451110 1182451113
1182451126 1182451128
1182451133 1182451138
1182451141 1182451146
1182451149 1182451154
1182451157 1182451162
1182451165 1182451170
1182451173 1182451178
1182451180 1182451187
1182451189 1182451195
1182451197 1182451202
1182451206 1182451210
1182451213 1182451218
1182451222 1182451226
1182451230 1182451233
1182451238 1182451242
1182451246 1182451249
1182451255 1182451257
1182451341 1182451343
1182451349 1182451352
1182451435 1182451437
1182451443 1182451445
1182451452 1182451453
1182451467 1182451469
1182451552 1182451553
1182451589 1182451592
1182451597 1182451602
1182451605 1182451609
1182451636 1182451639
1182451643 1182451649
1182451652 1182451656
1182451660 1182451665
1182451668 1182451672
1182451677 1182451680
1182451893 1182451894
1182451901 1182451903
1182452004 1182452005
1182452013 1182452014
1182547605 1182547606
1182547657 1182547658
1182550706 1182550708
1182550710 1182550713
1182550714 1182550716
1182550718 1182550720
1182550726 1182550729
1182550742 1182550744
1182551170 1182551171
1182551326 1182551327
1182560160 1182560161
1182560165 1182560169
1182560175 1182560178
1182560213 1182560214
1182560215 1182560218
1182560275 1182560276
1182560293 1182560295
1182560304 1182560305
1182560309 1182560311
1182560313 1182560318
1182560323 1182560324
1182560327 1182560328
1182560338 1182560343
1182560349 1182560352
1182560354 1182560355
1182560383 1182560387
1182560392 1182560394
1182560397 1182560399
1182560401 1182560404
1182560406 1182560409
1182560423 1182560428
1182560434 1182560435
1182560438 1182560439
1182560489 1182560499
1182560504 1182560507
1182560509 1182560512
1182560517 1182560528
1182560543 1182560545
1182560548 1182560551
1182560553 1182560557
1182560559 1182560566
1182560568 1182560570
1182560571 1182560577
1182560579 1182560588
1182560600 1182560603
1182560608 1182560613
1182560616 1182560625
1182560629 1182560631
1182560632 1182560634
1182560635 1182560641
1182560643 1182560645
1182660520 1182660521
1182660660 1182660661
1182660995 1182660996
1182661007 1182661008
1182661652 1182661653
1182661730 1182661731
1182662145 1182662146
1182662204 1182662205
1182662215 1182662216
1182662276 1182662277
1182662282 1182662284
1182662305 1182662308
1182662341 1182662343
1182662347 1182662350
1182662449 1182662450
1182662499 1182662501
1182662518 1182662519
1182662612 1182662613
1182662679 1182662681
1182662719 1182662720
1182662828 1182662830
1182662881 1182662882
1182662893 1182662895
1182662897 1182662901
1182663115 1182663116
1182663118 1182663121
1182663283 1182663284
1182663564 1182663566
1182663641 1182663643
1182663877 1182663878
1182663931 1182663932
1182711901 1182711902
1182711907 1182711910
1182711921 1182711925
1182711934 1182711938
1182711946 1182711952
1182711958 1182711964
1182711972 1182711977
1182711983 1182711990
1182711992 1182711993
1182711994 1182712001
1182712007 1182712014
1182712019 1182712025
1182712031 1182712036
1182712044 1182712047
1182712055 1182712056
1182712077 1182712080
1182712094 1182712095
1182712101 1182712103
1182712112 1182712115
1182712118 1182712124
1182712129 1182712136
1182712139 1182712145
1182712150 1182712157
1182712159 1182712165
1182712170 1182712177
1182712179 1182712185
1182712189 1182712196
1182712198 1182712205
1182712209 1182712216
1182712217 1182712225
1182712228 1182712235
1182712236 1182712244
1182712247 1182712255
1182712256 1182712264
1182712267 1182712275
1182712276 1182712283
1182712287 1182712294
1182712296 1182712302
1182712305 1182712309
1182712332 1182712334
1182712337 1182712344
1182712345 1182712353
1182712354 1182712362
1182712363 1182712371
1182712373 1182712381
1182712382 1182712390
1182712391 1182712409
1182712410 1182712426
1182712428 1182712444
1182712446 1182712453
1182712454 1182712462
1182712463 1182712480
1182712481 1182712489
1182712490 1182712498
1182712499 1182712507
1182712508 1182712516
1182712517 1182712534
1182712536 1182712543
1182712544 1182712551
1182712554 1182712559
1182712561 1182712567
1182712570 1182712576
1182712578 1182712584
1182712587 1182712593
1182712595 1182712601
1182712604 1182712611
1182712613 1182712619
1182712622 1182712625
1182712626 1182712628
1182712633 1182712636
1182712669 1182712674
1182712677 1182712684
1182712686 1182712702
1182712703 1182712719
1182712720 1182712728
1182712729 1182712737
1182712738 1182712754
1182712756 1182712763
1182712764 1182712771
1182712773 1182712780
1182712781 1182712788
1182712791 1182712797
1182712799 1182712804
1182712811 1182712815
1182712819 1182712823
1182712841 1182712843
1182712858 1182712863
1182712868 1182712873
1182712876 1182712881
1182712885 1182712891
1182712893 1182712899
1182712902 1182712909
1182712910 1182712916
1182712919 1182712925
1182712927 1182712933
1182712937 1182712942
1182712944 1182712950
1182712954 1182712957
1182712961 1182712963
1182712964 1182712967
1182712971 1182712973
1182712987 1182712989
1182712994 1182712995
1182712996 1182712997
1182713003 1182713007
1182713010 1182713014
1182713027 1182713030
1182713037 1182713040
1182713044 1182713048
1182713053 1182713054
1182713099 1182713100
1182713109 1182713110
1182713126 1182713128
1182713132 1182713136
1182713143 1182713146
1182713150 1182713153
1182713161 1182713162
1182713221 1182713224
1182713227 1182713230
1182713238 1182713241
1182713245 1182713250
1182713255 1182713259
1182713263 1182713265
1182713374 1182713376
1182713381 1182713382
1182713408 1182713409
1182713430 1182713433
1182713447 1182713449
1182713455 1182713458
1182713464 1182713466
1182713471 1182713473
1182713514 1182713516
1182713520 1182713521
1182713530 1182713532
1182713538 1182713540
1182713555 1182713557
1182713565 1182713567
1182713582 1182713583
1182713597 1182713599
1182727222 1182727223
1182732636 1182732637
1182733141 1182733143
1182733642 1182733644
1182733784 1182733787
1182734382 1182734384
1182734391 1182734392
1182734740 1182734742
1182735388 1182735390
1182735391 1182735392
1182735972 1182735973
1182736135 1182736136
1182737973 1182737975
1182739358 1182739359
1182739527 1182739528
1182739731 1182739732
1182740614 1182740615
1182742053 1182742055
1182743521 1182743522
1182743849 1182743850
1182744817 1182744818
1182745318 1182745320
1182745326 1182745328
1182745449 1182745451
1182745459 1182745461
1182745482 1182745483
1182745951 1182745952
1182746071 1182746073
1182746078 1182746079
1182746266 1182746268
1182746326 1182746328
1182746584 1182746585
1182747332 1182747333
1182747611 1182747612
1182747616 1182747618
1182747626 1182747627
1182747691 1182747693
1182747698 1182747699
1182747729 1182747731
1182747785 1182747789
1182747870 1182747874
1182747882 1182747883
1182747890 1182747892
1182747906 1182747907
1182747922 1182747923
1182747944 1182747947
1182747954 1182747955
1182748019 1182748020
1182748021 1182748022
1182748170 1182748173
1182748284 1182748286
1182748293 1182748296
1182748412 1182748413
1182748486 1182748488
1182748498 1182748499
1182748527 1182748528
1182748533 1182748534
1182748720 1182748724
1182748730 1182748731
1182748770 1182748771
1182748802 1182748803
1182748809 1182748811
1182748820 1182748823
1182748830 1182748832
1182748921 1182748922
1182748932 1182748933
1182748975 1182748977
1182749012 1182749013
1182749202 1182749203
1182749270 1182749271
1182749493 1182749494
1182749505 1182749506
1182749614 1182749616
1182749707 1182749708
1182749738 1182749739
1182749746 1182749747
1182750118 1182750119
1182750876 1182750877
1182750958 1182750959
1182822845 1182822849
1182822854 1182822858
1182823560 1182823562
1182823570 1182823571
1182823695 1182823696
1182823702 1182823706
1182823709 1182823713
1182823725 1182823726
1182823731 1182823736
1182823741 1182823748
1182823750 1182823755
1182897694 1182897696
1182898075 1182898077
1182898078 1182898083
1182898086 1182898091
1182898093 1182898098
1182898101 1182898105
1182898136 1182898138
1182898187 1182898188
1182898197 1182898198
1182898304 1182898305
1182898310 1182898311
1182898353 1182898355
1182898359 1182898361
1182898468 1182898470
1182898488 1182898490
1182898510 1182898511
1182898700 1182898702
1182898844 1182898847
1182898876 1182898878
1182898881 1182898883
1182898887 1182898891
1182898913 1182898919
1182898921 1182898925
1182898930 1182898932
1182898934 1182898937
1182898940 1182898941
1182898947 1182898951
1182898954 1182898958
1182898961 1182898965
1182898967 1182898969
1182898972 1182898977
1182898979 1182898985
1182898987 1182898992
1182898994 1182898995
1182898999 1182899003
1182899005 1182899012
1182899018 1182899019
1182899045 1182899047
1182899051 1182899053
1182899057 1182899061
1182899064 1182899069
1182899075 1182899076
1182899080 1182899083
1182899093 1182899096
1182899098 1182899105
1182899106 1182899112
1182899114 1182899119
1182899121 1182899124
1182899130 1182899133
1182899134 1182899136
1182999820 1182999821
1183027500 1183027503
1183027507 1183027511
1183027519 1183027524
1183027528 1183027533
1183027541 1183027545
1183027549 1183027554
1183027560 1183027566
1183027569 1183027574
1183027581 1183027586
1183027590 1183027595
1183027602 1183027606
1183027610 1183027615
1183027620 1183027626
1183027630 1183027634
1183027641 1183027644
1183027661 1183027662
1183027751 1183027753
1183027759 1183027761
1183027769 1183027772
1183027777 1183027780
1183027787 1183027791
1183027795 1183027799
1183027805 1183027809
1183027813 1183027818
1183027824 1183027827
1183027832 1183027836
1183027842 1183027845
1183027851 1183027853
1183027861 1183027862
1183027957 1183027958
1183027964 1183027965
1183027974 1183027977
1183027982 1183027984
1183027991 1183027994
1183028009 1183028010
1183028122 1183028124
1183028140 1183028142
1183028157 1183028159
1183028382 1183028383
1183028667 1183028668
1183028691 1183028693
1183037279 1183037280
1183071211 1183071212
1183074240 1183074241
1183074242 1183074243
1183074250 1183074251
1183098234 1183098235
1183117292 1183117293
1183152358 1183152362
1183152524 1183152527
1183152532 1183152535
1183152537 1183152538
1183153392 1183153393
1183153407 1183153412
1183153416 1183153417
1183153418 1183153420
1183153449 1183153455
1183153462 1183153464
1183153507 1183153509
1183154583 1183154587
1183155368 1183155369
1183158391 1183158394
1183158399 1183158405
1183158409 1183158413
1183158414 1183158415
1183158792 1183158796
1183158803 1183158807
1183158816 1183158817
1183160201 1183160202
1183222930 1183222931
1183223025 1183223026
1183223472 1183223475
1183223480 1183223482
1183223628 1183223630
1183246624 1183246627
1185788129 1185788130
1185788138 1185788139
1185788147 1185788150
1185788166 1185788167
1185788168 1185788169
1185788174 1185788175
1185788176 1185788178
1185788186 1185788187
1185788204 1185788206
1185788222 1185788223
1185788256 1185788258
1185788259 1185788260
1185788265 1185788268
1185788274 1185788276
1185788283 1185788286
1185788291 1185788295
1185788299 1185788305
1185788308 1185788313
1185788316 1185788322
1185788326 1185788331
1185788334 1185788339
1185788344 1185788349
1185788351 1185788357
1185788362 1185788366
1185788370 1185788374
1185788379 1185788384
1185788387 1185788392
1185788396 1185788400
1185788405 1185788408
1185788414 1185788417
1185788422 1185788425
1185788431 1185788434
1185788439 1185788442
1185788447 1185788450
1185788456 1185788457
1185788465 1185788468
1185791842 1185791843
1185791895 1185791896
1185791930 1185791931
1185792014 1185792015
1185841547 1185841548
1185841567 1185841568
1185841586 1185841589
1185841594 1185841598
1185841605 1185841608
1185841615 1185841618
1185841624 1185841627
1185841633 1185841635
1185841644 1185841645
1185841651 1185841653
1185841661 1185841664
1185841680 1185841683
1185841699 1185841700
1185841709 1185841710
1185841716 1185841720
1185841735 1185841736
1185841744 1185841745
1185841753 1185841755
1185841760 1185841761
1185841770 1185841772
1185841779 1185841780
1185841789 1185841790
1186235854 1186235856
1186235865 1186235866
1186235874 1186235875
1186236031 1186236032
1186236252 1186236254
1186236260 1186236265
1186236271 1186236276
1186236318 1186236321
1186236326 1186236334
1187062372 1187062373
1187062379 1187062385
1187062390 1187062394
1187062950 1187062951
1187063180 1187063185
1187063189 1187063195
1187063214 1187063215
1187063421 1187063423
1187063428 1187063430
1187063436 1187063437
1187063446 1187063449
1187063451 1187063456
1187063463 1187063466
1187063516 1187063518
1187144546 1187144549
1187592904 1187592907
1187655854 1187655855
