832015088 832015105
832460285 832460302
832541233 832541250
832545074 832545091
832545088 832545105
832545709 832545726
832957282 832957299
833056326 833056343
833749751 833749768
836765893 836765910
836836513 836836530
836841672 836841689
836873302 836873319
836967202 836967219
837539719 837539736
837539955 837539972
838573109 838573126
838607543 838607560
838657240 838657257
839106114 839106131
839608588 839608605
839608870 839608887
839609111 839609128
839609304 839609321
839609338 839609355
839772868 839772885
839952286 839952303
839952664 839952681
840472384 840472401
842168471 842168488
842197075 842197092
842811361 842811378
842980118 842980135
843451876 843451893
843452092 843452109
843586227 843586244
843595945 843595962
843597694 843597711
843862177 843862194
844122495 844122512
844468743 844468760
844471682 844471699
845671881 845671898
846083581 846083598
846089797 846089814
846313258 846313275
846317297 846317314
846517607 846517624
846548744 846548761
847119839 847119856
847123459 847123476
