835045153 835047609
835048991 835062825
835062888 835085797
835085852 835099673
835100727 835102107
835102907 835103047
835103835 835110900
835110947 835125052
835125108 835135724
835135851 835148488
835148767 835149564
835151226 835154580
835154628 835186436
835186484 835193724
835193835 835199580
835199627 835206534
835206982 835212361
835214243 835229317
835229380 835244980
835245037 835250294
835251490 835251677
835251723 835253934
835255258 835257702
835257763 835260845
835262435 835264293
835266919 835270718
835270772 835275762
835277114 835292006
835292061 835304548
835304597 835306590
835306923 835307960
835309281 835315226
835316441 835324004
835324068 835330939
835331758 835334603
835334919 835346687
835348930 835355268
835355332 835358560
835359537 835361874
835362731 835367997
835368958 835372516
835372745 835377566
835377612 835388372
835388420 835392129
835393563 835397914
835398814 835401068
835401962 835404412
835405329 835411660
835417704 835422132
835422188 835429956
835430003 835439717
835439771 835450042
835451823 835455660
835478234 835480060
835481873 835482895
835483892 835486622
835487817 835490739
835491522 835495852
835495971 835498895
835500447 835503733
867344496 867344624
