1 1117264313 1117266068 1755
1 1117345675 1117357762 12087
1 1117368478 1117375790 7312
1 1117375900 1117377333 1433
1 1117408143 1117408494 351
1 1117432662 1117433922 1260
1 1117433927 1117448883 14956
1 1117483591 1117487987 4396
1 1117493328 1117499404 6076
1 1117561284 1117562229 945
1 1117575602 1117592794 17192
1 1117613088 1117621400 8312
1 1117629612 1117632970 3358
1 1117659433 1117665437 6004
1 1117667359 1117676535 9176
1 1117683410 1117690605 7195
1 1117701199 1117702258 1059
1 1117709888 1117719595 9707
1 1117752907 1117760867 7960
1 1117861010 1117866838 5828
1 1117868188 1117872159 3971
1 1117872497 1117878119 5622
1 1117884319 1117890432 6113
1 1117890837 1117891071 234
1 1117891490 1117891814 324
1 1117931466 1117936993 5527
1 1117937002 1117939924 2922
1 1118009073 1118009809 736
1 1118019595 1118022123 2528
1 1118048123 1118048790 667
1 1118053594 1118068477 14883
1 1118074077 1118088040 13963
1 1118207683 1118207892 209
