816086340 816086400
816086460 816086520
816393780 816393840
816795180 816795240
817242300 817242360
817251360 817251420
817269540 817269600
817336320 817336440
817412700 817412760
817416060 817416120
817418460 817418520
817430280 817430400
817499280 817499400
817578660 817578720
817580640 817580700
817582800 817582860
817587900 817588020
817590960 817591080
817591200 817591320
817600200 817600260
817661940 817662000
817736820 817736880
817943760 817943820
817946160 817946220
818040360 818040420
818110860 818110920
819821400 819821460
819831180 819831240
819832920 819832980
819834660 819834780
819837060 819837180
819844200 819844320
819855180 819855240
819918420 819918480
819920820 819920880
819921600 819921660
820376880 820376940
820418220 820418280
820422060 820422180
820436400 820436460
820561860 820561920
820611240 820611300
820612080 820612200
820613460 820613520
820625880 820625940
820730040 820730100
820785300 820785360
820786680 820786740
820872540 820872600
820942140 820942200
821026260 821026320
821139840 821139900
821290500 821290620
821656560 821656620
821738100 821738160
822064140 822064200
822069960 822070020
822082320 822082440
822082800 822082920
822086280 822086340
822414420 822414480
822442860 822442920
822793560 822793620
822795540 822795600
822860280 822860340
822877920 822877980
822886260 822886380
822927300 822927360
822940020 822940140
822947040 822947100
822949140 822949260
822954600 822954660
823042740 823042860
823055700 823055820
823275900 823275960
823444860 823444920
824216940 824217000
824509920 824509980
824836080 824836140
825086460 825086520
825086640 825086700
825096600 825096660
825097860 825097920
825176640 825176700
825176820 825176880
825695040 825695160
825702480 825702540
825707940 825708000
825779400 825779520
825866040 825866100
825871200 825871320
825889500 825889560
825955140 825955200
825970560 825970620
825973260 825973380
825999720 825999780
826052460 826052580
826061820 826061880
826306320 826306380
826306980 826307100
826308120 826308180
826313580 826313640
826314660 826314720
826475880 826475940
826478340 826478460
826487700 826487760
826564500 826564560
826576260 826576380
826579500 826579560
826637340 826637400
826651080 826651200
826653420 826653480
826899540 826899600
826915620 826915680
827073540 827073600
827077740 827077800
827088060 827088120
827099460 827099520
827108640 827108700
827110260 827110380
827112540 827112600
827134920 827134980
827165340 827165460
827172000 827172120
827187060 827187120
827249400 827249520
827264460 827264520
827352120 827352240
827547180 827547240
827591280 827591340
827625060 827625120
827638140 827638200
827683860 827683920
827695080 827695140
827775660 827775720
827778300 827778480
827795940 827796000
827855640 827855700
827945700 827945760
827953680 827953740
828281700 828281760
828281880 828281940
828283980 828284040
828284820 828284880
828454980 828455040
828455460 828455520
828455640 828455700
828456780 828456840
828458940 828459000
828460080 828460140
828460740 828460860
828461100 828461340
828461520 828461580
828461640 828461820
828883620 828883680
828884820 828884880
828885120 828885180
828885300 828885480
828885660 828885780
828886560 828886620
828886800 828886860
828886980 828887220
828887280 828887340
828887460 828887520
828888000 828888060
828888240 828888300
828888360 828888480
828888600 828888660
828888900 828888960
828889020 828889140
828889680 828890040
828890280 828890340
828890580 828890700
828891120 828891180
828899760 828899820
828899880 828899940
828900360 828900420
828900600 828900720
828900780 828900900
828903060 828903120
828903300 828903420
828905040 828905100
828905280 828905340
828905400 828905460
828906360 828906420
828906480 828906540
828906600 828906660
828907560 828907620
828907680 828907740
828907980 828908040
828908220 828908280
828908760 828908820
828910380 828910500
828972240 828972300
828974280 828974340
828978060 828978180
828993780 828993900
829149480 829149540
829345680 829345800
829405980 829406040
829516920 829517040
829574760 829574820
829588320 829588380
829593180 829593240
829600200 829600260
829677840 829677900
829677960 829678020
829763400 829763520
829788960 829789080
829789860 829789920
829920720 829920840
829923300 829923420
829954380 829954440
829960140 829960200
830006220 830006280
830011680 830011800
830093640 830093700
830102400 830102460
830104440 830104500
830111580 830111700
830121360 830121480
830124060 830124120
830139540 830139600
830179620 830179680
830191740 830191800
830227800 830227920
830265840 830265900
830272140 830272200
830276880 830276940
830284380 830284500
830291160 830291280
830532720 830532780
830725440 830725500
830787900 830787960
830806380 830806440
830808840 830808900
830810460 830810520
830816760 830816820
830886360 830886480
830886600 830886660
830893980 830894040
830903040 830903160
830939040 830939160
830958120 830958240
831145440 831145500
831221520 831221580
831254040 831254100
831263280 831263340
831305220 831305280
831323100 831323160
831335100 831335220
831335520 831335580
831388320 831388380
831394560 831394620
831400740 831400800
831414720 831414840
831415380 831415440
831426480 831426540
831436740 831436860
831477720 831477780
831481560 831481680
831482640 831482820
831515880 831516000
831577680 831577800
831750960 831751080
831757020 831757140
831923100 831923160
831923340 831923400
831938100 831938160
832000200 832000260
832001040 832001100
832007340 832007400
832024680 832024740
832034400 832034520
832094940 832095000
832096380 832096440
832461060 832461120
832466820 832466880
832520220 832520280
832529040 832529100
832544520 832544640
832623780 832623900
832886820 832886880
832959480 832959600
833032980 833033100
833142600 833142660
833143320 833143380
833150400 833150460
833307960 833308020
833396520 833396580
833406660 833406720
833547900 833547960
833565060 833565180
833586120 833586180
833638920 833639040
833668800 833668860
833684340 833684400
833737260 833737380
833764140 833764260
833816160 833816220
833822160 833822220
833827020 833827080
833834580 833834640
833838060 833838120
833859720 833859780
834155460 834155520
834171540 834171600
834243120 834243240
834279960 834280020
834287640 834287760
834335280 834335340
834339000 834339060
834345300 834345420
834414960 834415020
834423720 834423780
834428220 834428340
834430080 834430140
834430440 834430500
834432840 834432900
834437700 834437760
834501240 834501360
834505800 834505860
834508560 834508620
834517620 834517680
834517860 834517920
834591720 834591840
834621840 834621900
834682140 834682200
834769620 834769740
834774540 834774600
834786180 834786300
834872700 834872760
834880200 834880260
834934020 834934080
834939240 834939300
834942120 834942180
834972660 834972720
835022700 835022760
835028940 835029060
835031820 835031880
835032300 835032360
835038780 835038840
835038960 835039020
835105860 835105920
835117260 835117320
835117380 835117440
835133340 835133400
835547580 835547640
835548960 835549080
835638900 835638960
835639440 835639560
835652220 835652280
835735740 835735800
835738500 835738560
835759500 835759560
835994820 835994880
836075760 836075820
836242260 836242320
836273880 836274000
836349240 836349300
836352540 836352600
836359680 836359740
836387220 836387400
836589300 836589420
836751900 836751960
836761800 836761860
836847600 836847660
836860200 836860260
836871360 836871420
836928060 836928120
836953260 836953320
837011520 837011640
837024900 837024960
837052080 837052140
837133080 837133140
837188160 837188220
837219360 837219420
837266340 837266400
837352740 837352860
837376200 837376260
837380340 837380400
837439560 837439620
837613920 837613980
837647040 837647100
837743040 837743100
837782940 837783000
837783840 837783900
837816900 837816960
837867600 837867660
837954600 837954660
837955020 837955080
838050720 838050780
838084260 838084320
838128060 838128120
838142220 838142340
838153740 838153800
838163340 838163400
838165920 838165980
838404480 838404540
838499580 838499700
838513680 838513740
838524240 838524300
838561080 838561140
838609260 838609320
838656780 838656840
838662120 838662180
838680120 838680180
838744080 838744140
838768920 838769040
838992900 838992960
839020440 839020500
839117160 839117220
839117340 839117400
839175720 839175840
839181000 839181060
839280600 839280660
839286360 839286420
839350200 839350320
839442600 839442660
839598900 839599020
839621520 839621580
839795220 839795280
839852880 839852940
839866560 839866620
839867700 839867820
839875260 839875320
839892060 839892120
839892180 839892240
839940720 839940780
840043560 840043620
840210960 840211020
840216060 840216120
840392700 840392760
840474900 840474960
840477720 840477780
840500280 840500340
840500760 840500820
840553260 840553320
840555180 840555240
840557340 840557400
840559140 840559200
840564180 840564300
840642120 840642180
840664320 840664380
840817320 840817380
840818580 840818640
840821640 840821760
840932220 840932280
840985320 840985380
840991440 840991500
840991680 840991740
840993420 840993480
841003800 841003860
841006920 841006980
841007160 841007220
841082220 841082280
841093680 841093740
841099800 841099860
841107720 841107780
841287780 841287840
841427820 841427880
841437540 841437600
841503420 841503540
841544700 841544760
841594560 841594620
841670520 841670580
841679100 841679160
841680960 841681020
841685220 841685280
841688940 841689000
842021280 842021340
842044440 842044500
842214060 842214120
842300100 842300160
842373660 842373720
842378580 842378640
842452740 842452800
842463900 842463960
