847798368 847798385
847807261 847807278
847889779 847889796
848072511 848072528
848139732 848139749
848145458 848145476
848152248 848152265
848187946 848187963
848188004 848188021
848240488 848240505
848263579 848263596
848306047 848306064
848442041 848442058
848442062 848442079
848493562 848493581
848502819 848502836
848512764 848512781
848665166 848665183
848686343 848686361
848686410 848686427
848693658 848693675
848701235 848701252
848757570 848757587
848757651 848757668
848829575 848829592
848951792 848951809
848954763 848954780
848955195 848955212
848955224 848955241
848955253 848955270
848955351 848955368
848955548 848955565
848955632 848955652
848955713 848955730
848955776 848955793
848955967 848955984
848956035 848956052
848956102 848956120
848956287 848956304
848956300 848956317
848956355 848956372
848956520 848956538
848956525 848956542
848956534 848956551
848956562 848956583
848956572 848956589
848956628 848956645
848956725 848956742
848956784 848956802
848956828 848956845
848956931 848956948
848956992 848957009
848957010 848957027
849049679 849049696
849108140 849108157
849108914 849108931
849364628 849364645
849531199 849531216
849540900 849540917
849890673 849890690
849890833 849890851
849890877 849890894
849891363 849891380
849891439 849891456
849960908 849960925
850051091 850051108
850146776 850146794
850147799 850147817
850157976 850157993
850158004 850158021
850226689 850226706
850230945 850230962
850231257 850231274
850231324 850231341
850231355 850231372
850485234 850485251
850593468 850593486
850678488 850678507
850839383 850839400
851030038 851030055
851144394 851144411
851253725 851253742
851347409 851347427
851347459 851347477
851347502 851347519
851349838 851349855
851356518 851356535
851370649 851370666
851384063 851384081
851441270 851441288
851441318 851441336
851441341 851441358
851453422 851453439
851457213 851457230
851457239 851457256
851458279 851458296
851686617 851686634
851686723 851686740
851686735 851686752
851686848 851686865
851729155 851729172
851759871 851759888
851782273 851782290
851782315 851782334
851805041 851805059
851805064 851805081
851809169 851809188
851871230 851871247
851871238 851871255
851886423 851886440
851950961 851950978
851963246 851963263
852007749 852007766
852008409 852008426
852040394 852040411
852041912 852041929
852044252 852044269
852087022 852087039
852134399 852134416
852504411 852504428
852504499 852504516
852575446 852575463
852577065 852577082
852581092 852581109
852584260 852584278
852584983 852585000
852632447 852632464
852656575 852656592
852658277 852658294
852665165 852665182
852668695 852668712
852733850 852733868
852733920 852733937
852908850 852908867
852908896 852908913
852921545 852921562
852949973 852949990
852997951 852997968
852998008 852998025
853073520 853073537
853074628 853074645
853084062 853084081
853252236 853252253
853857500 853857517
854474328 854474345
854734960 854734977
854806832 854806849
854982565 854982582
855060701 855060718
855163538 855163555
855163608 855163625
855322754 855322771
855337249 855337266
855396058 855396075
855396081 855396098
855418039 855418056
855698883 855698900
855702170 855702187
855744922 855744939
855746209 855746226
855779682 855779699
855783402 855783419
855921617 855921634
855952203 855952224
855958569 855958586
856021681 856021698
856124646 856124663
856194257 856194274
856210431 856210448
856245856 856245873
856296889 856296906
856296951 856296968
856299003 856299020
856368773 856368790
856417658 856417675
856444581 856444598
856446421 856446438
856553469 856553486
856578353 856578370
856579893 856579910
856650227 856650244
856650301 856650318
856650344 856650361
856810191 856810208
856861762 856861779
856900785 856900802
857035345 857035362
857153971 857153988
857164015 857164032
857166174 857166191
857166180 857166197
857166194 857166211
857169486 857169503
857227318 857227337
857248872 857248889
857249929 857249946
857306693 857306711
857318634 857318651
857322237 857322254
857326954 857326971
857336291 857336308
857400376 857400393
857420064 857420081
857427530 857427547
857574437 857574454
857683442 857683459
857697609 857697626
857919959 857919976
857924400 857924417
857926363 857926380
857936233 857936250
857941424 857941441
857941448 857941465
857941499 857941516
857972577 857972594
858014728 858014745
858093196 858093215
858093292 858093309
858093297 858093314
858104407 858104426
858346339 858346356
858346387 858346404
858346417 858346434
858432210 858432227
858531399 858531416
858539830 858539847
858543431 858543448
858572634 858572651
858602114 858602132
858633636 858633653
858682816 858682833
858949781 858949798
858962178 858962195
858968732 858968749
858968790 858968807
859132303 859132320
859132383 859132400
859214142 859214161
859235130 859235147
859287183 859287201
859299470 859299487
859321578 859321595
859323424 859323441
859330937 859330955
859403163 859403180
859567178 859567195
859572388 859572405
859572452 859572469
859572461 859572478
859573162 859573179
859740228 859740245
859756841 859756858
859756888 859756905
859756905 859756922
859756915 859756934
859816369 859816386
859993222 859993239
860169289 860169306
860173687 860173705
860181823 860181840
860245116 860245134
860245211 860245231
860352287 860352304
860497091 860497108
860519560 860519577
860522908 860522925
860585223 860585240
860776896 860776913
860963779 860963797
861037468 861037485
861050905 861050922
861111488 861111505
861115982 861115999
861123463 861123481
861123515 861123532
861123544 861123561
861128342 861128359
861361837 861361854
861370297 861370314
861372154 861372171
861372188 861372205
861376099 861376116
861387557 861387574
861387629 861387646
861387644 861387661
861387650 861387667
861388610 861388627
861391921 861391939
861457263 861457280
861521074 861521091
861555743 861555760
861597941 861597958
861602951 861602968
861642520 861642537
861717233 861717250
861793240 861793257
861995657 861995674
861995701 861995718
861995705 861995722
861995782 861995801
862002639 862002656
862056539 862056556
862063186 862063203
