862160520 862160580
862160700 862160760
862160880 862160940
862161300 862161540
862161600 862162080
862162140 862162680
862162740 862163100
862163160 862163460
862164000 862164060
862165500 862165560
862165680 862165800
862166100 862166160
862166400 862166520
862166760 862166820
862166880 862167000
862167360 862167420
862167540 862167600
862167660 862167720
862167780 862167840
862168080 862168140
862168260 862168620
862168740 862169220
862169280 862169760
862169820 862169880
862169940 862170060
862170120 862170300
862187280 862187340
862188780 862188840
862188960 862189140
862189680 862189740
862190760 862190820
862191180 862191240
862191420 862191480
862191660 862191720
862191960 862192020
862192080 862192140
862192200 862192260
862194120 862194180
862194300 862194360
862195080 862195140
862195920 862195980
862196700 862196760
862196880 862196940
862197360 862197420
862197480 862197660
862197780 862197840
862198080 862198140
862198560 862198620
862198740 862198860
862198920 862199040
862199160 862199340
862199400 862199520
862199640 862199700
862200300 862200420
862200540 862200600
862200900 862201080
862201560 862201620
862201860 862202640
862202700 862202760
862202820 862203660
862203720 862203900
862203960 862204380
862204440 862204560
862204620 862205580
862205640 862206480
862206540 862206600
862206660 862207140
862207200 862207380
862207440 862207620
862207680 862207920
862207980 862208280
862208520 862208580
862208640 862208700
862211340 862211400
862213080 862213140
862238880 862238940
862258380 862258440
862259160 862259220
862265700 862265760
862265880 862265940
862274280 862274400
862317660 862317720
862318800 862319760
862349220 862349280
862351860 862351980
862381320 862381440
862393560 862394160
862394220 862394400
862394700 862394760
862674660 862674720
862701120 862701180
862701240 862701300
862701360 862701480
862701540 862701600
862701720 862701780
862702260 862702440
862702740 862702800
862702860 862702980
862703880 862703940
862705080 862705140
862705680 862705740
862705920 862705980
862706640 862706700
862707660 862707720
862707780 862707840
862707900 862707960
862711200 862711260
862711320 862711380
862711620 862711680
862712100 862712160
862712280 862712340
862712760 862712820
862713300 862713360
862714380 862714500
862716000 862716060
862732560 862732740
862732800 862732920
863048520 863048640
863052000 863052120
863052180 863052240
863052660 863052900
863052960 863053020
863053260 863053320
863053380 863053560
863053620 863053680
863053740 863053860
863054160 863054220
863054280 863054460
863055060 863055120
863288220 863288280
863344080 863345820
863346000 863346060
863346180 863346240
863346300 863346360
863397900 863398080
863398320 863398380
863408940 863409000
863465040 863465100
863482200 863482320
863583180 863583240
863584440 863584500
863584860 863584980
863587860 863587920
863625540 863625600
863627220 863627280
863628000 863628180
863628240 863628420
863628480 863628600
863628660 863628720
863628840 863629020
863629140 863629320
863629440 863629620
863629680 863629920
863630160 863630220
863630580 863630940
863631360 863631420
863632080 863632260
863632500 863632980
863633220 863633280
863633400 863633580
863634480 863634540
863634720 863634780
863635440 863635500
863635620 863635680
863636340 863636400
863636880 863636940
863637600 863637660
863638140 863638200
863638260 863638560
863638860 863638980
863639400 863639520
863639640 863640000
863640060 863640120
863640300 863640600
863640660 863640900
863640960 863641020
863641140 863641200
863641380 863641440
863641920 863641980
863642040 863642220
863642280 863642460
863642700 863642940
863643180 863643420
863643660 863643720
863643840 863644020
863644140 863644260
863644440 863644500
863644680 863644740
863644800 863644860
863644920 863645040
863645160 863645280
863645520 863645580
863645640 863645700
863645820 863645880
863733180 863733240
863759760 863759820
863760060 863760120
863760540 863760600
863760840 863760900
863761020 863761140
863761200 863761260
863761500 863761620
863761980 863762100
863827440 863827500
863828580 863828640
863828760 863828820
863829000 863829180
863829300 863829360
863829600 863829660
863829780 863829960
863830140 863830440
863830500 863830560
863830620 863831340
863831400 863831520
863831580 863831640
863831700 863832240
863832300 863832600
863832660 863832720
863832840 863833080
863833140 863833380
863833440 863833860
863833920 863834160
863834220 863834820
863834880 863834940
863835000 863835060
863835180 863835480
863835600 863835780
863835840 863835900
863836080 863836140
863836200 863836380
863836500 863836740
863836860 863837040
863837280 863837460
863837580 863837640
863837940 863838300
863838360 863838720
863838900 863838960
863839080 863839140
863839200 863839320
863839380 863839680
863839740 863839860
863839920 863840100
863840160 863840340
863840460 863840760
863840820 863841120
863841180 863841360
863841420 863841660
863841720 863841900
863841960 863842260
863842740 863842800
863842860 863842920
863843880 863843940
863844780 863844840
863932320 863932860
863984520 863984580
863990640 863990760
864047040 864047460
864184320 864184740
864326880 864326940
864327240 864327300
864327600 864327660
864333000 864333060
864334500 864334560
864334620 864334680
864339360 864339420
864339720 864339780
864340500 864340680
864340740 864340860
864341580 864341760
864342000 864342060
864342120 864342720
864342780 864343860
864343920 864344040
864344160 864344280
864344340 864344580
864344640 864344820
864345240 864345300
864345360 864345420
864345540 864346260
864346320 864346860
864346920 864347220
864347340 864347400
864347520 864347820
864347880 864347940
864348120 864348600
864348660 864348780
864348900 864349320
864349440 864349860
864349920 864349980
864350040 864350220
864350280 864350400
864350460 864350700
864350820 864350940
864351000 864351120
864351180 864351540
864351660 864351720
864351780 864352140
864352200 864352320
864352980 864353040
864353100 864353340
864353400 864353520
864353580 864353940
864354240 864354300
864354900 864354960
864355860 864355980
864356460 864356520
864370560 864370620
864370800 864370860
864371340 864371400
864405840 864405900
864592740 864593940
864594120 864594180
864642540 864642660
864858420 864859440
864859500 864859860
864860040 864860160
864963300 864963780
864963840 864964560
864964620 864964800
864964860 864965400
864965580 864966060
864966180 864966240
864966540 864966600
864966660 864966840
864967740 864967800
864968040 864968160
864969300 864969360
864969480 864969540
865055880 865056000
865058160 865058220
865058340 865058460
865092180 865092240
865094040 865094220
865094400 865094940
865102620 865102920
865103040 865103220
865103460 865104240
865104300 865104480
865104600 865104900
865128000 865128060
865128420 865128480
865128660 865128840
865128960 865129140
865129560 865129680
865129920 865129980
865130160 865130280
865130520 865130580
865131060 865131120
865131600 865131720
865131780 865131840
865132380 865132440
865132620 865132740
865133460 865133520
865173300 865173360
865173660 865173720
865175280 865175340
865175580 865175700
865176000 865176180
865177200 865177260
865177980 865178040
865178160 865178220
865178400 865178520
865179180 865179240
865179540 865179600
865179780 865179900
865180620 865180680
865181460 865181580
865182600 865182660
865183320 865183380
865183680 865183800
865184040 865184100
865184220 865184340
865184400 865184460
865184820 865184880
865185000 865185120
865185420 865185540
865185660 865185900
865186020 865186080
865186140 865186260
865186560 865186680
865186740 865186800
865187280 865187340
865187580 865187640
865188060 865188120
865188900 865188960
865189380 865189680
865189740 865189860
865189980 865190040
865190220 865190280
865190340 865190520
865190640 865190880
865190940 865191000
865191360 865191720
865191840 865192260
865192440 865192500
865192620 865192800
865192920 865193160
865193280 865193400
865193520 865193580
865193700 865193940
865194000 865194060
865194180 865194300
865194360 865194600
865194660 865194720
865194780 865194840
865194960 865195080
865195200 865195440
865195500 865195560
865195620 865195860
865195980 865196220
865196340 865196400
865196460 865196580
865196640 865196880
865196940 865197060
865197120 865197180
865197240 865197300
865197360 865197420
865197480 865197540
865197660 865198020
865198080 865198200
865198260 865198320
865198440 865198500
865198560 865198740
865198860 865199100
865199160 865199880
865199940 865200000
865200060 865200120
865200360 865200540
865200600 865200720
865200900 865201080
865201140 865201320
865201440 865201500
865201560 865201920
865201980 865202100
865202160 865202940
865203000 865203060
865203120 865203720
865203780 865203840
865203900 865203960
865204020 865204440
865204500 865204560
865204620 865204680
865204740 865204860
865204920 865205220
865205340 865207020
865207080 865207140
865207260 865207800
865207860 865208280
865208340 865208760
865208880 865208940
865209000 865209360
865209420 865209660
865209720 865210140
865210260 865210740
865210800 865211040
865211100 865212240
865212300 865213320
865213560 865213980
865214100 865214460
865214520 865216500
865216560 865216740
865216980 865217040
865217400 865217820
865217940 865218000
865218180 865218240
865218600 865218660
865218840 865218900
865220520 865220580
865220700 865220760
865220940 865221000
865221600 865221660
865233480 865233540
865273680 865273740
865288440 865288500
865346160 865346520
865519560 865519620
865554060 865554120
865554780 865554840
865561680 865561740
865564080 865564140
865568940 865569000
865650360 865650420
865654080 865654140
865656240 865656300
865660500 865660560
865696860 865696920
865697040 865697220
865697460 865697520
865697700 865697880
865697940 865698060
865702320 865702440
865702680 865702740
865705800 865705860
865706160 865706280
865709340 865709460
865710840 865710900
865799100 865802580
865802640 865803420
865803480 865803900
865804080 865804140
865804380 865804440
865818360 865818480
865823760 865823820
865825740 865825800
865826100 865826160
865826280 865826340
865826580 865826700
865826820 865826880
865827060 865827120
865827360 865827480
865827600 865827660
865827780 865827900
865828680 865828740
865828860 865828980
865829220 865829280
865881120 865881180
865881300 865881540
865972560 865972620
865972740 865972800
865972860 865972920
865973160 865973220
865974420 865974480
866006160 866006400
866069460 866069640
866071380 866071440
866072760 866072820
866076180 866076240
866076600 866076660
866076900 866076960
866078460 866078520
866078640 866078700
866078940 866079060
866079360 866079420
866079480 866079720
866079900 866080200
866080260 866080320
866080560 866080680
866080860 866080980
866081040 866081100
866081220 866081280
866082000 866082060
866082120 866082180
866082480 866082540
866082780 866082840
866083800 866083860
866157420 866157480
866158380 866158440
866160300 866160360
866161020 866161140
866161380 866161500
866162160 866162220
866162280 866162460
866162640 866162700
866163300 866163360
866163720 866163900
866163960 866164080
866164200 866164260
866164320 866164440
866164680 866164740
866164800 866164860
866164920 866164980
866165400 866165520
866165580 866165760
866165880 866166060
866166240 866166300
866166360 866166540
866166600 866166720
866166840 866167080
866167320 866167380
866167620 866167740
866167860 866168100
866168160 866168400
866168820 866168940
866169180 866169240
866169300 866169360
866169480 866169600
866169900 866169960
866170020 866170080
866170200 866170260
866170380 866170500
866170860 866170920
866170980 866171040
866171760 866171820
866172120 866172180
866172240 866172300
866172540 866172660
866172840 866172900
866172960 866173020
866173320 866173380
866184300 866184360
866185200 866185320
866185380 866185440
866185500 866186040
866186100 866186640
866187000 866187300
866187420 866187600
866237040 866237160
866251140 866251260
866303760 866303820
866311680 866311740
866311800 866311860
866311920 866312160
866312220 866312340
866316120 866316300
866317020 866317080
866483820 866483880
866579640 866579700
866586060 866586180
866590980 866591040
866594220 866594340
866594520 866594580
866594760 866594820
866594940 866595000
866595120 866595180
866595480 866595540
866599500 866599800
866599860 866599920
866600400 866600460
866600520 866600580
866600760 866600880
866601060 866601120
866601600 866601960
866602080 866602260
866602440 866602620
866602860 866602920
866602980 866603040
866603520 866603580
866603640 866603700
866603760 866603940
866604300 866604480
866604720 866604840
866604960 866605020
866605500 866605560
866605740 866605800
866605860 866605920
866606340 866606460
866606520 866606580
866606880 866606940
866607180 866607240
866625300 866625360
866672820 866672880
866684820 866684880
866745000 866745060
866751660 866751720
866754540 866754660
866755560 866755680
866755740 866755800
866757060 866757120
866758800 866758860
866759460 866759640
866760000 866760060
866760540 866760600
866762580 866762880
866764440 866764560
866766300 866766360
866766720 866766840
866767380 866767440
866767500 866767560
866769180 866769240
866769480 866769540
866769600 866769660
866769960 866770020
866770260 866770380
866770500 866770740
866770980 866771040
866771100 866771280
866771340 866771400
866771760 866771820
866772900 866772960
866773020 866773140
866774280 866774400
866774460 866774640
866774760 866774820
866775000 866775060
866775120 866775180
866775240 866775420
866775540 866775660
866775720 866776020
866776440 866776500
866776620 866776680
866776740 866776860
866778000 866778060
866778120 866778180
866778240 866778300
866778360 866778420
866778540 866778600
866779140 866779260
866779500 866779560
866779620 866779680
867037440 867040500
867040560 867040740
867040800 867040920
867041160 867041220
867042600 867042720
867042840 867043380
867043620 867043740
867110040 867110100
867120360 867120420
867120660 867120840
867121740 867121800
867121860 867121920
867122940 867123000
867123840 867123900
867202260 867202320
867452040 867452220
867457860 867457920
867469980 867470040
867487860 867487980
867488220 867488340
867488940 867489060
867489180 867489540
867720360 867720540
867720720 867721020
867721140 867721200
867738780 867738840
867739260 867739320
867740040 867740100
867741720 867741780
867814740 867814800
867819720 867819780
867820380 867820440
867820560 867820620
867820740 867820800
867820920 867821100
867821220 867821340
867821520 867821640
867821700 867821820
867821880 867822300
867822360 867822540
867822660 867822780
867822840 867822900
867897300 867897360
867902400 867902460
867902760 867902880
867903240 867903300
867903480 867903600
867903960 867904020
867904320 867904380
867904620 867904680
867907200 867907260
867907560 867907620
867971220 867971280
868254360 868254420
868385400 868385940
868386000 868386180
868386300 868386420
868391820 868391940
868399740 868399800
868399920 868400220
868400280 868400580
868400640 868400820
868528440 868528500
868540860 868545120
868545180 868545720
868545780 868545900
868546020 868546260
868546500 868546560
868546860 868546980
868547280 868547340
868584900 868588260
868588320 868589520
868589580 868589940
868596540 868596600
868631940 868633740
868633800 868634220
868634280 868634340
868634580 868634640
868635060 868635180
868669440 868669500
868681620 868682100
868682160 868682220
868701900 868702020
868702980 868703520
868703580 868704240
868704300 868704600
868721040 868721100
868721340 868721400
868722180 868722240
868722480 868722720
868726800 868726920
868755120 868755300
868755360 868755600
868755660 868756140
868756260 868756320
868756380 868756620
868804620 868804740
868808760 868808880
868840680 868840740
868840800 868840860
868841940 868842000
868842060 868842120
868842300 868842360
868843200 868843260
868900620 868900680
868902600 868902780
868907280 868907340
868909500 868909680
868909860 868909920
868910100 868910160
868911540 868911600
868914960 868915020
868915440 868915500
868915560 868915620
868917480 868917660
868918560 868918620
868922340 868922400
868924020 868924080
868925700 868925820
869004480 869004600
869005200 869005260
869005440 869005620
869006160 869006220
869006580 869006640
869007060 869007120
869007360 869007420
869007540 869008020
869008200 869008380
869008920 869008980
869019600 869019660
869019720 869019780
869020140 869020200
869021340 869021400
869060820 869060880
869068680 869068980
869069700 869069760
869089740 869089800
869090940 869091000
869092800 869092860
869207520 869207580
869207640 869207700
869261880 869261940
869282940 869283000
869283780 869283840
869284020 869284080
869284380 869284620
869284740 869284800
869284920 869285040
869285400 869285520
869285640 869286060
869286120 869286180
869286540 869286660
869286960 869287020
869290800 869290860
869294340 869294400
869295420 869295480
869445780 869447040
869447100 869447220
869447460 869447520
869465160 869466060
869466120 869469780
869469840 869469960
869470200 869470260
869470380 869470440
869471880 869471940
869472000 869472060
869472300 869472360
869535780 869536080
869536260 869536560
869584380 869584440
869584740 869584800
869585460 869586540
869586960 869587020
869587260 869587380
869614080 869614320
869616480 869616600
869617560 869617680
869618160 869618400
869721240 869721300
869721540 869721660
869721900 869721960
869722020 869722320
869722380 869722440
869722620 869722680
869780400 869780520
869796720 869796780
869799180 869799300
869800140 869800200
869801520 869801580
869932620 869932680
869932800 869932860
869932980 869933040
869933100 869933220
870024180 870030660
870030720 870030960
870031020 870031080
870031140 870031260
870031440 870031620
870031680 870031740
870031860 870032220
870032280 870032880
870032940 870033300
870033360 870033420
870058680 870058740
870059100 870059160
870059340 870060780
870060840 870066180
870066240 870066600
870067140 870067200
870067320 870067380
870069480 870069660
870069780 870069960
870140940 870141000
870152760 870152940
870153120 870153180
870230640 870230700
870231900 870231960
870236220 870236280
870236760 870236820
870237000 870237060
870237180 870237300
870237720 870237840
870237960 870238020
870238080 870238140
870238680 870238740
870239040 870239160
870239280 870239340
870274260 870274920
870275040 870275160
870275400 870275460
870275640 870275700
870483060 870483180
870483240 870483300
870483360 870483540
870483600 870483780
870483900 870483960
870484020 870484080
870484200 870484260
870546960 870547020
870557580 870557640
870558480 870558540
870567420 870567480
870567840 870567900
870568440 870568500
870569040 870569100
870571560 870571620
870572820 870572880
870629160 870636000
870636060 870636420
870636480 870636540
870636600 870636660
870636900 870636960
870717600 870717720
870717780 870717840
870817620 870817680
870824820 870824880
870958140 870958320
871006020 871006080
871006380 871006440
871007220 871007280
871007400 871007460
871106280 871106460
871106520 871106580
871148460 871148520
871245060 871245240
871245300 871249320
871249380 871249680
871249740 871250760
871250820 871251000
871251060 871251180
871251300 871251480
871252140 871252260
871252560 871252680
871257180 871269600
871269660 871269720
871269780 871270320
871270440 871270860
871270920 871270980
871271040 871271100
871271220 871271340
871271760 871271820
871273200 871273320
871273500 871273680
871273740 871273800
871273860 871274160
871274460 871274520
871274640 871274700
871277940 871278000
871278600 871278660
871278780 871279980
871290240 871293180
871293240 871293480
871293540 871293660
871293720 871294200
871294260 871294680
871294800 871294980
871295160 871295220
871295340 871295400
871295820 871295940
871296060 871296180
871296240 871296300
871296900 871296960
871297380 871297500
871297560 871297680
871297800 871297920
871297980 871298100
871298520 871298580
871326840 871326900
871327620 871327680
871337040 871337100
871337280 871337340
871339260 871339380
871341120 871341180
871341300 871341360
871343160 871343220
871343940 871344000
871344600 871344660
871357200 871357260
871358220 871358640
871358820 871358880
871358940 871359000
871359300 871359360
871359600 871359660
871394520 871394640
871394820 871394880
871498560 871498620
871524420 871524480
871524720 871524780
871654500 871654620
871654800 871654920
871655040 871655100
871655460 871655520
871655700 871656180
871656240 871656480
871656540 871656840
871657560 871657620
871688700 871689300
871689420 871689480
871689540 871689600
871689660 871689720
871689780 871689840
871689960 871690020
871691220 871691280
872114400 872114460
872117700 872117760
872125440 872125500
872126220 872126280
872126520 872126580
872126640 872126700
872126820 872126940
872127180 872127360
872128200 872128260
872128560 872128620
872128680 872128800
872128860 872128920
872128980 872129220
872129340 872129460
872130060 872130120
872130420 872130660
872131020 872131080
872131320 872131380
872131440 872131560
872131740 872131800
872132040 872132160
872132280 872132400
872134140 872134200
872198940 872199000
872210520 872210580
872210820 872210880
872211540 872211600
872212560 872212680
872212920 872213040
872213340 872213400
872213460 872213520
872213580 872213640
872213880 872213940
872214180 872214240
872214360 872214420
872272260 872272320
872272500 872272920
872352240 872353080
872462280 872462340
872569200 872569260
872569800 872569920
872572320 872572440
872572800 872572860
872573340 872573640
872573700 872574000
872574120 872574480
872574600 872574780
872574840 872574900
872574960 872575020
872575080 872575140
872575200 872575260
872575380 872575440
872576400 872576520
872576760 872576820
872577060 872577120
872577840 872577900
872624100 872624160
872625120 872625180
872630580 872630640
872630820 872630880
872631660 872631720
872634000 872634060
872635020 872635080
872637720 872637780
872640120 872640180
872640600 872640660
872641320 872641380
872644080 872644140
872644380 872644440
872644620 872644800
872645040 872645100
872645160 872645220
872645280 872645340
872645640 872645820
872645940 872646000
872646300 872646480
872646720 872646780
872646900 872647020
872647200 872647260
872647440 872647500
872647560 872647740
872649060 872649240
872651340 872651400
872651520 872651580
872657100 872657160
872658060 872658120
872660220 872660280
872709900 872711820
872711880 872712000
872712060 872712120
872712180 872712360
872712420 872712480
872712660 872712840
872712960 872713020
872713140 872713200
872714220 872714400
872725800 872725980
872731140 872741520
872741640 872741760
872741940 872742000
872742240 872742300
872745720 872745780
872745840 872745900
872767140 872767440
872809380 872809440
872824920 872824980
872827680 872827740
872872500 872872560
872872860 872872980
872873520 872873580
872939160 872939220
872956200 872956380
872956500 872956620
872997660 872998080
872998140 872998200
873057960 873058020
873059460 873059520
873064260 873064320
873066180 873066240
873068340 873068400
873072780 873072900
873137760 873137820
873140220 873140280
873419760 873419940
873424860 873424920
873424980 873431820
873431880 873432120
873432240 873432300
873432360 873432420
873432660 873432840
873433020 873433200
873433260 873433320
873433440 873433560
873433920 873433980
873528780 873528900
873569580 873569760
873631740 873631800
873631920 873645180
873645240 873645540
873645600 873646860
873647040 873647400
873647460 873647580
873647700 873647940
873648000 873648180
873648240 873648360
873648540 873648600
873648660 873648720
873648840 873648900
873648960 873649080
873649440 873649500
873677460 873687900
873687960 873688080
873688140 873688620
873688680 873688920
873688980 873689160
873689220 873689280
873689400 873689460
873689520 873689580
873689700 873689760
873689940 873690420
873690480 873691320
873691380 873698100
873698160 873698340
873698400 873698760
873698940 873699060
873713700 873713820
873713880 873714000
873714900 873715020
873715200 873715560
873715740 873715980
873716040 873716100
873716340 873716400
873716580 873716640
873716700 873716760
873717120 873717180
873752400 873753000
873786480 873786600
873786720 873786780
873786960 873787080
873788940 873789000
873789060 873790380
873790440 873790680
873790860 873790920
873791100 873791340
874020900 874020960
874021020 874021080
874021440 874021560
874021680 874021740
874022700 874022760
874023660 874023720
874024260 874024800
874052340 874052520
874173840 874174020
874281600 874281660
874314720 874314780
874314960 874315020
874315500 874315680
874315740 874315800
874316340 874316400
874316460 874318200
874318320 874318500
874318740 874319040
874319100 874320240
874320420 874320600
874320660 874320720
874351560 874351620
874368240 874368300
874371180 874371240
874371360 874371420
874372380 874372440
874374360 874374420
874374480 874374540
874374720 874374780
874380480 874380540
874509300 874509360
874511640 874511700
874524120 874524180
874526280 874526340
874526520 874526580
874527360 874527420
874527600 874527660
874528980 874529040
874529280 874529340
874529400 874529460
874529880 874529940
874530060 874530180
874530360 874530480
874530660 874530720
874530900 874530960
874531020 874531080
874531200 874531260
874531380 874531440
874531560 874531680
874531800 874532040
874532160 874532400
874532460 874532520
874533000 874533120
874533360 874533540
874545060 874545120
874552020 874552080
874552500 874552560
874563600 874563660
874634700 874634820
874794180 874794300
874816140 874816200
874816260 874816320
874816500 874816560
874818360 874818420
874818720 874818780
874818840 874818960
874846860 874847580
874847820 874847880
874848000 874850040
874850100 874850280
874850400 874850460
874850580 874850700
874850760 874850880
874851000 874851060
874851300 874851360
874853820 874853880
874854060 874854120
874860780 874860840
874861020 874861140
874861260 874861320
874861380 874861440
874861560 874861680
874861740 874861800
874861860 874861920
874862100 874862160
874959780 874960020
874960200 874960260
874960320 874960380
874960440 874960500
874960920 874962360
874962420 874962600
874962720 874963080
874963140 874963320
874963380 874963440
874964880 874964940
874977960 874978740
874978800 874979100
874979160 874983600
874983660 874983840
874983960 874984260
874984380 874984440
874984500 874984620
874984680 874984740
874985040 874985160
874985640 874985700
874985760 874985880
874987080 874987140
874987380 874987440
874987800 874987920
875004900 875004960
875005380 875005440
875014920 875015040
875016180 875016240
875016300 875016420
875016480 875016720
875016960 875017440
875017680 875017740
875019300 875019360
875020560 875020620
875020980 875021040
875021280 875021340
875021700 875021940
875022120 875022180
875022240 875022300
875022360 875022420
875022480 875022540
875022600 875029800
875029860 875029980
875030040 875030220
875030280 875030340
875030400 875030460
875030520 875031000
875031180 875031240
875031300 875031420
875031480 875031660
875031720 875032020
875053560 875053620
875060580 875060640
875068020 875068140
875083800 875083920
875084040 875084220
875154180 875154240
875154300 875154720
875154780 875159760
875159820 875160000
875160060 875160660
875160720 875161080
875161140 875161260
875161320 875161380
875161500 875161560
875161980 875162100
875162280 875162580
875162640 875162760
875162820 875162880
875163000 875163060
875163180 875163240
875163480 875163540
875166300 875174520
875174580 875175060
875175120 875175300
875175360 875175540
875176020 875176140
875182740 875183040
875183160 875183340
875183400 875183760
875183820 875183880
875183940 875184000
875184060 875186640
875186760 875187000
875187180 875187360
875187480 875187600
875187660 875187720
875188320 875188560
875188740 875188800
875188980 875189160
