862247459 862247476
862247757 862247774
862247997 862248014
862248311 862248328
862294256 862294273
862295328 862295345
863386841 863386858
863386978 863386995
863388735 863388752
863401222 863401239
864666487 864666504
864672147 864672164
864672983 864673000
864673808 864673825
864795380 864795397
864986658 864986675
864995903 864995920
865140898 865140915
865192733 865192750
865192911 865192928
865193252 865193269
865204205 865204222
865257959 865257976
865382228 865382245
865454326 865454343
865467155 865467172
865467906 865467923
865467975 865467992
865468005 865468022
865468825 865468842
865468950 865468967
865470220 865470237
865513155 865513172
865631607 865631624
865631809 865631826
865632525 865632542
865812172 865812189
865812497 865812514
865812657 865812674
865812711 865812728
865813126 865813143
865816918 865816935
865818144 865818161
865818532 865818549
865867690 865867707
866221092 866221109
866221132 866221149
866247991 866248008
866322706 866322723
866323236 866323253
866331242 866331259
866331365 866331382
866331410 866331427
866331632 866331649
866331807 866331824
866335634 866335651
866336023 866336040
866336465 866336482
866336878 866336895
866337063 866337080
866337302 866337319
866337513 866337530
866337671 866337688
866337861 866337878
866526209 866526226
866840766 866840783
866841202 866841219
866892088 866892105
867180565 867180582
867181079 867181096
867181136 867181153
867181208 867181225
867181260 867181277
867181307 867181324
867181329 867181346
867181409 867181426
867181461 867181478
867181643 867181660
867182505 867182522
867182599 867182616
867182708 867182725
867182816 867182833
867183073 867183090
867183208 867183225
867183411 867183428
867184340 867184357
867184572 867184589
867184702 867184719
867184840 867184857
867185094 867185111
867185218 867185235
867214157 867214174
867337293 867337310
867454987 867455004
867455105 867455122
867455138 867455155
867455232 867455249
867455275 867455292
867455308 867455325
867455508 867455525
867455536 867455553
867455587 867455606
867455606 867455623
867455693 867455710
867455905 867455922
867456022 867456039
867571360 867571377
867613729 867613746
867613948 867613965
867614029 867614046
867614977 867614994
867615097 867615114
867625601 867625618
867686657 867686674
867687594 867687611
868042135 868042152
868042670 868042688
868042988 868043005
868050116 868050133
868050866 868050883
868050952 868050969
868051190 868051207
868051355 868051372
868052776 868052793
868054135 868054152
868054473 868054490
868054936 868054953
868055023 868055040
868055206 868055223
868055330 868055347
868303480 868303497
868313718 868313735
868319289 868319306
868468998 868469015
868469362 868469380
868556918 868556935
869007322 869007339
869701830 869701847
869854753 869854770
869854789 869854806
869854954 869854971
869855302 869855319
869855393 869855410
869855468 869855485
869882489 869882506
869883340 869883357
869884988 869885005
869885155 869885172
869885545 869885562
869891083 869891100
870049690 870049707
870050440 870050457
870128570 870128587
871529333 871529352
871778895 871778912
872051240 872051257
872193862 872193879
872199333 872199350
872199387 872199404
872199705 872199722
872199974 872199991
872200079 872200096
872200171 872200188
872201594 872201611
872249867 872249884
872287596 872287613
872287688 872287705
872289891 872289909
872373940 872373957
872379207 872379224
872656466 872656483
872656597 872656614
872656798 872656815
872657183 872657200
872657293 872657310
872657485 872657502
872657581 872657598
872658342 872658359
872718413 872718430
872718702 872718719
872773253 872773271
872892986 872893003
872893298 872893315
872977851 872977868
872979567 872979584
872981252 872981269
873243841 873243858
873749724 873749741
873817077 873817094
874746507 874746524
