/data/node251/frames/S5/strain-L2/LLO/L-L1_RDS_C03_L2-8160/L-L1_RDS_C03_L2-816065631-128.gwf
/data/node251/frames/S5/strain-L2/LLO/L-L1_RDS_C03_L2-8160/L-L1_RDS_C03_L2-816065759-128.gwf
/data/node251/frames/S5/strain-L2/LLO/L-L1_RDS_C03_L2-8160/L-L1_RDS_C03_L2-816065887-70.gwf
