815580748 815580749
815586555 815586556
815798537 815798538
815913216 815913217
815927381 815927384
815962841 815962842
816183194 816183195
816209619 816209620
816214256 816214257
816280915 816280918
816280920 816280925
816952168 816952169
817077861 817077862
817431059 817431078
817440419 817440467
817448819 817448851
817457459 817457465
817940320 817940321
818093543 818093544
818096087 818096088
818346866 818346867
818439003 818439004
818454116 818454117
818493659 818493699
818635045 818635046
818636580 818636581
818723648 818723649
818780219 818780247
818878586 818878587
819185292 819185293
819579926 819579927
819687419 819687464
819828899 819828918
819977551 819977552
820002955 820002956
820052975 820052976
820172006 820172007
820528762 820528763
820626138 820626139
820695681 820695682
820716196 820716197
820756090 820756091
821388576 821388577
821480155 821480156
821536061 821536062
821725822 821725823
822092530 822092531
822435585 822435586
822438539 822438540
822567104 822567105
822920423 822920424
824678719 824678720
824959241 824959242
825582018 825582019
825590819 825590820
825822820 825822821
827093011 827093012
827161514 827161515
827291900 827291901
827588649 827588653
827618505 827618506
827849246 827849247
828153412 828153417
828619901 828619902
829248327 829248330
829290904 829290907
829290908 829290912
829290937 829290948
829290962 829290968
829505279 829505305
829516019 829516028
830096744 830096745
830342821 830342822
830365588 830365589
830490891 830490892
830705954 830705955
830833523 830833524
831134434 831134435
831171602 831171603
831419091 831419092
831695891 831695895
831695898 831695903
831695905 831695909
831695912 831695917
831767879 831767924
831811971 831811974
831934042 831934045
832017727 832017728
832109384 832109385
832284928 832284929
832296458 832296459
832801966 832801969
833137609 833137610
833235216 833235217
833269412 833269415
833425456 833425457
833446740 833446741
833576875 833576876
833580716 833580717
833885547 833885548
834189236 834189237
834294411 834294412
834323002 834323003
834524291 834524292
834691117 834691118
834731727 834731728
834873850 834873851
835009415 835009416
835039738 835039739
835480057 835480058
835567491 835567492
835643706 835643707
835818153 835818154
835848164 835848165
835954346 835954347
835984133 835984134
836080693 836080694
836247777 836247778
836259729 836259730
836352744 836352745
836356484 836356485
836395969 836395970
836426862 836426863
836769089 836769090
836782093 836782094
837025905 837025906
837078634 837078635
837322042 837322043
837456779 837456838
837600205 837600206
837642959 837643020
837723753 837723754
837865959 837865960
838078974 838078975
838174533 838174536
838242179 838242186
838242719 838242751
838373694 838373695
838406370 838406371
838413239 838413281
838415443 838415444
838569441 838569442
838894799 838894818
839256385 839256386
839284961 839284962
839337938 839337939
839680448 839680449
839721979 839721980
839828582 839828583
840039698 840039699
840083139 840083143
840238345 840238346
840336352 840336353
840373123 840373124
840492010 840492011
840502639 840502640
840533595 840533599
840740762 840740763
840857944 840857945
840996056 840996057
841046798 841046799
841143796 841143797
841236741 841236742
841922222 841922223
842103830 842103831
842385189 842385190
842803551 842803552
842821925 842821928
842928276 842928277
842997999 842998000
843167743 843167744
843460465 843460466
843604922 843604923
843674442 843674443
843744542 843744543
843753472 843753473
844348106 844348107
844967739 844967740
845590661 845590662
846421079 846421100
846826570 846826571
847604965 847604966
847625074 847625075
847753434 847753435
847797139 847797143
847836326 847836329
847945289 847945290
847955160 847955161
847998459 847998462
847998479 847998482
847999495 847999499
848069455 848069459
848069475 848069478
848330601 848330602
848673458 848673459
848922367 848922368
849213047 849213048
849214802 849214803
849564293 849564294
849711516 849711517
849898985 849898988
849903538 849903539
849908418 849908419
850066775 850066776
850137785 850137786
850187444 850187445
851038878 851038879
851111331 851111334
851506516 851506520
851507044 851507050
852323455 852323456
852325461 852325467
852440093 852440094
852698002 852698003
853272983 853272984
853344468 853344471
853444760 853444761
854171883 854171884
854198170 854198173
854198209 854198213
854251267 854251270
854706552 854706555
855243397 855243400
856135778 856135779
856201784 856201785
856322028 856322031
856383013 856383014
856451151 856451152
856544305 856544306
856571537 856571540
856778897 856778898
857169285 857169286
857258016 857258017
857733440 857733443
857733791 857733794
857767051 857767052
858031507 858031508
858107585 858107586
858165188 858165191
858182897 858182898
858185008 858185009
858207180 858207181
858219651 858219652
858467833 858467834
858594476 858594477
858724969 858724970
858741282 858741285
858819212 858819213
858973812 858973813
859078193 859078194
859085182 859085183
859852118 859852119
860011001 860011002
860163262 860163263
860527310 860527311
860710824 860710825
860921076 860921077
861158551 861158552
861886166 861886167
862139824 862139825
862177047 862177048
862381092 862381093
862384746 862384747
862524772 862524776
862732329 862732330
863053275 863053276
863216963 863216964
863301808 863301809
863637351 863637352
863770803 863770804
864151203 864151206
864418221 864418224
864612162 864612163
865079311 865079312
865345197 865345198
865490998 865490999
865798656 865798657
866169994 866169995
866172796 866172797
867766563 867766564
867782791 867782795
868054800 868054801
868399209 868399210
868753255 868753260
868753261 868753264
869060245 869060246
869413836 869413837
869613894 869613895
869617377 869617378
870103420 870103423
870991923 870991924
871105598 871105599
871158599 871158630
871243438 871243439
871291496 871291500
871392601 871392602
871432679 871432718
871446179 871446239
871456499 871456509
871468139 871468146
871478039 871478060
871515839 871515898
871539479 871539537
871551179 871551210
871560179 871560197
871566359 871566370
871601519 871601531
871629359 871629389
871639919 871639933
871685683 871685684
872167787 872167791
872201840 872201844
873060204 873060205
873141122 873141123
873147576 873147577
873648749 873648750
873670114 873670117
874272889 874272890
874316935 874316938
874360687 874360688
874706780 874706781
874802186 874802189
875022653 875022654
875104060 875104061
