817420778 817420795
817704856 817704873
817704888 817704905
818009987 818010004
818517190 818517207
818713952 818713969
818770704 818770721
819327305 819327322
819917808 819917825
820446927 820446944
821731401 821731418
821748018 821748035
821748283 821748300
821827752 821827769
821827765 821827782
821827799 821827816
821828616 821828633
821828728 821828745
822088065 822088082
822096717 822096734
822349923 822349940
822779882 822779899
822795073 822795090
823036778 823036795
824462244 824462261
824474862 824474879
824485378 824485395
825782029 825782046
825870178 825870195
825898568 825898585
825913202 825913219
825974409 825974426
825979611 825979628
826214618 826214635
826337347 826337364
826475109 826475126
826475173 826475190
826649726 826649743
826655778 826655795
827527625 827527642
827882279 827882296
827961775 827961792
828234122 828234139
828993357 828993374
829327039 829327056
829505249 829505266
829510852 829510869
829511854 829511871
829591649 829591666
829670319 829670336
829940281 829940298
829940547 829940564
829940717 829940734
830102066 830102083
830103223 830103240
830103918 830103935
830104522 830104539
830104949 830104966
830106857 830106874
830110994 830111011
830125733 830125750
830289429 830289446
830466834 830466851
830616470 830616487
830792840 830792857
830806603 830806620
831134076 831134093
831316870 831316887
