816065678
816065680
816065682
816065684
816065686
816065688
816065690
816065692
816065694
816065696
816065698
816065700
816065702
816065704
816065706
816065708
816065710
816065712
816065714
816065716
816065718
816065720
816065722
816065724
816065726
816065728
816065730
816065732
816065734
816065736
816065738
816065740
816065742
816065744
816065746
816065748
816065750
816065752
816065754
816065756
816065758
816065760
816065762
816065764
816065766
816065768
816065770
816065772
816065774
816065776
816065778
816065780
816065782
816065784
816065786
816065788
816065790
816065792
816065794
816065796
816065798
816065800
816065802
816065804
816065806
816065808
816065810
816065812
816065814
816065816
816065818
816065820
816065822
816065824
816065826
816065828
816065830
816065832
816065834
816065836
816065838
816065840
816065842
816065844
816065846
816065848
816065850
816065852
816065854
816065856
816065858
816065860
816065862
816065864
816065866
816065868
816065870
816065872
816065874
816065876
816065878
816065880
816065882
816065884
816065886
816065888
816065890
816065892
816065894
816065896
816065898
816065900
816065902
816065904
816065906
816065908
816065910
816065912
816065914
816065916
816065918
816065920
816065922
816065924
816065926
816065928
816065930
816065932
816065934
