854658960 854659080
854659140 854661480
854661540 854662020
854662080 854662200
854707020 854707080
854707740 854707800
854708220 854708340
854824740 854824980
854825100 854825160
854825280 854825340
855243660 855243720
855314220 855314280
855314340 855314460
855314520 855314640
855422820 855422880
855454140 855454680
855522120 855522180
855522300 855522360
855526680 855526980
855602880 855602940
855607620 855607800
855608100 855608160
855608220 855608280
855608340 855610260
855610380 855610740
855610800 855610980
855611040 855611400
855611580 855611820
855611940 855612060
855612180 855612420
855612480 855612600
855612660 855612720
855612840 855612960
855613020 855613140
855613200 855613260
855613320 855613380
855613440 855613500
855615120 855615300
855615480 855615780
855615840 855615960
855616080 855616140
855624600 855624660
855624840 855624900
855625140 855625260
855625380 855625440
855625500 855625560
855625980 855626040
855628440 855628500
855707040 855707100
855708180 855708240
855708420 855708600
855708720 855708780
855708840 855708900
855709200 855709320
855736560 855736620
855736680 855736740
855817020 855817080
855817380 855817440
855817980 855818100
855818160 855818220
855818280 855818400
855818460 855818580
855818640 855819300
855819540 855819600
855819660 855819720
855820080 855820140
855856740 855856800
855857400 855857460
855857580 855857700
855857820 855857880
855857940 855858000
855858060 855858120
855859740 855859860
855859920 855859980
855860040 855860220
855860280 855860520
855860700 855860820
855861540 855861600
855861660 855861720
855861780 855861840
855861900 855862020
855862080 855862140
855863640 855863700
855864420 855864600
855865260 855865500
855865800 855865860
855865920 855865980
855866040 855866160
855866820 855867120
855868200 855868380
855868620 855868680
855868800 855868860
855869160 855869280
855869340 855869400
855869760 855869820
855869880 855869940
855870180 855870300
855871320 855871440
855871560 855871620
855871920 855872100
855872220 855872280
855872640 855872700
855872880 855873120
855873360 855873540
855873600 855873720
855873780 855873900
855874080 855874140
855874500 855874560
855874740 855874800
855875100 855875160
855875520 855875580
855876600 855876660
855880260 855880380
855881280 855881340
855881640 855881700
855882000 855882060
855930960 855931020
855933780 855933840
855935400 855935460
855935520 855935580
855936060 855936120
855936600 855936660
855937080 855937260
855937380 855937500
855941520 855941580
855945540 855945600
855947640 855947820
855948000 855948120
855948540 855948600
855948720 855948840
855949080 855949140
855949200 855949260
855949320 855949560
855949680 855949800
855950040 855950520
855950640 855950700
855950760 855950820
855951480 855951720
855951900 855952080
855952320 855952620
855952740 855952920
855953040 855953280
855953340 855953520
855953580 855953760
855953820 855953880
855953940 855954000
855954420 855954480
855954540 855954780
855954840 855954900
855955140 855955620
855955680 855955860
855955920 855956100
855956160 855957540
855957600 855958020
855958080 855958200
855958260 855958380
855958500 855958740
855958800 855958860
855958980 855959040
855959700 855959880
855959940 855960000
855960120 855960240
855960300 855960360
855960420 855960660
855960720 855960900
855960960 855961080
855961200 855961740
855961800 855961860
855962280 855962400
855962520 855962640
855962760 855963180
855963240 855963300
855963360 855964680
855964740 855967020
855967080 855970440
855970500 855972000
855972180 855972540
855972660 855972780
855972900 855973020
855973140 855973260
855973560 855973620
855973680 855973740
855974040 855974100
855974280 855974400
855974460 855974700
855974820 855975120
855975180 855976020
855976080 855976500
855976560 855976620
855976680 855976740
855977040 855977160
855977340 855977400
855977460 855977640
855977700 855978060
855978120 855978300
855978360 855978420
855978480 855978540
855979140 855979740
855979800 855980220
855980280 855980580
855980640 855980760
855980880 855981060
855981180 855981420
855981540 855981600
855982200 855982260
855982380 855982800
855982860 855982980
855987840 855987900
855988440 855988500
855988560 855988860
855988920 855988980
855989040 855989100
855989160 855989340
855989460 855989520
855989640 855989760
855989880 855990360
855990480 855990840
855990900 855991440
855991500 855992040
855992100 855992220
855992280 855993840
855993960 855994080
855994200 855994260
855994320 855994440
855994620 855994800
855994860 855995100
855995160 855995280
855995460 855998700
855998760 856002240
856002360 856002540
856002840 856002900
856003200 856003260
856003320 856003380
856003440 856003500
856003740 856003800
856012920 856013040
856013220 856013280
856013820 856013880
856014900 856014960
856015080 856015140
856015200 856015260
856015380 856015620
856015680 856016100
856016160 856016220
856016280 856016340
856016400 856016460
856016580 856016700
856016760 856016880
856016940 856017060
856017180 856017300
856017480 856017600
856017660 856017720
856018140 856018200
856018860 856018920
856019640 856019700
856020060 856020120
856020180 856020300
856020360 856020420
856020780 856020900
856023000 856023060
856023120 856023180
856025820 856025880
856026540 856026660
856026720 856026840
856027260 856027380
856027500 856027560
856027680 856027740
856028280 856028400
856028640 856028700
856029000 856029120
856032360 856032420
856032780 856032960
856033020 856033140
856033200 856033320
856033380 856033440
856033500 856033740
856033860 856033980
856034100 856034220
856034280 856034340
856034520 856034580
856034640 856034820
856034880 856034940
856035000 856035600
856035660 856035780
856035900 856036080
856036620 856036680
856036740 856036860
856036980 856037040
856037100 856037160
856037280 856037340
856037580 856037640
856037940 856038540
856038600 856038660
856038720 856039020
856039140 856039200
856039500 856039620
856039680 856039740
856040100 856040220
856040460 856040580
856040760 856040880
856040940 856041060
856041120 856041240
856041300 856041420
856041600 856041660
856041720 856041780
856042200 856042320
856042440 856042620
856042800 856042860
856042920 856043280
856043340 856043460
856043520 856043700
856043760 856044180
856044300 856044360
856044480 856044600
856044900 856045020
856045140 856045320
856045440 856046280
856046340 856047000
856047060 856047180
856047300 856047660
856047720 856048020
856048440 856048500
856048560 856048800
856048980 856049040
856049100 856049220
856049280 856049400
856049460 856049520
856049640 856049820
856049940 856050060
856050780 856050840
856052160 856052280
856053120 856053180
856066860 856066920
856067640 856067700
856068900 856068960
856069680 856069740
856070700 856070760
856070940 856071000
856071240 856071360
856071480 856071720
856071780 856071900
856072140 856072440
856072500 856072800
856072860 856072920
856072980 856073040
856073100 856073280
856073340 856073400
856073520 856073580
856073640 856073820
856074120 856074300
856074480 856074540
856074840 856074900
856131900 856132320
856250760 856251000
856251840 856252140
856252200 856252260
856308540 856308600
856321020 856321200
856321740 856322700
856322760 856322820
856322940 856323000
856323120 856323180
856323300 856323360
856402320 856402560
856451520 856452960
856453020 856453200
856453260 856453320
856453380 856453560
856453620 856453680
856453800 856453920
856454100 856454160
856454640 856454700
856477620 856477740
856517460 856517580
856518900 856518960
856522680 856522740
856523040 856523160
856523520 856523640
856523940 856524060
856525020 856525140
856525860 856525920
856527900 856528380
856528440 856528560
856532040 856532160
856532460 856532520
856632840 856632900
856633080 856633140
856634100 856634220
856634400 856634580
856635840 856635900
856636920 856637280
856737840 856738140
856738500 856738560
856738680 856738740
856738920 856739220
856739580 856739640
856739700 856739820
856739940 856740240
856740600 856741140
856741200 856741320
856741380 856741740
856741860 856742160
856742220 856742280
856742400 856742580
856742700 856743000
856743120 856743240
856743300 856743420
856743540 856743720
856743780 856745040
856745100 856745280
856745520 856745580
856745700 856745820
856746180 856746240
856754940 856755000
856755060 856755180
856755360 856755420
856755900 856756020
856769220 856769280
856769340 856769400
856773660 856773720
856773900 856773960
856774080 856774140
856827120 856827180
856827540 856827600
856827660 856827720
856827780 856827840
856827900 856828860
856828920 856829100
857191860 857191920
857192040 857193120
857193180 857193480
857193540 857193720
857193780 857193840
857193900 857194020
857194560 857194680
857199240 857200140
857200200 857200440
857200620 857200680
857200860 857201040
857359020 857359080
857366760 857366820
857378100 857378160
857378460 857378520
857378700 857378760
857379240 857379300
857381280 857381340
857381580 857381640
857392380 857392440
857403540 857404080
857404200 857404320
857404380 857404620
857404680 857404800
857404860 857406000
857406060 857406120
857406180 857407200
857407260 857407440
857407500 857407560
857407620 857407740
857407860 857407920
857408040 857408160
857408220 857408340
857408460 857408700
857408760 857408940
857409000 857409120
857409180 857409360
857409720 857410140
857410200 857410500
857410620 857410680
857410980 857411160
857411220 857411280
857411400 857411520
857411760 857411820
857412060 857412240
857412300 857412360
857412420 857412480
857412840 857412900
857412960 857413200
857413320 857413380
857413440 857413500
857413560 857413680
857413740 857414040
857414100 857414160
857414220 857414340
857414520 857414640
857414700 857414820
857414880 857415000
857415060 857415120
857415240 857415300
857415360 857415660
857415780 857415840
857416560 857416620
857416740 857416800
857417040 857417100
857418000 857418120
857418240 857418540
857418780 857418900
857419500 857419560
857419620 857419740
857420160 857420220
857420280 857420340
857420700 857420820
857421000 857421120
857421180 857421300
857421720 857421840
857421960 857422080
857422320 857422380
857422620 857422680
857424540 857424600
857424720 857424840
857424900 857425020
857425740 857425800
857583300 857583600
857583660 857583780
857598240 857598300
857685420 857685480
857685720 857685960
857686020 857686200
857686380 857686500
857686560 857687040
857687100 857687160
857687280 857687400
857687460 857688000
857688060 857688720
857688780 857688840
857688900 857689200
857689260 857689320
857689560 857689680
857689800 857689860
857689920 857689980
857690280 857690340
857690400 857690640
857691240 857691300
857691780 857691840
857691960 857692020
857692260 857692380
857692860 857692920
857693100 857693160
857693340 857693400
857694480 857694720
857694780 857694840
857694960 857695020
857695140 857695200
857695560 857695680
857696100 857696220
857696340 857696460
857699100 857699160
857729160 857729220
857729340 857729460
857729520 857729640
857729760 857729940
857730000 857730360
857730480 857731380
857731440 857731680
857731740 857731800
857731860 857732340
857732400 857738160
857738220 857738340
857738460 857738520
857738580 857740440
857740500 857740800
857740860 857741220
857741280 857741520
857741700 857741880
857741940 857742060
857742120 857742180
857742300 857742540
857742660 857743020
857743080 857743560
857743620 857743740
857743800 857743860
857744040 857744160
857744280 857744400
857744640 857745060
857745180 857745240
857745300 857745780
857745900 857746020
857746140 857746260
857747340 857747400
857747460 857747520
857747880 857748000
857748120 857748420
857748540 857748840
857748900 857748960
857749080 857749200
857749260 857749320
857749440 857749500
857749560 857749620
857749680 857749740
857750340 857750400
857765040 857765100
857765280 857765340
857765580 857765640
857766060 857766180
857766360 857766480
857766720 857766780
857766960 857767260
857767320 857767380
857767860 857767980
857768700 857769000
857769120 857769240
857769360 857769540
857769720 857769780
857769840 857769960
857770260 857770500
857770680 857770740
857770920 857771040
857771640 857771820
857772000 857772060
857772120 857772180
857772240 857772300
857772600 857772660
857772780 857772960
857773020 857773260
857773860 857773920
857774100 857774160
857774220 857774340
857774460 857774640
857774940 857775240
857775300 857775660
857775720 857775780
857775840 857776140
857776260 857776440
857776500 857776800
857776860 857776980
857777100 857777220
857777400 857777460
857777520 857777940
857778060 857778120
857778240 857778300
857778540 857778600
857778960 857779020
857779200 857779320
857779500 857779620
857780760 857780820
857790540 857792040
857792100 857792760
857792820 857793360
857793420 857793540
857793660 857793780
858000840 858000900
858191700 858191880
858208440 858208860
858220140 858220200
858220260 858220380
858220500 858220560
858220620 858221940
858367440 858367500
858368640 858368700
858368880 858369000
858369660 858369720
858371940 858372000
858372180 858372300
858372420 858372480
858372720 858372900
858374940 858375000
858375540 858375600
858375840 858375900
858376980 858377100
858377220 858377340
858377400 858377520
858377580 858377760
858378060 858378120
858378180 858378300
858378420 858378600
858379020 858379080
858379680 858379740
858384060 858384120
858401640 858401700
858434460 858434640
858434820 858434880
858435120 858435600
858435720 858435900
858435960 858436200
858436680 858436740
858437220 858437280
858437460 858437520
858437640 858437700
858439200 858439260
858440880 858440940
858441000 858441060
858441420 858441480
858442200 858442380
858442500 858442560
858442680 858442800
858442860 858442920
858443040 858443340
858443400 858443520
858443580 858443760
858443820 858444000
858444300 858444720
858444780 858444900
858445080 858445200
858445260 858445320
858446160 858446280
858446340 858446400
858446520 858446700
858447120 858447240
858447660 858447780
858447960 858448020
858448140 858448320
858449340 858449400
858449820 858449880
858450060 858450120
858450180 858450240
858460620 858460680
858460800 858460980
858461040 858461220
858461280 858461340
858461700 858461820
858461880 858462000
858463020 858463080
858463260 858463320
858463500 858463560
858463800 858463860
858464400 858464520
858464580 858464640
858465180 858465240
858466080 858466140
858466320 858466380
858466440 858466500
858466980 858467040
858468660 858468720
858469140 858469200
858469800 858469860
858472740 858472800
858473100 858473160
858574860 858574920
858583380 858583440
858654120 858654240
858752580 858752640
858754260 858754320
858757020 858757080
858765420 858765480
858765540 858765600
858768780 858768840
858781800 858781920
858783120 858783540
858783600 858784860
858784920 858784980
858785220 858785340
858785520 858785640
858789240 858789300
858789480 858789540
858789960 858790200
858790320 858790380
858790740 858790980
858791040 858791100
858791460 858791520
858791580 858791700
858791760 858791880
858792000 858792060
858792240 858792360
858792420 858792480
858792540 858793380
858793560 858793800
858794340 858794400
858803400 858803640
858803700 858803940
858804000 858804360
858804420 858804660
858805920 858805980
858816540 858816600
858817980 858818040
858819300 858819660
858819720 858827340
858827400 858828840
858828900 858829500
858829560 858830280
858830340 858830520
858830640 858830760
858830880 858830940
858869460 858869520
858869580 858869700
858869760 858869820
858870300 858870360
858894600 858894660
859068540 859068600
859068720 859068780
859072800 859072860
859073400 859073700
859073760 859073880
859073940 859074000
859074180 859074360
859074420 859074480
859074540 859074660
859074960 859075080
859075380 859075440
859075740 859075860
859076040 859076100
859076160 859076400
859076460 859076580
859076640 859076700
859076760 859076880
859077000 859077180
859077480 859077720
859077780 859077840
859077900 859077960
859078260 859078440
859078500 859078620
859078980 859079040
859079160 859079460
859079520 859079580
859079640 859079700
859079820 859079940
859080180 859080300
859080420 859080540
859080720 859080840
859080960 859081020
859081140 859081380
859081500 859081680
859081740 859082040
859082280 859082400
859082460 859082520
859083720 859083780
859084200 859084260
859084980 859085160
859085400 859085460
859087440 859087500
859088340 859088400
859088460 859088520
859088820 859089120
859089240 859089360
859090200 859090260
859090800 859090860
859094280 859094340
859095960 859096020
859096560 859096620
859124040 859124520
859128120 859128540
859143600 859143660
859143780 859143840
859156800 859156860
859317600 859317900
859317960 859318080
859383540 859384020
859384140 859384560
859384620 859384680
859384800 859384860
859419660 859419780
859496100 859508220
859508280 859508340
859508400 859508820
859508880 859509780
859509840 859510200
859510260 859510500
859510680 859510860
859510920 859510980
859511160 859511400
859511640 859511700
859512240 859512300
859530000 859530840
859531320 859531380
859548900 859549380
859549620 859549800
859549860 859549920
859552080 859552260
859552500 859552560
859552680 859552800
859553220 859553880
859553940 859554540
859554600 859554660
859554720 859554960
859560000 859560060
859560300 859560360
859560480 859560540
859592760 859592940
859593360 859593420
859593900 859594680
859594740 859595040
859595100 859595460
859595520 859595580
859595640 859595760
859598580 859599000
859639860 859640340
859654440 859654560
859668660 859668900
859669140 859669200
859669320 859669380
859669920 859671480
859671540 859671600
859671660 859671720
859672260 859672320
859672380 859672560
859685160 859685640
859705200 859705440
859705620 859705740
859705800 859706040
859706100 859706160
859706340 859708380
859708440 859708740
859708920 859708980
859709220 859709520
859709700 859709760
859712280 859712340
859721160 859722000
859722060 859724640
859724700 859725300
859725420 859725480
859726380 859726440
859761120 859761180
859781880 859782000
859782120 859782180
859782360 859782480
859782720 859784220
859784280 859784580
859922880 859923000
859923240 859923420
859923660 859923720
859966260 859966320
859966440 859966500
859967100 859967820
859967880 859968000
859968060 859968180
859968300 859968360
859968480 859968540
859978680 859979220
859979280 859979520
859979640 859979760
860096760 860096820
860102400 860102460
860106000 860106060
860106180 860106240
860106300 860106360
860116080 860116140
860149800 860149980
860150280 860150340
860150700 860150820
860150880 860151600
860151960 860152020
860158980 860159040
860159160 860159400
860160420 860160480
860160540 860160600
860160780 860161680
860161740 860162100
860162160 860163360
860163420 860163480
860163540 860163660
860163720 860164020
860164080 860164860
860164920 860166840
860167080 860167140
860167260 860167380
860167560 860169000
860169060 860170200
860170260 860170800
860170860 860172120
860172180 860173620
860173680 860173860
860173920 860174040
860174220 860174280
860174580 860174640
860174700 860175720
860175780 860176800
860176860 860177100
860177160 860177640
860177700 860177880
860178000 860178180
860178240 860178300
860178360 860178780
860178840 860179320
860179440 860179980
860180040 860180100
860180160 860180280
860180400 860180820
860180880 860180940
860181120 860181180
860181360 860181660
860181720 860182140
860182200 860182800
860182860 860182980
860183160 860183700
860183760 860183880
860183940 860185140
860185200 860185980
860186040 860186280
860186340 860186580
860186640 860187360
860187420 860188620
860188740 860189040
860189100 860189160
860189220 860189460
860189580 860190540
860190600 860190720
860190780 860191440
860191500 860191620
860191680 860191980
860192100 860192640
860192820 860193540
860193600 860193720
860193780 860193900
860193960 860195700
860195760 860195880
860195940 860196240
860196300 860196360
860196420 860196720
860196900 860197020
860197080 860197200
860197260 860197740
860197800 860199540
860199600 860199780
860199840 860200080
860200200 860200440
860200560 860200800
860200860 860200920
860200980 860201160
860201280 860201400
860201520 860201820
860204040 860204100
860255280 860255340
860258820 860258940
860263980 860264040
860264280 860264340
860434680 860434740
860441520 860441640
860441820 860441880
860442180 860442300
860479080 860480340
860480580 860480640
860490180 860490360
860511660 860511720
860526120 860526240
860526360 860526480
860526660 860526720
860526900 860526960
860768700 860769120
860769240 860769360
860769420 860769480
860769660 860769720
860769840 860770020
860811900 860812020
860868420 860868540
860883300 860883360
860886180 860886240
860886300 860886360
860886840 860886900
860887020 860887080
860887320 860887440
860887800 860887860
860887920 860888220
860888520 860888580
860921280 860921640
861013260 861013500
861066840 861066960
861067020 861067620
861067680 861067920
861067980 861068160
861068280 861068340
861068460 861068520
861070200 861070380
861070440 861070500
861071220 861071280
861071580 861073260
861073500 861073560
861073620 861073680
861074160 861074220
861074340 861074760
861074820 861074880
861075120 861075180
861075420 861075540
861215520 861215580
861215880 861215940
861216300 861216360
861216420 861216540
861216600 861216960
861217020 861217140
861217200 861217260
861217320 861217380
861217440 861217680
861217740 861217860
861218640 861218700
861479040 861479100
861479340 861479400
861479580 861479640
861479700 861479880
861480060 861480120
861480240 861480300
861480480 861480720
861490620 861490680
861499020 861499260
861500880 861500940
861544740 861544920
861545820 861546120
861546180 861546420
861546480 861546600
861546720 861546840
861546900 861547080
861719700 861719880
861720000 861720240
861773760 861773880
861804960 861805020
861886620 861886680
861886740 861887160
861887220 861887580
861887760 861887820
861909780 861909900
862016580 862016760
862017300 862017360
862021920 862021980
862022400 862023060
862023180 862023300
862068180 862068240
