843948000 843948420
843951600 843952020
843955200 843955620
843958800 843959220
843962400 843962820
843966000 843966420
843969600 843970020
843973200 843973620
843976800 843977220
843980400 843980820
843987600 843988020
843991200 843991620
843994800 843995220
843998400 843998820
844002000 844002240
844005600 844005660
844005780 844006020
844009200 844009620
844099200 844099620
844102800 844103220
844106400 844106820
844110120 844110420
844113600 844114020
844117200 844117620
844124400 844124820
844128300 844128420
844131600 844132020
844135200 844135620
844138800 844139220
844142400 844142820
844146000 844146420
844149600 844150020
844153200 844153440
844156800 844157220
844160400 844160820
844164000 844164420
844167600 844168020
844171200 844171620
844174800 844175220
844178400 844178820
844182000 844182420
844189500 844189620
844192980 844193220
844196400 844196820
844200000 844200240
844203600 844204020
844207200 844207620
844210800 844211220
844214400 844214820
844218000 844218420
844221600 844222020
844225200 844225620
844228800 844229220
844232400 844232820
844236000 844236420
844239600 844240020
844243200 844243620
844246800 844247220
844250400 844250820
844254000 844254420
844257600 844258020
844261200 844261620
844264800 844265220
844268400 844268820
844275600 844276020
844279200 844279620
844282800 844283220
844286400 844286820
844290000 844290420
844293600 844294020
844297200 844297620
844300800 844301220
844304400 844304820
844308000 844308420
844311600 844312020
844315200 844315620
844318920 844319220
844322760 844322820
844329600 844330020
844333200 844333620
844336800 844337220
844340400 844340820
844344000 844344420
844347600 844348020
844351200 844351620
844358400 844358820
844362000 844362420
844365600 844366020
844369200 844369620
844372800 844373220
844376400 844376820
844380000 844380420
844383600 844384020
844387200 844387620
844390800 844391220
844398000 844398420
844401600 844402020
844405200 844405620
844408800 844409220
844412400 844412820
844416000 844416420
844419600 844420020
844423200 844423620
844437600 844438020
844444800 844445220
844462800 844463220
844466580 844466820
844470000 844470180
844470240 844470300
844473600 844474020
844477200 844477620
844480800 844481220
844484400 844484820
844488000 844488420
844491600 844492020
844495200 844495620
844498800 844499220
844502400 844502820
844506000 844506420
844513200 844513620
844516800 844517160
844560000 844560420
844567200 844567620
844570800 844571220
844574400 844574820
844581600 844582020
844585260 844585620
844588800 844589220
844592400 844592820
844596000 844596420
844599600 844599960
844603200 844603620
844606800 844607220
844610400 844610820
844614000 844614060
844642980 844643220
844653600 844654020
844664400 844664820
844675200 844675620
848095200 848095620
848098800 848099220
848102400 848102820
848106000 848106420
848109600 848110020
848113200 848113620
848116800 848117220
848120400 848120820
848124000 848124420
848127600 848128020
848131200 848131620
848134800 848135220
848142000 848142420
848145600 848146020
848149380 848149620
852741000 852741420
852744600 852745020
852751800 852752220
852755400 852755820
852759000 852759420
852762600 852763020
852766200 852766620
852769800 852770220
852773400 852773820
852777000 852777420
852780600 852781020
852784200 852784620
852787800 852788220
852791400 852791820
852795000 852795420
852798600 852799020
852802200 852802620
852805800 852806220
852809400 852809820
852813000 852813420
852816600 852817020
852820200 852820620
852823800 852824220
852827400 852827820
852831000 852831420
852834600 852835020
852838200 852838620
852841800 852842220
852845400 852845820
852849000 852849420
852852600 852853020
852856200 852856620
852859800 852860220
852863400 852863820
852867000 852867420
852870600 852871020
852874200 852874620
852877800 852878220
852881400 852881820
852885000 852885420
852888600 852889020
852892200 852892620
852895800 852896220
852899400 852899820
852903000 852903420
852906600 852907020
852910200 852910620
853021800 853022220
853025400 853025820
853029000 853029420
853032600 853033020
853036200 853036620
853039800 853040220
853043400 853043820
853047000 853047420
853050600 853051020
853054200 853054620
853061400 853061820
853065000 853065420
853068600 853069020
853072380 853072620
853079400 853079820
853083000 853083420
853086660 853086840
853090200 853090620
853093800 853094220
853101000 853101420
853104840 853105020
853108200 853108620
853111800 853112220
853119000 853119420
853122600 853123020
853126200 853126620
853129800 853130220
853133400 853133820
853137000 853137300
853140600 853141020
853144440 853144620
853147800 853148220
853151400 853151820
853155000 853155420
853158600 853159020
853162200 853162260
853162320 853162620
853165800 853166220
853169400 853169820
853173060 853173420
853176600 853177020
853183800 853184220
853187400 853187460
853191000 853191420
853194600 853195020
853198200 853198620
853201800 853202220
853205400 853205820
853209000 853209420
853212600 853213020
853216200 853216620
853219800 853220220
853223400 853223820
853227000 853227420
853230600 853230900
853230960 853231020
853234200 853234620
853237800 853238220
853241400 853241820
853245000 853245420
853248600 853249020
853252200 853252500
853255800 853256220
853263000 853263420
853266600 853267020
853270200 853270620
853273800 853274220
853277400 853277820
853281000 853281420
853284600 853285020
853288200 853288620
853291800 853292220
853295400 853295820
853299000 853299420
853302600 853303020
853306200 853306620
853309800 853310220
853320600 853321020
853324200 853324620
853327800 853328220
853331400 853331820
853335000 853335420
853342200 853342620
853345800 853346220
853349400 853349820
853353000 853353420
853356600 853357020
853360200 853360620
853363800 853364220
853367400 853367820
853371000 853371420
853374600 853375020
853378200 853378620
853381800 853382220
853385400 853385820
853389000 853389420
853392600 853393020
853396200 853396620
853399800 853400220
853403400 853403820
853407000 853407420
853410600 853411020
853414200 853414620
853439640 853439820
853446600 853447020
853453800 853454220
853457400 853457820
853461000 853461420
853464600 853465020
853468200 853468620
853471800 853472220
853475400 853475820
853479000 853479420
853489800 853490220
853493400 853493820
853497000 853497420
853500600 853501020
