841990745 841990746
842053577 842053579
842053582 842053583
842053942 842053943
842054624 842054625
842054634 842054635
842054637 842054638
842054649 842054651
842054652 842054653
842054677 842054680
842169207 842169208
842169213 842169214
842169216 842169217
842193602 842193603
