1126628427.500000 1126628432.000000
1126629140.000000 1126629153.000000
1126629162.000000 1126629177.000000
1126675828.000000 1126675863.250000
1126675876.750000 1126675883.250000
1126675919.500000 1126675926.000000
1126675937.000000 1126675955.000000
1126675955.250000 1126675959.500000
1126676045.000000 1126676053.000000
1126676061.000000 1126676064.500000
1126676143.000000 1126676146.500000
1126676210.000000 1126676220.000000
1126676248.000000 1126676259.000000
1126676962.000000 1126676964.500000
1126676982.000000 1126676992.000000
1126677274.500000 1126677279.500000
1126677286.500000 1126677306.500000
1126689787.875000 1126689793.000000
1126689967.750000 1126689973.750000
1126691756.000000 1126691775.500000
1126691784.203125 1126691789.000000
1126729174.000000 1126729177.000000
1126730988.000000 1126730994.000000
1126734926.000000 1126734931.000000
1126734933.000000 1126734945.000000
1126735009.000000 1126735012.000000
1126735013.500000 1126735017.500000
1126819680.000000 1126819691.000000
1126821009.000000 1126821021.000000
1126832339.750000 1126832344.000000
1126850629.750000 1126850633.500000
1126850687.250000 1126850693.000000
1126850696.000000 1126850699.500000
1126850735.000000 1126850753.000000
1126858258.000000 1126858263.000000
1126858426.500000 1126858430.375000
1126858787.000000 1126858792.000000
1126884614.500000 1126884617.000000
1126886177.429687 1126886180.125000
1126886306.500000 1126886309.000000
1126887268.000000 1126887274.000000
1126942636.750000 1126942640.500000
1126942689.750000 1126942692.250000
1126942714.875000 1126942718.500000
1126942756.000000 1126942764.000000
1126944100.000000 1126944145.250000
1126944149.500000 1126944155.000000
1126963807.750000 1126963836.500000
1126963873.000000 1126963877.500000
1126996074.500000 1126996078.000000
1127071805.000000 1127071810.000000
1127108028.875000 1127108031.250000
1127169653.750000 1127169656.000000
1127171931.000000 1127171934.000000
1127174164.750000 1127174168.250000
1127175329.375000 1127175331.625000
1127272494.000000 1127272519.000000
1127296689.625000 1127296692.000000
1127309827.562500 1127309830.687500
1127332833.375000 1127332836.375000
1127333055.750000 1127333058.000000
1127342073.500000 1127342079.500000
1127347614.000000 1127347616.750000
1127348887.375000 1127348889.937500
1127354041.000000 1127354044.000000
1127383517.968750 1127383520.250000
1127387337.531250 1127387339.625000
1127443766.921875 1127443769.375000
1127443863.000000 1127443865.250000
1127443865.375000 1127443868.125000
1127453659.187500 1127453661.250000
1127454101.500000 1127454104.000000
1127476656.000000 1127476659.000000
1127478920.875000 1127478923.625000
1127490645.000000 1127490660.000000
1127495705.500000 1127495708.000000
1127600909.539062 1127600911.625000
1127601034.625000 1127601038.898438
1127601040.953125 1127601043.937500
1127601044.375000 1127601050.000000
1127603077.796875 1127603080.500000
1127603253.500000 1127603259.281250
1127603822.375000 1127603829.625000
1127603994.875000 1127603998.000000
1127604162.375000 1127604164.750000
1127604165.828125 1127604169.000000
1127604222.775390 1127604226.750000
1127606646.500000 1127606650.875000
1127610005.500000 1127610008.000000
1127610447.000000 1127610450.000000
1127610476.750000 1127610482.000000
1127612375.062500 1127612377.250000
1127623519.250000 1127623522.750000
1127623531.625000 1127623539.250000
1127627153.375000 1127627157.000000
1127627369.000000 1127627371.750000
1127628326.164062 1127628330.375000
1127628434.488281 1127628440.250000
1127628803.000000 1127628806.000000
1127630609.000000 1127630615.000000
1127630898.500000 1127630901.750000
1127720930.500000 1127720932.625000
1128053769.000000 1128053773.625000
1128100871.500000 1128100903.000000
1128331504.500000 1128331507.000000
1128331555.375000 1128331558.125000
1128331582.000000 1128331584.250000
1128331627.000000 1128331631.593750
1128331639.000000 1128331642.500000
1128331772.875000 1128331775.250000
1128331787.375000 1128331791.125000
1128331927.500000 1128331935.000000
1128454437.000000 1128454439.125000
1128456036.875000 1128456039.500000
1128456727.500000 1128456730.500000
1128461446.000000 1128461451.000000
1128465597.000000 1128465599.125000
1128467189.500000 1128467192.500000
1128473729.000000 1128473733.000000
1128491991.625000 1128491994.000000
1128504699.000000 1128504704.500000
1128504755.000000 1128504772.000000
1128537271.875000 1128537276.000000
1128538192.875000 1128538195.000000
1128538206.625000 1128538209.125000
1128538302.500000 1128538305.500000
1128538312.500000 1128538315.000000
1128538323.875000 1128538327.000000
1128538329.250000 1128538331.750000
1128538334.750000 1128538341.750000
1128538349.500000 1128538353.046875
1128538381.250000 1128538386.000000
1128538477.687500 1128538482.125000
1128538482.500000 1128538487.000000
1128540007.875000 1128540010.000000
1128540041.000000 1128540048.000000
1128544899.500000 1128544902.000000
1128623521.000000 1128623526.500000
1128640329.000000 1128640334.000000
1128643578.500000 1128643581.500000
1128656288.500000 1128656293.000000
1128656365.500000 1128656368.500000
1128657047.500000 1128657050.000000
1128657645.000000 1128657649.000000
1128658421.000000 1128658425.500000
1128658679.000000 1128658684.000000
1128662757.500000 1128662760.000000
1128665484.000000 1128665488.000000
1128666202.000000 1128666206.500000
1128669172.500000 1128669176.000000
1128669638.500000 1128669645.000000
1128670107.500000 1128670110.500000
1128670131.375000 1128670134.000000
1128673116.500000 1128673119.500000
1128673127.000000 1128673131.000000
1128674997.500000 1128675000.000000
1128675144.000000 1128675150.000000
1128675546.000000 1128675553.000000
1128675987.000000 1128675994.000000
1128682548.500000 1128682551.000000
1128684904.500000 1128684907.000000
1128685521.000000 1128685524.000000
1128688565.000000 1128688568.000000
1128689084.500000 1128689087.500000
1128693247.000000 1128693250.000000
1128693280.500000 1128693284.000000
1128695193.000000 1128695201.500000
1128695207.500000 1128695210.000000
1128695226.000000 1128695230.000000
1128695234.000000 1128695236.500000
1128695478.625000 1128695481.500000
1128695512.500000 1128695516.500000
1128695543.250000 1128695546.000000
1128695556.000000 1128695558.500000
1128697337.500000 1128697351.000000
1128697359.500000 1128697363.000000
1128698178.125000 1128698182.000000
1128698303.125000 1128698307.000000
1128698314.500000 1128698317.500000
1128700347.000000 1128700352.000000
1128700353.000000 1128700358.000000
1128700571.750000 1128700574.500000
1128700676.000000 1128700680.000000
1128700690.500000 1128700695.000000
1128700696.000000 1128700703.000000
1128701032.000000 1128701034.500000
1128701052.500000 1128701057.000000
1128703587.000000 1128703589.500000
1128704663.187500 1128704667.000000
1128705498.000000 1128705501.000000
1128705556.500000 1128705561.500000
1128705564.500000 1128705567.500000
1128706055.750000 1128706058.000000
1128706106.500000 1128706109.500000
1128706119.500000 1128706123.625000
1128707178.875000 1128707181.750000
1128739954.250000 1128739956.500000
1128740621.687500 1128740624.250000
1128741275.750000 1128741278.500000
1128741596.250000 1128741599.000000
1128741697.250000 1128741700.750000
1128741709.750000 1128741713.000000
1128762082.000000 1128762084.250000
1128777007.500000 1128777014.000000
1128777038.000000 1128777047.500000
1128779797.000000 1128779800.000000
1128780447.500000 1128780451.000000
1128781928.500000 1128781932.500000
1128781934.500000 1128781942.000000
1128782463.000000 1128782466.000000
1128827309.000000 1128827317.000000
1128837634.250000 1128837638.250000
1128837710.000000 1128837712.750000
1128837716.000000 1128837725.500000
1128837748.750000 1128837766.250000
1128837772.500000 1128837792.000000
1128866180.000000 1128866183.000000
1128867801.000000 1128867810.500000
1128867816.500000 1128867839.000000
1128867938.000000 1128867943.000000
1128867963.000000 1128867967.500000
1128868522.500000 1128868534.500000
1128869634.500000 1128869639.000000
1128869649.000000 1128869652.000000
1128869977.875000 1128869993.000000
1128872499.500000 1128872503.000000
1128936405.000000 1128936408.000000
1128954407.250000 1128954426.000000
1129039571.000000 1129039579.000000
1129045607.000000 1129045613.500000
1129050603.500000 1129050619.500000
1129052940.000000 1129052942.500000
1129057996.500000 1129058001.500000
1129062520.000000 1129062522.500000
1129067303.500000 1129067307.500000
1129067931.000000 1129067936.000000
1129070185.000000 1129070189.500000
1129070193.500000 1129070200.000000
1129070207.500000 1129070213.000000
1129106487.875000 1129106490.000000
1129112057.000000 1129112063.000000
1129118228.250000 1129118247.000000
1129133932.500000 1129133935.500000
1129143852.500000 1129143856.500000
1129148729.500000 1129148734.000000
1129148859.000000 1129148863.750000
1129148905.000000 1129148908.500000
1129148966.500000 1129148970.500000
1129149114.000000 1129149117.500000
1129150593.500000 1129150599.500000
1129151159.500000 1129151162.500000
1129152675.625000 1129152679.000000
1129152696.000000 1129152710.875000
1129152721.000000 1129152738.000000
1129152740.500000 1129152747.500000
1129152750.500000 1129152755.000000
1129155927.500000 1129155930.500000
1129156040.000000 1129156046.000000
1129156399.000000 1129156401.500000
1129156991.500000 1129156994.000000
1129157154.000000 1129157157.000000
1129157522.500000 1129157525.500000
1129221703.000000 1129221718.500000
1129221741.125000 1129221743.500000
1129221798.000000 1129221801.500000
1129221804.000000 1129221812.500000
1129221831.500000 1129221834.500000
1129221884.500000 1129221889.500000
1129221997.250000 1129222003.000000
1129222005.500000 1129222010.000000
1129222362.000000 1129222391.000000
1129241961.500000 1129241965.187500
1129266970.000000 1129266973.000000
1129271202.500000 1129271204.625000
1129287696.000000 1129287699.000000
1129287817.718750 1129287820.750000
1129298483.000000 1129298489.000000
1129298504.500000 1129298513.000000
1129298594.500000 1129298597.000000
1129298602.000000 1129298606.000000
1129298620.000000 1129298622.125000
1129298622.250000 1129298625.000000
1129298625.500000 1129298630.000000
1129298637.500000 1129298643.500000
1129298838.500000 1129298842.500000
1129298843.500000 1129298851.500000
1129298855.500000 1129298861.000000
1129298862.500000 1129298881.000000
1129298885.500000 1129298888.000000
1129298889.500000 1129298896.500000
1129300770.500000 1129300779.000000
1129302744.750000 1129302747.000000
1129302898.750000 1129302902.000000
1129302930.500000 1129302933.000000
1129302944.500000 1129302954.000000
1129303955.500000 1129303959.000000
1129305315.000000 1129305318.000000
1129305335.500000 1129305341.000000
1129305375.000000 1129305380.500000
1129306595.000000 1129306598.000000
1129306763.500000 1129306766.000000
1129308059.500000 1129308063.000000
1129309913.500000 1129309922.500000
1129311314.750000 1129311320.000000
1129311414.000000 1129311417.000000
1129312538.000000 1129312540.500000
1129312565.500000 1129312569.000000
1129312571.500000 1129312575.500000
1129312590.000000 1129312594.000000
1129312662.125000 1129312665.500000
1129312767.500000 1129312776.500000
1129312860.000000 1129312862.500000
1129312903.000000 1129312916.500000
1129313911.000000 1129313921.500000
1129314307.000000 1129314316.000000
1129317435.500000 1129317441.000000
1129317452.500000 1129317460.500000
1129317464.000000 1129317471.000000
1129317495.000000 1129317498.375000
1129319206.500000 1129319209.000000
1129319218.000000 1129319220.500000
1129319222.000000 1129319224.500000
1129319242.000000 1129319245.000000
1129319251.500000 1129319254.000000
1129378668.000000 1129378670.500000
1129497641.500000 1129497646.000000
1129514674.000000 1129514679.000000
1129532449.500000 1129532452.000000
1129552966.500000 1129552969.000000
1129560724.312500 1129560728.000000
1129560729.250000 1129560732.500000
1129560850.000000 1129560855.000000
1129560883.500000 1129560887.500000
1129560891.875000 1129560895.500000
1129560897.000000 1129560904.500000
1129560923.375000 1129560928.500000
1129570756.375000 1129570758.500000
1129610182.500000 1129610185.000000
1129612408.500000 1129612412.000000
1129613327.500000 1129613332.000000
1129613634.500000 1129613637.500000
1129614114.750000 1129614122.000000
1129614570.500000 1129614574.000000
1129644226.500000 1129644230.000000
1129652536.500000 1129652540.500000
1129656610.000000 1129656613.000000
1129657771.000000 1129657773.500000
1129658256.000000 1129658260.000000
1129658552.000000 1129658556.000000
1129660005.500000 1129660024.500000
1129694893.500000 1129694896.000000
1129760460.000000 1129760463.000000
1130018988.500000 1130018991.000000
1130019001.312500 1130019005.500000
1130065742.500000 1130065745.500000
1130078911.500000 1130078916.000000
1130079868.000000 1130079871.000000
1130080311.000000 1130080314.500000
1130080318.000000 1130080322.000000
1130080336.000000 1130080339.000000
1130081147.000000 1130081152.000000
1130081154.000000 1130081157.000000
1130081169.250000 1130081173.500000
1130082347.500000 1130082351.500000
1130082356.000000 1130082359.000000
1130082362.500000 1130082366.500000
1130082367.500000 1130082374.000000
1130083645.000000 1130083652.250000
1130084396.125000 1130084399.500000
1130084425.000000 1130084428.000000
1130086909.375000 1130086913.000000
1130087515.750000 1130087519.000000
1130087530.500000 1130087533.500000
1130088020.500000 1130088024.000000
1130088723.000000 1130088726.500000
1130088754.000000 1130088759.500000
1130090204.500000 1130090212.000000
1130090613.437500 1130090616.500000
1130090657.500000 1130090661.000000
1130091233.875000 1130091236.500000
1130091990.500000 1130091994.000000
1130092744.500000 1130092751.000000
1130093885.000000 1130093889.000000
1130094099.000000 1130094102.000000
1130094120.500000 1130094123.000000
1130094124.000000 1130094132.500000
1130128620.500000 1130128633.500000
1130178238.125000 1130178244.000000
1130181517.000000 1130181525.000000
1130184043.000000 1130184045.500000
1130184053.812500 1130184056.500000
1130188549.750000 1130188553.000000
1130188580.750000 1130188584.000000
1130233394.500000 1130233399.000000
1130235505.000000 1130235511.000000
1130326813.500000 1130326820.000000
1130327056.000000 1130327058.500000
1130329009.250000 1130329015.000000
1130596032.000000 1130596034.125000
1130598792.500000 1130598797.000000
1130598813.000000 1130598817.500000
1130599611.000000 1130599616.250000
1130600118.000000 1130600120.500000
1130600178.500000 1130600220.000000
1130600583.000000 1130600585.500000
1130601154.000000 1130601157.000000
1130601182.000000 1130601190.000000
1130602308.000000 1130602312.000000
1130602330.000000 1130602332.015625
1130602345.000000 1130602349.000000
1130602778.000000 1130602781.500000
1130602783.500000 1130602788.000000
1130603032.500000 1130603035.000000
1130603123.867187 1130603135.000000
1130645613.000000 1130645627.000000
1130660656.187500 1130660670.000000
1130680203.500000 1130680206.859375
1130685317.468750 1130685320.062500
1130685387.500000 1130685389.781250
1130685390.519531 1130685394.015625
1130685662.500000 1130685665.375000
1130687538.250000 1130687542.734375
1130687677.781250 1130687680.125000
1130688810.500000 1130688813.250000
1130688862.500000 1130688865.625000
1130688965.875000 1130688970.671875
1130688973.750000 1130688979.250000
1130753376.500000 1130753411.000000
1130772092.000000 1130772094.750000
1130775374.500000 1130775391.000000
1130777388.500000 1130777399.000000
1130777412.000000 1130777416.000000
1130777418.500000 1130777424.000000
1130777723.656250 1130777730.000000
1130777740.500000 1130777744.000000
1130780157.500000 1130780161.000000
1130781874.000000 1130781883.000000
1130782689.250000 1130782698.000000
1130795604.500000 1130795608.000000
1130796200.000000 1130796209.000000
1130796344.000000 1130796361.000000
1130796418.500000 1130796430.000000
1130796461.000000 1130796471.000000
1130796481.062500 1130796490.000000
1130808544.000000 1130808562.500000
1130808576.875000 1130808580.000000
1130808584.125000 1130808587.500000
1130808590.500000 1130808594.500000
1130808599.500000 1130808620.000000
1130808620.500000 1130808628.000000
1130808629.000000 1130808632.000000
1130808640.000000 1130808651.000000
1130840234.000000 1130840246.000000
1130859953.500000 1130859956.250000
1130887966.000000 1130887973.000000
1130916495.000000 1130916516.000000
1130955407.750000 1130955410.000000
1130979927.500000 1130979930.500000
1130980018.000000 1130980020.500000
1131012748.500000 1131012751.000000
1131015713.000000 1131015721.500000
1131015794.000000 1131015802.500000
1131015850.000000 1131015860.000000
1131015918.000000 1131015920.500000
1131015943.000000 1131015949.500000
1131015965.750000 1131015972.000000
1131015976.000000 1131015983.000000
1131015989.500000 1131015993.500000
1131015998.500000 1131016002.000000
1131054419.000000 1131054422.500000
1131054494.500000 1131054497.500000
1131054547.937500 1131054552.500000
1131054654.500000 1131054657.250000
1131054666.750000 1131054669.000000
1131054702.000000 1131054705.000000
1131054727.671875 1131054730.000000
1131054927.500000 1131054931.500000
1131054951.875000 1131054954.000000
1131054976.750000 1131054981.000000
1131055672.875000 1131055675.000000
1131055677.875000 1131055681.000000
1131055711.000000 1131055713.500000
1131055768.000000 1131055770.500000
1131055795.000000 1131055799.500000
1131055806.000000 1131055809.000000
1131055939.625000 1131055943.000000
1131055946.750000 1131055949.500000
1131055951.000000 1131055953.250000
1131055966.437500 1131055969.250000
1131056008.687500 1131056011.000000
1131056032.500000 1131056034.750000
1131056082.500000 1131056085.000000
1131056090.500000 1131056093.500000
1131056142.000000 1131056144.500000
1131056147.000000 1131056150.000000
1131056184.750000 1131056188.000000
1131056323.500000 1131056326.500000
1131056326.875000 1131056331.000000
1131056348.000000 1131056350.500000
1131056393.500000 1131056400.000000
1131058520.125000 1131058524.500000
1131058525.000000 1131058531.000000
1131058545.000000 1131058551.000000
1131058579.500000 1131058583.500000
1131058646.000000 1131058649.000000
1131058652.125000 1131058654.500000
1131058655.375000 1131058657.500000
1131058701.375000 1131058705.000000
1131058705.500000 1131058708.000000
1131058709.500000 1131058712.000000
1131058786.000000 1131058788.500000
1131058838.750000 1131058843.500000
1131058848.500000 1131058854.500000
1131058874.875000 1131058877.000000
1131058889.000000 1131058894.000000
1131058903.000000 1131058905.500000
1131058914.750000 1131058917.250000
1131058934.875000 1131058938.000000
1131058965.250000 1131058970.000000
1131058972.750000 1131058975.000000
1131058977.187500 1131058981.000000
1131058997.000000 1131059000.000000
1131059002.750000 1131059006.500000
1131059048.500000 1131059051.000000
1131059051.500000 1131059058.250000
1131059075.000000 1131059078.000000
1131059083.000000 1131059093.000000
1131059114.250000 1131059119.500000
1131059126.875000 1131059129.000000
1131059140.000000 1131059144.500000
1131059181.875000 1131059184.500000
1131059192.000000 1131059197.000000
1131059251.375000 1131059254.000000
1131059285.375000 1131059290.000000
1131059295.000000 1131059298.500000
1131059309.125000 1131059311.250000
1131059315.750000 1131059318.500000
1131059353.750000 1131059356.500000
1131059374.500000 1131059379.500000
1131059381.000000 1131059387.000000
1131059413.000000 1131059415.500000
1131059431.500000 1131059434.250000
1131059466.500000 1131059469.500000
1131059472.250000 1131059476.000000
1131059497.500000 1131059500.000000
1131059516.000000 1131059518.500000
1131059556.500000 1131059559.500000
1131062887.625000 1131062892.000000
1131062892.125000 1131062895.000000
1131062976.437500 1131062979.250000
1131062979.625000 1131062982.000000
1131063038.500000 1131063043.000000
1131063116.000000 1131063119.000000
1131063140.500000 1131063143.500000
1131063145.000000 1131063147.500000
1131063154.625000 1131063158.000000
1131063159.500000 1131063162.500000
1131063164.500000 1131063168.000000
1131063221.375000 1131063223.500000
1131063224.875000 1131063227.000000
1131063244.375000 1131063247.000000
1131063267.250000 1131063272.000000
1131063272.250000 1131063276.500000
1131063292.750000 1131063295.500000
1131063300.000000 1131063302.500000
1131063360.000000 1131063365.250000
1131063371.000000 1131063375.000000
1131063382.500000 1131063384.750000
1131063397.250000 1131063400.000000
1131063425.750000 1131063429.000000
1131063429.437500 1131063432.000000
1131063437.000000 1131063439.500000
1131063499.250000 1131063501.750000
1131063502.625000 1131063505.500000
1131063517.375000 1131063520.250000
1131063530.812500 1131063533.000000
1131063567.250000 1131063569.500000
1131063577.500000 1131063581.250000
1131063600.250000 1131063605.000000
1131063628.625000 1131063631.000000
1131063649.750000 1131063653.500000
1131063657.500000 1131063660.000000
1131063668.500000 1131063671.500000
1131063694.000000 1131063699.250000
1131063731.250000 1131063736.250000
1131063763.500000 1131063772.500000
1131063773.500000 1131063777.500000
1131063828.750000 1131063833.500000
1131063839.500000 1131063842.500000
1131063844.125000 1131063849.500000
1131179499.000000 1131179508.750000
1131205621.500000 1131205626.000000
1131260167.875000 1131260171.750000
1131260175.000000 1131260210.000000
1131272064.875000 1131272068.000000
1131272238.250000 1131272240.500000
1131272253.000000 1131272266.000000
1131272325.000000 1131272335.500000
1131272348.500000 1131272361.000000
1131272365.250000 1131272373.500000
1131272835.000000 1131272839.000000
1131272839.500000 1131272847.000000
1131272849.937500 1131272856.000000
1131301673.500000 1131301677.000000
1131302391.750000 1131302394.000000
1131310485.000000 1131310492.000000
1131338066.500000 1131338069.500000
1131338072.000000 1131338076.000000
1131339791.000000 1131339797.500000
1131369335.250000 1131369337.500000
1131373844.625000 1131373850.875000
1131382238.000000 1131382241.000000
1131382266.250000 1131382269.500000
1131382271.500000 1131382274.000000
1131385708.000000 1131385711.000000
1131399269.500000 1131399272.000000
1131403294.500000 1131403297.500000
1131408606.500000 1131408609.000000
1131409179.000000 1131409182.500000
1131410493.000000 1131410495.500000
1131411496.000000 1131411500.000000
1131412465.750000 1131412469.500000
1131415073.250000 1131415075.500000
1131417991.000000 1131417996.000000
1131421947.000000 1131421949.750000
1131423217.000000 1131423220.000000
1131423907.500000 1131423910.000000
1131424795.000000 1131424799.000000
1131425511.000000 1131425515.000000
1131426492.000000 1131426497.000000
1131426896.000000 1131426900.000000
1131427520.375000 1131427523.500000
1131427659.750000 1131427662.500000
1131428114.500000 1131428117.000000
1131428118.000000 1131428121.500000
1131428583.250000 1131428592.000000
1131428641.000000 1131428645.000000
1131429828.750000 1131429837.000000
1131773049.625000 1131773052.062500
1131773434.000000 1131773436.078125
1131773479.125000 1131773481.500000
1131773660.500000 1131773663.000000
1131774063.875000 1131774074.984375
1131774357.500000 1131774360.000000
1131774360.218750 1131774363.750000
1131775377.500000 1131775386.718750
1131776046.250000 1131776048.500000
1131780302.250000 1131780304.750000
1131780372.500000 1131780376.000000
1133004493.000000 1133004496.000000
1133287572.625000 1133287583.500000
1133287588.000000 1133287593.500000
1133287613.500000 1133287616.500000
1133288580.000000 1133288583.000000
1133292867.000000 1133292871.000000
1133296048.000000 1133296051.000000
1133302504.000000 1133302507.000000
1133304324.000000 1133304351.000000
1133304353.000000 1133304356.000000
1133448112.000000 1133448117.000000
1133449816.000000 1133449821.000000
1133450029.500000 1133450034.500000
1133450225.000000 1133450228.000000
1133451516.000000 1133451531.000000
1133453295.125000 1133453300.000000
1133454910.437500 1133454915.500000
1133456441.000000 1133456446.500000
1133459543.000000 1133459546.000000
1133459547.000000 1133459553.000000
1133461217.000000 1133461227.000000
1133465318.000000 1133465321.000000
1133465798.500000 1133465803.500000
1133465941.875000 1133465945.500000
1133466206.000000 1133466208.500000
1133466441.500000 1133466444.000000
1133466559.000000 1133466564.000000
1133467722.000000 1133467726.000000
1133615897.000000 1133615899.500000
1133617387.750000 1133617390.000000
1133617485.500000 1133617489.000000
1133617493.000000 1133617500.000000
1133617582.500000 1133617585.000000
1133619969.000000 1133619972.000000
1133621680.500000 1133621687.000000
1133621688.000000 1133621696.000000
1133621714.000000 1133621717.000000
1133621721.000000 1133621724.500000
1133621729.750000 1133621734.500000
1133690900.000000 1133690904.000000
1133692208.000000 1133692211.000000
1133692709.250000 1133692715.000000
1133740901.000000 1133740909.500000
1133745182.875000 1133745185.500000
1133775949.000000 1133775952.000000
1133789022.000000 1133789024.500000
1133793056.000000 1133793060.000000
1133927623.625000 1133927626.000000
1133927627.000000 1133927638.000000
1133928840.000000 1133928853.000000
1133928854.500000 1133928860.000000
1133929451.500000 1133929455.000000
1133929460.000000 1133929462.500000
1133930021.000000 1133930034.000000
1133930036.000000 1133930043.000000
1133930715.000000 1133930729.000000
1133930729.500000 1133930732.500000
1133930858.500000 1133930863.000000
1133931223.125000 1133931226.000000
1133932785.000000 1133932790.000000
1133933743.500000 1133933764.000000
1133933942.500000 1133933948.000000
1133935830.500000 1133935836.500000
1133936648.000000 1133936651.000000
1133936652.000000 1133936655.000000
1133936655.500000 1133936658.500000
1133936755.187500 1133936772.000000
1133937806.250000 1133937817.000000
1133938216.937500 1133938222.000000
1133938645.000000 1133938652.000000
1133938783.125000 1133938802.000000
1133938883.000000 1133938886.000000
1133939354.000000 1133939360.000000
1133939367.500000 1133939371.000000
1133939701.000000 1133939710.000000
1133940828.000000 1133940832.000000
1133942974.000000 1133942979.000000
1133944060.250000 1133944063.000000
1133946231.500000 1133946236.000000
1133949704.000000 1133949712.125000
1133953648.000000 1133953659.000000
1133953662.000000 1133953667.000000
1133956522.000000 1133956536.750000
1133960527.000000 1133960529.500000
1133960529.750000 1133960533.000000
1133960541.500000 1133960547.750000
1134008629.000000 1134008633.500000
1134110522.000000 1134110525.000000
1134118506.000000 1134118523.000000
1134119779.000000 1134119783.000000
1134120533.250000 1134120544.000000
1134132097.000000 1134132100.000000
1134134011.500000 1134134015.000000
1134134350.250000 1134134352.500000
1134134776.125000 1134134779.000000
1134139153.000000 1134139156.000000
1134145868.500000 1134145871.000000
1134146884.000000 1134146887.000000
1134152867.000000 1134152870.000000
1134153885.000000 1134153888.000000
1134158339.750000 1134158344.500000
1134164784.000000 1134164789.000000
1134166213.000000 1134166237.000000
1134166238.750000 1134166244.000000
1134274659.750000 1134274664.000000
1134294599.000000 1134294626.000000
1134294661.000000 1134294670.000000
1134294673.500000 1134294685.000000
1134315356.750000 1134315360.000000
1134327562.000000 1134327565.000000
1134328076.000000 1134328085.000000
1134353287.000000 1134353295.500000
1134366084.000000 1134366093.000000
1134386097.000000 1134386101.000000
1134404022.500000 1134404025.500000
1134405504.250000 1134405509.000000
1134407893.000000 1134407898.000000
1134408731.000000 1134408735.000000
1134413134.500000 1134413138.000000
1134413168.500000 1134413174.000000
1134413190.750000 1134413194.000000
1134441251.000000 1134441255.000000
1134447097.000000 1134447100.000000
1134473801.000000 1134473804.000000
1134477178.000000 1134477182.000000
1134487755.468750 1134487760.000000
1134489063.750000 1134489068.000000
1134489070.500000 1134489075.500000
1134489322.000000 1134489325.000000
1134490496.500000 1134490499.000000
1134493274.500000 1134493277.000000
1134521308.812500 1134521311.000000
1134566052.000000 1134566056.000000
1134576992.500000 1134576995.000000
1134577701.000000 1134577704.500000
1134586964.500000 1134586967.000000
1134591191.750000 1134591195.000000
1134675331.500000 1134675334.500000
1134675624.500000 1134675632.000000
1134675687.000000 1134675696.000000
1134736636.500000 1134736639.000000
1134737102.750000 1134737105.500000
1134737198.500000 1134737201.000000
1134738024.000000 1134738028.000000
1134750897.750000 1134750901.500000
1134757402.468750 1134757404.500000
1134758090.500000 1134758093.500000
1134763646.437500 1134763649.000000
1134764193.000000 1134764203.000000
1134764903.000000 1134764906.000000
1134775123.000000 1134775126.000000
1134775181.625000 1134775184.750000
1134784842.734375 1134784849.710938
1134784852.628906 1134784854.855469
1134784858.750000 1134784861.937500
1134785107.705078 1134785114.625000
1134785242.500000 1134785249.000000
1134785673.375000 1134785684.875000
1134786154.500000 1134786156.625000
1134787086.750000 1134787089.500000
1134790450.875000 1134790454.750000
1134790738.500000 1134790741.031250
1134790784.500000 1134790789.000000
1134792533.250000 1134792535.500000
1134794277.500000 1134794280.250000
1134794797.500000 1134794800.000000
1134795509.500000 1134795513.000000
1134795567.500000 1134795573.000000
1134825280.750000 1134825283.000000
1134862361.500000 1134862366.000000
1134870535.000000 1134870538.000000
1134872391.906250 1134872395.250000
1134872723.500000 1134872730.500000
1134877091.000000 1134877093.500000
1134903566.000000 1134903576.000000
1134904695.500000 1134904707.000000
1134907658.437500 1134907662.605469
1134907674.329101 1134907676.816407
1134907677.250000 1134907689.687500
1134907695.937500 1134907700.500000
1134907739.382812 1134907741.917969
1134907755.167968 1134907759.125000
1134907763.430664 1134907765.625000
1134907769.541015 1134907772.351563
1134907787.007812 1134907790.000000
1134907792.500000 1134907797.074219
1134907850.250000 1134907853.500000
1134907857.500000 1134907860.500000
1134907860.750000 1134907872.750000
1134907875.484375 1134907878.250000
1134907932.500000 1134907935.000000
1134908033.000000 1134908036.000000
1134908060.000000 1134908062.750000
1134908144.500000 1134908153.000000
1134908177.500000 1134908181.500000
1134908199.187500 1134908202.000000
1134908205.062500 1134908212.750000
1134908214.875000 1134908222.000000
1134908292.500000 1134908297.000000
1134908298.500000 1134908304.000000
1134908304.125000 1134908306.750000
1134908306.937500 1134908309.347657
1134908309.460937 1134908312.023438
1134908320.437500 1134908329.597657
1134908330.500000 1134908332.507813
1134908336.373047 1134908339.250000
1134908339.500000 1134908344.000000
1134908349.187500 1134908352.500000
1134908354.000000 1134908358.250000
1134908367.250000 1134908371.500000
1134908432.000000 1134908438.500000
1134908438.750000 1134908443.250000
1134908453.062500 1134908455.500000
1134908487.375000 1134908491.000000
1134908506.812500 1134908509.625000
1134908547.000000 1134908549.500000
1134908561.000000 1134908569.500000
1134908573.437500 1134908575.500000
1134908595.000000 1134908599.500000
1134908604.250000 1134908608.000000
1134908608.500000 1134908611.296875
1134908613.763672 1134908617.890625
1134908618.116211 1134908620.750000
1134908621.156250 1134908624.367188
1134908651.000000 1134908656.000000
1134908696.875000 1134908699.000000
1134908710.625000 1134908714.500000
1134908741.625000 1134908743.750000
1134908746.500000 1134908749.500000
1134908881.750000 1134908884.500000
1134908961.750000 1134908967.250000
1134908986.500000 1134908989.000000
1134909008.468750 1134909011.250000
1134909031.625000 1134909034.125000
1134909037.855468 1134909042.750000
1134909071.000000 1134909074.250000
1134909101.750000 1134909104.250000
1134909118.000000 1134909120.500000
1134909131.500000 1134909137.000000
1134909159.117187 1134909163.000000
1134909202.500000 1134909205.000000
1134909208.875000 1134909212.000000
1134909216.000000 1134909220.000000
1134909243.000000 1134909254.625000
1134909297.187500 1134909301.500000
1134909304.500000 1134909307.000000
1134909360.000000 1134909362.500000
1134909363.250000 1134909366.500000
1134909367.562500 1134909374.250000
1134909374.375000 1134909384.000000
1134909399.000000 1134909403.000000
1134909426.531250 1134909429.050782
1134909442.968750 1134909445.000000
1134909450.000000 1134909453.500000
1134909499.875000 1134909502.500000
1134909556.000000 1134909559.500000
1134909562.500000 1134909565.500000
1134909656.375000 1134909658.500000
1134909814.000000 1134909819.000000
1134909828.500000 1134909837.500000
1134909839.500000 1134909842.000000
1134909844.750000 1134909850.000000
1134909853.750000 1134909861.000000
1134909879.500000 1134909889.125000
1134910538.750000 1134910541.000000
1134910543.000000 1134910549.250000
1134910586.000000 1134910589.500000
1134910591.000000 1134910595.500000
1134910597.480468 1134910606.000000
1134910675.750000 1134910685.750000
1134910688.500000 1134910708.000000
1134910708.500000 1134910712.000000
1134910726.500000 1134910729.000000
1134910817.875000 1134910821.000000
1134910831.125000 1134910835.625000
1134910837.000000 1134910839.750000
1134910872.750000 1134910875.750000
1134910876.375000 1134910878.500000
1134910881.750000 1134910886.500000
1134910888.734375 1134910891.000000
1134910897.250000 1134910900.000000
1134910924.750000 1134910929.000000
1134911044.000000 1134911051.750000
1134911272.000000 1134911277.250000
1134911278.750000 1134911285.750000
1134911287.500000 1134911290.500000
1134911313.000000 1134911318.000000
1134911337.875000 1134911344.000000
1134911390.625000 1134911396.703125
1134911406.000000 1134911409.593750
1134911418.000000 1134911429.000000
1134911485.000000 1134911487.500000
1134911497.500000 1134911503.000000
1134911551.500000 1134911559.125000
1134911575.250000 1134911582.000000
1134911594.500000 1134911598.500000
1134911600.843750 1134911603.250000
1134911653.375000 1134911656.000000
1134911669.000000 1134911673.500000
1134911701.250000 1134911705.500000
1134911754.875000 1134911758.000000
1134911877.000000 1134911885.500000
1134911937.000000 1134911944.000000
1134911958.500000 1134911962.250000
1134912004.000000 1134912010.750000
1134912011.000000 1134912016.000000
1134912105.375000 1134912110.000000
1134912110.875000 1134912113.625000
1134912116.500000 1134912119.000000
1134912130.250000 1134912137.000000
1134912198.279297 1134912201.500000
1134912442.500000 1134912445.250000
1134912457.875000 1134912463.000000
1134912552.000000 1134912554.500000
1134912555.000000 1134912558.000000
1134913960.000000 1134913973.000000
1134914595.750000 1134914598.000000
1134915469.500000 1134915472.000000
1134916264.500000 1134916272.000000
1134916482.000000 1134916484.500000
1134916568.000000 1134916575.500000
1134917111.250000 1134917113.500000
1134917122.000000 1134917128.000000
1134917937.500000 1134917940.000000
1134917940.500000 1134917951.000000
1134918342.000000 1134918346.000000
1134918885.250000 1134918889.000000
1134918891.000000 1134918895.750000
1134918931.500000 1134918934.500000
1134918937.500000 1134918941.250000
1134918990.375000 1134918993.750000
1134919229.500000 1134919232.000000
1134919236.500000 1134919240.500000
1134919244.500000 1134919254.000000
1134919262.625000 1134919265.000000
1134919280.250000 1134919282.500000
1134919629.500000 1134919632.750000
1134919671.500000 1134919676.000000
1134919771.875000 1134919774.750000
1134919781.000000 1134919783.500000
1134920027.000000 1134920030.000000
1134920038.000000 1134920042.000000
1134920042.500000 1134920045.000000
1134920360.000000 1134920366.000000
1134920374.750000 1134920377.500000
1134920659.000000 1134920663.500000
1134920665.000000 1134920670.500000
1134920672.000000 1134920678.000000
1134920691.375000 1134920693.500000
1134920796.000000 1134920800.000000
1134920805.875000 1134920815.375000
1134921185.500000 1134921188.000000
1134921385.500000 1134921388.500000
1134921585.500000 1134921595.500000
1134921910.500000 1134921916.000000
1134922608.000000 1134922610.250000
1134922764.750000 1134922767.750000
1134923222.000000 1134923227.500000
1134923314.000000 1134923316.250000
1134923316.500000 1134923319.500000
1134923321.500000 1134923334.500000
1134923605.500000 1134923611.500000
1134923780.000000 1134923784.000000
1134923905.875000 1134923915.000000
1134924628.000000 1134924631.000000
1134924702.000000 1134924705.000000
1134924711.000000 1134924718.000000
1134925332.625000 1134925336.000000
1134925340.000000 1134925344.000000
1134925344.125000 1134925347.250000
1134926360.000000 1134926362.500000
1134926368.000000 1134926377.500000
1134926379.000000 1134926381.500000
1134926757.000000 1134926766.000000
1134926772.500000 1134926782.000000
1134926867.000000 1134926870.000000
1134927451.640625 1134927455.031250
1134927467.101562 1134927469.195313
1134927611.934570 1134927614.875000
1134927617.160156 1134927619.781250
1134927636.000000 1134927638.500000
1134927641.000000 1134927646.500000
1134927648.500000 1134927651.062500
1134927651.187500 1134927654.375000
1134927955.328125 1134927957.613282
1134928097.500000 1134928101.732422
1134928122.421875 1134928124.902344
1134928128.549804 1134928130.960938
1134928237.000000 1134928244.000000
1134928744.000000 1134928746.750000
1134928747.500000 1134928751.000000
1134929282.000000 1134929289.000000
1134929548.000000 1134929552.000000
1134929636.375000 1134929642.000000
1134929642.250000 1134929647.500000
1135022005.500000 1135022008.000000
1135022041.500000 1135022044.500000
1135022391.000000 1135022393.500000
1135033541.019531 1135033544.500000
1135033600.621093 1135033604.250000
1135033607.375000 1135033609.750000
1135033614.250000 1135033616.500000
1135050903.875000 1135050907.000000
1135054262.000000 1135054267.000000
1135054405.500000 1135054408.000000
1135055913.125000 1135055915.750000
1135056788.000000 1135056792.000000
1135057189.500000 1135057193.000000
1135697309.000000 1135697313.000000
1135698410.000000 1135698416.500000
1135745482.000000 1135745528.250000
1135751536.500000 1135751543.000000
1135754149.250000 1135754154.000000
1135754155.500000 1135754162.000000
1135754179.000000 1135754182.000000
1135799680.000000 1135799684.000000
1135823671.000000 1135823676.000000
1135887459.000000 1135887463.000000
1135890709.500000 1135890714.000000
1135916463.000000 1135916467.250000
1135942642.000000 1135942646.000000
1135942990.250000 1135943016.000000
1135957272.000000 1135957277.000000
1135961358.500000 1135961370.000000
1135982774.750000 1135982780.000000
1135989891.000000 1135989894.000000
1136006378.000000 1136006383.000000
1136013029.750000 1136013032.000000
1136015151.000000 1136015155.000000
1136024544.500000 1136024553.000000
1136024556.000000 1136024576.000000
1136113637.000000 1136113645.000000
1136115068.000000 1136115073.000000
1136121260.000000 1136121264.000000
1136122797.000000 1136122803.500000
1136166295.000000 1136166299.000000
1136176698.000000 1136176708.000000
1136202241.000000 1136202244.000000
1136203753.000000 1136203756.000000
1136206122.500000 1136206136.000000
1136206136.250000 1136206146.000000
1136265468.000000 1136265471.000000
1136269445.500000 1136269449.000000
1136270319.500000 1136270326.000000
1136289585.000000 1136289589.000000
1136299775.000000 1136299782.000000
1136301121.750000 1136301124.000000
1136368603.250000 1136368625.062500
1136368625.437500 1136368653.812500
1136368655.000000 1136368657.375000
1136368714.125000 1136368716.250000
1136368721.000000 1136368723.437500
1136368727.500000 1136368729.531250
1136368733.875000 1136368735.937500
1136368736.125000 1136368741.000000
1136368742.437500 1136368744.687500
1136368752.812500 1136368767.562500
1136368767.875000 1136368770.187500
1136368771.093750 1136368773.812500
1136368774.312500 1136368779.718750
1136368783.750000 1136368788.312500
1136368788.562500 1136368791.500000
1136368791.718750 1136368797.750000
1136368803.093750 1136368807.296875
1136368825.718750 1136368828.687500
1136368843.625000 1136368846.656250
1136368847.875000 1136368874.000000
1136368878.171875 1136368881.281250
1136368884.843750 1136368887.031250
1136368927.250000 1136368931.187500
1136368954.500000 1136368956.593750
1136368970.250000 1136368973.125000
1136368986.343750 1136368990.500000
1136368992.562500 1136369005.000000
1136369005.500000 1136369008.750000
1136369008.906250 1136369011.093750
1136369069.843750 1136369072.125000
1136369077.250000 1136369079.500000
1136369079.875000 1136369082.250000
1136369082.375000 1136369091.625000
1136369092.031250 1136369094.750000
1136369096.125000 1136369098.250000
1136369099.875000 1136369102.375000
1136369102.718750 1136369109.375000
1136369111.625000 1136369114.000000
1136369114.875000 1136369117.125000
1136369140.375000 1136369147.937500
1136369163.500000 1136369170.625000
1136369203.029297 1136369206.250000
1136369222.437500 1136369225.050782
1136369225.750000 1136369228.386719
1136369230.500000 1136369269.750000
1136369271.625000 1136369282.000000
1136375175.875000 1136375179.000000
1136391476.250000 1136391479.000000
1136391552.500000 1136391557.500000
1136391574.500000 1136391577.750000
1136391583.742187 1136391586.000000
1136393603.500000 1136393606.000000
1136394262.000000 1136394264.500000
1136394397.000000 1136394399.375000
1136394480.000000 1136394483.125000
1136394501.406250 1136394503.750000
1136394547.445312 1136394550.046875
1136395553.343750 1136395557.312500
1136396088.875000 1136396091.125000
1136396326.000000 1136396330.093750
1136396345.843750 1136396349.000000
1136396721.500000 1136396725.000000
1136396914.750000 1136396917.000000
1136397300.062500 1136397302.156250
1136397515.750000 1136397526.140625
1136397528.867187 1136397533.855469
1136397537.525390 1136397541.355469
1136397579.085937 1136397583.500000
1136397587.035156 1136397589.421875
1136397589.531250 1136397591.929688
1136397607.238281 1136397609.349610
1136397615.832031 1136397617.964844
1136397620.574218 1136397622.734375
1136397625.011718 1136397627.479493
1136397630.207031 1136397632.863282
1136397635.009765 1136397637.082032
1136397638.562500 1136397640.636719
1136397647.119140 1136397650.222657
1136397652.855468 1136397660.632813
1136397660.738281 1136397664.093750
1136397665.890625 1136397670.367188
1136397725.011718 1136397728.609375
1136397753.707031 1136397755.878907
1136397756.863281 1136397760.234375
1136397768.550781 1136397771.140625
1136397779.632812 1136397781.671875
1136397784.207031 1136397786.773438
1136397786.875000 1136397788.902344
1136397794.601562 1136397796.878907
1136397797.136718 1136397803.203125
1136397811.929687 1136397814.804688
1136397846.628906 1136397848.890625
1136397849.085937 1136397851.304688
1136397969.937500 1136397975.375000
1136398065.250000 1136398068.062500
1136398116.125000 1136398123.875000
1136398184.750000 1136398187.125000
1136398219.875000 1136398222.875000
1136398363.750000 1136398370.250000
1136398370.406250 1136398374.500000
1136398741.343750 1136398752.937500
1136398757.687500 1136398765.218750
1136398765.375000 1136398768.250000
1136398770.312500 1136398773.218750
1136398773.656250 1136398781.875000
1136398815.000000 1136398820.906250
1136398822.750000 1136398827.125000
1136398827.648437 1136398838.343750
1136398838.968750 1136398842.250000
1136398894.000000 1136398896.343750
1136398903.593750 1136398905.890625
1136398909.656250 1136398912.062500
1136398946.781250 1136398948.875000
1136398972.890625 1136398978.000000
1136398979.296875 1136398982.125000
1136398985.203125 1136398987.234375
1136398990.218750 1136398992.750000
1136399019.617187 1136399023.656250
1136399062.984375 1136399078.843750
1136399079.531250 1136399083.968750
1136399086.000000 1136399090.500000
1136399111.234375 1136399114.250000
1136399124.406250 1136399128.343750
1136399135.437500 1136399141.406250
1136399141.656250 1136399144.625000
1136399152.906250 1136399166.343750
1136399170.671875 1136399178.000000
1136400727.000000 1136400732.000000
1136400772.000000 1136400774.250000
1136401222.843750 1136401225.500000
1136401232.964843 1136401235.812500
1136404620.500000 1136404622.750000
1136404730.875000 1136404737.000000
1136404810.625000 1136404813.218750
1136404815.968750 1136404820.250000
1136404883.375000 1136404885.500000
1136404910.125000 1136404915.000000
1136405060.921875 1136405067.500000
1136406672.000000 1136406675.000000
1136406729.500000 1136406732.000000
1136406735.750000 1136406738.000000
1136406781.312500 1136406784.000000
1136406879.000000 1136406882.250000
1136407274.000000 1136407276.625000
1136407570.250000 1136407574.750000
1136407645.250000 1136407651.000000
1136407775.625000 1136407778.250000
1136407801.679687 1136407804.500000
1136407855.937500 1136407863.375000
1136408116.312500 1136408118.500000
1136408142.250000 1136408147.000000
1136408225.000000 1136408228.000000
1136408384.406250 1136408390.625000
1136408391.000000 1136408398.250000
1136408404.875000 1136408410.375000
1136408471.625000 1136408474.750000
1136422967.500000 1136422970.000000
1136438221.000000 1136438225.000000
1136460711.000000 1136460714.000000
1136460953.000000 1136460958.000000
1136513154.750000 1136513158.000000
1136513983.625000 1136513986.000000
1136514879.000000 1136514882.000000
1136587964.500000 1136587968.187500
1136592063.500000 1136592067.562500
