847623003 847623020
847841864 847841881
847843473 847843490
847851051 847851068
847870596 847870613
847879848 847879865
847889779 847889796
847941419 847941436
848030514 848030531
848052474 848052491
848060212 848060229
848073221 848073238
848121952 848121969
848123993 848124010
848146479 848146496
848152248 848152265
848152298 848152315
848187946 848187963
848188003 848188022
848194458 848194475
848240489 848240506
848245612 848245629
848247070 848247087
848247136 848247154
848363390 848363407
848365644 848365661
848423436 848423453
848442062 848442079
848479708 848479725
848493561 848493579
848502819 848502836
848512684 848512701
848512764 848512781
848671224 848671241
848693658 848693675
848701235 848701252
848757570 848757587
848820837 848820854
848829576 848829593
848886993 848887010
848951792 848951809
849041760 849041777
849049551 849049568
849086457 849086474
849108226 849108243
849120438 849120455
849124050 849124067
849124097 849124114
849170301 849170318
849197351 849197368
849201032 849201049
849265720 849265737
849267892 849267909
849352012 849352029
849354678 849354695
849358266 849358283
849359428 849359445
849359791 849359808
849389028 849389045
849474102 849474119
849475504 849475521
849484912 849484929
849540508 849540525
849541978 849541995
849592468 849592485
849594401 849594418
849609767 849609784
849624891 849624908
849727350 849727367
849732117 849732134
849733209 849733226
849890672 849890691
849891362 849891380
849894242 849894259
849960928 849960945
850051091 850051108
850051332 850051349
850137748 850137765
850141548 850141565
850146776 850146794
850147799 850147817
850153257 850153274
850157944 850157961
850157990 850158007
850158003 850158021
850224187 850224204
850226633 850226650
850226688 850226706
850227829 850227846
850230945 850230962
850335734 850335751
850341085 850341102
850417079 850417096
850449691 850449708
850485234 850485251
850485238 850485256
850509756 850509773
850575039 850575056
850575054 850575071
850656544 850656561
850656653 850656670
850678488 850678507
850680547 850680564
850700862 850700879
850700866 850700884
850771804 850771821
850787324 850787342
851030037 851030055
851144394 851144412
851199673 851199690
851230495 851230512
851258019 851258036
851261815 851261833
851342951 851342968
851347332 851347349
851347410 851347427
851347458 851347477
851347488 851347505
851347502 851347519
851349838 851349855
851356518 851356536
851384063 851384081
851441270 851441288
851441317 851441335
851441340 851441358
851453089 851453106
851457165 851457182
851457215 851457232
851654821 851654838
851666065 851666083
851666368 851666385
851669816 851669833
851686617 851686634
851686643 851686660
851686723 851686740
851686735 851686752
851686848 851686865
851729155 851729172
851738157 851738174
851759871 851759888
851759940 851759957
851766855 851766872
851766904 851766921
851782223 851782240
851782270 851782288
851805041 851805059
851805064 851805081
851809169 851809188
851871192 851871209
851871229 851871246
851871238 851871255
851888033 851888050
851897507 851897524
851898135 851898152
851898188 851898205
851927834 851927851
851950961 851950978
851960456 851960473
851963246 851963264
851963312 851963329
851966898 851966915
851997574 851997591
852006949 852006966
852007175 852007192
852041916 852041933
852044252 852044269
852069805 852069822
852069809 852069826
852073788 852073805
852134399 852134416
852159901 852159918
852269746 852269763
852271884 852271901
852286910 852286927
852322181 852322198
852367349 852367366
852377684 852377701
852445393 852445410
852470190 852470207
852477414 852477431
852504410 852504427
852504500 852504517
852539106 852539123
852560939 852560956
852572519 852572536
852572564 852572581
852575446 852575463
852577132 852577149
852580487 852580504
852580939 852580956
852581092 852581109
852584983 852585000
852656575 852656593
852665164 852665183
852665207 852665224
852733850 852733868
852733920 852733937
852733932 852733950
852779551 852779568
852908895 852908912
852968599 852968616
852970860 852970877
853252234 853252253
853747365 853747382
853769574 853769591
853769649 853769666
853769674 853769693
853770053 853770070
853831171 853831188
853836182 853836199
853837134 853837151
853838035 853838052
853838174 853838191
853841355 853841372
853841618 853841635
853842451 853842468
853842755 853842772
853842921 853842938
853842943 853842960
853843040 853843057
853843684 853843701
853844039 853844056
853844052 853844069
853844285 853844302
853844745 853844762
853845014 853845031
853845107 853845124
853845241 853845258
853845670 853845687
853845684 853845702
853845732 853845749
853846676 853846693
853846722 853846739
853846790 853846807
853846894 853846911
853847001 853847018
853847023 853847041
853847055 853847073
853847926 853847943
853848079 853848096
853848204 853848221
853848598 853848615
853848937 853848954
853849015 853849032
853849179 853849196
853849317 853849334
853849390 853849407
853849566 853849583
853849570 853849587
853849635 853849652
853849915 853849932
853850158 853850178
853850830 853850847
853850842 853850859
853851004 853851021
853851043 853851060
853851196 853851213
853851316 853851333
853851404 853851421
853852441 853852458
853852456 853852473
853852722 853852739
853852746 853852763
853852815 853852832
853852907 853852924
853853133 853853150
853857425 853857442
853857500 853857518
853857517 853857535
853858759 853858776
853860038 853860055
853862588 853862605
854346100 854346117
854388504 854388521
854397806 854397823
854398188 854398205
854400474 854400491
854400805 854400822
854401312 854401329
854401991 854402008
854402235 854402252
854402493 854402510
854402534 854402551
854438598 854438615
854472651 854472668
854472693 854472710
854472697 854472715
854472716 854472733
854474327 854474345
854546208 854546225
854546213 854546230
854556752 854556769
854734954 854734978
854737880 854737897
854806818 854806835
854806832 854806849
854880294 854880311
854891826 854891843
854925133 854925150
854925169 854925187
854955576 854955593
854982515 854982532
854982565 854982583
854982589 854982607
855003308 855003325
855038500 855038517
855060652 855060669
855060716 855060733
855154802 855154819
855160122 855160139
855162069 855162086
855162124 855162141
855163538 855163555
855163584 855163601
855163588 855163605
855163592 855163611
855177194 855177212
855197701 855197718
855322754 855322771
855326404 855326422
855326452 855326470
855337246 855337266
855380500 855380518
855395680 855395697
855396058 855396075
855396081 855396098
855417068 855417085
855418039 855418059
855445933 855445950
855558451 855558468
855698883 855698900
855699929 855699946
855702146 855702163
855702170 855702187
855743912 855743929
855744922 855744939
855746208 855746225
855774370 855774387
855783402 855783419
855790891 855790908
855790937 855790954
855790959 855790976
855791047 855791064
855841474 855841491
855848728 855848745
855860270 855860287
855921525 855921543
855921531 855921548
855921617 855921635
855939049 855939066
855952175 855952193
855952203 855952220
855952207 855952224
855958564 855958586
855959712 855959729
856012572 856012589
856012598 856012615
856021681 856021701
856023046 856023065
856023352 856023369
856124595 856124612
856124646 856124664
856124992 856125010
856160097 856160114
856194257 856194275
856194320 856194338
856245856 856245873
856296889 856296906
856296950 856296969
856299958 856299976
856306768 856306785
856307491 856307508
856307505 856307522
856354649 856354666
856371786 856371803
856373586 856373603
856374159 856374177
856417658 856417675
856499399 856499416
856553467 856553485
856553495 856553512
856559699 856559716
856570127 856570144
856571057 856571074
856575717 856575734
856576937 856576954
856577332 856577349
856578353 856578370
856579893 856579910
856581756 856581773
856604551 856604568
856650227 856650244
856650300 856650318
856650332 856650349
856689899 856689916
856710272 856710289
856722242 856722259
856722499 856722516
856780780 856780797
856810191 856810210
856810235 856810252
856810268 856810286
856822006 856822023
856861747 856861764
856861772 856861789
856865988 856866005
856887712 856887729
856900156 856900173
856900627 856900644
856904643 856904660
857035345 857035362
857062469 857062486
857131152 857131169
857132743 857132760
857134058 857134075
857140281 857140298
857141347 857141364
857144115 857144132
857147060 857147077
857153971 857153988
857154519 857154536
857163994 857164011
857164015 857164032
857169471 857169488
857227318 857227335
857227730 857227747
857248869 857248886
857248873 857248892
857249300 857249317
857249929 857249946
857250134 857250151
857252564 857252582
857306693 857306711
857314108 857314125
857318411 857318428
857322237 857322254
857327002 857327019
857336288 857336306
857336333 857336351
857336355 857336372
857376922 857376939
857400375 857400393
857401926 857401943
857420041 857420058
857420063 857420080
857424019 857424036
857427530 857427548
857486264 857486281
857492111 857492128
857497312 857497329
857497871 857497888
857497991 857498008
857515554 857515571
857574354 857574371
857574437 857574455
857574445 857574462
857574658 857574675
857659307 857659324
857675712 857675729
857697609 857697626
857729361 857729378
857731902 857731920
857731960 857731977
857739518 857739535
857757424 857757441
857767783 857767800
857767826 857767844
857819509 857819526
857824879 857824896
857924331 857924348
857924406 857924423
857926363 857926380
857927684 857927702
857927788 857927807
857927797 857927814
857928285 857928302
857941447 857941465
857941516 857941533
857972242 857972259
857972577 857972595
857972594 857972611
857973423 857973440
857980866 857980883
858014666 858014684
858014727 858014744
858086577 858086594
858093197 858093214
858093296 858093314
858093620 858093637
858104408 858104425
858111430 858111447
858163794 858163811
858177237 858177254
858274660 858274677
858293548 858293565
858294183 858294200
858346338 858346356
858346386 858346403
858346416 858346434
858352308 858352325
858431779 858431796
858432210 858432227
858451584 858451601
858451629 858451648
858451645 858451662
858522997 858523014
858529696 858529713
858531345 858531362
858539830 858539848
858541538 858541555
858548971 858548988
858572634 858572651
858602114 858602132
858620731 858620748
858620736 858620753
858621380 858621397
858627546 858627563
858633579 858633596
858633636 858633654
858682800 858682817
858682816 858682834
858714403 858714420
858806228 858806245
858810306 858810323
858884090 858884107
858949781 858949798
858955227 858955244
858957566 858957583
858962121 858962138
858966123 858966140
858968732 858968749
858968779 858968796
858968789 858968806
858975437 858975454
858988309 858988326
859065016 859065033
859065070 859065087
859065172 859065189
859131347 859131364
859156538 859156555
859156582 859156599
859214142 859214162
859214171 859214189
859230650 859230667
859235102 859235119
859235130 859235147
859236464 859236481
859240455 859240472
859287184 859287201
859287241 859287258
859287267 859287284
859299231 859299248
859299469 859299486
859299500 859299518
859309034 859309051
859311938 859311955
859321494 859321511
859321541 859321559
859321578 859321595
859323423 859323441
859330936 859330955
859330966 859330983
859543966 859543983
859568299 859568316
859569064 859569081
859571477 859571494
859571989 859572006
859572388 859572405
859572452 859572469
859573166 859573183
859576028 859576045
859589638 859589655
859607916 859607933
859666281 859666298
859719843 859719860
859740228 859740245
859740232 859740249
859756841 859756858
859756887 859756906
859756904 859756922
859756917 859756934
859808981 859808998
859816370 859816387
859828597 859828615
859993223 859993241
859993987 859994004
860001095 860001112
860173686 860173705
860175368 860175385
860181822 860181839
860182047 860182064
860245096 860245114
860245115 860245134
860245210 860245229
860245228 860245245
860323895 860323912
860352225 860352242
860352287 860352304
860497091 860497111
860522908 860522925
860523248 860523266
860541092 860541109
860585153 860585171
860585169 860585186
860585223 860585241
860598855 860598872
860687386 860687403
860715687 860715704
860724406 860724423
860762106 860762123
860776787 860776805
860776825 860776842
860776833 860776850
860776838 860776855
860776849 860776866
860776879 860776896
860776893 860776910
860798329 860798346
860941775 860941792
860963779 860963797
861032273 861032290
861037468 861037485
861037599 861037616
861049196 861049213
861050906 861050923
861093563 861093580
861107523 861107540
861111490 861111507
861111544 861111561
861114678 861114695
861115981 861115999
861119632 861119649
861123463 861123481
861123515 861123533
861123531 861123548
861123542 861123562
861128341 861128358
861307105 861307122
861370297 861370315
861372154 861372171
861372180 861372198
861375185 861375202
861375244 861375261
861376098 861376115
861376155 861376172
861376170 861376187
861387556 861387574
861387578 861387596
861387627 861387646
861387644 861387661
861391457 861391474
861391921 861391939
861437079 861437096
861457263 861457281
861458267 861458284
861493860 861493877
861521043 861521060
861521074 861521091
861533352 861533370
861536746 861536763
861555744 861555761
861597156 861597173
861597962 861597980
861598061 861598078
861598175 861598192
861598182 861598199
861601852 861601869
861602919 861602936
861602951 861602968
861616321 861616340
861630115 861630132
861653044 861653061
861717233 861717250
861717259 861717276
861846403 861846420
861965541 861965558
861979115 861979132
861993784 861993801
861993800 861993817
861995657 861995674
861995701 861995722
861995709 861995726
861995782 861995800
862002639 862002656
862040364 862040381
862044777 862044794
862059746 862059763
862061280 862061297
