817420778 817420795
817703473 817703490
817704856 817704873
818459628 818459645
818468719 818468736
818803900 818803917
819557970 819557987
819759369 819759386
819917808 819917825
820446927 820446944
820616491 820616508
820617109 820617126
821748018 821748035
821748283 821748300
821748498 821748515
821827799 821827816
821828728 821828745
822779882 822779899
822786004 822786021
823871936 823871953
824379008 824379025
825439266 825439283
825697369 825697386
825979611 825979628
826045177 826045194
826045185 826045202
826045202 826045219
826045219 826045236
826045728 826045745
826045746 826045763
826059723 826059740
826059738 826059755
826305317 826305334
826312886 826312903
826326463 826326480
826337347 826337364
826466502 826466519
826474454 826474471
826475093 826475110
826475109 826475126
826475173 826475190
826485016 826485033
826485184 826485201
826571369 826571386
826587021 826587038
826655778 826655795
826659737 826659754
826663059 826663076
826666310 826666328
826679159 826679176
827165230 827165247
827165374 827165391
827258769 827258786
827258967 827258984
827627073 827627090
828234122 828234139
829279040 829279057
829288085 829288102
829347153 829347170
829510852 829510869
829511484 829511502
829511854 829511871
829512966 829512983
829668420 829668437
829670319 829670336
830125750 830125767
830125755 830125772
830145263 830145281
830284002 830284019
830549525 830549542
830616396 830616413
830616470 830616487
830616624 830616641
830722081 830722098
830722260 830722277
830723233 830723250
830723245 830723262
830792840 830792857
