817775922 817775939
817780171 817780188
817780818 817780835
817780976 817780993
817781102 817781119
817781160 817781177
817781250 817781267
817781303 817781320
817781313 817781330
817781372 817781389
817781420 817781437
817781574 817781591
817781665 817781682
817781671 817781688
817784894 817784911
817786642 817786659
817787171 817787188
818635072 818635089
819363280 819363297
819460904 819460921
819478270 819478287
819478683 819478700
819479350 819479367
819479612 819479629
819479724 819479741
819480208 819480225
819480334 819480351
819480557 819480574
819480634 819480651
819480759 819480776
819480797 819480814
819499381 819499398
819499937 819499954
819785518 819785535
819803044 819803061
820671465 820671482
821975746 821975763
821993747 821993764
821993817 821993834
821993893 821993910
821993942 821993959
821994004 821994021
821994344 821994361
821994608 821994625
821994695 821994712
821995024 821995041
821995362 821995379
821995428 821995445
821995754 821995771
821996080 821996097
822000348 822000365
822000359 822000376
822000476 822000493
822000593 822000610
822000645 822000662
822006807 822006824
822008098 822008115
822008165 822008182
822008307 822008324
822008659 822008676
822008741 822008758
822008856 822008873
822009394 822009411
822009913 822009930
822010184 822010201
822012005 822012022
822077863 822077880
822077878 822077895
822905418 822905435
822906098 822906115
822906311 822906328
822906581 822906598
822907184 822907201
822907702 822907719
822908900 822908917
822909106 822909123
823659688 823659705
823659795 823659812
823667075 823667092
823865803 823865820
823867379 823867396
823950762 823950779
826625749 826625766
828524041 828524058
828525060 828525077
828525434 828525451
828532322 828532339
828953182 828953199
828955165 828955182
828957211 828957228
828959255 828959272
828961360 828961377
828963394 828963411
828965459 828965476
828971532 828971549
828973635 828973652
828975759 828975776
829037666 829037683
829041833 829041850
829043908 829043925
829045944 829045961
829048027 829048044
829050169 829050186
829052265 829052282
829057122 829057139
829131850 829131867
829133923 829133940
829136037 829136054
829138092 829138109
829140185 829140202
829142200 829142217
829144304 829144321
829146370 829146387
829148511 829148528
829150585 829150602
829152916 829152933
829155138 829155155
829160778 829160795
829164422 829164439
829167129 829167146
829174310 829174327
829203654 829203671
829205657 829205674
829207752 829207769
829209727 829209744
829211781 829211798
829213796 829213813
829215803 829215820
829217836 829217853
829219919 829219936
829224009 829224026
829225994 829226011
829228079 829228096
829234378 829234395
829236671 829236688
829239001 829239018
829277728 829277745
829279989 829280006
829282054 829282071
829284276 829284293
829286342 829286359
829288562 829288579
829290628 829290645
829292701 829292718
829294765 829294782
829296840 829296857
829298903 829298920
829301007 829301024
829303053 829303070
829307161 829307178
829309275 829309292
829313392 829313409
829315438 829315455
829329284 829329301
829337436 829337453
829360693 829360710
829363210 829363227
829365523 829365540
829367735 829367752
829378105 829378122
829380128 829380145
829382194 829382211
829384217 829384234
829386282 829386299
829388338 829388355
829394538 829394555
829398727 829398744
829403092 829403109
829405205 829405222
829410084 829410101
829448476 829448493
829453296 829453313
829455478 829455495
829461996 829462013
829468159 829468176
829470263 829470280
829472270 829472287
829474361 829474378
829476408 829476425
829478522 829478539
829480585 829480602
829489187 829489204
829491460 829491477
829493740 829493757
829497603 829497620
829530818 829530835
829533010 829533027
829535550 829535567
829538068 829538085
829540656 829540673
829542926 829542943
829547174 829547191
829549238 829549255
829551282 829551299
829557503 829557520
829559500 829559517
829561593 829561610
829563609 829563626
829565691 829565708
829569770 829569787
829573860 829573877
829576082 829576099
829578641 829578658
829646502 829646519
829648556 829648573
829652666 829652683
829671532 829671549
829672576 829672593
829684102 829684119
829686612 829686629
829691461 829691478
829696754 829696771
829700507 829700524
829702552 829702569
829706829 829706846
829711076 829711093
829713278 829713295
829715342 829715359
829719471 829719488
829723549 829723566
829725585 829725602
829727619 829727636
829735737 829735754
829737812 829737829
829741891 829741908
829743906 829743923
829745970 829745987
829750128 829750145
829752222 829752239
829756538 829756555
829758810 829758827
829769595 829769612
829772074 829772091
829785784 829785801
829787888 829787905
829790002 829790019
829791956 829791973
829794020 829794037
829798011 829798028
829800005 829800022
829804044 829804061
829806030 829806047
829808026 829808043
829818218 829818235
829820213 829820230
829822259 829822276
829824360 829824377
829830525 829830542
829832559 829832576
829834585 829834602
829838782 829838799
829843413 829843430
829845765 829845782
829849341 829849358
829852066 829852083
829872747 829872764
829879492 829879509
829881714 829881731
829883721 829883738
829887779 829887796
829889815 829889832
829891848 829891865
829893874 829893891
829899917 829899934
829901943 829901960
829903958 829903975
829906001 829906018
829907968 829907985
829912037 829912054
829914060 829914077
829916095 829916112
829918110 829918127
829920125 829920142
829922259 829922276
829924361 829924378
829931661 829931678
829934359 829934376
829969122 829969139
829971100 829971117
829973312 829973329
829975306 829975323
829977362 829977379
829979385 829979402
829981440 829981457
829987523 829987540
829989539 829989556
829991582 829991599
829993598 829993615
829995631 829995648
829999711 829999728
830001815 830001832
830003898 830003915
830039268 830039285
830039807 830039824
830041845 830041862
830043217 830043234
830043512 830043529
830043864 830043881
830046002 830046019
830046825 830046842
830047080 830047097
830048158 830048175
830048240 830048257
830050231 830050248
830052285 830052302
830054358 830054375
830056365 830056382
830058489 830058506
830060492 830060509
830062606 830062623
830064601 830064618
830066684 830066701
830068699 830068716
830070773 830070790
830074902 830074919
830076976 830076993
830079030 830079047
830079756 830079773
830079873 830079890
830079921 830079938
830080550 830080567
830080682 830080699
830080817 830080834
830080943 830080960
830080963 830080980
830081068 830081085
830081230 830081248
830081431 830081448
830081489 830081506
830081581 830081598
830081626 830081643
830081639 830081656
830081733 830081750
830081846 830081863
830082011 830082028
830082245 830082262
830082315 830082332
830082321 830082338
830082346 830082363
830082430 830082447
830082707 830082724
830082812 830082829
830082864 830082881
830082915 830082932
830083071 830083088
830083168 830083185
830083229 830083246
830083470 830083487
830083539 830083556
830083662 830083679
830083749 830083766
830083899 830083916
830084038 830084055
830084151 830084168
830084191 830084208
830084270 830084287
830084391 830084408
830084745 830084762
830084959 830084976
830085013 830085030
830085146 830085163
830085213 830085230
830085641 830085658
830086183 830086200
830086362 830086379
830086454 830086471
830086733 830086750
830086751 830086768
830087103 830087120
830087963 830087980
830088323 830088340
830092846 830092863
830099741 830099758
830101787 830101804
830104070 830104087
830106121 830106138
830110922 830110939
830114083 830114100
830116750 830116767
830121836 830121853
830124493 830124510
830126645 830126662
830129164 830129181
830131169 830131186
830133403 830133420
830135446 830135463
830137521 830137538
830139564 830139581
830141610 830141627
830143643 830143660
830145678 830145695
830147724 830147741
830149737 830149754
830151752 830151769
830153818 830153835
830157878 830157895
830162103 830162120
830164148 830164165
830166260 830166277
830168346 830168363
830171229 830171246
830173234 830173251
830177283 830177300
830179369 830179386
830216059 830216076
830216248 830216265
830218787 830218804
830220870 830220887
830222863 830222880
830224938 830224955
830226903 830226920
830230954 830230971
830232949 830232966
830235012 830235029
830237057 830237074
830239123 830239140
830241245 830241262
830251407 830251424
830255733 830255750
830257819 830257836
830265047 830265064
830267181 830267198
830269254 830269271
830271407 830271424
830277778 830277795
830279991 830280008
830290123 830290140
830294135 830294152
830296623 830296640
830299300 830299317
830301562 830301579
830306630 830306647
830308781 830308798
830313126 830313143
830315201 830315218
830317305 830317322
830319338 830319355
830321464 830321481
830323527 830323544
830325633 830325650
830327734 830327751
830334035 830334052
830336199 830336216
830338293 830338310
830340426 830340443
830346806 830346823
830360230 830360247
830533066 830533083
