816185392 816185401
816211274 816211384
816291552 816291562
816439311 816439322
816500123 816500233
816897939 816897946
817236806 817236916
817236980 817237090
817447648 817447758
817449567 817449677
817459711 817459821
817662190 817662200
817781836 817781844
818012232 818012261
818034373 818034387
818068482 818068490
818160993 818161103
818327343 818327398
818345490 818345498
818457162 818457171
818479720 818479732
818550091 818550111
818552601 818552711
818557919 818558029
818558627 818558737
818561481 818561591
818561628 818561738
818561767 818561932
818564844 818564954
818569770 818569880
818571844 818571954
818572070 818572180
818572242 818572352
818572695 818572805
818572938 818573048
818573143 818573417
818573677 818573787
818573883 818574101
818574248 818574358
818574664 818574774
818574844 818575037
818575313 818575423
818734877 818734882
818878585 818878588
818971275 818971385
819035372 819035482
819037412 819037522
819037741 819037851
819057929 819057933
819093868 819093888
819144599 819144607
819308258 819308368
819325387 819325390
819348000 819348110
819656602 819656712
819887410 819887417
820002950 820002957
820196401 820196511
820196678 820196839
820210673 820210683
820218668 820218669
820539403 820539409
820554549 820554558
820966573 820966683
820986534 820986644
820988899 820989009
820989415 820989525
820991059 820991169
821070983 821071093
821073445 821073555
821104019 821104129
821104812 821104922
821107515 821107625
821124516 821124594
821127519 821127629
821127757 821127867
821129326 821129436
821131171 821131281
821131395 821131505
821131520 821131676
821287442 821287451
821513389 821513499
821592293 821592298
821783057 821783067
821832100 821832198
822012116 822012119
822179810 822179843
822205521 822205631
822205803 822205913
822208681 822208791
822209074 822209184
822233856 822233956
822263696 822263796
822271306 822271416
822329157 822329183
822329204 822329314
822329400 822329510
822339243 822339353
822375858 822375968
822376050 822376160
822382993 822383103
822383169 822383279
822385949 822386059
822386573 822386683
822413351 822413406
822417172 822417184
822424877 822424918
822477831 822477941
822481807 822481917
822487893 822488003
822488732 822488842
822488963 822488964
822489434 822489544
822493160 822493270
822494685 822494795
822554227 822554337
822576573 822576576
822578848 822578958
822579147 822579257
822579989 822580099
822584067 822584177
822605241 822605351
822610249 822610359
822632864 822632974
822633100 822633249
822633274 822633384
822634169 822634279
822638560 822638670
822639038 822639148
822651045 822651155
822654135 822654208
822664729 822664839
822665111 822665221
822666867 822666919
822667118 822667228
822714392 822714502
822714599 822714709
822725831 822725941
822732743 822732853
822734966 822735076
822737937 822737943
822804951 822805061
822806425 822806433
822862556 822862597
822862690 822862732
822865654 822865678
822865777 822865887
822944165 822944275
822947100 822947210
822947247 822947407
822973531 822973641
822985597 822985707
822985744 822985854
822994800 822994910
823032431 823032437
823078023 823078133
823162541 823162635
823187884 823187984
823351253 823351363
823355485 823355548
823357672 823357782
823423479 823423488
823768727 823768832
823769157 823769267
823770141 823770251
823770803 823770913
823771127 823771237
823771554 823771664
823771833 823771943
823772467 823772577
823773422 823773532
823773944 823774054
823775027 823775137
823775282 823775392
823777429 823777539
823778270 823778380
823778431 823778541
823784667 823784777
823789412 823789522
823789602 823789712
823792697 823792807
823800470 823800580
823870748 823870858
823871066 823871250
823871462 823871572
824211937 824212047
824212092 824212202
824214437 824214547
824214598 824214814
824215355 824215368
824217441 824217449
824300235 824300336
824390242 824390352
824392962 824393072
824393412 824393522
824397922 824397925
824411912 824411919
824413034 824413144
824413857 824413864
824414295 824414405
824454259 824454271
824494672 824494681
824495253 824495439
824495460 824495570
824501194 824501304
824502075 824502083
824618471 824618581
824674552 824674561
824676260 824676370
824676420 824676530
824676654 824676764
824683006 824683023
824720663 824720773
824807221 824807331
824808796 824808896
824818786 824818896
824825549 824825566
824833102 824833212
824837898 824837905
824842055 824842165
824846457 824846567
824846897 824847007
824855342 824855363
824865585 824865695
824866082 824866192
824866388 824866550
824867983 824868093
824868881 824868991
824871049 824871159
824871569 824871679
824872767 824872782
824877569 824877679
824879088 824879198
824879935 824880045
824880723 824880833
824881072 824881182
824882435 824882545
824883230 824883340
824883700 824883800
824886033 824886143
824887770 824887880
824888239 824888349
824888770 824888880
824932273 824932383
824937553 824937663
824938830 824938940
824939572 824939682
824941150 824941260
824941266 824941376
824942189 824942299
824943069 824943179
824944008 824944118
824944529 824944639
824946124 824946234
824947099 824947209
824947450 824947560
824948689 824948799
824950015 824950125
824950203 824950304
824954134 824954244
824954468 824954578
824955276 824955386
824956015 824956125
824958162 824958272
824960560 824960670
824961429 824961539
824961814 824961924
824962184 824962294
824962906 824963016
824963484 824963594
824964401 824964511
824965150 824965260
824965793 824965903
824966227 824966337
824966553 824966663
824967008 824967207
824968202 824968297
824978079 824978189
824978430 824978540
824979129 824979239
824979596 824979706
824983326 824983436
824996773 824996783
824999938 825000048
825001010 825001120
825002584 825002694
825004171 825004281
825004346 825004456
825014702 825014812
825015981 825016091
825019592 825019702
825019913 825020023
825020649 825020759
825020975 825021085
825021862 825021972
825022205 825022315
825024117 825024227
825026213 825026323
825027813 825027923
825028138 825028248
825028689 825028799
825029425 825029535
825030175 825030285
825031128 825031238
825032010 825032120
825032811 825032921
825035293 825035403
825035553 825035663
825035751 825035861
825044523 825044778
825045786 825045896
825047111 825047221
825048077 825048187
825048311 825048421
825048448 825048558
825050300 825050410
825050457 825050567
825050906 825051016
825051113 825051301
825089294 825089404
825093208 825093318
825093768 825093878
825097925 825097964
825098011 825098112
825105226 825105272
825105597 825105707
825105976 825106086
825106348 825106400
825109980 825110090
825110875 825110980
825119844 825119954
825120061 825120171
825120596 825120706
825150266 825150376
825150549 825150659
825150818 825150928
825151639 825151749
825204981 825205091
825208401 825208607
825240634 825240744
825428905 825429015
825437678 825437788
825437912 825438022
825448424 825448438
825485209 825485319
825519845 825519955
825528749 825528758
825529051 825529223
825547274 825547484
825579040 825579150
825580331 825580432
825588285 825588385
825590168 825590278
825605398 825605508
825607392 825607586
825609683 825609772
825609819 825609920
825610154 825610264
825610681 825610791
825615181 825615260
825697374 825697484
825702880 825702990
825711345 825711455
825712020 825712130
825781374 825781484
825841438 825841548
825873739 825873782
825880411 825880521
825889613 825889622
825898706 825898816
825899130 825899240
825899308 825899523
825900088 825900290
825900781 825900891
825904459 825904569
825906152 825906262
825906649 825906759
825907141 825907251
825910190 825910300
825912817 825912927
825913645 825913755
825913891 825913972
825941483 825941593
825941603 825941713
825941896 825942006
825942361 825942471
825944817 825944927
825962409 825962519
825965882 825965992
825975589 825975699
825988922 825989023
826000552 826000662
826002050 826002160
826014462 826014572
826015459 826015569
826017173 826017283
826062500 826062515
826083642 826083752
826092500 826092610
826093659 826093769
826111613 826111723
826112654 826112764
826127321 826127431
826135512 826135622
826137074 826137184
826169183 826169293
826172386 826172496
826172919 826173029
826194467 826194577
826194704 826194814
826194822 826194932
826195000 826195110
826195200 826195310
826196704 826196883
826196946 826197056
826229387 826229402
826237076 826237186
826260144 826260254
826265001 826265111
826265812 826265922
826266291 826266401
826266985 826267095
826268783 826268893
826270589 826270699
826271975 826272085
826272196 826272306
826272609 826272820
826272904 826273014
826273018 826273181
826273184 826273440
826273539 826273842
826274050 826274160
826274175 826274285
826275622 826275732
826277397 826277507
826280835 826280936
826281005 826281115
826316361 826316369
826326919 826326945
826339639 826339749
826340098 826340267
826341464 826341574
826342742 826342791
826347025 826347135
826355829 826355939
826356790 826356797
826368310 826368420
826439473 826439583
826440981 826441091
826443851 826443961
826445411 826445521
826468350 826468460
826468802 826468912
826478625 826478657
826497018 826497128
826507294 826507404
826554052 826554162
826564584 826564685
826569539 826569649
826570706 826570816
826573758 826573868
826580411 826580521
826582965 826583075
826602671 826602781
826626624 826626734
826626914 826627024
826627264 826627374
826640996 826641106
826642213 826642323
826658331 826658441
826660954 826661064
826681296 826681406
826681889 826681999
826682220 826682295
826685506 826685616
826686415 826686525
826686672 826686782
826700232 826700342
826700509 826700653
826709211 826709321
826717542 826717652
826717684 826717794
826718285 826718395
826718746 826718856
826724400 826724510
826744905 826745015
826746602 826746712
826801542 826801652
826804228 826804338
826829306 826829416
826829561 826829671
826830035 826830145
826830177 826830287
826920653 826920662
827031819 827031856
827032370 827032480
827041451 827041467
827082782 827082892
827089674 827089784
827093000 827093012
827101432 827101542
827104839 827104949
827115571 827115681
827156401 827156511
827189397 827189507
827189897 827190007
827247748 827247858
827250132 827250242
827250762 827250796
827251114 827251170
827255692 827255802
827267785 827267798
827274977 827275087
827277334 827277444
827278771 827278871
827291878 827291902
827352957 827352978
827364347 827364457
827366216 827366326
827369423 827369533
827370466 827370576
827373600 827373710
827375189 827375299
827378591 827378701
827385447 827385557
827386044 827386154
827462042 827462260
827465094 827465303
827466463 827466573
827503844 827503954
827528713 827528823
827536994 827537104
827588640 827588656
827618493 827618509
827687654 827687678
827689355 827689435
827696519 827696629
827698205 827698315
827706857 827706967
827771566 827771676
827772647 827772757
827773012 827773064
827784120 827784132
827786477 827786587
827791536 827791646
827793108 827793218
827794765 827794875
827868899 827869009
827869200 827869310
827876386 827876404
827876456 827876496
827882119 827882229
827921742 827921852
827945828 827945938
827971455 827971565
827980702 827980812
828038108 828038218
828038284 828038394
828038444 828038554
828039724 828039834
828041324 828041332
828138377 828138487
828163577 828163687
828167460 828167570
828167618 828167728
828167879 828167989
828170897 828171007
828172795 828172905
828173093 828173203
828173475 828173585
828174262 828174372
828178620 828178730
828178797 828178907
828179066 828179176
828182111 828182221
828185941 828186051
828186820 828186930
828190769 828190879
828190956 828191066
828191800 828191910
828192634 828192658
828192696 828192716
828233681 828233791
828239227 828239337
828265893 828266003
828282091 828282201
828347394 828347504
828457821 828457931
828527904 828528014
828591287 828591397
828712760 828712770
828758447 828758557
828759011 828759121
828798856 828798966
828799525 828799718
828801959 828802069
828802478 828802588
828910550 828910660
828968224 828968334
828970344 828970454
828994350 828994460
829066446 829066556
829248325 829248337
829259518 829259628
829331024 829331134
829333752 829333862
829335967 829335975
829349138 829349248
829363326 829363436
829518024 829518115
829524843 829524953
829601381 829601396
829607458 829607568
829611192 829611202
829633304 829633414
829653747 829653760
829669553 829669663
829701812 829701922
829703282 829703392
829703593 829703703
829705041 829705151
829705960 829706070
829707311 829707421
829709010 829709120
829710658 829710768
829726208 829726217
829744759 829744767
829782914 829783024
829842595 829842705
829886968 829887078
829887216 829887326
829893910 829894020
829928597 829928707
829937790 829937809
829942123 829942233
829948708 829948718
829956072 829956182
829981968 829981981
830032317 830032423
830035718 830035828
830044422 830044431
830057200 830057310
830058144 830058254
830063026 830063136
830113129 830113239
830124680 830124790
830144013 830144123
830145383 830145493
830191969 830192079
830194153 830194210
830204581 830204691
830204934 830204946
830210482 830210592
830273065 830273175
830273393 830273503
830280106 830280216
830294056 830294166
830324470 830324580
830334784 830334894
830360277 830360387
830361097 830361207
830365580 830365590
830393869 830393979
830394468 830394578
830395957 830396067
830434133 830434243
830434532 830434632
830437196 830437405
830440480 830440590
830450760 830450870
830460615 830460725
830461535 830461645
830469271 830469381
830533724 830533834
830534937 830535047
830542540 830542650
830545233 830545343
830547549 830547659
830548459 830548548
830548603 830548704
830550779 830550889
830551570 830551680
830574538 830574648
830574771 830574881
830574914 830575024
830575979 830576089
830602713 830602823
830612781 830612891
830702286 830702396
830705947 830705955
830722082 830722192
830722711 830722780
830770969 830771079
830777910 830778020
830800848 830800856
830811438 830811449
830857512 830857525
830862343 830862453
830872562 830872672
830882786 830882797
830889191 830889199
830895298 830895315
830904867 830904876
830906553 830906663
830985449 830985460
830999187 830999297
831000662 831000772
831001252 831001362
831001374 831001484
831001785 831001895
831005211 831005321
831008361 831008471
831022699 831022809
831038955 831039065
831096932 831096940
831099668 831099778
831100146 831100256
831100336 831100446
831141205 831141315
831142241 831142351
831142862 831142972
831144499 831144508
831151221 831151331
831153012 831153029
831162248 831162358
831163708 831163818
831164744 831164854
831165506 831165616
831166949 831167059
831167531 831167615
831168020 831168130
831171528 831171604
831176195 831176305
831180540 831180650
831208284 831208335
831242145 831242157
831247142 831247252
831263361 831263471
831264576 831264588
831273258 831273368
831274079 831274189
831277177 831277287
831312275 831312284
831323509 831323525
831331582 831331601
831344026 831344059
831350986 831351096
831396080 831396190
831402039 831402149
831402485 831402595
831412651 831412662
831420180 831420290
831475526 831475536
831484035 831484043
831498830 831498842
831510547 831510557
831518648 831518758
831552815 831552925
831569550 831569558
831582610 831582613
831588780 831588890
831630995 831631105
831669178 831669200
831688946 831688974
831747218 831747328
831765199 831765211
831790842 831790952
831811966 831811974
831848907 831849017
831850435 831850545
831851682 831851690
831871249 831871359
831872358 831872468
831911441 831911551
831923480 831923590
831934036 831934045
831938833 831938943
832001414 832001524
832008899 832008903
832012680 832012688
832017717 832017728
832029215 832029231
832037640 832037683
832044153 832044263
832045368 832045478
832046553 832046663
832049754 832049864
832052298 832052408
832054193 832054303
832072751 832072861
832109374 832109386
832111497 832111577
832116469 832116579
832117081 832117097
832234833 832234943
832272013 832272020
832284914 832284929
832295739 832295849
832300415 832300430
832338072 832338182
832427235 832427266
832451472 832451544
832452795 832452905
832454599 832454609
832461998 832462108
832465138 832465248
832472664 832472774
832493920 832494030
832504102 832504212
832520440 832520550
832542556 832542568
832553352 832553356
832555482 832555592
832601921 832601945
832619101 832619115
832621016 832621021
832625488 832625490
832627545 832627560
832643528 832643638
832643908 832643920
832658073 832658183
832688377 832688487
832690166 832690276
832698914 832699024
832716684 832716700
832772776 832772886
832801956 832801972
832821935 832821978
832853033 832853143
832853394 832853504
832858424 832858534
832860501 832860611
832865496 832865606
832940004 832940114
832940409 832940628
832940793 832940903
833016167 833016277
833020524 833020634
833026177 833026287
833026749 833026859
833051357 833051367
833053719 833053829
833054479 833054589
833057372 833057392
833137597 833137611
833140809 833140821
833144691 833144704
833147264 833147273
833148490 833148600
833210654 833210764
833210876 833210976
833227321 833227332
833233723 833233833
833235208 833235217
833269404 833269416
833320143 833320154
833369503 833369613
833369655 833369765
833386767 833386877
833389832 833389942
833393809 833393818
833396796 833396906
833414790 833414806
833425443 833425457
833446731 833446741
833451127 833451135
833574157 833574267
833580702 833580717
833658800 833658806
833728668 833728778
833742348 833742356
833749181 833749291
833756535 833756645
833827220 833827330
833833872 833833982
833836616 833836726
833839550 833839660
833845568 833845678
833868606 833868716
833885539 833885548
833957675 833957785
833958441 833958551
833958642 833958752
833959513 833959623
833960766 833960980
833962000 833962110
833962540 833962650
833963021 833963131
833963328 833963438
833964530 833964640
833965773 833965883
833965930 833966040
833968298 833968399
833968985 833969095
833987324 833987434
833987525 833987635
833990731 833990831
833996187 833996288
833996641 833996845
833997180 833997290
833998025 833998195
833998378 833998912
833999207 833999496
833999635 833999788
834003198 834003308
834003316 834003513
834003781 834003891
834004026 834004136
834004272 834004382
834005227 834005427
834095640 834095750
834156418 834156528
834185832 834185942
834294403 834294412
834322705 834322815
834350573 834350587
834358418 834358436
834390158 834390190
834435524 834435534
834450498 834450608
834518378 834518389
834691110 834691119
834744434 834744450
834779956 834780066
834780246 834780356
834795917 834795927
834796832 834796851
834797286 834797396
834800219 834800329
834811536 834811646
834839925 834840035
834840083 834840193
834963571 834963582
835009407 835009416
835039732 835039740
835099655 835099673
835100815 835100925
835247121 835247231
835374896 835375006
835393648 835393758
835411648 835411660
835443443 835443553
835480050 835480060
835490033 835490143
835490358 835490468
835495971 835496072
835501734 835501844
835545175 835545285
835567481 835567492
835648026 835648037
835721846 835721856
835770751 835770761
835818142 835818154
835848137 835848166
835895149 835895158
835900487 835900597
835954340 835954348
836039534 836039644
836080686 836080696
836108886 836108996
836118818 836118928
836188660 836188668
836247770 836247779
836261529 836261639
836293102 836293134
836335209 836335214
836352737 836352746
836375220 836375228
836412532 836412540
836426855 836426863
836461558 836461578
836485070 836485089
836601985 836602095
836699359 836699469
836853271 836853381
837025897 837025907
837033734 837033744
837088318 837088428
837088549 837088659
837089841 837089951
837135039 837135044
837160811 837160872
837227386 837227496
837333090 837333200
837369543 837369552
837384582 837384692
837452443 837452553
837452709 837452819
837454089 837454199
837458184 837458294
837548047 837548157
837548264 837548374
837549242 837549352
837549498 837549608
837579804 837579914
837801653 837801763
838078967 838078975
838153981 838153990
838174526 838174536
838257953 838257966
838325705 838325711
838373687 838373696
838399513 838399522
838406363 838406372
838415432 838415444
838419180 838419191
838469775 838469783
838569433 838569442
838584574 838584684
838584714 838584824
838584898 838585008
838607544 838607654
838629610 838629617
838635768 838635778
838688375 838688381
838713251 838713262
838831632 838831639
838831710 838831742
838831816 838831926
838831929 838832257
838911828 838911834
838912331 838912342
838923981 838924091
839020530 839020640
839025072 839025083
839073628 839073738
839103142 839103205
839127737 839127746
839186933 839187043
839193199 839193207
839258187 839258297
839258851 839258968
839259256 839259366
839284954 839284962
839299275 839299385
839300115 839300123
839302211 839302321
839304203 839304313
839342234 839342268
839347366 839347374
839362499 839362609
839371049 839371056
839564699 839564717
839565795 839565812
839565847 839565957
839566121 839566231
839618645 839618755
839626499 839626510
839629593 839629603
839630687 839630705
839680438 839680450
839718674 839718682
839721972 839721980
839801321 839801331
839808216 839808225
839828566 839828583
839829478 839829560
839848816 839848826
839863874 839863881
839869620 839869730
839870021 839870131
839870250 839870360
839870650 839870760
839871171 839871281
839872442 839872552
839872697 839872807
839872901 839873011
839873118 839873228
839885319 839885325
839977655 839977659
840039690 840039699
840047977 840048087
840049268 840049279
840078669 840078779
840081689 840081740
840176712 840176736
840194158 840194268
840196470 840196580
840196597 840196707
840197539 840197649
840200735 840200845
840200875 840200985
840222288 840222398
840222487 840222597
840225004 840225114
840230218 840230328
840231610 840231720
840238331 840238348
840243996 840244003
840317217 840317230
840403592 840403702
840488407 840488447
840491998 840492012
840500896 840501006
840576651 840576664
840580789 840580802
840582323 840582433
840671290 840671300
840734651 840734761
840736824 840736831
840737676 840737684
840740752 840740763
840926216 840926326
840931144 840931194
840932656 840932667
840995755 840995865
841063347 841063457
841063743 841063869
841141943 841141964
841147837 841147846
841178610 841178720
841236734 841236742
841242301 841242411
841242820 841242930
841245461 841245462
841305686 841305703
841342889 841342898
841471835 841471945
841533339 841533351
841554523 841554532
841586004 841586019
841691469 841691579
841767475 841767585
841777394 841777504
841811475 841811585
841811620 841811750
841827857 841827967
841828207 841828317
841863908 841864018
841922198 841922223
841960898 841961008
841961387 841961497
841962357 841962467
842038050 842038133
842038746 842038856
842046994 842047011
842047069 842047104
842048458 842048470
842103822 842103833
842205443 842205453
842236246 842236356
842294332 842294442
842295380 842295490
842303969 842303987
842325891 842326001
842385178 842385191
842387839 842387949
842428671 842428781
842429161 842429271
842458195 842458305
842458396 842458506
842468464 842468482
842472488 842472598
842478525 842478635
842478753 842478863
842479063 842479173
842485353 842485463
842521633 842521657
842561780 842561798
842586537 842586647
842652960 842653070
842653174 842653284
842666995 842667105
842670974 842671084
842678806 842678916
842689189 842689299
842762975 842763085
842803544 842803552
842814226 842814238
842815142 842815252
842821920 842821928
842823608 842823617
842825878 842825889
842832928 842832939
842900149 842900259
842907859 842907865
842911008 842911118
842911286 842911396
842911457 842911567
842915642 842915752
842922617 842922727
842923001 842923111
842923468 842923578
842928267 842928277
842967534 842967644
842981159 842981165
842981532 842981642
842981696 842981806
842986091 842986201
842988990 842989008
842994528 842994545
842996043 842996086
842997991 842998000
842999793 842999903
843025611 843025629
843105382 843105492
843108855 843108965
843132716 843132826
843174996 843175002
843223883 843223993
843251638 843251748
843257752 843257768
843272265 843272375
843311705 843311815
843421653 843421665
843431666 843431680
843435862 843435871
843443221 843443331
843445278 843445388
843460458 843460467
843571115 843571124
843635624 843635734
843637977 843638087
843638172 843638282
843638628 843638738
843640993 843641103
843642855 843642965
843643677 843643787
843644524 843644634
843645028 843645138
843656425 843656535
843656756 843656866
843669568 843669678
843674429 843674444
843703587 843703697
843704170 843704280
843704746 843704856
843709095 843709205
843710900 843711010
843721521 843721534
843729372 843729387
843742080 843742107
843795783 843795893
843796102 843796212
843801525 843801635
843802755 843802865
843803313 843803423
843833301 843833411
843836181 843836291
843837439 843837549
843839446 843839556
843840425 843840535
843842277 843842387
843843240 843843350
843855614 843855724
843857146 843857256
843857386 843857487
843861819 843861890
843887073 843887084
843902034 843902144
843906350 843906460
843906549 843906659
843906707 843906817
843907363 843907473
843907523 843907633
843912288 843912398
843921451 843921561
843922223 843922333
843965914 843966024
843966314 843966424
843966580 843966690
843966750 843966860
844007066 844007176
844008226 844008336
844008747 844008848
844010704 844010814
844011328 844011438
844012238 844012348
844012421 844012531
844012532 844012642
844013652 844013762
844015215 844015325
844016027 844016137
844016182 844016292
844017726 844017836
844018113 844018223
844018656 844018766
844035232 844035342
844051578 844051688
844097068 844097078
844122032 844122142
844122686 844122796
844245204 844245214
844345196 844345306
844354687 844354769
844356907 844357008
844370467 844370577
844370611 844370794
844371521 844371631
844423965 844424075
844430938 844431048
844440038 844440148
844446098 844446208
844448062 844448205
844448268 844448378
844448779 844448889
844450668 844450778
844457490 844457600
844459369 844459479
844459526 844459636
844463092 844463298
844464569 844464588
844467905 844468015
844468675 844468776
844485661 844485771
844497540 844497650
844508485 844508489
844514901 844515011
844516737 844516847
844562824 844562898
844567234 844567344
844570374 844570484
844575033 844575143
844578542 844578652
844592042 844592143
844606659 844606759
844619226 844619336
844619849 844619959
844622442 844622645
844657283 844657393
844661822 844661932
844662344 844662454
844663188 844663298
844673007 844673117
844684703 844684813
844696899 844697009
844697174 844697283
844697331 844697489
844702934 844703044
844703103 844703213
844706467 844706577
844756179 844756279
844764466 844764567
844782572 844782672
844789228 844789328
844812803 844812812
844813468 844813568
844835524 844835624
844850756 844850866
844864246 844864356
844865245 844865355
844870259 844870268
844877927 844878037
844884759 844884869
844889574 844889684
844898187 844898287
844913506 844913607
844933896 844934006
844936143 844936253
844941710 844941820
844942357 844942467
844942990 844943100
844943240 844943350
844943757 844943867
844967731 844967740
845026559 845026669
845047114 845047224
845057219 845057329
845061724 845061834
845066623 845066733
845067704 845067814
845138821 845138823
845158683 845158701
845159182 845159292
845160640 845160766
845176189 845176299
845186723 845186833
845187636 845187746
845232755 845232926
845238273 845238290
845316279 845316389
845319958 845320068
845321562 845321672
845324259 845324369
845329963 845329976
845360333 845360443
845377229 845377243
845398955 845398966
845446606 845446716
845476795 845476905
845477465 845477575
845478675 845478785
845492592 845492702
845504066 845504075
845533118 845533228
845533593 845533703
845533971 845534081
845534156 845534266
845534340 845534450
845542958 845543044
845543187 845543297
845543762 845543872
845544158 845544268
845544735 845544845
845547552 845547662
845560842 845560952
845561120 845561230
845561459 845561569
845561572 845561682
845562275 845562385
845562801 845562911
845563058 845563168
845585749 845585859
845587330 845587440
845587674 845587784
845587934 845587974
845589499 845589609
845636166 845636276
845657694 845657804
845665848 845665958
845668159 845668173
845674159 845674181
845688452 845688562
845690029 845690139
845700276 845700386
845704944 845705054
845705423 845705533
845708482 845708592
845715037 845715138
845722240 845722350
845725108 845725208
846013221 846013232
846013302 846013441
846016670 846016730
846016764 846016780
846095566 846095574
846106896 846106907
846117211 846117321
846117597 846117790
846118896 846119006
846136038 846136148
846136899 846137009
846137307 846137417
846137653 846137763
846138142 846138252
846188971 846189081
846191780 846191890
846192264 846192374
846193711 846193821
846194644 846194754
846194908 846194917
846197998 846198058
846344149 846344259
846345387 846345396
846364018 846364020
846441846 846441956
846444269 846444379
846446718 846446828
846449572 846449682
846450871 846450981
846457821 846457828
846510722 846510832
846513447 846513557
846514062 846514172
846529467 846529577
846529604 846529714
846545021 846545068
846545122 846545223
846623382 846623492
846632748 846632858
846633520 846633630
846633797 846633907
846675241 846675351
846675677 846675787
846689897 846690007
846692426 846692536
846692652 846692762
846698861 846698971
846746052 846746162
846746931 846747041
846748008 846748118
846751161 846751271
846751620 846751730
846751904 846752014
846752626 846752736
846753356 846753466
846754209 846754319
846826560 846826572
846834626 846834648
846853821 846853931
846854468 846854578
846855155 846855265
847120121 847120231
847230650 847230659
847237386 847237496
847317984 847318094
847381451 847381671
847383641 847383751
847384374 847384484
847395208 847395318
847395577 847395687
847402649 847402670
847417118 847417127
847425889 847425999
847426391 847426501
847426677 847426787
847427149 847427259
847427391 847427501
847427694 847427804
847430491 847430601
847432103 847432213
847473286 847473393
847473930 847474040
847604957 847604971
847622493 847622603
847623353 847623463
847624066 847624176
847624465 847624575
847625060 847625079
847661531 847661562
847731461 847731571
847736635 847736745
847737165 847737250
847738140 847738192
847738608 847738644
847738710 847738718
847739080 847739190
847739589 847739642
847740631 847740741
847741027 847741137
847741423 847741533
847744316 847744426
847745118 847745228
847745507 847745617
847747296 847747406
847747993 847748103
847748393 847748503
847748558 847748668
847749290 847749400
847750175 847750285
847750335 847750445
847797111 847797169
847802579 847802689
847802829 847802939
847811801 847811911
847812679 847812789
847814843 847814953
847815054 847815164
847815229 847815339
847815384 847815494
847815609 847815719
847815770 847815880
847816192 847816302
847816556 847816666
847818783 847818893
847823963 847824073
847834714 847834735
847836322 847836432
847837431 847837541
847841063 847841173
847841364 847841474
847883722 847883768
847915369 847915386
847922245 847922268
847945279 847945295
847998429 847998539
847998726 847998836
848000077 848000187
848004646 848004756
848032507 848032617
848033342 848033452
848035724 848035834
848069432 848069494
848071472 848071582
848086238 848086253
848095213 848095232
848099934 848100044
848100085 848100195
848100832 848100942
848101153 848101263
848116322 848116432
848116591 848116701
848157776 848157869
848159077 848159187
848219980 848220090
848229935 848229947
848231639 848231749
848233984 848234094
848237098 848237208
848288994 848289104
848302822 848302932
848311662 848311772
848311860 848311970
848317905 848318015
848318323 848318433
848319594 848319704
848319973 848320083
848323270 848323380
848323744 848323854
848324957 848325067
848325669 848325779
848325790 848325900
848326022 848326122
848330592 848330604
848335492 848335602
848348192 848348195
848418270 848418302
848418575 848418682
848418990 848419154
848424947 848425057
848430974 848431084
848431593 848431703
848432709 848432819
848439982 848439993
848458140 848458250
848458269 848458379
848458495 848458605
848466307 848466320
848492204 848492314
848581265 848581576
848582109 848582219
848619437 848619547
848624016 848624126
848625713 848625823
848626394 848626504
848627928 848628038
848630002 848630013
848638823 848638933
848642264 848642293
848648686 848648796
848648852 848648962
848673434 848673459
848684656 848684766
848691435 848691545
848691993 848692103
848692448 848692558
848701448 848701558
848702220 848702306
848702756 848702847
848735309 848735419
848736708 848736753
848741976 848742190
848742193 848742468
848744555 848744665
848745083 848745193
848750515 848750625
848755591 848755788
848757264 848757374
848785897 848786007
848786268 848786378
848789439 848789543
848816655 848816765
848842326 848842436
848843330 848843440
848846388 848846498
848850544 848850654
848853393 848853503
848855642 848855652
848865355 848865374
848876453 848876657
848896824 848896842
848918900 848919010
848922358 848922368
848942071 848942181
848944314 848944325
848970237 848970347
848981899 848982009
848982183 848982337
848982909 848983019
849037135 849037245
849037473 849037583
849037590 849037720
849037974 849038084
849044947 849045057
849050344 849050350
849053467 849053478
849076412 849076522
849080960 849081070
849082456 849082566
849087827 849087937
849147700 849147810
849153671 849153771
849160715 849160937
849162071 849162181
849162209 849162319
849164618 849164728
849164921 849165031
849213039 849213049
849248228 849248247
849300029 849300032
849413740 849413850
849413940 849414040
849443408 849443432
849470622 849470628
849477119 849477229
849554417 849554428
849564285 849564294
849568092 849568202
849568609 849568772
849637557 849637667
849705309 849705419
849705510 849705620
849719493 849719603
849720092 849720202
849726063 849726173
849729312 849729321
849774038 849774148
849774367 849774477
849775155 849775296
849775363 849775473
849776200 849776310
849776441 849776551
849776657 849776767
849786116 849786226
849786832 849787014
849787303 849787313
849822498 849822608
849823399 849823509
849870131 849870154
849892656 849892766
849892830 849892940
849893191 849893301
849894250 849894445
849894767 849894877
849901325 849901334
849950618 849950728
849951217 849951423
849951485 849951595
849953358 849953468
849958677 849958787
849959549 849959659
849959926 849960036
849960079 849960189
850020508 850020618
850020908 850021009
850061104 850061214
850062186 850062296
850063195 850063305
850064038 850064148
850064564 850064674
850065183 850065293
850065378 850065488
850065845 850065955
850101591 850101701
850101878 850101988
850153573 850153683
850161571 850161579
850164457 850164465
850170214 850170324
850172995 850173105
850173280 850173390
850182175 850182190
850187428 850187446
850241301 850241411
850271905 850272015
850275996 850276106
850282736 850282745
850317444 850317462
850330644 850330731
850331146 850331256
850346061 850346074
850362310 850362420
850362733 850362867
850370167 850370277
850395833 850395859
850405260 850405370
850488184 850488294
850488694 850488804
850490762 850490872
850514493 850514503
850532643 850532650
850602905 850603015
850666511 850666621
850674315 850674425
850677420 850677422
850679378 850679387
850692251 850692252
850694594 850694605
850697183 850697192
850715820 850715832
850825149 850825259
850825418 850825528
850825619 850825769
850825849 850826064
850841077 850841187
850841360 850841470
850841590 850841789
850853412 850853426
850880233 850880338
850881245 850881355
851033104 851033214
851033418 851033594
851038868 851038880
851072903 851072939
851072984 851073094
851073290 851073400
851073646 851073756
851074040 851074150
851074570 851074680
851074720 851074830
851075905 851076015
851077039 851077149
851395809 851395919
851395929 851396039
851400330 851400567
851400588 851400698
851408099 851408111
851408203 851408297
851464259 851464270
851467350 851467460
851467676 851467786
851513388 851513400
851520002 851520112
851522153 851522180
851646561 851646671
851660183 851660387
851665982 851666092
851670390 851670500
851674107 851674217
851674233 851674343
851698045 851698057
851729491 851729601
851778335 851778445
851780791 851780872
851784637 851784747
851785378 851785382
851787956 851787978
851934655 851934665
851970276 851970486
851978296 851978406
851978453 851978563
852025694 852025804
852051479 852051489
852065277 852065387
852065620 852065730
852100364 852100474
852101177 852101287
852101920 852102030
852138922 852139032
852139712 852139822
852141666 852141776
852142550 852142660
852143207 852143317
852144747 852144757
852144856 852144857
852144923 852145033
852147402 852147512
852148899 852149009
852149435 852149523
852156159 852156269
852212321 852212431
852247723 852247833
852249066 852249176
852250935 852251045
852251516 852251626
852263403 852263513
852263810 852263920
852264238 852264348
852266202 852266312
852266706 852266816
852266905 852267096
852276909 852277019
852312974 852313038
852314250 852314360
852314863 852314973
852315144 852315254
852323447 852323457
852325454 852325467
852358205 852358315
852360663 852360773
852360794 852360904
852361026 852361136
852361679 852361789
852414532 852414599
852414627 852414642
852415212 852415244
852415260 852415359
852415998 852416108
852416307 852416417
852416995 852417044
852417980 852418090
852418828 852418938
852419093 852419203
852419413 852419523
852419833 852419943
852421841 852421951
852422162 852422272
852422534 852422644
852422811 852422921
852423163 852423273
852435981 852436091
852440083 852440094
852458892 852459002
852489585 852489695
852490443 852490553
852493275 852493286
852497245 852497355
852502422 852502532
852504074 852504259
852504336 852504446
852506277 852506387
852507509 852507619
852507884 852507994
852509083 852509193
852520749 852520859
852520871 852520981
852566254 852566263
852568700 852568810
852575031 852575141
852576309 852576419
852577437 852577547
852577722 852577832
852578843 852578953
852580469 852580579
852582016 852582030
852583848 852583958
852595322 852595432
852627999 852628109
852633514 852633624
852634787 852634999
852635263 852635373
852635663 852635849
852636378 852636488
852636532 852636642
852637074 852637184
852661378 852661702
852663184 852663294
852669929 852670039
852671865 852671975
852672267 852672377
852672715 852672825
852679325 852679341
852697994 852698005
852715726 852715739
852716873 852716983
852745650 852745760
852752869 852752979
852758778 852758888
852758928 852759038
852794529 852794548
852825687 852825797
852920961 852920972
852931501 852931611
852953060 852953170
852953299 852953409
853024162 853024170
853034317 853034427
853067354 853067464
853196725 853196735
853264007 853264019
853272972 853272984
853280288 853280398
853290943 853291053
853346903 853347070
853347141 853347251
853414940 853414967
853444752 853444761
853453952 853454062
853479051 853479066
853483082 853483090
853522317 853522427
853572613 853572723
853572780 853572927
853573360 853573470
853573584 853573694
853573735 853573845
853573937 853574047
853574135 853574245
853575014 853575124
853575321 853575431
853575859 853575969
853577109 853577219
853577648 853577758
853578624 853578734
853595429 853595449
853758767 853758877
853838692 853838701
853949427 853949537
853950132 853950242
853950308 853950418
853955039 853955051
853955110 853955124
854041760 854041870
854086965 854087065
854249351 854249372
854292417 854292426
854295681 854295791
854295857 854296214
854296520 854296630
854297652 854297762
854306096 854306206
854311872 854311879
854408770 854408778
854427605 854427616
854476871 854477049
854478778 854478789
854482234 854482252
854483448 854483558
854504684 854504709
854584199 854584205
854585771 854585881
854586000 854586110
854618027 854618038
854658323 854658325
854705316 854705344
854706545 854706573
854751265 854751278
854751810 854751820
854770229 854770339
854794523 854794633
854910438 854910445
854916989 854916998
854926280 854926300
855004893 855004902
855011522 855011524
855030915 855031025
855086951 855086960
855158557 855158667
855159193 855159303
855199431 855199541
855220541 855220651
855243392 855243400
855258371 855258481
855268093 855268102
855312461 855312463
855461360 855461470
855476962 855477072
855478241 855478351
855486918 855487028
855487905 855488015
855488439 855488519
855489638 855489699
855491160 855491270
855501668 855501778
855506459 855506569
855526480 855526489
855544104 855544214
855599318 855599428
855599437 855599626
855604234 855604344
855604640 855604671
855606347 855606357
855608321 855608431
855609360 855609470
855609488 855609598
855620229 855620339
855621045 855621155
855689326 855689339
855706440 855706447
855783262 855783264
855809723 855809833
855812523 855812633
855824228 855824338
855862436 855862446
855864493 855864603
855864878 855864887
855866238 855866348
855866583 855866693
855866828 855866938
855869762 855869872
855870422 855870424
855873787 855873897
855907803 855907913
855943447 855943557
856006450 856006560
856007049 856007159
856008264 856008374
856008414 856008524
856067902 856068012
856069680 856069790
856075785 856075895
856105824 856105934
856127818 856127928
856133542 856133548
856135771 856135780
856142938 856143048
856150235 856150345
856167370 856167480
856167500 856167610
856210350 856210460
856210922 856211032
856218072 856218182
856223835 856223945
856224287 856224397
856233107 856233217
856258807 856258899
856276901 856277011
856294330 856294333
856295091 856295201
856295898 856296008
856320430 856320447
856323747 856323857
856331102 856331212
856331357 856331467
856383002 856383014
856396271 856396281
856401857 856401967
856402040 856402150
856411004 856411011
856414768 856414878
856436341 856436371
856466328 856466438
856466657 856466767
856467178 856467288
856500900 856501010
856501087 856501197
856501343 856501453
856502491 856502601
856502675 856502785
856502853 856502963
856503069 856503179
856503460 856503628
856504535 856504645
856505569 856505679
856505712 856505822
856506149 856506259
856509021 856509131
856527710 856527719
856536430 856536540
856571524 856571540
856583613 856583723
856591055 856591165
856613471 856613581
856695738 856695848
856698648 856698671
856703019 856703129
856710919 856711029
856718678 856718788
856727673 856727783
856729522 856729632
856730216 856730326
856745741 856745963
856746030 856746309
856778889 856778898
856826551 856826725
856827403 856827513
856876843 856876858
856900929 856900940
856922497 856922607
856928236 856928346
856987267 856987280
857007030 857007140
857007984 857008094
857094668 857094676
857131824 857131934
857132311 857132421
857215132 857215362
857215412 857215522
857258007 857258017
857262630 857262637
857268809 857268822
857334916 857335026
857362643 857362651
857366113 857366125
857402373 857402388
857410393 857410503
857411130 857411240
857412754 857412763
857424109 857424219
857424559 857424657
857424810 857424911
857426586 857426696
857428082 857428192
857428719 857428828
857435213 857435219
857436363 857436467
857445588 857445599
857461690 857461800
857495724 857495834
857498079 857498189
857500962 857501002
857502331 857502340
857505411 857505421
857507492 857507602
857509765 857509769
857512014 857512124
857514490 857514600
857516521 857516527
857522141 857522251
857529338 857529448
857531053 857531234
857544371 857544481
857551803 857551913
857559164 857559274
857582003 857582113
857582213 857582356
857592078 857592087
857596918 857596932
857632791 857632805
857636334 857636444
857637115 857637225
857639331 857639340
857645438 857645453
857652038 857652148
857652713 857652823
857667275 857667385
857678593 857678703
857678728 857678904
857682030 857682140
857686188 857686285
857688250 857688330
857695468 857695578
857706568 857706678
857707555 857707665
857715502 857715612
857735288 857735398
857743029 857743139
857755024 857755134
857755485 857755595
857755922 857756026
857761667 857761777
857761798 857761908
857762795 857762905
857763711 857763821
857764570 857764585
857769468 857769568
857774439 857774549
857777939 857778040
857778616 857778726
857790240 857790252
857848947 857849057
857862311 857862421
857862734 857862844
857863315 857863425
857898529 857898639
857900624 857900734
857932506 857932616
857940937 857941047
857945256 857945262
857945703 857945813
857946460 857946570
857947042 857947152
857947763 857947873
857947999 857948109
857949058 857949168
858107575 858107586
858118990 858119100
858119535 858119645
858121147 858121257
858132586 858132696
858165025 858165135
858207173 858207181
858217005 858217115
858219643 858219653
858268975 858269085
858291795 858291808
858377799 858377909
858390354 858390358
858455603 858455713
858465397 858465507
858467825 858467835
858470032 858470142
858470353 858470561
858489769 858489778
858532044 858532154
858535254 858535290
858556065 858556074
858594465 858594477
858607770 858607778
858609102 858609212
858617700 858617716
858620383 858620393
858626653 858626659
858643077 858643080
858693365 858693475
858724952 858724970
858741273 858741285
858766027 858766128
858785011 858785121
858785884 858785979
858797946 858797988
858805155 858805265
858806785 858806865
858819203 858819213
858951734 858951844
858952236 858952346
858961265 858961272
858963331 858963441
858964074 858964082
858973800 858973814
859068987 859068998
859075132 859075142
859075285 859075370
859077723 859077833
859079171 859079271
859082345 859082455
859082793 859082903
859083132 859083242
859084715 859084718
859084798 859084825
859085648 859085718
859085900 859085919
859093684 859093699
859094148 859094258
859094941 859095051
859095885 859095995
859096242 859096352
859096836 859096946
859097154 859097264
859123617 859123623
859140892 859141002
859182074 859182082
859231925 859232035
859232241 859232351
859242788 859242800
859281365 859281381
859312556 859312563
859313762 859313872
859320132 859320144
859348550 859348558
859431749 859431859
859474812 859474922
859477536 859477549
859496001 859496017
859551346 859551381
859576019 859576024
859591363 859591473
859592249 859592359
859662726 859662836
859704490 859704690
859704720 859704830
859720437 859720499
859751626 859751720
859781281 859781290
859787094 859787204
859791900 859792000
859795366 859795476
859831600 859831609
859848847 859848957
859898977 859899087
859934490 859934499
860000752 860000929
860010994 860011002
860060484 860060494
860091132 860091242
860092547 860092657
860094155 860094265
860094458 860094617
860095305 860095415
860095419 860095529
860096933 860097043
860097400 860097510
860097837 860097947
860098649 860098759
860099149 860099259
860099710 860099820
860100114 860100224
860101630 860101777
860102119 860102229
860102375 860102485
860102631 860102776
860103590 860103700
860104150 860104370
860104937 860105178
860106335 860106354
860149693 860149700
860160353 860160463
860160520 860160630
860162615 860162725
860166855 860166965
860168685 860168795
860169807 860169866
860170439 860170470
860271245 860271355
860271706 860271816
860274955 860275065
860276730 860276840
860284327 860284437
860292939 860293049
860356309 860356419
860356647 860356757
860357880 860357896
860364389 860364451
860440193 860440205
860478570 860478576
860489469 860489513
860489856 860489886
860490333 860490443
860497450 860497556
860506938 860507048
860507145 860507255
860509667 860509777
860509798 860509908
860510213 860510323
860510600 860510710
860510939 860511035
860527302 860527311
860528194 860528274
860550849 860550863
860552184 860552294
860585211 860585321
860624070 860624083
860796795 860796803
860857378 860857392
860879022 860879031
860894438 860894444
860947986 860948155
860970708 860970812
860970875 860970976
861038238 861038257
861040892 861041002
861041438 861041548
861042054 861042164
861043349 861043360
861043457 861043463
861043541 861043563
861044661 861044771
861055430 861055442
861056499 861056605
861064797 861064819
861065744 861065854
861071852 861071952
861073825 861073935
861084197 861084307
861089137 861089322
861111712 861111822
861175523 861175562
861214948 861215162
861233120 861233230
861278794 861278800
861279968 861280078
861306866 861306942
861310029 861310139
861315718 861315720
861390955 861390970
861398713 861398823
861424465 861424469
861428463 861428471
861483512 861483622
861484279 861484389
861484395 861484505
861484885 861484995
861485477 861485587
861486479 861486679
861487626 861487736
861489563 861489568
861495226 861495336
861495435 861495623
861501245 861501355
861501526 861501636
861501724 861501834
861504693 861504888
861544085 861544195
861544347 861544558
861566200 861566310
861566434 861566544
861569138 861569306
861577259 861577369
861616381 861616572
861625593 861625604
861629587 861629697
861641348 861641363
861641725 861641835
861644411 861644631
861647528 861647638
861647671 861647781
861650107 861650109
861654558 861654668
861693172 861693282
861693395 861693510
861739770 861739778
861750954 861751051
861824195 861824210
861843045 861843054
861866592 861866702
861886159 861886168
861919907 861919914
861924511 861924621
861924636 861924746
861924771 861924843
861924891 861924991
861925283 861925393
861931763 861931873
861946268 861946276
861992530 861992640
861992864 861992974
861996881 861996891
862139816 862139825
862159547 862159557
862159634 862159744
862159957 862160067
862160614 862160724
862161320 862161430
862163226 862163336
862165238 862165348
862168747 862168790
862177032 862177049
862179438 862179453
862187307 862187417
862187970 862188080
862207604 862207714
862258337 862258346
862262550 862262556
862278835 862279110
862312808 862312918
862313460 862313618
862324861 862324971
862351895 862352005
862384727 862384747
862404452 862404562
862408495 862408605
862409253 862409424
862409552 862409662
862409740 862409850
862409896 862410006
862462609 862462648
862521808 862521816
862524764 862524776
862533383 862533400
862543209 862543418
862556183 862556197
862565809 862565919
862566946 862567056
862568015 862568125
862583635 862583745
862599892 862599907
862602139 862602239
862605866 862605976
862646157 862646267
862698688 862698699
862701048 862701158
862701518 862701613
862701813 862701841
862701850 862701960
862704854 862704875
862705966 862706076
862706588 862706698
862708806 862708916
862710070 862710180
862711825 862711935
862711981 862712091
862712327 862712437
862713546 862713656
862716230 862716340
862732322 862732330
862768797 862768809
862773085 862773104
862813915 862814025
862855429 862855539
862855565 862855718
862858304 862858414
862858571 862858681
862870012 862870021
862870163 862870273
862870597 862870604
862872603 862872713
862872737 862872847
862880083 862880090
862897005 862897024
862942194 862942304
862944117 862944124
862947244 862947252
862948340 862948450
862948648 862948745
862950273 862950383
862954136 862954149
862976646 862976756
863034387 863034497
863052305 863052479
863052655 863052765
863073115 863073225
863073486 863073596
863074305 863074415
863091503 863091719
863119440 863119550
863119618 863119728
863146681 863146791
863147735 863147845
863147848 863147958
863168012 863168122
863168162 863168272
863168277 863168387
863168771 863168881
863169356 863169466
863169581 863169790
863169910 863170020
863170122 863170232
863201548 863201658
863202521 863202531
863205203 863205313
863205903 863206013
863206780 863206890
863207211 863207321
863216956 863216965
863230100 863230210
863295680 863295692
863301801 863301809
863317378 863317488
863371788 863371898
863372032 863372142
863372219 863372329
863377897 863377908
863401065 863401175
863401394 863401504
863402571 863402681
863402922 863403032
863403042 863403152
863457768 863457777
863470576 863470731
863486305 863486599
863486895 863487005
863539877 863539890
863541079 863541189
863547532 863547549
863635500 863635610
863637344 863637352
863667988 863668098
863668558 863668668
863668691 863668801
863669768 863669777
863683952 863683960
863713663 863713773
863715656 863715766
863718372 863718482
863719501 863719611
863720713 863720823
863721259 863721369
863734110 863734220
863734363 863734473
863735011 863735121
863770796 863770804
863805585 863805695
863810260 863810370
863830585 863830695
863831067 863831177
863848318 863848428
863848488 863848598
863932557 863932667
863932710 863932924
863938116 863938226
863945547 863945657
863951342 863951452
863965458 863965568
863965658 863965834
863966565 863966675
863966849 863966959
863969686 863969796
863971547 863971647
863977652 863977762
863979282 863979296
863982947 863982955
863984370 863984378
863993749 863993859
864014655 864014765
864015274 864015375
864058986 864058999
864069322 864069330
864107882 864107992
864131983 864132093
864146468 864146578
864149871 864149888
864150235 864150345
864158796 864158807
864168563 864168673
864193841 864193951
864253432 864253446
864258817 864258927
864267200 864267310
864272182 864272292
864273348 864273458
864274509 864274619
864280527 864280637
864305752 864305862
864314463 864314471
864325509 864325518
864328185 864328186
864328450 864328560
864339200 864339267
864340127 864340128
864340411 864340454
864353216 864353233
864354018 864354128
864416215 864416325
864416329 864416439
864417120 864417230
864434089 864434099
864436597 864436707
864437196 864437306
864464145 864464153
864506315 864506425
864510606 864510716
864585219 864585329
864586024 864586190
864586329 864586439
864594239 864594252
864604554 864604664
864606926 864606935
864607689 864607750
864607773 864607883
864628203 864628313
864673450 864673458
864678546 864678656
864751169 864751181
864753358 864753468
864753650 864753760
864753938 864754048
864754273 864754383
864754434 864754544
864761261 864761371
864761531 864761641
864771374 864771484
864778538 864778549
864859055 864859063
864921834 864921846
864922042 864922152
864963097 864963207
864963358 864963468
864969406 864969516
865029061 865029069
865030608 865030612
865055965 865056075
865129586 865129792
865134178 865134288
865181809 865181919
865183437 865183547
865184795 865184905
865185194 865185204
865189237 865189347
865190292 865190333
865193992 865194102
865194365 865194475
865196750 865196860
865198283 865198393
865199399 865199509
865200196 865200306
865200636 865200933
865288842 865288952
865288993 865289103
865330304 865330414
865331579 865331689
865345189 865345199
865397990 865398100
865398574 865398684
865399447 865399547
865465053 865465072
865465497 865465607
865474636 865474652
865490976 865491001
865542465 865542480
865613979 865613988
865616823 865616933
865625904 865626014
865668372 865668382
865684200 865684222
865720714 865720824
865720843 865720953
865721414 865721524
865744951 865745061
865745299 865745409
865795311 865795327
865798649 865798657
865808666 865808676
865824192 865824200
865828740 865828850
865828982 865829037
865829066 865829092
865829363 865829473
865829612 865829828
865853741 865853851
865876524 865876538
865893514 865893523
865947214 865947324
865982209 865982319
866032212 866032225
866075664 866075774
866075817 866075927
866078356 866078466
866079080 866079190
866084031 866084141
866084328 866084438
866086263 866086373
866087083 866087193
866099699 866099809
866110357 866110467
866110970 866111080
866112045 866112155
866123135 866123245
866125781 866125891
866129099 866129249
866150399 866150509
866152072 866152265
866159756 866159866
866160056 866160166
866160695 866160805
866161241 866161351
866162809 866162919
866164159 866164269
866164795 866164905
866165823 866165933
866166492 866166510
866166769 866166801
866167962 866168072
866168685 866168709
866169854 866169964
866170939 866170960
866171037 866171147
866171391 866171501
866171744 866171957
866172227 866172337
866172658 866172768
866183546 866183656
866184117 866184227
866209939 866210049
866210399 866210500
866216780 866216890
866217271 866217372
866221938 866222048
866222196 866222306
866225169 866225279
866225480 866225590
866225821 866225931
866226682 866226792
866229748 866229858
866231543 866231653
866231694 866231804
866231953 866231957
866232348 866232458
866232475 866232585
866235993 866236103
866237547 866237729
866241555 866241588
866246021 866246131
866259343 866259453
866325905 866326015
866333482 866333498
866354768 866354878
866355083 866355256
866355947 866356057
866391988 866392098
866396833 866396943
866397897 866398007
866410908 866411018
866411263 866411373
866413727 866413837
866490903 866491013
866491627 866491737
866524481 866524591
866524782 866524892
866567579 866567689
866569725 866569835
866569844 866569954
866571794 866571904
866579906 866580016
866580057 866580167
866580404 866580514
866581347 866581457
866583662 866583671
866593671 866593781
866600581 866600691
866601321 866601541
866601786 866601896
866602319 866602429
866602741 866602851
866603976 866604086
866604159 866604269
866605187 866605220
866605496 866605606
866605762 866605811
866606115 866606199
866672706 866672816
866673457 866673652
866674151 866674333
866698419 866698529
866711282 866711392
866711448 866711558
866736411 866736425
866762354 866762464
866762657 866762767
866762994 866763188
866770954 866771064
866774057 866774071
866829464 866829574
866836132 866836242
866850466 866850576
866935992 866936009
866941665 866941775
866944876 866944976
866945462 866945572
866946028 866946138
866946639 866946749
866947077 866947187
866948519 866948629
866949155 866949265
866949553 866949746
866950217 866950327
866950853 866950963
866951409 866951519
866952747 866952857
866953323 866953433
866953901 866954011
866954169 866954279
866954792 866954902
866955651 866955761
866956273 866956383
866956686 866956796
866957000 866957110
866957211 866957321
866961680 866961790
866961847 866962014
866966113 866966277
866989890 866990000
867006565 867006587
867006896 867007116
867008032 867008142
867008199 867008309
867008900 867009010
867009226 867009336
867014595 867014705
867034771 867034881
867056198 867056208
867078144 867078254
867081768 867081878
867089622 867089732
867108957 867108964
867109607 867109717
867109989 867110099
867110529 867110639
867111260 867111370
867120021 867120131
867121051 867121092
867121148 867121248
867143117 867143227
867191163 867191172
867206350 867206460
867212083 867212193
867246618 867246728
867275334 867275444
867277029 867277036
867281754 867281864
867285593 867285988
867285989 867286099
867298964 867298983
867319763 867319797
867319851 867319873
867364088 867364198
867378792 867378902
867449555 867449665
867501130 867501240
867501702 867501812
867502144 867502254
867502649 867502759
867510467 867510577
867558674 867558753
867619682 867619792
867628386 867628496
867628741 867628851
867687405 867687515
867771682 867771709
867774880 867774990
867776572 867776682
867777490 867777600
867779586 867779696
867782784 867782795
867789499 867789609
867791003 867791113
867795622 867795638
867797223 867797333
867815999 867816109
868045689 868045799
868046045 868046155
868054782 868054802
868057820 868057930
868060781 868060891
868143067 868143177
868144472 868144582
868144588 868144698
868213011 868213121
868214729 868214839
868214906 868215016
868216385 868216398
868232606 868232626
868236187 868236297
868236610 868236720
868247664 868247692
868253679 868253688
868262639 868262647
868300766 868300922
868300957 868301090
868301406 868301516
868305174 868305372
868391917 868392027
868472288 868472304
868527529 868527639
868540486 868540496
868584291 868584302
868602709 868602819
868603007 868603117
868603233 868603343
868603691 868603783
868608382 868608492
868612601 868612795
868612827 868612937
868631322 868631331
868651846 868651858
868661469 868661579
868662741 868662762
868701168 868701180
868745028 868745037
868753249 868753273
868794190 868794213
868851572 868851682
868909135 868909245
868909289 868909399
868919357 868919376
868987990 868988100
869006687 869006797
869006859 869006969
869007207 869007317
869020200 869020310
869020490 869020600
869060237 869060246
869068023 869068030
869164320 869164430
869177770 869177880
869234001 869234028
869255656 869255766
869282799 869283089
869283898 869284008
869367616 869367726
869439783 869439893
869442636 869442651
869443733 869443843
869464566 869464676
869465114 869465224
869472332 869472442
869473771 869473881
869505232 869505251
869524299 869524308
869535589 869535611
869540714 869540824
869540921 869541031
869541290 869541400
869542031 869542141
869583597 869583707
869583720 869583995
869600606 869600716
869601416 869601526
869604866 869604908
869613887 869613895
869616265 869616314
869617367 869617378
869648699 869648809
869661184 869661294
869668108 869668218
869720577 869720586
869773254 869773261
869775234 869775344
869776710 869776820
869777141 869777251
869868640 869868750
869871452 869871562
869922593 869922703
869949651 869949751
869950641 869950751
869950939 869951049
869951933 869952043
869954380 869954490
869954896 869955006
869986915 869987025
869992033 869992143
870024112 870024128
870034076 870034186
870038684 870038702
870058123 870058233
870058453 870058563
870067988 870068098
870071463 870071573
870103412 870103429
870103714 870103773
870122292 870122402
870261899 870262009
870262490 870262600
870262617 870262727
870273267 870273276
870290001 870290020
870292488 870292598
870293443 870293553
870294233 870294343
870296233 870296343
870296940 870297050
870297337 870297447
870298087 870298197
870299684 870299794
870300063 870300173
870302245 870302355
870303664 870303774
870304056 870304166
870304595 870304705
870342116 870342134
870453095 870453282
870467412 870467422
870526856 870526966
870561873 870561983
870562084 870562185
870578145 870578164
870629014 870629026
870645640 870645844
870716147 870716257
870788355 870788465
870813956 870814066
870815192 870815201
870824948 870825058
870891407 870891423
870939908 870939919
870956303 870956413
870959788 870959889
870991916 870991924
871061229 871061230
871105566 871105599
871236633 871236743
871241223 871241333
871243430 871243440
871272637 871272696
871277325 871277334
871289569 871289599
871290128 871290238
871301158 871301268
871312989 871313099
871441442 871441457
871522462 871522572
871590273 871590383
871619295 871619304
871653652 871653762
871653879 871653989
871672015 871672024
871679612 871679620
871685674 871685685
871695397 871695404
871718972 871719082
871803504 871803614
871920982 871920990
871933676 871933786
872092903 872093013
872103992 872104003
872142129 872142239
872142509 872143042
872167779 872167792
872183079 872183189
872201832 872201844
872299574 872299684
872304715 872304825
872315355 872315465
872331580 872331690
872345471 872345581
872345780 872345890
872367562 872367582
872419754 872419864
872420724 872420834
872442801 872442911
872461197 872461307
872461717 872461827
872635359 872635371
872643799 872643804
872644487 872644597
872645300 872645370
872704671 872704781
872706064 872706174
872706723 872706833
872708235 872708345
872731127 872731160
872731693 872731803
872731818 872731828
872816908 872817076
872817082 872817269
872871893 872871905
872885764 872885774
872886988 872887098
872887171 872887281
872887296 872887406
872887682 872887792
872894726 872894836
872895387 872895497
872918013 872918123
872979797 872979808
872997221 872997331
872997720 872997830
872998198 872998222
872998269 872998369
873039669 873039708
873060196 873060205
873137071 873137080
873141108 873141124
873222856 873222864
873245572 873245747
873257944 873258054
873274724 873274834
873318429 873318539
873318686 873318796
873413477 873413587
873413989 873414099
873416032 873416142
873424746 873424758
873436439 873436549
873489657 873489767
873489784 873489894
873492843 873492953
873583011 873583121
873583456 873583459
873618100 873618210
873618214 873618324
873631783 873631802
873648738 873648750
873651422 873651532
873652155 873652265
873653141 873653251
873653320 873653430
873653688 873653798
873657118 873657228
873657770 873657880
873658105 873658215
873658739 873658849
873659206 873659316
873659607 873659717
873660243 873660353
873661265 873661375
873665971 873665980
873668106 873668216
873677293 873677306
873689401 873689511
873690884 873690901
873713262 873713372
873714550 873714660
873733475 873733585
873734093 873734203
873736112 873736222
873745613 873745625
873769282 873769392
873786061 873786171
873786546 873786656
873806618 873806728
873814254 873814364
873814963 873815073
873834763 873834936
873844508 873844618
873903831 873903941
873939920 873940030
873940277 873940318
873940381 873940387
873940389 873940532
873940639 873940829
873940875 873940985
873964106 873964216
874015305 874015415
874023764 874023874
874087553 874087663
874087688 874087798
874088195 874088305
874189117 874189227
874272867 874272890
874275428 874275440
874313432 874313466
874352749 874352761
874354136 874354145
874360663 874360688
874436873 874436903
874439970 874440080
874478790 874479060
874501481 874501515
874514087 874514097
874524806 874524916
874526304 874526414
874530200 874530310
874530398 874530499
874531307 874531417
874536284 874536394
874536624 874536734
874537401 874537511
874567559 874567669
874567965 874568075
874568324 874568434
874622909 874622927
874650115 874650126
874687188 874687298
874695974 874695986
874706767 874706783
874802178 874802189
874802460 874802545
874817612 874817621
874846212 874846236
874874462 874874572
874875254 874875364
874878333 874878345
874901674 874901784
874902136 874902246
