GRB090708	931059510
GRB090709	931160329
GRB090709B	931187277
GRB090711	931379017
GRB090712	931405880
GRB090713	931480183
GRB090715	931713954
GRB090715B	931727009
GRB090717	931826987
GRB090717B	931833646
GRB090718	931972617
GRB090718B	931976277
GRB090719	932002301
GRB090720	932107103
GRB090720B	932144591
GRB090725	932587595
GRB090726	932620462
GRB090726B	932683362
GRB090727	932769753
GRB090727B	932772764
GRB090728	932827560
GRB090730	932999722
GRB090802	933226758
GRB090802B	933263918
GRB090804B	933460415
GRB090807	933692442
GRB090807B	933710294
GRB090809	933874289
GRB090809B	933895709
GRB090810	933965099
GRB090810B	933954562
GRB090811	934044125
GRB090812	934092143
GRB090813	934171858
GRB090814	934246354
GRB090814B	934248076
GRB090814C	934274996
GRB090814E	934325263
GRB090815	934355547
GRB090815B	934367456
GRB090815C	934413714
GRB090815D	934411321
GRB090817	934505488
GRB090819	934727682
GRB090820	934763911
GRB090820B	934805611
GRB090823	935032268
GRB090823B	935079087
GRB090824	935186554
GRB090826	935285866
GRB090827	935435201
GRB090828	935461383
GRB090829	935597273
GRB090829B	935599855
GRB090831	935739411
GRB090831C	935789440
GRB090902	935919500
GRB090902B	935924730
GRB090904	936061281
GRB090904B	936062673
GRB090904C	936107852
GRB090907	936318264
GRB090907B	936386642
GRB090908	936430327
GRB090908B	936432654
GRB090909	936531692
GRB090909B	936563407
GRB090910	936646203
GRB090911	936674639
GRB090911B	936719731
GRB090911C	936745820
GRB090912	936805844
GRB090914	937005495
GRB090915	937064151
GRB090916	937119659
GRB090916B	937114178
GRB090917	937237913
GRB090920	937443014
GRB090920B	937507372
GRB090922	937659417
GRB090922B	937665056
GRB090924	937839609
GRB090925	937905648
GRB090926	937974041
GRB090926B	938037363
GRB090927	938081251
GRB090928	938186999
GRB090929	938233998
GRB090929B	938254162
GRB091002	938535986
GRB091003	938579760
GRB091005	938794665
GRB091006	938853541
GRB091010	939177804
GRB091012	939408437
GRB091013	939512680
GRB091015	939611157
GRB091015B	939682832
GRB091017	939847239
GRB091017B	939857952
GRB091018	939934114
GRB091018B	939941915
GRB091019	940010455
GRB091020	940109819
GRB091020B	940116409
GRB091022	940269822
GRB091023	940292999
GRB091024	940409776
GRB091024B	940410404
GRB091026	940592343
GRB091026B	940597905
GRB091029	940823617
GRB091030	940949011
GRB091030B	940967561
GRB091031	941025643
GRB091101	941081207
GRB091102	941207693
GRB091103	941320446
GRB091104B	941359777
GRB091106B	941566647
GRB091107	941642054
GRB091109	941777878
GRB091109B	941838558
GRB091109C	941837335
GRB091111	941988134
GRB091112	942082896
GRB091112B	942099366
GRB091115	942293705
GRB091117	942458139
GRB091117B	942515084
GRB091120	942726895
GRB091122	942897275
GRB091123	942976574
GRB091123B	942995332
GRB091126	943257579
GRB091126B	943262403
GRB091127	943399560
GRB091128	943426249
GRB091130B	943639159
GRB091201	943668467
GRB091202	943753461
GRB091202B	943766157
GRB091202C	943830619
GRB091207	944208025
GRB091207B	944255947
GRB091208	944297175
GRB091208B	944301012
GRB091208D	944319440
GRB091209	944352059
GRB091215	944890661
GRB091219	945255900
GRB091220	945340625
GRB091221	945463987
GRB091223	945578125
GRB091223B	945605768
GRB091224	945680271
GRB091227	945932608
GRB091230	946188864
GRB091230B	946189635
GRB091230C	946227929
GRB091231	946270608
GRB091231B	946299483
GRB100101	946341604
GRB100101B	946424550
GRB100103	946575767
GRB100107	946864006
GRB100111	947218384
GRB100112	947325692
GRB100115	947589334
GRB100116	947712771
GRB100117	947797594
GRB100118	947816628
GRB100119	947960740
GRB100122	948206872
GRB100126	948539000
GRB100130	948907779
GRB100130B	948911930
GRB100131	948994272
GRB100201	949068392
GRB100203	949257082
GRB100204	949278848
GRB100204B	949325698
GRB100204C	949350978
GRB100205	949378738
GRB100205B	949405553
GRB100206	949498220
GRB100207B	949593489
GRB100207C	949598324
GRB100208	949655748
GRB100210	949803904
GRB100211	949919630
GRB100212	950015520
GRB100212B	950018857
GRB100213	950135283
GRB100213B	950137129
GRB100216	950350035
GRB100218	950503140
GRB100219	950575049
GRB100219B	950627761
GRB100221	950777441
GRB100223	950927904
GRB100224	951014470
GRB100224B	951060025
GRB100225	951101168
GRB100225B	951112760
GRB100225C	951141346
GRB100225D	951151953
GRB100228	951397376
GRB100228B	951425882
GRB100301	951442653
GRB100301B	951456121
GRB100302	951594801
GRB100304	951696335
GRB100304B	951742113
GRB100305	951815153
GRB100306	951886000
GRB100307	952035405
GRB100311	952345569
GRB100313	952498478
GRB100313B	952517552
GRB100315	952677567
GRB100316	952741395
GRB100316B	952761711
GRB100316C	952765094
GRB100316D	952778705
GRB100318	952958379
GRB100322	953255124
GRB100322B	953276793
GRB100323	953384459
GRB100324	953425302
GRB100324B	953438871
GRB100325	953531698
GRB100325B	953534183
GRB100326	953622200
GRB100326B	953631515
GRB100327	953718210
GRB100328	953781779
GRB100330	953969106
GRB100330B	954016383
GRB100331	954030637
GRB100331B	954104933
GRB100401	954140866
GRB100401B	954182065
GRB100406	954612700
GRB100410	954923532
GRB100410B	954956761
GRB100411	955023792
GRB100413	955215223
GRB100413B	955183376
GRB100414	955246836
GRB100417	955511998
GRB100417B	955565755
GRB100418	955660223
GRB100420	955757541
GRB100420B	955776177
GRB100421	955922403
GRB100423	956018114
GRB100423C	956037100
GRB100424	956161977
GRB100424B	956165425
GRB100424C	956178127
GRB100425	956199060
GRB100427	956392330
GRB100429	956620806
GRB100502	956824397
GRB100503	949238298
GRB100504A	957036074
GRB100506	957195604
GRB100507	957275490
GRB100508	957345657
GRB100510	957554841
GRB100511	957574211
GRB100513	957751643
GRB100513B	957819972
GRB100514	957898453
GRB100515	957957204
GRB100516	958004429
GRB100516B	958035056
GRB100516C	958037453
GRB100517	958095803
GRB100517B	958102943
GRB100517C	958110607
GRB100517E	958144813
GRB100517F	958101005
GRB100518A	958217632
GRB100519	958280017
GRB100522	958535167
GRB100525	958845100
GRB100526A	958926385
GRB100526B	958935653
GRB100527	959022292
GRB100528	959046496
GRB100530	959276526
GRB100604	959756029
GRB100605	959798125
GRB100606	959886776
GRB100608	960023421
GRB100609	960144506
GRB100612B	960383076
GRB100612C	960398781
GRB100614	960551858
GRB100614B	960586721
GRB100615	960602358
GRB100616	960748367
GRB100616B	960687748
GRB100617	960812424
GRB100619	960942082
GRB100620	961037504
GRB100621	961124627
GRB100621B	961152693
GRB100621C	961159351
GRB100625	961525963
GRB100625B	961536180
GRB100628	961748215
GRB100629	961874058
GRB100701	962019938
GRB100701B	962002483
GRB100702	962067842
GRB100703A	962214232
GRB100704	962249723
GRB100706	962469513
GRB100707	962498813
GRB100709B	962720867
GRB100713	963066965
GRB100713B	963099109
GRB100714B	963158858
GRB100714C	963160055
GRB100715	963228452
GRB100717	963392121
GRB100717B	963398522
GRB100718	963460224
GRB100718B	963515197
GRB100719	963545472
GRB100719B	963559712
GRB100719C	963604103
GRB100719D	963618259
GRB100722	963800332
GRB100722B	963817119
GRB100724	963967340
GRB100724B	963967354
GRB100725A	964077187
GRB100725B	964092289
GRB100727	964244552
GRB100728	964318719
GRB100728B	964348330
GRB100729	964432663
GRB100730	964523189
GRB100802	964763151
GRB100804	964924181
GRB100805	965016777
GRB100805C	965074604
GRB100805D	965027547
GRB100807	965207608
GRB100810	965437849
GRB100811	965529364
GRB100811B	965587464
GRB100814	965793026
GRB100814B	965809540
GRB100816	965952776
GRB100816B	965954286
GRB100819	965390210
GRB100820	966329833
GRB100823	966619550
GRB100825	966754443
GRB100826	966898717
GRB100829	967107562
GRB100829B	967150943
GRB100831	967304260
GRB100901	967383265
GRB100902	967491129
GRB100902B	967506334
GRB100904	967599238
GRB100905	967734509
GRB100905B	967758397
GRB100906	967816182
GRB100907	967917686
GRB100909	968058255
GRB100910	968182678
GRB100911	968268954
GRB100915	968549480
GRB100915B	968564993
GRB100916	968697687
GRB100917	968735020
GRB100918	968877753
GRB100919	968965951
GRB100922	969202798
GRB100923	969308125
GRB100924	969335903
GRB100926	969545838
GRB100926B	969554409
GRB100928	969675607
GRB100929	969773947
GRB100929B	969780799
GRB100929C	969832800
GRB101002	970036901
GRB101003	970120283
GRB101004	970222444
GRB101008	970591410
GRB101010	970720441
GRB101011	970851530
GRB101013	970998777
GRB101014	971064727
GRB101015	971184257
GRB101016	971243431
GRB101017	971346782
GRB101017B	971362304
GRB101020	971653256
