847767752 847767769
847807441 847807458
847858745 847858762
847870595 847870612
848052474 848052491
848060212 848060229
848071211 848071228
848071239 848071256
848072511 848072528
848072527 848072544
848073241 848073258
848073246 848073263
848149468 848149486
848149495 848149512
848152230 848152247
848152248 848152265
848152303 848152320
848187834 848187851
848187946 848187963
848188003 848188022
848203002 848203019
848238615 848238632
848240488 848240505
848245611 848245629
848247044 848247061
848247070 848247087
848247099 848247116
848247136 848247154
848260904 848260921
848263582 848263599
848363390 848363407
848363407 848363424
848365644 848365661
848437394 848437411
848442062 848442079
848451240 848451257
848453112 848453129
848453643 848453660
848456345 848456362
848493560 848493579
848502819 848502836
848503794 848503811
848512684 848512701
848512741 848512758
848512764 848512781
848591649 848591666
848600076 848600093
848609625 848609643
848614000 848614017
848614090 848614107
848614176 848614193
848665166 848665183
848671224 848671241
848685090 848685107
848686343 848686361
848686409 848686426
848686899 848686916
848686908 848686925
848687336 848687353
848689794 848689811
848693582 848693599
848693658 848693675
848694740 848694757
848700094 848700111
848701235 848701253
848742199 848742216
848757570 848757587
848757594 848757611
848757624 848757642
848757651 848757668
848757920 848757937
848758823 848758840
848759323 848759340
848759328 848759345
848759354 848759371
848829574 848829591
848914489 848914506
848914506 848914523
848914554 848914571
848941621 848941639
848943550 848943567
848951792 848951809
848951863 848951880
848951904 848951922
848955927 848955944
849086462 849086479
849098058 849098075
849098065 849098082
849107276 849107293
849197352 849197369
849274785 849274802
849310964 849310981
849364628 849364645
849389027 849389045
849465946 849465963
849466583 849466601
849474397 849474414
849531199 849531216
849539088 849539105
849540453 849540470
849540507 849540527
849540531 849540548
849540887 849540904
849540899 849540917
849541978 849541997
849547826 849547843
849548827 849548844
849550760 849550779
849550976 849550994
849624891 849624909
849631634 849631652
849631665 849631684
849631927 849631944
849633557 849633577
849642511 849642528
849642789 849642806
849727350 849727367
849732117 849732135
849735652 849735670
849890833 849890851
849890878 849890895
849891079 849891096
849891361 849891380
849960906 849960923
850051091 850051108
850054278 850054295
850058914 850058932
850058958 850058975
850074918 850074935
850074989 850075006
850137747 850137764
850146776 850146794
850147799 850147817
850147862 850147879
850157452 850157469
850157871 850157888
850157943 850157961
850157955 850157972
850157974 850157993
850158003 850158021
850224187 850224204
850224305 850224322
850226634 850226651
850226688 850226706
850230945 850230962
850231138 850231155
850231257 850231274
850231323 850231341
850231355 850231372
850236282 850236299
850247448 850247465
850323021 850323038
850335733 850335750
850335754 850335771
850335811 850335829
850428547 850428564
850485186 850485203
850485233 850485250
850485237 850485255
850501643 850501660
850566059 850566077
850575039 850575056
850593468 850593486
850593613 850593630
850593637 850593654
850593727 850593744
850656544 850656562
850656554 850656571
850656652 850656669
850663548 850663566
850663625 850663642
850663631 850663648
850663683 850663700
850677191 850677208
850678488 850678507
850680545 850680564
850686120 850686137
850763078 850763095
850763122 850763139
850763130 850763147
850771735 850771753
850771804 850771821
850787336 850787353
850826050 850826067
850839382 850839401
850846709 850846726
850846794 850846811
850846993 850847010
850847022 850847039
851202774 851202792
851202835 851202852
851202857 851202874
851261815 851261833
851347409 851347427
851347458 851347477
851347502 851347519
851349766 851349783
851349838 851349855
851349852 851349870
851354480 851354497
851354531 851354548
851356470 851356487
851356517 851356536
851356531 851356550
851356545 851356562
851369544 851369561
851370648 851370666
851384063 851384081
851441270 851441288
851441291 851441308
851441316 851441336
851441341 851441358
851453041 851453058
851453089 851453106
851453105 851453122
851453116 851453133
851453371 851453389
851457141 851457158
851457165 851457182
851457215 851457233
851457239 851457256
851457243 851457260
851458278 851458295
851461328 851461345
851461352 851461369
851461398 851461418
851461415 851461432
851461444 851461461
851666066 851666083
851686643 851686660
851686724 851686741
851686735 851686752
851707873 851707890
851759871 851759888
851777358 851777375
851782223 851782241
851782270 851782290
851782296 851782313
851782315 851782333
851786915 851786932
851801222 851801240
851801270 851801287
851801288 851801306
851804996 851805014
851805041 851805059
851805063 851805080
851809124 851809141
851809168 851809188
851809208 851809225
851871184 851871201
851871198 851871215
851871230 851871247
851871238 851871255
851886422 851886440
851888079 851888096
851897448 851897465
851897506 851897523
851898134 851898151
851898188 851898205
851957460 851957477
851960914 851960931
851963246 851963264
851963312 851963329
851974740 851974757
851997573 851997592
852025472 852025489
852038268 852038285
852040394 852040411
852041912 852041929
852041916 852041933
852041989 852042006
852044251 852044269
852044321 852044338
852044332 852044349
852069014 852069031
852069805 852069823
852087022 852087039
852105534 852105551
852134399 852134416
852239185 852239202
852240819 852240836
852242453 852242470
852248445 852248462
852253891 852253910
852257164 852257181
852257707 852257726
852275703 852275720
852280060 852280077
852286054 852286071
852287142 852287159
852339558 852339575
852349381 852349398
852349926 852349943
852366260 852366277
852367349 852367366
852373333 852373350
852379863 852379880
852381493 852381510
852421239 852421256
852422328 852422345
852422873 852422890
852428323 852428340
852429416 852429433
852432692 852432709
852433240 852433257
852433784 852433803
852437602 852437619
852441422 852441439
852444696 852444714
852445393 852445410
852449604 852449621
852455058 852455075
852459962 852459979
852465959 852465976
852470190 852470207
852470221 852470238
852472504 852472521
852477414 852477431
852477959 852477976
852488867 852488884
852489413 852489430
852504411 852504428
852504498 852504515
852517805 852517822
852522723 852522740
852527085 852527102
852539106 852539123
852541837 852541854
852542381 852542398
852544567 852544584
852551661 852551678
852560939 852560959
852568023 852568040
852570081 852570098
852570106 852570123
852572383 852572400
852572518 852572536
852572584 852572604
852572604 852572624
852575446 852575463
852575450 852575467
852577019 852577036
852577065 852577082
852577127 852577144
852577131 852577149
852580472 852580489
852580939 852580957
852581015 852581034
852581092 852581109
852581908 852581925
852583820 852583837
852584180 852584197
852584258 852584278
852584364 852584381
852584982 852585000
852597446 852597463
852612192 852612209
852612736 852612753
852614368 852614385
852632457 852632474
852633928 852633945
852640990 852641007
852646330 852646347
852646352 852646369
852656530 852656548
852656575 852656593
852656599 852656616
852656746 852656763
852657713 852657730
852658277 852658294
852659240 852659257
852665117 852665134
852665164 852665183
852665206 852665224
852668695 852668712
852669410 852669427
852733850 852733868
852733920 852733938
852733930 852733950
852884984 852885001
852908849 852908867
852908895 852908915
852908917 852908934
852921343 852921360
852921420 852921437
852921545 852921562
852944771 852944788
852997950 852997968
852998008 852998025
853064467 853064484
853074628 853074645
853084062 853084081
853084136 853084153
853178294 853178311
853180060 853180077
853192699 853192716
853252212 853252229
853252234 853252253
853252297 853252317
853323260 853323277
853351638 853351655
853677721 853677738
853680236 853680253
853769573 853769591
853769600 853769617
853769647 853769666
853769675 853769692
853857500 853857517
853857516 853857535
853857533 853857550
854342009 854342026
854388503 854388520
854438598 854438615
854469940 854469957
854472651 854472669
854472692 854472709
854472697 854472715
854472715 854472733
854472736 854472753
854473659 854473676
854474246 854474263
854474325 854474345
854474367 854474384
854479416 854479433
854479436 854479453
854546208 854546225
854556753 854556770
854568576 854568593
854642282 854642299
854647094 854647111
854734925 854734942
854734955 854734972
854734959 854734976
854734983 854735000
854742042 854742059
854799263 854799280
854799286 854799303
854802914 854802931
854803088 854803105
854806818 854806835
854806832 854806849
854892354 854892372
854892433 854892450
854925086 854925103
854925108 854925125
854925168 854925186
854982515 854982533
854982565 854982583
854982577 854982594
854982589 854982607
854982630 854982647
854997284 854997303
854997359 854997376
855003308 855003325
855014131 855014148
855040450 855040467
855060652 855060670
855060701 855060718
855060715 855060732
855160123 855160140
855161996 855162013
855162068 855162086
855162123 855162141
855163538 855163555
855163585 855163605
855163592 855163611
855163608 855163625
855177194 855177211
855177585 855177602
855322754 855322772
855322831 855322849
855326404 855326422
855326452 855326469
855326489 855326506
855337246 855337266
855418039 855418060
855445933 855445951
855698882 855698900
855699883 855699900
855699928 855699947
855699957 855699974
855702145 855702163
855702170 855702190
855702235 855702253
855743912 855743929
855744922 855744940
855746208 855746225
855774325 855774343
855774370 855774389
855774386 855774403
855779682 855779699
855783322 855783339
855783344 855783361
855783377 855783395
855783402 855783419
855790953 855790970
855790984 855791001
855791126 855791145
855860218 855860237
855860270 855860287
855921525 855921543
855921617 855921635
855921622 855921639
855939050 855939067
855952175 855952193
855952202 855952224
855952265 855952282
855958489 855958506
855958515 855958532
855958564 855958586
855958590 855958607
855959712 855959729
856012517 856012534
856012572 856012589
856012597 856012616
856021681 856021701
856021744 856021761
856023046 856023065
856023079 856023097
856041951 856041968
856105886 856105903
856110588 856110605
856120912 856120929
856124595 856124613
856124646 856124664
856124661 856124678
856125016 856125033
856125033 856125050
856194257 856194278
856194319 856194338
856195677 856195694
856210427 856210444
856210431 856210448
856296808 856296825
856296889 856296907
856296950 856296969
856296959 856296976
856296974 856296991
856297307 856297324
856299004 856299021
856299958 856299976
856300036 856300053
856306637 856306654
856306768 856306786
856307490 856307508
856307505 856307522
856374083 856374100
856374092 856374109
856374159 856374176
856380656 856380673
856553468 856553486
856553495 856553512
856559638 856559655
856559653 856559670
856559699 856559717
856563723 856563740
856650227 856650244
856650237 856650254
856650301 856650318
856650324 856650345
856689898 856689915
856722500 856722517
856722762 856722779
856727741 856727758
856810169 856810186
856810191 856810210
856810269 856810286
856810278 856810295
856821929 856821946
856822008 856822025
856822064 856822081
856865987 856866004
856887713 856887730
856895864 856895881
856899027 856899044
856900623 856900640
856900784 856900801
856907795 856907812
856968146 856968163
856970155 856970172
856971401 856971418
856982221 856982238
857035345 857035362
857045095 857045112
857062470 857062487
857141348 857141365
857142866 857142883
857147059 857147077
857147969 857147986
857163947 857163964
857163993 857164010
857164013 857164032
857164513 857164531
857166174 857166191
857166179 857166197
857166193 857166211
857169471 857169488
857169486 857169503
857224844 857224861
857225586 857225603
857227318 857227335
857227367 857227384
857227372 857227389
857227731 857227748
857248872 857248892
857250157 857250174
857252101 857252118
857252152 857252169
857252564 857252581
857252645 857252663
857306693 857306711
857306736 857306753
857306742 857306759
857310986 857311003
857314108 857314125
857318411 857318428
857318438 857318455
857318634 857318651
857319095 857319112
857322237 857322254
857336289 857336308
857336333 857336351
857336355 857336372
857336386 857336403
857340180 857340197
857376921 857376938
857400374 857400393
857401926 857401943
857418495 857418512
857418543 857418560
857419967 857419984
857420006 857420023
857420041 857420058
857420063 857420081
857427530 857427548
857490861 857490878
857492194 857492211
857497312 857497329
857530715 857530732
857530769 857530786
857574354 857574371
857574374 857574392
857574435 857574455
857574444 857574461
857574659 857574676
857607379 857607396
857607429 857607446
857659193 857659210
857683442 857683459
857731884 857731901
857731902 857731919
857731960 857731977
857731971 857731988
857757375 857757392
857757423 857757440
857767826 857767845
857819509 857819527
857819530 857819547
857819599 857819616
857819611 857819628
857824804 857824821
857824879 857824896
857828567 857828584
857919958 857919976
857919992 857920010
857923177 857923194
857924331 857924349
857924399 857924417
857924406 857924423
857924421 857924438
857926362 857926380
857926402 857926419
857926578 857926595
857927685 857927702
857927788 857927808
857927796 857927814
857936181 857936198
857936233 857936250
857938442 857938459
857941424 857941441
857941448 857941465
857941498 857941516
857941515 857941533
857941528 857941545
857996084 857996101
858007317 858007334
858014666 858014684
858014727 858014745
858093196 858093215
858093292 858093309
858093297 858093314
858093322 858093341
858097634 858097651
858104162 858104179
858104407 858104425
858177239 858177256
858178367 858178384
858179617 858179634
858183449 858183466
858293548 858293565
858294184 858294201
858346337 858346357
858346386 858346404
858346416 858346434
858346435 858346452
858353261 858353278
858360422 858360439
858368916 858368933
858431739 858431756
858432210 858432228
858451557 858451574
858451571 858451588
858451583 858451601
858451612 858451629
858451628 858451647
858451644 858451662
858520056 858520073
858522996 858523014
858523019 858523036
858529696 858529713
858531344 858531363
858531399 858531417
858535693 858535710
858536539 858536556
858539830 858539848
858541538 858541556
858543431 858543448
858543437 858543454
858552607 858552624
858602113 858602132
858605102 858605119
858620590 858620607
858620656 858620673
858620731 858620748
858620736 858620755
858621379 858621397
858621396 858621413
858621432 858621449
858621436 858621453
858621449 858621466
858621466 858621483
858621487 858621504
858627534 858627552
858633578 858633597
858633636 858633654
858682795 858682812
858682800 858682818
858682815 858682834
858682866 858682883
858682882 858682900
858879223 858879241
858949772 858949789
858955226 858955244
858962176 858962195
858966052 858966069
858966077 858966095
858966123 858966140
858968708 858968725
858968732 858968749
858968790 858968807
859042436 859042453
859063324 859063341
859064992 859065009
859065016 859065033
859065070 859065088
859065172 859065191
859065234 859065256
859065254 859065271
859071173 859071190
859105866 859105883
859132303 859132320
859132327 859132344
859137137 859137154
859156538 859156555
859156583 859156600
859214141 859214161
859214171 859214189
859214208 859214225
859220376 859220393
859230650 859230667
859235103 859235120
859235129 859235147
859236421 859236438
859236451 859236468
859236464 859236481
859236826 859236843
859236892 859236909
859287158 859287176
859287183 859287201
859287267 859287284
859290366 859290383
859290371 859290388
859298964 859298981
859299176 859299193
859299230 859299248
859299469 859299487
859299501 859299518
859305609 859305626
859312981 859313000
859321494 859321512
859321541 859321559
859321562 859321580
859321578 859321595
859323146 859323163
859323400 859323417
859323423 859323441
859323488 859323505
859330936 859330955
859330966 859330983
859543966 859543983
859567178 859567195
859567875 859567892
859569062 859569080
859569089 859569106
859572038 859572055
859572169 859572187
859572388 859572405
859572451 859572469
859572461 859572479
859573038 859573055
859573162 859573179
859576027 859576045
859584820 859584837
859666347 859666364
859719843 859719860
859739239 859739257
859740228 859740250
859756821 859756838
859756841 859756858
859756884 859756905
859756904 859756922
859756917 859756934
859816369 859816387
859828597 859828615
859838479 859838496
859902843 859902860
859921064 859921081
859921127 859921144
859993175 859993192
859993222 859993241
859993987 859994004
860011000 860011017
860053176 860053193
860169276 860169293
860169289 860169306
860173637 860173654
860173685 860173705
860181751 860181768
860181797 860181814
860181822 860181840
860245096 860245114
860245115 860245134
860245210 860245229
860245228 860245245
860245249 860245266
860245306 860245323
860245409 860245426
860245513 860245533
860280629 860280646
860337149 860337166
860350817 860350834
860352226 860352243
860352286 860352304
860353325 860353342
860354092 860354109
860360098 860360115
860497091 860497111
860507143 860507160
860515927 860515945
860519559 860519577
860522908 860522925
860523248 860523265
860538152 860538169
860538159 860538176
860585143 860585160
860585153 860585170
860585170 860585187
860585223 860585241
860754597 860754615
860757305 860757322
860757377 860757394
860760019 860760036
860761615 860761633
860767561 860767578
860768376 860768393
860776787 860776805
860776825 860776842
860776833 860776850
860776838 860776855
860776879 860776896
860776891 860776908
860776896 860776913
860790301 860790318
860832630 860832647
860893674 860893691
860931855 860931872
860932045 860932062
860939892 860939909
860941774 860941791
860941788 860941805
860951376 860951393
860952116 860952133
860953577 860953594
860963779 860963797
860979820 860979837
861023994 861024011
861032273 861032290
861032547 861032564
861036357 861036374
861037428 861037445
861037468 861037486
861037480 861037497
861037582 861037599
861037599 861037616
861037821 861037838
861046808 861046825
861048721 861048738
861050905 861050923
861107521 861107538
861107540 861107557
861111487 861111507
861111536 861111553
861111544 861111562
861114678 861114695
861115687 861115704
861115709 861115726
861115981 861115999
861116492 861116509
861119631 861119649
861120021 861120038
861123463 861123481
861123515 861123534
861123542 861123561
861124147 861124164
861127577 861127594
861128322 861128341
861128341 861128359
861139785 861139802
861235464 861235481
861307106 861307123
861307116 861307134
861361836 861361853
861370295 861370314
861372152 861372171
861372180 861372199
861372187 861372205
861375244 861375261
861376073 861376091
861376098 861376116
861376154 861376172
861385743 861385760
861387538 861387555
861387557 861387574
861387578 861387595
861387627 861387646
861387644 861387661
861387650 861387667
861387696 861387713
861388533 861388550
861388603 861388620
861388610 861388627
861391879 861391896
861391921 861391939
861457262 861457281
861458266 861458283
861458316 861458333
861506038 861506055
861533279 861533296
861533327 861533345
861533352 861533370
861546050 861546067
861553974 861553992
861554478 861554495
861555743 861555761
861562950 861562969
861602949 861602966
861616322 861616339
861642519 861642537
861647981 861647998
861653044 861653061
861653071 861653088
861710277 861710294
861717231 861717250
861732606 861732623
861745500 861745519
861906641 861906659
861923592 861923609
861926038 861926055
861979453 861979470
861979507 861979524
861995656 861995675
861995705 861995722
861995782 861995801
862002639 862002656
862056539 862056557
862057139 862057156
862057200 862057217
862063186 862063203
862145245 862145262
862150676 862150693
862151241 862151259
862151270 862151288
862151280 862151297
862151395 862151412
862151413 862151430
862151420 862151438
862151493 862151510
862155051 862155068
862155113 862155130
862157999 862158016
862178825 862178842
862178898 862178915
862223783 862223800
862229286 862229303
862235050 862235068
862235066 862235083
862237409 862237426
862237433 862237451
862251009 862251026
862256287 862256304
862256368 862256385
862262519 862262536
862265123 862265144
862273510 862273527
862309499 862309516
862324324 862324342
862361795 862361812
862412908 862412925
862417716 862417733
862418292 862418309
862514699 862514716
862582848 862582865
862582889 862582906
862583767 862583784
862583811 862583828
862584880 862584897
862584928 862584945
862584954 862584973
862585226 862585244
862585287 862585305
862591425 862591442
862591945 862591962
862601152 862601169
862602492 862602509
862605030 862605047
862636601 862636618
862663378 862663395
862667972 862667989
862667993 862668010
862668051 862668071
862669042 862669060
862669714 862669731
862671074 862671093
862696421 862696439
862696474 862696491
862697893 862697910
862698921 862698938
862743906 862743923
862745526 862745543
862769948 862769966
862769971 862769988
862770155 862770172
862775058 862775075
862775802 862775819
862811129 862811146
862824132 862824149
862831598 862831616
862834234 862834251
862834291 862834309
862835783 862835800
862836710 862836727
862836790 862836807
862846252 862846269
862846870 862846887
862846882 862846899
862848419 862848436
862849333 862849350
862849346 862849363
862849368 862849385
862849391 862849408
862849418 862849435
862849433 862849450
862849449 862849466
862849467 862849484
862849496 862849513
862853660 862853679
862853684 862853701
862853689 862853706
862853694 862853711
862853726 862853744
862853742 862853759
862853760 862853779
862855131 862855148
862855214 862855231
862856540 862856557
862856586 862856603
862857058 862857076
862857893 862857913
862857923 862857941
862861296 862861314
862861364 862861381
862863048 862863065
862863079 862863097
862863131 862863149
862863173 862863190
862863207 862863225
862865186 862865203
862868816 862868833
862884328 862884345
862888724 862888741
862890036 862890053
862895885 862895902
862911849 862911866
862916656 862916673
862918256 862918273
862920214 862920231
862920848 862920865
862922334 862922351
862932241 862932258
862932875 862932894
862933146 862933163
862934712 862934729
862934763 862934781
862935353 862935370
862937950 862937967
862937960 862937977
862938007 862938024
862938012 862938029
862938083 862938100
862938108 862938125
862938154 862938171
862938777 862938794
862939410 862939427
862940246 862940263
862940599 862940616
863039262 863039279
863039307 863039324
863048910 863048927
863160357 863160374
863175669 863175686
863208045 863208063
863208779 863208796
863210504 863210528
863295419 863295436
863295468 863295485
863297420 863297440
863297444 863297461
863298079 863298096
863353264 863353281
863360921 863360938
863360960 863360977
863360987 863361005
863361006 863361023
863361010 863361027
863361027 863361044
863364311 863364328
863375760 863375777
863375812 863375830
863388480 863388499
863388519 863388537
863442263 863442282
863444020 863444038
863444082 863444100
863446990 863447007
863447003 863447021
863447186 863447203
863447203 863447220
863447314 863447331
863447692 863447709
863457049 863457066
863457073 863457091
863457120 863457138
863459240 863459257
863459678 863459696
863459696 863459714
863459714 863459731
863459765 863459785
863459779 863459796
863459805 863459823
863466218 863466235
863532133 863532150
863532194 863532213
863532572 863532589
863534490 863534507
863541524 863541541
863541576 863541595
863542684 863542702
863544768 863544787
863544804 863544823
863545582 863545599
863546439 863546456
863546465 863546482
863546520 863546537
863644886 863644904
863644899 863644917
863646143 863646160
863730728 863730746
863785203 863785220
863790419 863790436
863794283 863794300
863794420 863794438
863794595 863794612
863795297 863795314
863796216 863796233
863796238 863796256
863796250 863796268
863796386 863796405
863796413 863796430
863796423 863796441
863796454 863796471
863798208 863798225
863799735 863799752
863800347 863800364
863801652 863801669
863801848 863801865
863801979 863801996
863806749 863806766
863808274 863808291
863810658 863810676
863815718 863815735
863815769 863815786
863815812 863815829
863816218 863816235
863816318 863816335
863816376 863816393
863816443 863816461
863870836 863870853
863873092 863873109
863873144 863873162
863873170 863873187
863955184 863955201
863961430 863961447
863962821 863962838
863963227 863963244
863967987 863968004
863972874 863972891
863972919 863972937
863973030 863973050
863973941 863973958
863974006 863974024
863975685 863975702
863975699 863975716
863982113 863982130
863982125 863982142
863982174 863982192
863982196 863982213
864051216 864051233
864051228 864051246
864051248 864051265
864051294 864051311
864051306 864051323
864053770 864053787
864053957 864053974
864060402 864060419
864072960 864072977
864073008 864073026
864073923 864073940
864073957 864073975
864074001 864074018
864143705 864143722
864143752 864143769
864143756 864143773
864151835 864151853
864151867 864151884
864151892 864151911
864154511 864154528
864154536 864154553
864154600 864154617
864154629 864154646
864229251 864229268
864503200 864503217
864504140 864504157
864504145 864504162
864504242 864504260
864504258 864504275
864504325 864504343
864505679 864505696
864505706 864505723
864505712 864505730
864505728 864505745
864505762 864505781
864506321 864506338
864507315 864507332
864508744 864508761
864563049 864563066
864563095 864563112
864563110 864563127
864654399 864654416
864679995 864680012
864736673 864736690
864742042 864742059
864742066 864742083
864749915 864749932
864749939 864749956
864749989 864750006
864750005 864750022
864750017 864750035
864763487 864763504
864763727 864763744
864763778 864763795
864765567 864765584
864816611 864816628
864831727 864831745
864839333 864839350
864922257 864922274
864932666 864932684
864990795 864990813
864990862 864990879
864998471 864998488
865001177 865001194
865001298 865001315
865001316 865001333
865001417 865001435
865001464 865001481
865006373 865006390
865006784 865006801
865006969 865006986
865007245 865007264
865007314 865007331
865009591 865009608
865010662 865010679
865020340 865020357
865022380 865022398
865022442 865022461
865022461 865022480
865022771 865022789
865025818 865025835
865025853 865025870
865038540 865038557
865085531 865085548
865085634 865085651
865086564 865086581
865101805 865101827
865101850 865101867
865101876 865101893
865101900 865101917
865101904 865101921
865173213 865173230
865178759 865178778
865179838 865179855
865182555 865182573
865182583 865182600
865182621 865182639
865182649 865182667
865182724 865182742
865182801 865182819
865182885 865182902
865184708 865184725
865185186 865185203
865185745 865185764
865189345 865189363
865189841 865189859
865189932 865189949
865191060 865191077
865192860 865192877
865192897 865192915
865193382 865193399
865193727 865193744
865193735 865193753
865194459 865194476
865210982 865210999
865261060 865261077
865261421 865261439
865261487 865261506
865261518 865261535
865264371 865264388
865264938 865264955
865264966 865264986
865265018 865265035
865271894 865271912
865276295 865276312
865277563 865277580
865278434 865278455
865278496 865278514
865278502 865278520
865278533 865278550
865278886 865278903
865279050 865279067
865279606 865279623
865279637 865279655
865280133 865280152
865280644 865280661
865280672 865280689
865282140 865282157
865282384 865282401
865333960 865333977
865343160 865343177
865357734 865357751
865358340 865358357
865358752 865358770
865359395 865359412
865359525 865359542
865360201 865360219
865360216 865360233
865360257 865360274
865360655 865360672
865363041 865363059
865363085 865363102
865363782 865363799
865363809 865363826
865363998 865364015
865364480 865364499
865382272 865382289
865382925 865382942
865387154 865387171
865428374 865428391
865446454 865446471
865453751 865453768
865466401 865466418
865526256 865526273
865602120 865602137
865605278 865605295
865608086 865608104
865608327 865608344
865614838 865614857
865614924 865614941
865616185 865616203
865616209 865616226
865616263 865616282
865619377 865619395
865620531 865620548
865620610 865620628
865620621 865620639
865621202 865621219
865623001 865623018
865623727 865623745
865681787 865681804
865684366 865684386
865684388 865684406
865684439 865684456
865684465 865684484
865773394 865773411
865774705 865774723
865774758 865774775
865774769 865774786
865776908 865776927
865781153 865781170
865781176 865781195
865781230 865781247
865781243 865781260
865781256 865781274
865781329 865781346
865781939 865781956
865781993 865782010
865782997 865783014
865783935 865783954
865784282 865784299
865787502 865787519
865788041 865788058
865795606 865795623
865854288 865854306
865857568 865857586
865859680 865859697
865862881 865862900
865862936 865862953
865862978 865862996
865863046 865863063
865863967 865863984
865864000 865864018
865864047 865864064
865865161 865865178
865865261 865865278
865865909 865865926
865868872 865868889
865869656 865869673
865869814 865869831
865871305 865871322
865871485 865871502
865875071 865875088
865879412 865879430
865879479 865879498
865886728 865886746
865888581 865888598
865888589 865888607
865889927 865889944
865889954 865889973
865889998 865890017
865893694 865893711
865895016 865895033
865929079 865929097
865941097 865941118
865941137 865941156
865942673 865942690
865942766 865942783
865955494 865955511
865960430 865960447
865961346 865961363
866203640 866203657
866210598 866210615
866210649 866210668
866217225 866217242
866217305 866217323
866220777 866220794
866220899 866220916
866221159 866221176
866295783 866295800
866324869 866324886
866325150 866325167
866325161 866325178
866325416 866325433
866325459 866325476
866325538 866325555
866325719 866325736
866331843 866331861
866337386 866337405
866376472 866376489
866377321 866377338
866377381 866377398
866381453 866381470
866381504 866381521
866381511 866381528
866382634 866382651
866387453 866387470
866387471 866387489
866387528 866387545
866388072 866388089
866388143 866388160
866389933 866389950
866410243 866410260
866468838 866468855
866471801 866471818
866471811 866471828
866471816 866471837
866471868 866471886
866471943 866471960
866482550 866482567
866482566 866482583
866482574 866482593
866485732 866485753
866486022 866486039
866486087 866486104
866487183 866487200
866487202 866487219
866487230 866487247
866487260 866487277
866487270 866487289
866487301 866487318
866488374 866488392
866492936 866492953
866502785 866502802
866542378 866542395
866543160 866543178
866561936 866561953
866571511 866571528
866571643 866571660
866573111 866573129
866573175 866573192
866573187 866573204
866573788 866573805
866574361 866574378
866574420 866574437
866574704 866574721
866574855 866574873
866574967 866574986
866574980 866574997
866575032 866575049
866575061 866575078
866575074 866575091
866575188 866575205
866575194 866575211
866575326 866575343
866575406 866575423
866575515 866575532
866575685 866575702
866575700 866575717
866575706 866575723
866575992 866576009
866576036 866576053
866576188 866576205
866576192 866576209
866576475 866576492
866576531 866576549
866576544 866576561
866576995 866577012
866577040 866577058
866577842 866577859
866636437 866636454
866653725 866653742
866809222 866809240
866809234 866809251
866809421 866809442
866809449 866809467
866809454 866809471
866809913 866809930
866821979 866821996
866822442 866822459
866822595 866822612
866822745 866822763
866823355 866823374
866823706 866823723
866823753 866823770
866823839 866823856
866823860 866823877
866823923 866823942
866823944 866823961
866824006 866824025
866824134 866824151
866824179 866824196
866827639 866827656
866828008 866828026
866830783 866830800
866830789 866830806
866831192 866831209
866831341 866831358
866831362 866831380
866831411 866831429
866831451 866831470
866831472 866831489
866831488 866831505
866833070 866833088
866833360 866833377
866833374 866833391
866833388 866833405
866833490 866833509
866833500 866833517
866833626 866833643
866833645 866833662
866833756 866833773
866840591 866840608
866840635 866840652
866840851 866840871
866894392 866894412
866896901 866896918
866897538 866897555
866897865 866897882
866898893 866898910
866899011 866899029
866900348 866900365
866900663 866900680
866900705 866900722
866900739 866900756
866968469 866968487
866968509 866968527
866984513 866984530
866984825 866984842
866995945 866995963
866995992 866996009
866996006 866996023
866996035 866996053
866996044 866996061
866996049 866996066
866996198 866996215
866996269 866996287
866996318 866996335
866996361 866996378
866996390 866996407
866996547 866996564
866996618 866996635
866996784 866996801
866997083 866997100
866997115 866997132
866997129 866997146
866997155 866997172
866997163 866997181
866998702 866998719
866998986 866999003
867001571 867001588
867001634 867001651
867001647 867001665
867001661 867001678
867001672 867001689
867001676 867001693
867003423 867003440
867003496 867003513
867003517 867003536
867003536 867003553
867003658 867003675
867004100 867004117
867004766 867004783
867004826 867004843
867005512 867005529
867005971 867005988
867006257 867006274
867006400 867006417
867006462 867006479
867006490 867006507
867006531 867006548
867006676 867006694
867086778 867086796
867086788 867086805
867087393 867087410
867087443 867087461
867087470 867087487
867088732 867088749
867088737 867088754
867120003 867120021
867155042 867155059
867162609 867162626
867162774 867162791
867162923 867162940
867163146 867163163
867163472 867163489
867165018 867165035
867165099 867165116
867165607 867165624
867166363 867166380
867166580 867166597
867167056 867167073
867167457 867167474
867167831 867167848
867167880 867167897
867169161 867169178
867170581 867170598
867170659 867170679
867171369 867171387
867171971 867171988
867171976 867171995
867176367 867176384
867177657 867177674
867177740 867177757
867178134 867178153
867178775 867178792
867179842 867179859
867179863 867179880
867179867 867179884
867181415 867181432
867181655 867181672
867182838 867182855
867184010 867184028
867186103 867186121
867192474 867192491
867192478 867192495
867197629 867197647
867197677 867197695
867249316 867249333
867276074 867276093
867281258 867281276
867412693 867412710
867420235 867420252
867420485 867420502
867420690 867420707
867420747 867420764
867420765 867420782
867420859 867420876
867421004 867421021
867421166 867421183
867421256 867421273
867422559 867422576
867422712 867422729
867423067 867423086
867423501 867423519
867423952 867423969
867423974 867423993
867425747 867425764
867425760 867425778
867425777 867425794
867425876 867425893
867426186 867426203
867426221 867426238
867426241 867426260
867426285 867426302
867426297 867426314
867430522 867430539
867437215 867437232
867437219 867437236
867437491 867437508
867437509 867437526
867437616 867437633
867438521 867438538
867438531 867438548
867439389 867439406
867439960 867439977
867440676 867440693
867441813 867441830
867442167 867442184
867442173 867442190
867442181 867442198
867442203 867442220
867442223 867442240
867455239 867455256
867457170 867457187
867478016 867478033
867478023 867478040
867499988 867500005
867500464 867500482
867500622 867500639
867500633 867500650
867500684 867500701
867500689 867500706
867500901 867500918
867502560 867502577
867502601 867502620
867502682 867502699
867502805 867502823
867503216 867503233
867608613 867608630
867680741 867680758
867681168 867681185
867681208 867681225
867681523 867681540
867681597 867681614
867683233 867683253
867684566 867684585
867684620 867684637
867688535 867688552
867689966 867689983
867690093 867690110
867770228 867770245
867961414 867961431
868018929 868018946
868018957 868018975
868019032 868019050
868019049 868019067
868031010 868031029
868031072 868031090
868031093 868031110
868033127 868033146
868033154 868033171
868039145 868039162
868039150 868039168
868043022 868043040
868044159 868044176
868044990 868045009
868045067 868045084
868047134 868047153
868212781 868212799
868212802 868212820
868212859 868212879
868218277 868218294
868218305 868218322
868218324 868218341
868218825 868218842
868223669 868223686
868286201 868286218
868286205 868286222
868294843 868294860
868309263 868309280
868309282 868309299
868309340 868309357
868363036 868363054
868363087 868363104
868363105 868363122
868363119 868363136
868376163 868376180
868377735 868377752
868379459 868379476
868387088 868387105
868453354 868453371
868456992 868457009
868457019 868457036
868460366 868460383
868467843 868467860
868583723 868583740
868611094 868611111
868648679 868648696
868651151 868651168
868651231 868651248
868651312 868651329
868651429 868651446
868651433 868651450
868800686 868800703
868805657 868805674
868805684 868805703
868880516 868880533
868880576 868880593
868881145 868881162
868881201 868881218
868893522 868893540
868893861 868893878
868893902 868893921
868893909 868893926
868893948 868893966
868900949 868900966
868900989 868901009
868901234 868901251
868901984 868902001
868913443 868913460
868913497 868913515
868968228 868968245
868968281 868968298
868968293 868968311
868983235 868983252
868985294 868985311
868985367 868985385
868985421 868985438
868985436 868985453
868989497 868989515
868990446 868990463
868993900 868993918
869149457 869149475
869226802 869226819
869226861 869226879
869227686 869227703
869240722 869240741
869241103 869241121
869258135 869258152
869309793 869309810
869310653 869310670
869312577 869312594
869312649 869312667
869316392 869316410
869316415 869316434
869316465 869316484
869321859 869321876
869324325 869324342
869324357 869324376
869349315 869349333
869399485 869399502
869401551 869401569
869401566 869401583
869406942 869406959
869409909 869409926
869412789 869412807
869418482 869418499
869427995 869428012
869429894 869429911
869429898 869429915
869429947 869429965
869431902 869431919
869436242 869436264
869502716 869502733
869512025 869512042
869512082 869512099
869515586 869515603
869581570 869581588
869675427 869675445
869685972 869685989
869764218 869764235
869832827 869832846
869833102 869833119
869838451 869838468
869838513 869838530
869844682 869844699
869845536 869845553
869845566 869845583
869845586 869845604
869885586 869885604
869913843 869913860
869913860 869913877
869913949 869913966
869914900 869914917
869926113 869926130
870004884 870004901
870004971 870004989
870008772 870008789
870020585 870020602
870022770 870022787
870022808 870022825
870022830 870022847
870049704 870049721
870091773 870091791
870096234 870096251
870099868 870099885
870099950 870099968
870100459 870100476
870104328 870104345
870104373 870104390
870107006 870107023
870107030 870107049
870107078 870107095
870107082 870107099
870107096 870107113
870108084 870108102
870108839 870108858
870108888 870108906
870112347 870112366
870112391 870112409
870112396 870112413
870112419 870112436
870112429 870112447
870123427 870123445
870123441 870123458
870125832 870125849
870125854 870125875
870307576 870307594
870362791 870362808
870458921 870458939
870465629 870465651
870465657 870465675
870465857 870465875
870465903 870465925
870465946 870465963
870473650 870473668
870473720 870473737
870547160 870547179
870547189 870547211
870547256 870547274
870551700 870551717
870551725 870551743
870558305 870558322
870558376 870558393
870563095 870563112
870611953 870611970
870612007 870612024
870702664 870702681
870724927 870724944
870732716 870732733
870777089 870777106
870785005 870785022
870785013 870785030
870785744 870785761
870792999 870793016
870793044 870793061
870793050 870793067
870793086 870793103
870803752 870803769
870803798 870803815
870803803 870803821
870806658 870806675
870806663 870806680
870807400 870807417
870815188 870815205
870815228 870815245
870819716 870819733
870824871 870824888
870824922 870824939
870827049 870827066
870827085 870827102
870827089 870827106
870827169 870827187
870892295 870892313
870892367 870892385
870962394 870962411
870965088 870965105
870974308 870974325
870987587 870987604
871053592 871053609
871055552 871055569
871065678 871065695
871071552 871071571
871071567 871071584
871071584 871071601
871071640 871071657
871073243 871073260
871073323 871073340
871125464 871125481
871136226 871136243
871136275 871136292
871136279 871136296
871136295 871136312
871211095 871211112
871211099 871211117
871211175 871211192
871211872 871211889
871211983 871212000
871212040 871212059
871218015 871218032
871218090 871218108
871218712 871218729
871218783 871218801
871218795 871218812
871225117 871225134
871225170 871225187
871225184 871225202
871225902 871225919
871227834 871227851
871227856 871227873
871227871 871227889
871228257 871228274
871232069 871232086
871235923 871235941
871236346 871236363
871236352 871236369
871236366 871236383
871236410 871236428
871237928 871237945
871318917 871318937
871318977 871318994
871318991 871319008
871326409 871326426
871326476 871326494
871326493 871326510
871389708 871389725
871389785 871389802
871413332 871413349
871413403 871413421
871471683 871471700
871495667 871495684
871503500 871503517
871506807 871506824
871508603 871508620
871508627 871508644
871577869 871577886
871586778 871586795
871641006 871641023
871650005 871650023
871650050 871650067
871650054 871650071
871652711 871652728
871668541 871668558
871668566 871668584
871668621 871668639
871674883 871674901
871674960 871674977
871738960 871738978
871738992 871739009
871739001 871739020
871821542 871821559
871821547 871821564
871822737 871822754
871840345 871840362
871843368 871843385
871843497 871843515
871843517 871843534
871844214 871844231
871844238 871844255
871844279 871844296
871908732 871908749
871908753 871908770
871932627 871932644
871932634 871932651
871934630 871934648
871934681 871934699
871934706 871934724
871934746 871934764
871935963 871935980
871939945 871939962
871939958 871939975
871992907 871992924
871994844 871994861
871994931 871994948
872004828 872004846
872009678 872009696
872009761 872009779
872009781 872009799
872009802 872009819
872011981 872012000
872016251 872016268
872016263 872016280
872016956 872016974
872031912 872031929
872031929 872031946
872093036 872093053
872095389 872095406
872095861 872095879
872109742 872109760
872198676 872198693
872198683 872198701
872256776 872256793
872256832 872256850
872266494 872266511
872267005 872267022
872273478 872273495
872277410 872277427
872279395 872279414
872279874 872279891
872337869 872337886
872337952 872337971
872373398 872373415
872373434 872373452
872373511 872373529
872374226 872374243
872423631 872423648
872425082 872425099
872425859 872425876
872426067 872426087
872426276 872426293
872426648 872426665
872427237 872427254
872427529 872427546
872427900 872427917
872428096 872428113
872428388 872428405
872428394 872428411
872428657 872428674
872428931 872428948
872428936 872428953
872429000 872429017
872429085 872429102
872429119 872429136
872429200 872429217
872429398 872429415
872429488 872429505
872429799 872429816
872429829 872429846
872429835 872429852
872429846 872429863
872429860 872429878
872429907 872429927
872429914 872429931
872429933 872429952
872429954 872429971
872430019 872430036
872430149 872430166
872430575 872430592
872430880 872430897
872431047 872431064
872431082 872431099
872431123 872431140
872431157 872431174
872431168 872431186
872431209 872431226
872431397 872431414
872431424 872431441
872431459 872431476
872431610 872431627
872431627 872431644
872431668 872431686
872431677 872431694
872431695 872431713
872431703 872431720
872431707 872431724
872431837 872431854
872432164 872432181
872432280 872432297
872432594 872432611
872432605 872432622
872432707 872432724
872432715 872432732
872432775 872432792
872433176 872433193
872433206 872433223
872433386 872433403
872433390 872433407
872433407 872433427
872433439 872433456
872433454 872433472
872433637 872433654
872433794 872433811
872436965 872436982
872437957 872437975
872438280 872438297
872439013 872439030
872439444 872439461
872439698 872439715
872439723 872439740
872439784 872439802
872439819 872439836
872440051 872440068
872440060 872440077
872440758 872440775
872441217 872441234
872442395 872442412
872442882 872442899
872442895 872442914
872442999 872443019
872444333 872444350
872444640 872444657
872444704 872444721
872444882 872444899
872448710 872448727
872450879 872450896
872450983 872451000
872451077 872451097
872451706 872451723
872451771 872451788
872452139 872452156
872452259 872452276
872452618 872452636
872455679 872455697
872455977 872455994
872456147 872456164
872456220 872456237
872456629 872456646
872457290 872457307
872457511 872457528
872457627 872457644
872509795 872509812
872522305 872522322
872522339 872522356
872522420 872522437
872522472 872522489
872522486 872522505
872522517 872522534
872522541 872522559
872523691 872523708
872523717 872523734
872523729 872523747
872523833 872523850
872524026 872524043
872594079 872594096
872596448 872596467
872596467 872596484
872596473 872596490
872596483 872596501
872596678 872596695
872596683 872596700
872596920 872596937
872596982 872597000
872597134 872597153
872597146 872597166
872597173 872597190
872597729 872597746
872597740 872597757
872597748 872597765
872597762 872597779
872597784 872597801
872597957 872597977
872597974 872597991
872598563 872598580
872598589 872598606
872598610 872598627
872598703 872598720
872598708 872598725
872598857 872598874
872598895 872598915
872598917 872598934
872599092 872599109
872599134 872599151
872599398 872599415
872599461 872599478
872687805 872687822
872687838 872687856
872701206 872701223
872708323 872708340
872718759 872718776
872848588 872848605
872855963 872855980
872883118 872883135
872883158 872883175
872918208 872918225
872941445 872941462
872941516 872941535
872973080 872973097
872973093 872973110
872974823 872974840
872974839 872974856
872974856 872974873
872979635 872979652
873027949 873027969
873029574 873029591
873032218 873032235
873032227 873032244
873032282 873032301
873032762 873032779
873033096 873033113
873033120 873033138
873033146 873033166
873037202 873037219
873037324 873037341
873037398 873037415
873037939 873037956
873038642 873038659
873039081 873039098
873039105 873039122
873039642 873039659
873039734 873039751
873039773 873039790
873039807 873039824
873039866 873039883
873039898 873039915
873040133 873040150
873040727 873040744
873041042 873041060
873041396 873041413
873041437 873041456
873041462 873041479
873041509 873041526
873041529 873041547
873041912 873041929
873042517 873042534
873042770 873042787
873043040 873043057
873044645 873044662
873045976 873045993
873052585 873052602
873055979 873055996
873057965 873057982
873061575 873061595
873062254 873062271
873062277 873062294
873062281 873062299
873062336 873062353
873069900 873069917
873069931 873069948
873117724 873117741
873117730 873117747
873117809 873117826
873134379 873134396
873195142 873195159
873205096 873205113
873206533 873206550
873206654 873206671
873211636 873211653
873212037 873212054
873222272 873222289
873223061 873223079
873223130 873223147
873223951 873223968
873225022 873225039
873225512 873225529
873225673 873225692
873232081 873232098
873232452 873232469
873232765 873232782
873283319 873283336
873292693 873292711
873292704 873292721
873295963 873295980
873305500 873305517
873306653 873306670
873306668 873306686
873306674 873306691
873309169 873309186
873310554 873310571
873310567 873310584
873310592 873310611
873310609 873310626
873310613 873310631
873310660 873310679
873310692 873310709
873475239 873475257
873481394 873481411
873483098 873483115
873486844 873486861
873490081 873490098
873490340 873490359
873492799 873492818
873493585 873493602
873554066 873554085
873554700 873554717
873556691 873556708
873556720 873556740
873576131 873576149
873576164 873576181
873576492 873576509
873578085 873578102
873578775 873578792
873578779 873578796
873578788 873578805
873579872 873579892
873579996 873580013
873581043 873581060
873581052 873581069
873581068 873581085
873663634 873663652
873663675 873663694
873663750 873663769
873664840 873664857
873665903 873665924
873665918 873665936
873665933 873665950
873665954 873665971
873668272 873668289
873670257 873670274
873737411 873737428
873737898 873737915
873737969 873737986
873737983 873738000
873745162 873745179
873747190 873747207
873810318 873810337
873816945 873816962
873819441 873819458
873819459 873819480
873819521 873819538
873819537 873819554
873821416 873821433
873828635 873828655
873829233 873829250
873829881 873829898
873831807 873831824
873832250 873832267
873841191 873841208
873841199 873841216
873899836 873899853
873908934 873908951
873909605 873909622
873986043 873986060
874011679 874011696
874011685 874011702
874018396 874018414
874071650 874071667
874079914 874079931
874080956 874080973
874081020 874081038
874081048 874081065
874082408 874082425
874082614 874082631
874083241 874083258
874087505 874087523
874096281 874096298
874097478 874097496
874122144 874122161
874155071 874155088
874161450 874161467
874162976 874162993
874162985 874163002
874163166 874163183
874163190 874163207
874163194 874163211
874243878 874243897
874244476 874244493
874244499 874244517
874244545 874244562
874244549 874244567
874244563 874244581
874244570 874244587
874253526 874253544
874253544 874253561
874253824 874253841
874257062 874257080
874257113 874257132
874257131 874257150
874258746 874258764
874258781 874258799
874260127 874260144
874260188 874260205
874261276 874261293
874261293 874261313
874262022 874262039
874262245 874262262
874268979 874268997
874269031 874269050
874269055 874269072
874269092 874269109
874275230 874275247
874275327 874275345
874275344 874275361
874333899 874333916
874333929 874333947
874333940 874333957
874333998 874334016
874335596 874335614
874335643 874335661
874335665 874335682
874337956 874337973
874337985 874338002
874338033 874338055
874338063 874338081
874339777 874339794
874357314 874357332
874359238 874359255
874379055 874379072
874390447 874390464
874412039 874412058
874416899 874416916
874416916 874416933
874416971 874416989
874438309 874438326
874438356 874438373
874438625 874438642
874438685 874438702
874442250 874442268
874442641 874442660
874443001 874443019
874443178 874443195
874500833 874500850
874505701 874505718
874505773 874505790
874505812 874505830
874528407 874528425
874541202 874541219
874674811 874674829
874676824 874676841
874699112 874699130
874699136 874699153
874699181 874699198
874699289 874699308
874699339 874699356
874875706 874875723
874907350 874907367
874945196 874945213
874945230 874945248
874945262 874945280
874945277 874945294
874945282 874945300
874945320 874945337
874958531 874958549
874958849 874958866
875045422 875045439
875099562 875099579
875108842 875108859
875126733 875126751
875126752 875126769
875126765 875126782
875129868 875129887
875205862 875205879
875222138 875222155
