861172920 861172980
861175500 861175560
861214920 861214980
861226140 861226200
861227280 861227340
861238980 861239040
861240480 861240540
861326700 861326820
861405060 861405120
861443280 861443340
862330140 862330200
862414140 862414200
862425720 862425780
862587480 862587540
862759860 862759920
862764360 862764420
862932720 862932780
863037480 863037540
863120460 863120520
863353200 863353260
863635080 863635140
863640480 863640540
863791620 863791680
863830680 863830740
863831100 863831220
863995980 863996040
864052200 864052260
864153720 864153780
864340980 864341040
864353160 864353220
864584580 864584640
864600720 864600780
864677580 864677640
865003680 865003740
865064040 865064100
865076580 865076640
865122180 865122240
865130520 865130580
865140480 865140540
865177800 865177860
865189140 865189200
865189380 865189440
865189560 865189620
865194360 865194480
865198500 865198560
865201080 865201140
865258920 865258980
865259160 865259220
865277820 865277880
865279200 865279260
865361520 865361580
865783320 865783380
865789860 865789920
865814340 865814400
865825800 865825860
865864020 865864080
865869600 865869660
865874640 865874700
865884720 865884840
866079300 866079360
866160120 866160180
866166780 866166840
866295780 866295900
866298600 866298660
866601660 866601720
866739840 866739900
866771280 866771340
866772780 866772840
867076020 867076080
867087180 867087240
867162780 867162840
867421980 867422040
867506100 867506160
867626520 867626580
867637500 867637560
867682020 867682140
867685020 867685080
867689520 867689580
867820860 867820920
867876420 867876480
867991200 867991260
868027860 868027920
868046280 868046340
868046940 868047000
868061820 868061880
868110480 868110540
868222080 868222140
868223640 868223700
868312320 868312380
868478640 868478700
868899780 868899840
868982880 868982940
869021160 869021220
869064360 869064420
869164320 869164380
869166540 869166600
869265420 869265480
869283120 869283180
869291760 869291820
869526660 869526720
869528280 869528340
869572920 869572980
869580060 869580120
869596260 869596320
869604840 869604900
869616240 869616300
869867460 869867520
869955960 869956020
870108240 870108300
870129840 870129900
870213120 870213180
870229200 870229260
870231540 870231600
870431460 870431520
870457500 870457560
870459000 870459060
870626940 870627000
870627120 870627240
870652320 870652380
870657000 870657060
870787560 870787620
870952020 870952080
871079880 871079940
871080480 871080540
871169400 871169460
871236600 871236660
871320300 871320360
871419120 871419180
871764720 871764780
871767720 871767780
871788960 871789020
871836600 871836660
871837500 871837560
871842900 871842960
871845540 871845600
871850400 871850460
871852740 871852860
871918560 871918620
871927320 871927380
871928940 871929000
871936800 871936860
872010540 872010600
872014320 872014380
872022780 872022840
872023140 872023200
872028000 872028060
872028180 872028240
872030640 872030700
872100120 872100180
872279940 872280000
872343060 872343120
872345640 872345700
872437860 872437920
872446560 872446620
872451720 872451780
872458980 872459040
872461200 872461260
872527140 872527200
872645280 872645340
872953080 872953140
873038880 873038940
873048120 873048180
873066420 873066480
873225600 873225660
873231900 873231960
873240300 873240360
873262620 873262680
873262860 873262920
873274740 873274800
873300000 873300060
873478020 873478080
873481980 873482040
873503940 873504000
873578400 873578460
873591120 873591180
873651180 873651240
873651420 873651480
873653040 873653100
873655920 873655980
873657120 873657180
873668700 873668760
873669840 873669960
873731160 873731280
873739080 873739140
873750120 873750180
873831540 873831600
873834420 873834480
873844500 873844560
874087680 874087740
874087920 874087980
874181340 874181400
874255980 874256100
874260180 874260240
874343280 874343340
874345500 874345560
874412640 874412700
874428120 874428180
874510200 874510260
874528620 874528680
874530480 874530540
874532040 874532100
874788180 874788240
874796940 874797000
874851060 874851120
874851540 874851600
874937640 874937700
874942020 874942080
874954740 874954800
875121240 875121300
875142300 875142360
875166300 875166360
875181060 875181120
