825061587 825061588
825075992 825075993
825264936 825264937
825676252 825676253
825680906 825680907
826089016 826089017
826368495 826368496
826586618 826586619
826939749 826939750
827007717 827007718
827106396 827106397
827607768 827607769
827828652 827828653
827832995 827832996
827875580 827875581
829510321 829510322
829600768 829600769
829650994 829650995
829785012 829785013
829801182 829801183
829875702 829875703
830626269 830626270
830839607 830839608
830849801 830849802
832418818 832418819
832525648 832525649
833064932 833064933
833210807 833210808
834696454 834696455
835141514 835141515
835402021 835402022
835844454 835844455
835893373 835893374
836060295 836060296
836137809 836137810
836473055 836473056
836477539 836477540
836968076 836968077
837127982 837127983
837420121 837420122
837571670 837571671
837932718 837932719
838353995 838353996
838842007 838842008
839229484 839229485
839616314 839616315
839678244 839678245
839731465 839731466
839755212 839755213
839971552 839971553
840034508 840034509
840225145 840225146
840807795 840807796
840828658 840828659
840986822 840986823
841040522 841040523
842544505 842544506
844342327 844342328
844583746 844583747
845282626 845282627
845964156 845964157
846071445 846071446
846475048 846475049
847092418 847092419
848053689 848053690
848110460 848110461
848569781 848569782
848745258 848745259
848894972 848894973
849636210 849636211
850558784 850558785
850588339 850588340
850608516 850608517
850685572 850685573
850685916 850685917
850694986 850694987
850699373 850699374
850715943 850715944
850720841 850720842
850728981 850728982
850739011 850739012
850740066 850740067
850746122 850746123
850748173 850748174
850887030 850887031
850932570 850932571
851010235 851010236
851064403 851064404
851250767 851250768
851378597 851378598
851579338 851579339
851689330 851689331
852616855 852616856
852638163 852638164
852856629 852856630
852911486 852911487
853056252 853056253
853116228 853116229
853117408 853117409
853276732 853276733
853690262 853690263
853860601 853860602
854732117 854732118
856851930 856851931
857340685 857340686
857447741 857447742
858377158 858377159
859098556 859098557
859216279 859216280
859336948 859336949
859412355 859412356
859482866 859482867
859718022 859718023
860134080 860134081
860324769 860324770
860423104 860423105
860859226 860859227
860877799 860877800
861086598 861086599
861360808 861360809
861658739 861658740
861935643 861935644
862215753 862215754
862935297 862935298
862959720 862959721
863390741 863390742
863697051 863697052
864173705 864173706
864532240 864532241
864541753 864541754
864799447 864799448
864841076 864841077
865096713 865096714
865163460 865163461
865645048 865645049
865837887 865837888
867016298 867016299
867251153 867251154
867306857 867306858
867394064 867394065
867569720 867569721
867676008 867676009
867970358 867970359
867997628 867997629
868053314 868053315
868138442 868138443
868721611 868721612
868813650 868813651
868981157 868981158
869773717 869773718
869842515 869842516
870350508 870350509
870549695 870549696
870592258 870592259
870640112 870640113
871171209 871171210
871206650 871206651
871380248 871380249
871474154 871474155
872053467 872053468
872479761 872479762
872588031 872588032
872640309 872640310
872827349 872827350
872829448 872829449
872931899 872931900
873084859 873084860
873124335 873124336
873290585 873290586
873319436 873319437
873322013 873322014
874182369 874182370
874916133 874916134
875062189 875062190
