H1:FAKE-STRAIN 16384
H1:PSL-ISS_PDB_OUT_DQ 32768
H1:PEM-CS_ACC_BEAMTUBE_YMAN_Z_DQ  8192
H1:PEM-CS_ACC_BSC8_ITMY_X_DQ  8192
H1:PEM-CS_ACC_BSC8_ITMY_Y_DQ  8192
H1:PEM-CS_ACC_BSC8_ITMY_Z_DQ  8192
H1:PEM-CS_ACC_EBAY_FLOOR_Z_DQ  8192
H1:PEM-CS_ACC_FLOOR_YCRYO_Z_DQ  8192
H1:PEM-CS_ACC_OPLEV_ITMY_X_DQ  8192
H1:PEM-CS_MAG_EBAY_SEIRACK_X_DQ  4096
H1:PEM-CS_MAG_EBAY_SEIRACK_Y_DQ  4096
H1:PEM-CS_MAG_EBAY_SEIRACK_Z_DQ  4096
H1:PEM-CS_MAG_EBAY_SUSRACK_X_DQ  4096
H1:PEM-CS_MAG_EBAY_SUSRACK_Y_DQ  4096
H1:PEM-CS_MAG_EBAY_SUSRACK_Z_DQ  4096
H1:PEM-CS_MAG_LVEA_VERTEX_X_DQ  4096
H1:PEM-CS_MAG_LVEA_VERTEX_Y_DQ  4096
H1:PEM-CS_MAG_LVEA_VERTEX_Z_DQ  4096
H1:PEM-CS_MIC_EBAY_RACKS_DQ  16384
H1:PEM-CS_MIC_LVEA_VERTEX_DQ  16384
H1:PEM-CS_MIC_YMAN_SPOOL_DQ  16384
H1:PEM-CS_SEIS_LVEA_FLOOR_X_DQ  1024
H1:PEM-CS_SEIS_LVEA_FLOOR_Y_DQ  1024
H1:PEM-CS_SEIS_LVEA_FLOOR_Z_DQ  1024
H1:PEM-CS_TILT_LVEA_FLOOR_T_DQ  512
H1:PEM-CS_TILT_LVEA_FLOOR_X_DQ  1024
H1:PEM-CS_TILT_LVEA_FLOOR_Y_DQ  1024
