862196828 862196845
863561856 863561873
863561871 863561888
863561887 863561904
863561913 863561930
863562030 863562047
863562151 863562168
863564523 863564540
863622261 863622278
863871938 863871955
866230521 866230538
866233703 866233720
866474961 866474978
866645134 866645152
868913396 868913413
871349848 871349865
873468824 873468841
873586577 873586594
873595693 873595710
873657119 873657136
873821530 873821547
874243354 874243371
874672463 874672480
874680138 874680155
874765942 874765959
874889120 874889137
875099463 875099480
