824596592 824596611
824618470 824618487
824631440 824631458
824671454 824671472
824674551 824674569
824676260 824676277
824683005 824683023
824686578 824686596
824694250 824694268
824720661 824720679
824773724 824773742
824774320 824774340
824776286 824776305
824777868 824777886
824777906 824777924
824778054 824778072
824807220 824807238
824825548 824825566
824833100 824833118
824837896 824837915
824842054 824842071
824846457 824846474
824855340 824855358
824858239 824858257
824865583 824865602
824867979 824867999
824871047 824871066
824932272 824932290
824937551 824937570
824939571 824939588
824968200 824968219
824983324 824983342
824991327 824991346
824996772 824996790
824998780 824998798
825002580 825002601
825004168 825004188
825014700 825014718
825015979 825015997
825019548 825019566
825019585 825019609
825024111 825024129
825024114 825024133
825026210 825026230
825027810 825027829
825029411 825029430
825029423 825029442
825047107 825047124
825047110 825047128
825048076 825048094
825089293 825089311
825093206 825093224
825097923 825097941
825105160 825105178
825109979 825109997
825114626 825114644
825119843 825119861
825150264 825150282
825202544 825202562
825202672 825202690
825204980 825204998
825208399 825208417
825240633 825240651
825246099 825246117
825257881 825257899
825262605 825262622
825268943 825268961
825282236 825282254
825299838 825299856
825319581 825319599
825331340 825331358
825343370 825343387
825348990 825349009
825355863 825355881
825375450 825375468
825375993 825376011
825378362 825378379
825379768 825379786
825428903 825428921
825448422 825448441
825459076 825459094
825482229 825482247
825519843 825519861
825528748 825528766
825530988 825531006
825546428 825546447
825579038 825579057
825605396 825605415
825615179 825615197
825697372 825697390
825702879 825702897
825711343 825711361
825748944 825748962
825781372 825781391
825796681 825796699
825803273 825803291
825803412 825803430
825807632 825807651
825822814 825822832
825841437 825841455
825873739 825873756
825880411 825880428
825881515 825881533
825889611 825889630
825891804 825891822
825898705 825898723
825904458 825904476
825910189 825910207
825912816 825912834
825916370 825916388
825944816 825944834
825956742 825956760
825960997 825961015
825962164 825962182
825965881 825965899
825975586 825975606
825987894 825987912
826000552 826000569
826010809 826010827
826014461 826014479
826017172 826017190
826062499 826062517
826065599 826065618
826075046 826075064
826078990 826079008
826083641 826083659
826092499 826092517
826111612 826111630
826127320 826127338
826135511 826135529
826142347 826142365
826169182 826169200
826172385 826172403
826182038 826182057
826194466 826194484
826229386 826229404
826237075 826237093
826260143 826260161
826265000 826265018
826268783 826268800
826270589 826270607
826275621 826275639
826277396 826277414
826316360 826316378
826319442 826319460
826326919 826326937
826339638 826339656
826341463 826341481
826342210 826342229
826347024 826347042
826355829 826355846
826356789 826356807
826368309 826368327
826380825 826380844
826380837 826380855
826387696 826387714
826404943 826404961
826408701 826408720
826413908 826413925
826439472 826439490
826440979 826440998
826445410 826445428
826468349 826468367
826478624 826478642
826489469 826489487
826489474 826489492
826497017 826497035
826507293 826507311
826554051 826554069
826564584 826564602
826569538 826569556
826570705 826570723
826573757 826573775
826580410 826580428
826582964 826582982
826602670 826602688
826626623 826626641
826640995 826641013
826642212 826642230
826643625 826643643
826648085 826648103
826658330 826658348
826660953 826660971
826667405 826667422
826681295 826681313
826686414 826686432
826700231 826700249
826709210 826709228
826717541 826717559
826718285 826718302
826724399 826724417
826730511 826730529
826744904 826744922
826801540 826801559
826804227 826804245
826829305 826829323
826920653 826920670
826923700 826923718
826992790 826992808
827006846 827006863
827017509 827017526
827024410 827024427
827031818 827031836
827041450 827041468
827082781 827082799
827089673 827089691
827092999 827093017
827101431 827101449
827104837 827104857
827115570 827115588
827156400 827156418
827163001 827163019
827189397 827189414
827247747 827247765
827250130 827250149
827255691 827255709
827267784 827267802
827274975 827274994
827276260 827276278
827277333 827277351
827291877 827291895
827293473 827293491
827352956 827352974
827364347 827364364
827366215 827366233
827370466 827370484
827373599 827373617
827378590 827378608
827385446 827385464
827462042 827462059
827465093 827465111
827466462 827466480
827503843 827503861
827513324 827513341
827517925 827517943
827528712 827528730
827536986 827537005
827536990 827537011
827588639 827588657
827599210 827599229
827609601 827609619
827618492 827618510
827619656 827619673
827687653 827687671
827696518 827696536
827698204 827698222
827706857 827706874
827769867 827769885
827771566 827771583
827784119 827784137
827786466 827786484
827786476 827786494
827791534 827791553
827792138 827792156
827793108 827793125
827794764 827794782
827847285 827847303
827849491 827849510
827859525 827859543
827862595 827862613
827865441 827865459
827865640 827865658
827867905 827867923
827868898 827868917
827874117 827874136
827876385 827876403
827882117 827882136
827906165 827906182
827921742 827921759
827945828 827945845
827969864 827969882
827971455 827971472
827980701 827980719
828038107 828038125
828041323 828041341
828043533 828043551
828051540 828051558
828112519 828112537
828118069 828118087
828126039 828126056
828126420 828126438
828126945 828126963
828128132 828128150
828128138 828128157
828131959 828131976
828138376 828138394
828153400 828153418
828153450 828153469
828156343 828156361
828158177 828158195
828163576 828163594
828167459 828167477
828170896 828170914
828172794 828172812
828178619 828178637
828182110 828182128
828185940 828185958
828186819 828186837
828190767 828190786
828191799 828191817
828224992 828225010
828226288 828226306
828227049 828227067
828227807 828227825
828233680 828233698
828265891 828265910
828282090 828282108
828283802 828283820
828287824 828287842
828287830 828287849
828288550 828288567
828292009 828292027
828302100 828302118
828303358 828303376
828307042 828307060
828313721 828313739
828337031 828337049
828345064 828345081
828347394 828347411
828361840 828361858
828363949 828363982
828364461 828364479
828366273 828366290
828366668 828366687
828366845 828366863
828368211 828368232
828368217 828368267
828369761 828369778
828371990 828372008
828375164 828375182
828380443 828380460
828382836 828382854
828384909 828384929
828388260 828388279
828393178 828393196
828393542 828393560
828397054 828397072
828425625 828425643
828427615 828427633
828434504 828434522
828457812 828457830
828457821 828457839
828472850 828472868
828472854 828472872
828486847 828486865
828486851 828486869
828500239 828500257
828503415 828503433
828503418 828503436
828527902 828527921
828537062 828537080
828543691 828543709
828543700 828543719
828543704 828543773
828543767 828543791
828555155 828555173
828557946 828557964
828557966 828557998
828558023 828558086
828558078 828558096
828560685 828560704
828566137 828566155
828571426 828571444
828581624 828581642
828581678 828581696
828585146 828585164
828588548 828588565
828591286 828591304
828592613 828592631
828625677 828625695
828625981 828625999
828626121 828626139
828679656 828679673
828680379 828680397
828692276 828692294
828704195 828704213
828704202 828704221
828711161 828711179
828711174 828711193
828711179 828711196
828711781 828711798
828712760 828712777
828714433 828714451
828714803 828714822
828718007 828718025
828722285 828722303
828722613 828722631
828723861 828723879
828724069 828724087
828730672 828730689
828730996 828731014
828732250 828732269
828750135 828750152
828758447 828758464
828796455 828796473
828797951 828797969
828798855 828798873
828804046 828804068
828804878 828804896
828807197 828807215
828809539 828809556
828812063 828812081
828813483 828813501
828839785 828839802
828889469 828889488
828893928 828893946
828898083 828898101
828898400 828898418
828901291 828901309
828910549 828910567
828915911 828915929
828918817 828918835
828925627 828925645
828968223 828968241
828979511 828979529
828985269 828985288
828987212 828987230
828994348 828994367
829001049 829001067
829002276 829002293
829002290 829002308
829059568 829059586
829063656 829063674
829066238 829066256
829066444 829066463
829071248 829071266
829073903 829073921
829073970 829073988
829076397 829076415
829079554 829079572
829083702 829083719
829083902 829083920
829083909 829083927
829097084 829097102
829166572 829166590
829167939 829167957
829170389 829170407
829170491 829170509
829171334 829171352
829176777 829176795
829176885 829176903
829181037 829181055
829187854 829187872
829191403 829191421
829198401 829198419
829204545 829204563
829205602 829205622
829224011 829224028
829234443 829234461
829248318 829248336
829248324 829248342
829259516 829259535
829265658 829265677
829266475 829266494
829268747 829268765
829271650 829271668
829271866 829271884
829273903 829273921
829274445 829274463
829277688 829277705
829277988 829278006
829278061 829278079
829288382 829288400
829331021 829331041
829333751 829333769
829335967 829335984
829340660 829340678
829349136 829349155
829363324 829363343
829380202 829380220
829396920 829396937
829407873 829407890
829408867 829408885
829409483 829409501
829410490 829410508
829410501 829410520
829410617 829410635
829411300 829411318
829412535 829412554
829413459 829413477
829414085 829414103
829419920 829419937
829421023 829421041
829421491 829421508
829424900 829424918
829425659 829425677
829425759 829425777
829426803 829426821
829428092 829428110
829434044 829434062
829497257 829497275
829510989 829511007
829518024 829518041
829589901 829589919
829590424 829590442
829591356 829591374
829596576 829596594
829601378 829601398
829603378 829603396
829607457 829607475
829611191 829611209
829633303 829633321
829653746 829653764
829669553 829669570
829684792 829684809
829685230 829685248
829685260 829685278
829687809 829687827
829687831 829687849
829687841 829687859
829699189 829699207
829701811 829701829
829705040 829705058
829705960 829705977
829707310 829707328
829709010 829709027
829710192 829710210
829710550 829710568
829710657 829710675
829726206 829726225
829744758 829744776
829782913 829782931
829842571 829842589
829842594 829842612
829886967 829886986
829893890 829893908
829893909 829893927
829928596 829928614
829936035 829936053
829936663 829936681
829937789 829937808
829942122 829942140
829948698 829948715
829948707 829948725
829950343 829950360
829956070 829956089
829981959 829981976
829981961 829981980
829981967 829981985
830013424 830013442
830015521 830015539
830030649 830030667
830031363 830031380
830035717 830035735
830036653 830036671
830037554 830037574
830039110 830039128
830039118 830039138
830044417 830044435
830044420 830044440
830057199 830057217
830058143 830058161
830063026 830063043
830096733 830096751
830096738 830096756
830102859 830102877
830113128 830113146
830116576 830116594
830116579 830116598
830120686 830120704
830124678 830124697
830127354 830127372
830143865 830143883
830144012 830144030
830145326 830145345
830145382 830145400
830191968 830191986
830194152 830194170
830200510 830200528
830200517 830200534
830202548 830202566
830204580 830204598
830210481 830210499
830211965 830211983
830273064 830273082
830277620 830277638
830280105 830280123
830283473 830283491
830291802 830291820
830294055 830294073
830297180 830297198
830308731 830308749
830324469 830324487
830334783 830334801
830360276 830360295
830361096 830361114
830365578 830365597
830380410 830380428
830380791 830380809
830387264 830387283
830391809 830391827
830393316 830393334
830393581 830393598
830393744 830393762
830393868 830393887
830415962 830415980
830416666 830416684
830434131 830434150
830437195 830437213
830440480 830440497
830450759 830450777
830460605 830460623
830460614 830460632
830461533 830461552
830469235 830469253
830469271 830469289
830496823 830496840
830496867 830496886
830505443 830505461
830510451 830510468
830510553 830510572
830533628 830533646
830533723 830533741
830534936 830534954
830537650 830537668
830542539 830542557
830545232 830545250
830547549 830547567
830548457 830548476
830549386 830549405
830549861 830549879
830550150 830550168
830550154 830550174
830550778 830550797
830551569 830551587
830573523 830573541
830573581 830573600
830574537 830574555
830575343 830575361
830575391 830575409
830575434 830575452
830575978 830575996
830602712 830602730
830612780 830612799
830639721 830639739
830644178 830644196
830644662 830644683
830649005 830649023
830661993 830662011
830689970 830689988
830702285 830702303
830705946 830705964
830717486 830717504
830719766 830719783
830722081 830722099
830727296 830727313
830727298 830727316
830727301 830727319
830754501 830754519
830754612 830754630
830770969 830770987
830777886 830777904
830777909 830777927
830797456 830797475
830800847 830800865
830804404 830804422
830811433 830811451
830811437 830811456
830815442 830815460
830815456 830815473
830838751 830838769
830845742 830845759
830846463 830846481
830854997 830855014
830857511 830857529
830862343 830862360
830872562 830872579
830882785 830882803
830889190 830889208
830892705 830892724
830892709 830892727
830895297 830895315
830904858 830904876
830904866 830904884
830906549 830906570
830985439 830985457
830985448 830985466
830999186 830999204
831000661 831000679
831005210 831005228
831008360 831008378
831022693 831022710
831022698 831022716
831038953 831038972
831096927 831096944
831096932 831096950
831099666 831099685
831104660 831104679
831104682 831104701
831138620 831138638
831141204 831141222
831142238 831142258
831144449 831144467
831144499 831144516
831146317 831146335
831146376 831146394
831146393 831146412
831146400 831146423
831146408 831146436
831146704 831146721
831146729 831146747
831146732 831146750
831146741 831146765
831147057 831147074
831147064 831147081
831147694 831147713
831151220 831151238
831153011 831153029
831158227 831158245
831158230 831158249
831162248 831162265
831162860 831162878
831162927 831162944
831163457 831163474
831163464 831163482
831163707 831163725
831164550 831164569
831164743 831164761
831165364 831165382
831165372 831165390
831165505 831165523
831166948 831166966
831170463 831170481
831171527 831171546
831174744 831174762
831176194 831176212
831176746 831176764
831180539 831180557
831208241 831208258
831208285 831208302
831222702 831222720
831235019 831235037
831235580 831235597
831242139 831242157
831242143 831242162
831247141 831247159
831249654 831249672
831263359 831263378
831264571 831264594
831273257 831273276
831277176 831277194
831312274 831312292
831323508 831323526
831331581 831331599
831344025 831344043
831350985 831351003
831357037 831357055
831396079 831396097
831399941 831399959
831402038 831402056
831412650 831412668
831419075 831419093
831419087 831419107
831420180 831420197
831420988 831421006
831454726 831454746
831465583 831465601
831465639 831465657
831475526 831475543
831484034 831484052
831495677 831495695
831496106 831496124
831498830 831498847
831502641 831502659
831510543 831510561
831510547 831510564
831518647 831518665
831552265 831552284
831552814 831552832
831569549 831569567
831582603 831582621
831582609 831582627
831588779 831588797
831610501 831610519
831616687 831616705
831616705 831616723
831616724 831616741
831621229 831621247
831621239 831621257
831621243 831621260
831630995 831631012
831669177 831669195
831673900 831673918
831673910 831673927
831688945 831688963
831699390 831699408
831705657 831705677
831747217 831747235
831765193 831765211
831765197 831765217
831790841 831790859
831811965 831811983
831827194 831827212
831848906 831848924
831850434 831850452
831860536 831860554
831871138 831871156
831871248 831871266
831911440 831911458
831923479 831923497
831934035 831934053
831935159 831935176
831938832 831938850
831962844 831962864
831982724 831982742
831982727 831982745
832001412 832001431
832008893 832008916
832012679 832012697
832017716 832017734
832019056 832019074
832029214 832029232
832031802 832031820
832037639 832037657
832043718 832043736
832043822 832043840
832043889 832043907
832044152 832044170
832045367 832045385
832046436 832046454
832046489 832046507
832046551 832046570
832049753 832049771
832052297 832052315
832054192 832054210
832072750 832072768
832100859 832100877
832106699 832106716
832109372 832109390
832111403 832111421
832111443 832111461
832111495 832111513
832116469 832116486
832118404 832118422
832162415 832162433
832175555 832175573
832197076 832197094
832199766 832199784
832205705 832205723
832234832 832234850
832272012 832272030
832284913 832284931
832295738 832295756
832300414 832300432
832332015 832332033
832338071 832338089
832345379 832345397
832350231 832350249
832355201 832355219
832363551 832363570
832364245 832364262
832370383 832370401
832427157 832427175
832436063 832436081
832444159 832444177
832449985 832450002
832452794 832452812
832454598 832454616
832455773 832455791
832458530 832458548
832461997 832462015
832465137 832465155
832472663 832472681
832479849 832479867
832493920 832493938
832504102 832504120
832520439 832520457
832532486 832532504
832542555 832542573
832553352 832553370
832555481 832555499
832601920 832601938
832613845 832613863
832613861 832613880
832619100 832619118
832621015 832621033
832625488 832625506
832627544 832627562
832630418 832630436
832640528 832640546
832643527 832643545
832650614 832650638
832650623 832650642
832658072 832658090
832667457 832667475
832667463 832667481
832688376 832688394
832690165 832690183
832698913 832698931
832702382 832702400
832706560 832706577
832713996 832714014
832716683 832716701
832718875 832718893
832720412 832720430
832772776 832772794
832801956 832801973
832821934 832821952
832823326 832823345
832853032 832853050
832858423 832858441
832860500 832860518
832865495 832865513
832882973 832882991
832940003 832940021
832954154 832954172
833009964 833009983
833016166 833016184
833020522 833020540
833026176 833026194
833026748 833026766
833039687 833039705
833042206 833042224
833050511 833050529
833051356 833051374
833053719 833053736
833054478 833054496
833057371 833057389
833057913 833057932
833059009 833059027
833059025 833059043
833059033 833059051
833059455 833059473
833061548 833061566
833137597 833137615
833140809 833140826
833144690 833144708
833147263 833147281
833148459 833148477
833148464 833148483
833148489 833148507
833210653 833210671
833227321 833227338
833228445 833228463
833233722 833233740
833235207 833235226
833269403 833269421
833320142 833320160
833369502 833369521
833386766 833386784
833389831 833389849
833393808 833393826
833396795 833396813
833414789 833414807
833425442 833425460
833446730 833446748
833451125 833451144
833574156 833574174
833576865 833576883
833576873 833576892
833578459 833578477
833580701 833580719
833641871 833641889
833653646 833653664
833654347 833654365
833654533 833654551
833654603 833654621
833654678 833654696
833655470 833655488
833655673 833655691
833658799 833658817
833663497 833663515
833681859 833681877
833728667 833728685
833742348 833742365
833749180 833749198
833750180 833750198
833753190 833753208
833753687 833753705
833756534 833756552
833811839 833811857
833827219 833827237
833833871 833833889
833836615 833836633
833839549 833839567
833845568 833845585
833868605 833868623
833885538 833885556
833922952 833922971
833947562 833947580
833957674 833957692
833987323 833987341
834092004 834092021
834095639 834095657
834156417 834156435
834183084 834183102
834247102 834247120
834261886 834261904
834262454 834262471
834270539 834270557
834282051 834282069
834294402 834294420
834307682 834307701
834322704 834322722
834326405 834326424
834346947 834346965
834350573 834350590
834353301 834353320
834358417 834358435
834390157 834390175
834435523 834435541
834450497 834450515
834518377 834518395
834520137 834520155
834525352 834525370
834528997 834529014
834530066 834530085
834596642 834596660
834624437 834624455
834635063 834635081
834691109 834691127
834744433 834744451
834779955 834779973
834781893 834781911
834795917 834795935
834800218 834800236
834803713 834803731
834808504 834808522
834811535 834811553
834833069 834833088
834839925 834839942
834846564 834846582
834858050 834858068
834862111 834862129
834864938 834864956
834953262 834953280
834963570 834963588
835009406 835009424
835039731 835039749
835099654 835099672
835100814 835100832
835212357 835212375
835247120 835247138
835374895 835374913
835393152 835393172
835411647 835411666
835413058 835413076
835443442 835443460
835475782 835475801
835480049 835480067
835490032 835490050
835499628 835499645
835501733 835501751
835545174 835545192
835557046 835557064
835567481 835567499
835643705 835643723
835648025 835648044
835669661 835669678
835721845 835721863
835770750 835770768
835818141 835818159
835848136 835848154
835895148 835895166
835900486 835900504
835954339 835954357
836039533 836039551
836067782 836067821
836067811 836067832
836067879 836067908
836067914 836067933
836068711 836068731
836068722 836068740
836068726 836068744
836069496 836069518
836072113 836072131
836073361 836073383
836073372 836073393
836073498 836073521
836080685 836080703
836108885 836108903
836118817 836118835
836127797 836127815
836127800 836127817
836188659 836188677
836247769 836247787
836261528 836261546
836293102 836293119
836331642 836331660
836335207 836335226
836352736 836352754
836375219 836375237
836412532 836412549
836426855 836426872
836454236 836454254
836459678 836459697
836461557 836461575
836485069 836485087
836601984 836602002
836602885 836602903
836667514 836667533
836699358 836699376
836709939 836709958
836769052 836769071
836769085 836769103
836771129 836771147
836776354 836776371
836783010 836783028
836783016 836783034
836783916 836783934
836787200 836787218
836787214 836787236
836790434 836790452
836790737 836790755
836853270 836853288
836861776 836861794
836929017 836929035
836932109 836932127
836943514 836943532
837025897 837025914
837033733 837033751
837038080 837038098
837086132 837086150
837110240 837110258
837135039 837135057
837160810 837160828
837164699 837164719
837185575 837185593
837185580 837185598
837188428 837188446
837189197 837189216
837223688 837223706
837224925 837224943
837227385 837227403
837267836 837267853
837272170 837272188
837333089 837333107
837344623 837344640
837369543 837369561
837384582 837384600
837401194 837401217
837401203 837401221
837401266 837401284
837444496 837444514
837452442 837452460
837458183 837458201
837464773 837464790
837548046 837548064
837569257 837569275
837579803 837579821
837723746 837723764
837797072 837797089
837801652 837801670
837815480 837815498
837832667 837832685
837843259 837843276
837865952 837865970
837875642 837875660
837898369 837898387
837900253 837900271
837924304 837924322
837967087 837967104
837970607 837970625
837974746 837974764
837977468 837977486
837977686 837977704
837978607 837978625
838041816 838041834
838054248 838054266
838064566 838064583
838078966 838078984
838087182 838087200
838108419 838108437
838153980 838153998
838174525 838174543
838238570 838238588
838257951 838257970
838295016 838295034
838325704 838325722
838373687 838373704
838388665 838388683
838399512 838399530
838406362 838406380
838410423 838410441
838415431 838415449
838419179 838419197
838469774 838469792
838481629 838481648
838483292 838483310
838487849 838487871
838487858 838487885
838568606 838568624
838569432 838569450
838578106 838578124
838578150 838578167
838578169 838578188
838584573 838584591
838592747 838592768
838592856 838592874
838592859 838592877
838607543 838607561
838609845 838609863
838629609 838629627
838635766 838635785
838662443 838662462
838662448 838662467
838683804 838683822
838688371 838688392
838713249 838713268
838831632 838831649
838844161 838844179
838911827 838911845
838923980 838923998
839020529 839020547
839025071 839025089
839073627 839073645
839088314 839088331
839101535 839101553
839103141 839103159
839108774 839108791
839127736 839127754
839185872 839185890
839193198 839193216
839194959 839194977
839201775 839201792
839255888 839255906
839258186 839258204
839267110 839267128
839284953 839284971
839296855 839296873
839297711 839297728
839299274 839299292
839300114 839300133
839300931 839300949
839302211 839302228
839304203 839304220
839337937 839337955
839342233 839342251
839343782 839343800
839347366 839347383
839362499 839362516
839371048 839371066
839564699 839564716
839618644 839618662
839626498 839626516
839629309 839629327
839629312 839629329
839629592 839629610
839630686 839630704
839680437 839680456
839691367 839691385
839706927 839706945
839718674 839718691
839721972 839721989
839777339 839777357
839801320 839801338
839808215 839808233
839828565 839828583
839829449 839829467
839848815 839848833
839863873 839863891
839869619 839869637
839883381 839883400
839885319 839885337
839953921 839953939
839961196 839961215
839961241 839961259
839963428 839963447
839971607 839971625
839977654 839977672
840039689 840039707
840047976 840047994
840049267 840049285
840078668 840078686
840081688 840081706
840176709 840176729
840194157 840194175
840196470 840196487
840197538 840197556
840200734 840200752
840222287 840222305
840225003 840225021
840230217 840230235
840231609 840231627
840238330 840238348
840243995 840244013
840292473 840292491
840293056 840293074
840305978 840305997
840308579 840308597
840317216 840317234
840403591 840403609
840488406 840488424
840491997 840492015
840500895 840500913
840502631 840502649
840504129 840504147
840576650 840576668
840580788 840580806
840582322 840582340
840671289 840671307
840734650 840734668
840736822 840736841
840737463 840737481
840737469 840737487
840737675 840737693
840740751 840740769
840752613 840752631
840832700 840832718
840836518 840836536
840857939 840857957
840882789 840882807
840898002 840898020
840915026 840915044
840926215 840926233
840931143 840931161
840932655 840932673
840933366 840933384
840995754 840995773
841063347 841063364
841085936 841085953
841096968 841096986
841141942 841141960
841143894 841143912
841147837 841147854
841178610 841178627
841236734 841236752
841242300 841242318
841245353 841245370
841262342 841262360
841305685 841305703
841342888 841342906
841471834 841471852
841505333 841505351
841526942 841526960
841533338 841533356
841554523 841554540
841586004 841586022
841689229 841689247
841691468 841691486
841767474 841767492
841769426 841769444
841777393 841777411
841792449 841792468
841811475 841811492
841827856 841827874
841863907 841863925
841922197 841922215
841934674 841934692
842037036 842037054
842038745 842038763
842046993 842047011
842048457 842048475
842103821 842103839
842108531 842108549
842117061 842117079
842119512 842119531
842128421 842128442
842128430 842128447
842131136 842131154
842133465 842133483
842133999 842134016
842135705 842135722
842137111 842137129
842189736 842189754
842205442 842205460
842219610 842219628
842236245 842236264
842275706 842275724
842294332 842294349
842295380 842295397
842303968 842303986
842325890 842325908
842340485 842340503
842384027 842384045
842385177 842385195
842409273 842409291
842428670 842428688
842443962 842443980
842458194 842458212
842468463 842468481
842472487 842472505
842478524 842478542
842485352 842485370
842495242 842495260
842521632 842521650
842533736 842533755
842561780 842561798
842586536 842586554
842652959 842652977
842654837 842654855
842666994 842667012
842670973 842670991
842678806 842678823
842689188 842689206
842713763 842713781
842715397 842715415
842716412 842716429
842719972 842719990
842728714 842728732
842732101 842732119
842740202 842740220
842762974 842762992
842803544 842803561
842814225 842814243
842815141 842815159
842816614 842816632
842817211 842817228
842821920 842821938
842823608 842823626
842825877 842825895
842831231 842831249
842832927 842832945
842900148 842900166
842907858 842907876
842911008 842911025
842915642 842915659
842917219 842917236
842918796 842918814
842919735 842919753
842922616 842922634
842928266 842928284
842967533 842967551
842973277 842973295
842973723 842973746
842973734 842973763
842973752 842973769
842981158 842981176
842986091 842986109
842988989 842989007
842994527 842994545
842996042 842996060
842997989 842998008
842999792 842999810
843025610 843025628
843105381 843105399
843108854 843108872
843132715 843132733
843167736 843167754
843174995 843175013
843223882 843223900
843251637 843251655
843257752 843257769
843272265 843272282
843311704 843311722
843331874 843331892
843421652 843421670
843428001 843428019
843429146 843429163
843431665 843431683
843435862 843435879
843443220 843443238
843445277 843445295
843460457 843460475
843461988 843462006
843493911 843493929
843494776 843494794
843503050 843503068
843506096 843506114
843507438 843507456
843512816 843512834
843514499 843514516
843571114 843571132
843589996 843590014
843604915 843604933
843635623 843635641
843642854 843642872
843643676 843643694
843644523 843644541
843656425 843656442
843669512 843669530
843669567 843669585
843674429 843674447
843703586 843703605
843709094 843709112
843710899 843710917
843721520 843721538
843722254 843722272
843729371 843729389
843742079 843742097
843791642 843791660
843795782 843795800
843801524 843801542
843802754 843802772
843803312 843803330
843833301 843833319
843836179 843836198
843837438 843837456
843839445 843839463
843840424 843840442
843843239 843843257
843855613 843855631
843860448 843860466
843887072 843887090
843888404 843888421
843902033 843902051
843906349 843906367
843912287 843912305
843921450 843921468
843922222 843922240
843941314 843941331
843942892 843942911
843944783 843944800
843965913 843965931
843986193 843986211
844007065 844007083
844010703 844010721
844012238 844012255
844013651 844013669
844015214 844015232
844016026 844016044
844017725 844017743
844024643 844024662
844025836 844025854
844029832 844029850
844035230 844035249
844051577 844051595
844095875 844095893
844095878 844095897
844096680 844096698
844097065 844097085
844122031 844122049
844201165 844201183
844245204 844245222
844310941 844310959
844345196 844345214
844423964 844423982
844430937 844430955
844440038 844440055
844446097 844446115
844450262 844450280
844450666 844450685
844457487 844457507
844463091 844463109
844464568 844464586
844485660 844485678
844497539 844497557
844508484 844508502
844514900 844514918
844516736 844516754
844521390 844521408
844521907 844521925
844526541 844526559
844555485 844555503
844567233 844567251
844570373 844570391
844575032 844575050
844578542 844578559
844657282 844657300
844673006 844673024
844684702 844684720
844696898 844696916
844884758 844884776
844941709 844941727
844967730 844967748
845026558 845026576
845057218 845057237
845061724 845061741
845065046 845065064
845066623 845066640
845067703 845067721
845078513 845078531
845149589 845149607
845149592 845149612
845151228 845151246
845153674 845153692
845158683 845158701
845176188 845176206
845186722 845186740
845222957 845222975
845316278 845316296
845319958 845319975
845324258 845324276
845329962 845329980
845360332 845360351
845377228 845377246
845398954 845398972
845406869 845406887
845421377 845421394
845446606 845446624
845464678 845464696
845476794 845476812
845477464 845477482
845478673 845478691
845492591 845492609
845504065 845504083
845533118 845533135
845541932 845541950
845560841 845560859
845585748 845585766
845587329 845587347
845589498 845589516
845636165 845636183
845657693 845657711
845665847 845665865
845668158 845668176
845669938 845669955
845674158 845674176
845690028 845690045
845700275 845700293
845704943 845704961
845708481 845708500
845722239 845722257
845739951 845739969
845747045 845747064
845754111 845754129
845762813 845762831
845778325 845778343
845823799 845823828
845826220 845826238
845827936 845827953
845834262 845834280
845840532 845840550
845854972 845854990
845889255 845889273
845908870 845908888
845929804 845929822
845931170 845931188
845936687 845936706
845942682 845942701
846000979 846000998
846013220 846013238
846016669 846016687
846020904 846020922
846028768 846028786
846037615 846037634
846051687 846051721
846051727 846051754
846095566 846095583
846106895 846106913
846116844 846116862
846136899 846136916
846138141 846138159
846143453 846143471
846188970 846188989
846191779 846191797
846197997 846198015
846345387 846345405
846370202 846370220
846441847 846441865
846446718 846446736
846449572 846449589
846457820 846457838
846507972 846507990
846507975 846507993
846507978 846508012
846507998 846508016
846508001 846508023
846510721 846510739
846529466 846529484
846532351 846532369
846537172 846537190
846537182 846537201
846542157 846542187
846544106 846544143
846544129 846544147
846544133 846544153
846545020 846545038
846613592 846613610
846621041 846621059
846623382 846623400
846632747 846632765
846675240 846675259
846675677 846675695
846689897 846689914
846692425 846692443
846698860 846698878
846746051 846746069
846751160 846751179
846826560 846826578
846834627 846834645
846853821 846853839
846855154 846855172
846855763 846855781
846908549 846908567
846920805 846920823
846924971 846924990
846930681 846930699
846936484 846936502
846941875 846941893
846951331 846951348
846964932 846964950
846966691 846966709
846972160 846972178
846977466 846977484
847022037 847022055
847041968 847041986
847063541 847063559
847087628 847087646
847090837 847090855
847092498 847092516
847095151 847095169
847096864 847096881
847120120 847120138
847123170 847123187
847136951 847136969
847139830 847139848
847139850 847139870
847139855 847139872
847141609 847141627
847149721 847149738
847153078 847153096
847165066 847165084
847166138 847166156
847172836 847172853
847179080 847179097
847179179 847179196
847206345 847206362
847206348 847206366
847217314 847217332
847223205 847223225
847223212 847223230
847223861 847223879
847230649 847230667
847237386 847237404
847242433 847242451
847248075 847248093
847256998 847257016
847287845 847287863
847317984 847318002
847335339 847335356
847381450 847381468
847383641 847383659
847402649 847402667
847417118 847417136
847421845 847421863
847430491 847430509
847432103 847432121
847469289 847469308
847555141 847555158
847588591 847588609
847590404 847590422
847604956 847604974
847622493 847622510
847625059 847625077
847637459 847637477
847639319 847639337
847647897 847647915
847651221 847651272
847651257 847651276
847651263 847651282
847651269 847651306
847651299 847651317
847652991 847653009
847652994 847653012
847653003 847653022
847653013 847653031
847661531 847661549
847725037 847725055
847725042 847725060
847730593 847730611
847730598 847730617
847731460 847731478
847734814 847734832
847738139 847738157
847739531 847739550
847744315 847744333
847753428 847753446
847772744 847772762
847774007 847774024
847797110 847797128
847802578 847802596
847811801 847811819
847814842 847814860
847822243 847822261
847822351 847822369
847822358 847822375
847823963 847823981
847834713 847834731
847836322 847836339
847837431 847837448
847841063 847841080
847883721 847883739
847900094 847900112
847915370 847915387
847922244 847922262
847945278 847945296
847955160 847955178
847998428 847998446
848004646 848004664
848032506 848032524
848033341 848033358
848035724 848035742
848069432 848069450
848086237 848086255
848095212 848095230
848099933 848099951
848116321 848116339
848156008 848156026
848191563 848191581
848192889 848192907
848219979 848219998
848229934 848229952
848231087 848231104
848231638 848231656
848233984 848234002
848237098 848237115
848258219 848258238
848302821 848302839
848311662 848311679
848317905 848317922
848319593 848319612
848324956 848324975
848325668 848325686
848330591 848330609
848335491 848335509
848348085 848348103
848367797 848367815
848372825 848372842
848418269 848418287
848424946 848424964
848430974 848430992
848439981 848439999
848440865 848440882
848458139 848458158
848466307 848466325
848492204 848492222
848527662 848527679
848581264 848581283
848619437 848619455
848624015 848624033
848625712 848625730
848626394 848626411
848627927 848627945
848630001 848630019
848638425 848638445
848638822 848638840
848641341 848641359
848648686 848648703
848655573 848655620
848655605 848655623
848657997 848658037
848661393 848661411
848661396 848661427
848664584 848664637
848664647 848664672
848664660 848664680
848673433 848673451
848684656 848684673
848691434 848691452
848692447 848692465
848701448 848701465
848715009 848715027
848715012 848715038
848715347 848715371
848715356 848715374
848715375 848715393
848715380 848715398
848718741 848718759
848718745 848718806
848728150 848728176
848729307 848729325
848729311 848729361
848729347 848729368
848729358 848729378
848732603 848732621
848732607 848732634
848732619 848732644
848732631 848732652
848732637 848732655
848732806 848732858
848732846 848732868
848732890 848732910
848732895 848732915
848732900 848732919
848732930 848732948
848732934 848732951
848735308 848735326
848735874 848735892
848735879 848735929
848735920 848736016
848736029 848736114
848736708 848736725
848741976 848741994
848744555 848744572
848745083 848745101
848750514 848750533
848755590 848755608
848757264 848757282
848764399 848764417
848770051 848770069
848781203 848781220
848785897 848785914
848786267 848786285
848789432 848789450
848816654 848816672
848842325 848842343
848843329 848843347
848846388 848846406
848850543 848850562
848853393 848853411
848855641 848855659
848865355 848865373
848876452 848876470
848896823 848896841
848918530 848918548
848922357 848922375
848942072 848942089
848944314 848944332
848970236 848970254
848981898 848981917
849037135 849037152
849044946 849044964
849050344 849050362
849053467 849053484
849073232 849073251
849073237 849073256
849076410 849076429
849085179 849085197
849085182 849085200
849085186 849085206
849087826 849087844
849089100 849089118
849147700 849147717
849171718 849171736
849171722 849171740
849171727 849171746
849171731 849171753
849180711 849180729
849192518 849192535
849192522 849192542
849192527 849192544
849192529 849192553
849192538 849192556
849192541 849192566
849192551 849192580
849192565 849192583
849192651 849192669
849192681 849192698
849195576 849195594
849201071 849201089
849201097 849201115
849201100 849201120
849213038 849213056
849214794 849214812
849248228 849248245
849300029 849300046
849301230 849301248
849305237 849305256
849369850 849369867
849369909 849369929
849376415 849376432
849377163 849377181
849396875 849396893
849399822 849399840
849413739 849413756
849443407 849443425
849457742 849457760
849470622 849470640
849477118 849477136
849480648 849480666
849501010 849501030
849501015 849501043
849506977 849506995
849541735 849541753
849541738 849541759
849554416 849554434
849564284 849564302
849568091 849568109
849630744 849630762
849630751 849630773
849636608 849636626
849637556 849637574
849674123 849674140
849680945 849680980
849686834 849686852
849689860 849689912
849690485 849690520
849693640 849693658
849693645 849693664
849705270 849705326
849708197 849708215
849708225 849708246
849708231 849708253
849711510 849711527
849714152 849714170
849717126 849717200
849717185 849717203
849717188 849717208
849719493 849719510
849720081 849720109
849726042 849726061
849726046 849726080
849729311 849729329
849751009 849751027
849774037 849774055
849786115 849786133
849820084 849820101
849822497 849822515
849823398 849823416
849870130 849870148
849892657 849892675
849901325 849901343
849906577 849906595
849942388 849942408
849942393 849942503
849942490 849942508
849945924 849945942
849945933 849945972
849945957 849945976
849947365 849947383
849947368 849947386
849947372 849947404
849947390 849947470
849947844 849947862
849948035 849948053
849949530 849949552
849949538 849949578
849949563 849949623
849949957 849949974
849949963 849949981
849949974 849950060
849950047 849950066
849950448 849950466
849950452 849950470
849950455 849950474
849950460 849950478
849950464 849950481
849950469 849950488
849950473 849950491
849950476 849950636
849958677 849958695
849959548 849959566
849959925 849959943
849974926 849974944
850020507 850020525
850061104 850061122
850064038 850064056
850101590 850101608
850137780 850137798
850153573 850153591
850161570 850161588
850164456 850164474
850170213 850170231
850172995 850173013
850177237 850177255
850177243 850177269
850182174 850182192
850187427 850187445
850194105 850194123
850197814 850197832
850271904 850271922
850275995 850276013
850278423 850278441
850278427 850278449
850278436 850278471
850278469 850278490
850278671 850278690
850278675 850278694
850278685 850278703
850281555 850281660
850281650 850281689
850281675 850281692
850282735 850282753
850285079 850285100
850285094 850285112
850285104 850285122
850285107 850285129
850285114 850285170
850285156 850285174
850287942 850287961
850287946 850287965
850287950 850287968
850287953 850287971
850287956 850287974
850287988 850288010
850288004 850288023
850288008 850288033
850288022 850288040
850288026 850288044
850291353 850291371
850291356 850291374
850291359 850291378
850294392 850294410
850294395 850294477
850294470 850294493
850303831 850303899
850303919 850303937
850303925 850303947
850306850 850306867
850306852 850306889
850310140 850310181
850313341 850313359
850313344 850313370
850313355 850313372
850316673 850316735
850316748 850316766
850316755 850316789
850317443 850317462
850320245 850320263
850325167 850325185
850329626 850329645
850329638 850329655
850330621 850330638
850331145 850331163
850346060 850346078
850349129 850349169
850362310 850362328
850370167 850370184
850378549 850378567
850378552 850378602
850385032 850385050
850395832 850395850
850405259 850405277
850407967 850407985
850437870 850437888
850488184 850488202
850490761 850490779
850500505 850500524
850514492 850514511
850517998 850518017
850532643 850532661
850595984 850596002
850602905 850602923
850643028 850643047
850666510 850666528
850674314 850674332
850677419 850677437
850679377 850679395
850689784 850689802
850689787 850689805
850692250 850692268
850694593 850694611
850697183 850697200
850715819 850715838
850720263 850720281
850720272 850720290
850732656 850732676
850738769 850738788
850738773 850738823
850738829 850738847
850738933 850738951
850744868 850744886
850749600 850749618
850757481 850757499
850759951 850759969
850777160 850777178
850780659 850780676
850825148 850825166
850841076 850841094
850845682 850845702
850853412 850853430
850856882 850856900
850880232 850880249
850904693 850904711
850904699 850904717
850904706 850904727
850904713 850904731
850936393 850936440
850940207 850940233
850948373 850948421
850952023 850952041
850952026 850952059
851033104 851033121
851038867 851038885
851071149 851071167
851102261 851102278
851102264 851102286
851215508 851215526
851215513 851215531
851215516 851215544
851215530 851215548
851218683 851218701
851218689 851218707
851218728 851218748
851218733 851218753
851218740 851218758
851231910 851231928
851239533 851239550
851262776 851262794
851262780 851262798
851270687 851270705
851276618 851276638
851286671 851286688
851295649 851295667
851309505 851309523
851329969 851330008
851330008 851330025
851330012 851330030
851330015 851330033
851332032 851332050
851332035 851332086
851335305 851335360
851335354 851335386
851338565 851338587
851338572 851338641
851341108 851341126
851341111 851341128
851341113 851341165
851343846 851343864
851343851 851343891
851343876 851343894
851343898 851343920
851343906 851343923
851343909 851343928
851343913 851343970
851346938 851346956
851346941 851347009
851349945 851349963
851349949 851349973
851349972 851349990
851353982 851354000
851356308 851356327
851356312 851356329
851356314 851356336
851356321 851356338
851356323 851356341
851356329 851356347
851356333 851356354
851356339 851356357
851356342 851356359
851356348 851356380
851356365 851356382
851356368 851356386
851356402 851356419
851356404 851356423
851356428 851356469
851356487 851356510
851362643 851362661
851362646 851362667
851362653 851362675
851362660 851362695
851371080 851371100
851392842 851392863
851392848 851392867
851392853 851392871
851392918 851392963
851395780 851395797
851395808 851395826
851398380 851398398
851398383 851398404
851398422 851398440
851398429 851398447
851398432 851398450
851398494 851398511
851398498 851398526
851398512 851398530
851398522 851398546
851400059 851400077
851401842 851401865
851401850 851401898
851401884 851401902
851402052 851402072
851402057 851402078
851405336 851405354
851405342 851405359
851405345 851405416
851408098 851408116
851410427 851410445
851410432 851410463
851410510 851410528
851428171 851428189
851428174 851428201
851464259 851464277
851472553 851472573
851472559 851472577
851472562 851472581
851472601 851472619
851513387 851513405
851520001 851520019
851522153 851522170
851551625 851551644
851551629 851551650
851551635 851551654
851551639 851551657
851554522 851554539
851632310 851632332
851645610 851645655
851646560 851646578
851660184 851660201
851665981 851665999
851670390 851670408
851674107 851674124
851680064 851680082
851682974 851682993
851682979 851682998
851682987 851683005
851685872 851685894
851685879 851685897
851698044 851698062
851729490 851729508
851755103 851755133
851778334 851778351
851784565 851784582
851784567 851784645
851784631 851784654
851785377 851785395
851787956 851787973
851934655 851934673
852022442 852022460
852022453 852022473
852022458 852022476
852025693 852025711
852051477 852051496
852065277 852065295
852138921 852138939
852147401 852147419
852156158 852156176
852212320 852212338
852213474 852213492
852216163 852216181
852263401 852263420
852266705 852266723
852276908 852276926
852312975 852312992
852323447 852323465
852325453 852325471
852358204 852358222
852393216 852393234
852435980 852435998
852440083 852440101
852458892 852458910
852489584 852489602
852490442 852490460
852493275 852493293
852495720 852495738
852497244 852497262
852502421 852502439
852504074 852504091
852509082 852509100
852520748 852520766
852545803 852545820
852545809 852545860
852548699 852548716
852563132 852563149
852563134 852563152
852563137 852563157
852564514 852564534
852566253 852566271
852568699 852568717
852575023 852575040
852575028 852575048
852576309 852576327
852577436 852577454
852580469 852580486
852583847 852583865
852595321 852595339
852627998 852628017
852633513 852633531
852652948 852652966
852661378 852661395
852663184 852663202
852669928 852669946
852679325 852679342
852687755 852687773
852697994 852698012
852715726 852715744
852716872 852716890
852729661 852729702
852741472 852741490
852741478 852741495
852741480 852741498
852741483 852741505
852745650 852745668
852752868 852752886
852758778 852758796
852794529 852794547
852813527 852813547
852813532 852813551
852813538 852813556
852813545 852813571
852813571 852813591
852813577 852813596
852813607 852813625
852813610 852813646
852813632 852813650
852825687 852825705
852829324 852829342
852829327 852829348
852829337 852829355
852892752 852892770
852920960 852920978
852931501 852931518
852953060 852953078
852998247 852998266
853024161 853024180
853067354 853067372
853196725 853196743
853264006 853264024
853272971 853272990
853280287 853280305
853290941 853290960
853296991 853297009
853296995 853297022
853297007 853297025
853300068 853300086
853316004 853316022
853387317 853387334
853405733 853405751
853405736 853405757
853405743 853405783
853414940 853414958
853439609 853439627
853439612 853439630
853439616 853439639
853442643 853442668
853442656 853442674
853442659 853442679
853442664 853442704
853442689 853442710
853444751 853444769
853453951 853453969
853479050 853479068
853483081 853483100
853500820 853500837
853500845 853500874
853515287 853515305
853515290 853515313
853522317 853522334
853575859 853575876
853595412 853595430
853595425 853595444
853595429 853595447
853607167 853607188
853607688 853607705
853625237 853625254
853668728 853668746
853673728 853673746
853694138 853694156
853701410 853701428
853702875 853702892
853710505 853710522
853711474 853711491
853713781 853713798
853758766 853758784
853781117 853781135
853838692 853838710
853867931 853867949
853869010 853869028
853949427 853949445
853952592 853952612
853952597 853952615
853952601 853952619
853952607 853952625
853955038 853955056
854041760 854041777
854056734 854056751
854123075 854123097
854123130 854123149
854228997 854229015
854234063 854234081
854237614 854237632
854240755 854240773
854240762 854240780
854249350 854249368
854292417 854292435
854293267 854293285
854306095 854306113
854308525 854308543
854311871 854311889
854408771 854408788
854427604 854427622
854475132 854475151
854476871 854476888
854478779 854478797
854482232 854482251
854483447 854483466
854504683 854504701
854531593 854531612
854531597 854531647
854533356 854533374
854558036 854558054
854558050 854558068
854565057 854565075
854584198 854584216
854618027 854618045
854658322 854658340
854666478 854666496
854705315 854705333
854706545 854706563
854751264 854751282
854770228 854770246
854794522 854794540
854813416 854813434
854815189 854815207
854817779 854817797
854825267 854825286
854836810 854836828
854837372 854837390
854910437 854910455
854916988 854917006
854919411 854919429
854926279 854926297
854988025 854988043
855004892 855004911
855011518 855011536
855011521 855011539
855030914 855030932
855086950 855086968
855199431 855199448
855220540 855220559
855243391 855243409
855258370 855258388
855268093 855268111
855312461 855312479
855356568 855356586
855414404 855414422
855444718 855444737
855444772 855444817
855444803 855444822
855444834 855444899
855444884 855444951
855444937 855445036
855445021 855445040
855445026 855445077
855445074 855445195
855445821 855445839
855449887 855449906
855457678 855457697
855461359 855461377
855476961 855476978
855486917 855486935
855488438 855488456
855489638 855489656
855491159 855491177
855494728 855494748
855494733 855494751
855498034 855498052
855501667 855501685
855506458 855506475
855526479 855526497
855546449 855546467
855599317 855599335
855604234 855604252
855604640 855604658
855606347 855606364
855608320 855608338
855620228 855620246
855689326 855689344
855706441 855706458
855778732 855778750
855783262 855783280
855809722 855809740
855824227 855824245
855862435 855862453
855866238 855866256
855867703 855867721
855869761 855869780
855901528 855901546
855907803 855907820
855943447 855943464
855949023 855949040
855953840 855953858
855987170 855987187
855988376 855988394
856006449 856006468
856022917 856022945
856022944 856022962
856023159 856023177
856075784 856075802
856105824 856105841
856127817 856127835
856133541 856133559
856135770 856135788
856142937 856142955
856150235 856150253
856167370 856167388
856210350 856210367
856218071 856218089
856223835 856223853
856233106 856233124
856258807 856258825
856276900 856276918
856294330 856294348
856320429 856320447
856323747 856323765
856331101 856331119
856383002 856383020
856396270 856396289
856401856 856401874
856411004 856411022
856414768 856414786
856436340 856436359
856451158 856451176
856466328 856466345
856471176 856471195
856500900 856500918
856527710 856527728
856536429 856536448
856544298 856544316
856571524 856571542
856583612 856583630
856591054 856591073
856613470 856613489
856646944 856646962
856653437 856653455
856695738 856695755
856698647 856698665
856703018 856703036
856710919 856710937
856718678 856718696
856726124 856726142
856727672 856727690
856728797 856728815
856778888 856778906
856826550 856826568
856876842 856876860
856900929 856900946
856908873 856908891
856912810 856912828
856922496 856922514
856928236 856928254
856987267 856987285
857007029 857007048
857007984 857008001
857022137 857022157
857094667 857094685
857131824 857131842
857169276 857169296
857169502 857169520
857169505 857169525
857169511 857169528
857215131 857215149
857232584 857232602
857258007 857258024
857262630 857262648
857268808 857268826
857334915 857334933
857362642 857362660
857366112 857366130
857402372 857402390
857406451 857406469
857435213 857435230
857436357 857436375
857445588 857445606
857461689 857461708
857495724 857495741
857500962 857500980
857502330 857502348
857505410 857505428
857507492 857507510
857509764 857509782
857511500 857511518
857514489 857514507
857516520 857516538
857522140 857522158
857529337 857529355
857531052 857531069
857544371 857544388
857551803 857551821
857559163 857559182
857582003 857582020
857592077 857592095
857596918 857596936
857632791 857632808
857636334 857636352
857637114 857637132
857639331 857639349
857645438 857645455
857652037 857652055
857667274 857667292
857673244 857673262
857678592 857678610
857682029 857682047
857686187 857686205
857695467 857695485
857706567 857706585
857715501 857715519
857735288 857735306
857739012 857739030
857742756 857742775
857743028 857743046
857755023 857755041
857758150 857758168
857763710 857763728
857765375 857765392
857790239 857790258
857855328 857855345
857862310 857862328
857898528 857898546
857907148 857907202
857908818 857908836
857908825 857908844
857908829 857908853
857910874 857910915
857912643 857912664
857912649 857912667
857912652 857912670
857914319 857914337
857914326 857914396
857932505 857932523
857940936 857940954
857946459 857946477
857949057 857949074
857995239 857995257
857997462 857997479
857997467 857997488
857997473 857997500
858000611 858000629
858006079 858006123
858024622 858024640
858107575 858107593
858132586 858132603
858165025 858165042
858182878 858182896
858185000 858185018
858207172 858207190
858217005 858217023
858219642 858219660
858268975 858268992
858291795 858291813
858377797 858377817
858390348 858390366
858390353 858390371
858463003 858463021
858465396 858465414
858467824 858467842
858470032 858470050
858489768 858489786
858518376 858518394
858518380 858518397
858518383 858518401
858528515 858528533
858532043 858532062
858535254 858535272
858540047 858540065
858541504 858541524
858556064 858556082
858594465 858594482
858607770 858607787
858615540 858615557
858615759 858615778
858615925 858615945
858617700 858617717
858620383 858620401
858626652 858626670
858643077 858643094
858683268 858683303
858693364 858693381
858724951 858724969
858741265 858741283
858741272 858741291
858785010 858785028
858797945 858797963
858805154 858805172
858806784 858806803
858819202 858819220
858885527 858885545
858892080 858892098
858892097 858892115
858892100 858892117
858951030 858951048
858951033 858951050
858951035 858951063
858951048 858951066
858951734 858951752
858956332 858956350
858961264 858961282
858963330 858963348
858964073 858964091
858966261 858966279
858973799 858973817
858985562 858985580
858991182 858991200
858991193 858991211
859039764 859039786
859039801 859039837
859068986 859069004
859074306 859074323
859075131 859075149
859082344 859082362
859082792 859082810
859084714 859084732
859093683 859093701
859094940 859094958
859095885 859095903
859096241 859096259
859123616 859123635
859127658 859127676
859140892 859140910
859145858 859145876
859146714 859146743
859146729 859146746
859146731 859146749
859146738 859146756
859155435 859155453
859182073 859182091
859231924 859231943
859242787 859242805
859281365 859281382
859312555 859312573
859320131 859320149
859323649 859323666
859348549 859348568
859399943 859399961
859431748 859431766
859474812 859474829
859477536 859477553
859496000 859496018
859551346 859551364
859576019 859576037
859607395 859607413
859647905 859647924
859704490 859704508
859720436 859720454
859751625 859751643
859761479 859761497
859781280 859781298
859787094 859787111
859821856 859821874
859831599 859831617
859848845 859848864
859898977 859898995
859925078 859925095
859934489 859934507
859987143 859987161
859987147 859987168
859987153 859987206
859987191 859987209
860000752 860000769
860010993 860011011
860060483 860060501
860091132 860091150
860149693 860149711
860160353 860160371
860162615 860162633
860166854 860166872
860168685 860168703
860169332 860169349
860241348 860241367
860244539 860244557
860244542 860244564
860244550 860244568
860250026 860250044
860250031 860250048
860253640 860253658
860253643 860253661
860284326 860284345
860292939 860292956
860341167 860341184
860341491 860341508
860342693 860342712
860342700 860342718
860342720 860342737
860342730 860342749
860342734 860342751
860342813 860342831
860342825 860342843
860342831 860342849
860342842 860342863
860342849 860342867
860342967 860342987
860342989 860343009
860356309 860356326
860357880 860357898
860364238 860364256
860366155 860366173
860371198 860371216
860440192 860440210
860441859 860441877
860453998 860454016
860478567 860478585
860489468 860489486
860497449 860497466
860506937 860506955
860509666 860509684
860527301 860527319
860543526 860543544
860550848 860550866
860552183 860552202
860585211 860585228
860624069 860624088
860671413 860671431
860675497 860675515
860710811 860710828
860736269 860736286
860743413 860743430
860759706 860759724
860772333 860772350
860789300 860789318
860796795 860796812
860857377 860857395
860879022 860879039
860894437 860894455
860921068 860921086
860944696 860944714
860947985 860948003
860970707 860970725
860990006 860990024
861035399 861035427
861035413 861035436
861035421 861035439
861035434 861035452
861035437 861035455
861035447 861035465
861035831 861035850
861035853 861035871
861035887 861035910
861035895 861035913
861038238 861038256
861040891 861040909
861041437 861041454
861042838 861042856
861044661 861044678
861055430 861055448
861064796 861064814
861069542 861069559
861073824 861073842
861084197 861084215
861089137 861089154
861111711 861111729
861125227 861125245
861131207 861131225
861133838 861133856
861141022 861141040
861175522 861175540
861214948 861214966
861233119 861233137
861278793 861278812
861306866 861306884
861315718 861315736
861390954 861390972
861398712 861398730
861424464 861424482
861428462 861428480
861462512 861462532
861462519 861462537
861462522 861462540
861483183 861483200
861483512 861483529
861484278 861484296
861484886 861484903
861486479 861486496
861489563 861489581
861495225 861495243
861501244 861501262
861504692 861504710
861544085 861544103
861566200 861566218
861577258 861577276
861616380 861616398
861625592 861625610
861629586 861629604
861641347 861641365
861644408 861644426
861644411 861644429
861647527 861647545
861650100 861650118
861650107 861650125
861652902 861652919
861654557 861654575
861671617 861671636
861693171 861693189
861739769 861739787
861750695 861750713
861824195 861824213
861824212 861824229
861824231 861824250
861824237 861824255
861824357 861824375
861843044 861843062
861866591 861866610
861886158 861886176
861919906 861919924
861924510 861924528
861931762 861931780
861946267 861946285
861992531 861992548
861996881 861996899
861997934 861997952
862009909 862009928
862068189 862068206
862084300 862084325
862084310 862084327
862084461 862084481
862139814 862139833
862158447 862158466
862163225 862163243
862177031 862177049
862179437 862179455
862187307 862187324
862207605 862207622
862258337 862258354
862262549 862262567
862278835 862278853
862312807 862312825
862324861 862324878
862351894 862351912
862381098 862381116
862384726 862384744
862404451 862404469
862408495 862408512
862409253 862409270
862462610 862462627
862521807 862521825
862524764 862524782
862533382 862533400
862543208 862543227
862556184 862556201
862565808 862565826
862568014 862568032
862583634 862583652
862599891 862599909
862605866 862605884
862646156 862646174
862668088 862668106
862674497 862674515
862686277 862686295
862689701 862689719
862698687 862698705
862701047 862701065
862704853 862704871
862705958 862705975
862705965 862705983
862711824 862711842
862716229 862716247
862732321 862732339
862768797 862768814
862770016 862770073
862770078 862770097
862770082 862770107
862770092 862770110
862770096 862770113
862773013 862773031
862773018 862773036
862773023 862773040
862773032 862773049
862773034 862773051
862773036 862773055
862773040 862773058
862773046 862773071
862773058 862773102
862783443 862783461
862813915 862813933
862855428 862855446
862858304 862858322
862870011 862870029
862871030 862871048
862880083 862880101
862897005 862897023
862942193 862942211
862944117 862944135
862947243 862947261
862948339 862948356
862954135 862954153
862976645 862976663
863034387 863034405
863052304 863052322
863073115 863073132
863091503 863091521
863119439 863119457
863145904 863145934
863145919 863146024
863146012 863146031
863146016 863146036
863146022 863146044
863146032 863146068
863146680 863146698
863157195 863157213
863157238 863157255
863157486 863157504
863158078 863158096
863167006 863167024
863201547 863201565
863202520 863202538
863205202 863205221
863216955 863216973
863221173 863221216
863277395 863277413
863277405 863277428
863295207 863295225
863295672 863295690
863295676 863295694
863295680 863295698
863301800 863301818
863317378 863317396
863371788 863371806
863377896 863377914
863401065 863401083
863457767 863457785
863470481 863470499
863532179 863532197
863532184 863532202
863534878 863534896
863534883 863534902
863539876 863539894
863547531 863547549
863555464 863555482
863556017 863556035
863635499 863635517
863637344 863637361
863648266 863648284
863667989 863668006
863669768 863669786
863683951 863683969
863713662 863713680
863715656 863715673
863718371 863718389
863734109 863734128
863770795 863770813
863805584 863805602
863810259 863810277
863830584 863830602
863848317 863848335
863885788 863885806
863898882 863898901
863931138 863931156
863938116 863938133
863945547 863945564
863951341 863951359
863965457 863965474
863969686 863969704
863977651 863977669
863979281 863979299
863982947 863982965
863984369 863984387
863993748 863993766
864014654 864014672
864058985 864059004
864069321 864069339
864107882 864107900
864131983 864132000
864146468 864146485
864149870 864149888
864158795 864158814
864168562 864168580
864193841 864193859
864253432 864253450
864258817 864258835
864267200 864267217
864272181 864272200
864274508 864274526
864280526 864280544
864305751 864305769
864314463 864314480
864325508 864325527
864328184 864328202
864339199 864339217
864340126 864340144
864353215 864353233
864416214 864416232
864434088 864434106
864436596 864436614
864464144 864464162
864486271 864486289
864486275 864486297
864486283 864486306
864501118 864501136
864585219 864585236
864586024 864586042
864592276 864592294
864594239 864594257
864604553 864604571
864606925 864606944
864612156 864612174
864628203 864628221
864673449 864673467
864678545 864678563
864751168 864751187
864761260 864761278
864771375 864771392
864777340 864777358
864778537 864778555
864859055 864859073
864885315 864885334
864921833 864921851
864963097 864963114
864969406 864969423
865015102 865015123
865015428 865015449
865015538 865015556
865015542 865015567
865019917 865019935
865029061 865029079
865030607 865030625
865055965 865055983
865085845 865085864
865089619 865089637
865089632 865089654
865089642 865089659
865089644 865089662
865089651 865089668
865089773 865089792
865089784 865089815
865090625 865090643
865090864 865090882
865093271 865093293
865093280 865093297
865093282 865093323
865093308 865093326
865093423 865093454
865095028 865095046
865111415 865111438
865121113 865121131
865129587 865129604
865131297 865131314
865134178 865134195
865181808 865181826
865183436 865183455
865196750 865196768
865198284 865198301
865199270 865199288
865199399 865199416
865303426 865303444
865330304 865330322
865345188 865345206
865354326 865354344
865364607 865364625
865374026 865374044
865376743 865376761
865397989 865398007
865465052 865465070
865474636 865474654
865490975 865490993
865542465 865542482
865557038 865557056
865613978 865613996
865625903 865625921
865630916 865630934
865668372 865668390
865684200 865684217
865695514 865695536
865710707 865710725
865717615 865717633
865720713 865720730
865737492 865737516
865737501 865737519
865743324 865743342
865795310 865795328
865798649 865798667
865807157 865807174
865808666 865808683
865824192 865824210
865828739 865828757
865829362 865829380
865853740 865853758
865864239 865864258
865869618 865869636
865876523 865876541
865893513 865893531
865947213 865947231
865966160 865966178
865971918 865971936
865982208 865982226
865990576 865990594
866032212 866032230
866040540 866040558
866044284 866044302
866072842 866072860
866073487 866073505
866075663 866075681
866077994 866078012
866078356 866078373
866086262 866086279
866087083 866087100
866090196 866090214
866093357 866093375
866099698 866099716
866110356 866110374
866112045 866112062
866120403 866120421
866123134 866123152
866125782 866125799
866129100 866129117
866133941 866133959
866135107 866135124
866137486 866137503
866138035 866138052
866139058 866139078
866139645 866139663
866139887 866139905
866141259 866141278
866143854 866143872
866145589 866145607
866149322 866149340
866150158 866150175
866150360 866150378
866150398 866150416
866157802 866157820
866158117 866158135
866158845 866158863
866159755 866159774
866160568 866160586
866160693 866160713
866162102 866162120
866162713 866162731
866162809 866162827
866163610 866163628
866163902 866163920
866164107 866164125
866164158 866164176
866174162 866174180
866175489 866175507
866175686 866175703
866175697 866175715
866177336 866177355
866177769 866177787
866177964 866177982
866178024 866178042
866178073 866178091
866178262 866178280
866178365 866178382
866178966 866178983
866179196 866179214
866179455 866179472
866179747 866179765
866180686 866180704
866181194 866181212
866182655 866182673
866183545 866183563
866184553 866184571
866184558 866184575
866185176 866185194
866186667 866186686
866186691 866186709
866186728 866186746
866186969 866186987
866187064 866187081
866187369 866187387
866187816 866187834
866188268 866188286
866188654 866188672
866188990 866189008
866189060 866189078
866189194 866189212
866190157 866190175
866190263 866190281
866190729 866190747
866191177 866191195
866191581 866191599
866192155 866192173
866192169 866192187
866192203 866192221
866192546 866192564
866192576 866192594
866192921 866192938
866193200 866193218
866193206 866193224
866193227 866193245
866193307 866193325
866193387 866193405
866193477 866193495
866193668 866193686
866194129 866194147
866194156 866194173
866194795 866194813
866194811 866194829
866194864 866194883
866195122 866195139
866195183 866195201
866195503 866195521
866195716 866195733
866195735 866195753
866196011 866196028
866196424 866196442
866197126 866197144
866197307 866197326
866197350 866197368
866197369 866197387
866197446 866197464
866197597 866197615
866197612 866197630
866197646 866197665
866197827 866197845
866197842 866197860
866199090 866199108
866199094 866199112
866199251 866199269
866199381 866199399
866199520 866199537
866199574 866199592
866199796 866199813
866199944 866199962
866200470 866200488
866200806 866200824
866200854 866200873
866200998 866201016
866201301 866201319
866201847 866201865
866201933 866201951
866201951 866201969
866202023 866202041
866202206 866202223
866202405 866202424
866202499 866202517
866202864 866202882
866203149 866203167
866204249 866204266
866204300 866204318
866204330 866204348
866204646 866204664
866205100 866205118
866206129 866206147
866206139 866206157
866206635 866206653
866207008 866207026
866207435 866207453
866207550 866207568
866207593 866207611
866207686 866207703
866207731 866207749
866207851 866207869
866207992 866208010
866208205 866208222
866208295 866208313
866208521 866208539
866208589 866208607
866208633 866208651
866208762 866208780
866208787 866208804
866208952 866208970
866209311 866209329
866209334 866209352
866209386 866209404
866209392 866209410
866209469 866209488
866209488 866209506
866209504 866209522
866209542 866209560
866209582 866209600
866209781 866209799
866209810 866209827
866209820 866209838
866209831 866209849
866209872 866209890
866209877 866209895
866209938 866209956
866212460 866212478
866212895 866212913
866212920 866212938
866213037 866213054
866213343 866213361
866213427 866213445
866213488 866213505
866213544 866213562
866213605 866213623
866213725 866213743
866213844 866213862
866214018 866214037
866214112 866214130
866214261 866214279
866214418 866214436
866214433 866214451
866214601 866214619
866214630 866214648
866214693 866214712
866216228 866216246
866216285 866216303
866216340 866216358
866216616 866216634
866216627 866216646
866216636 866216654
866216780 866216797
866220193 866220211
866220684 866220702
866220873 866220890
866220972 866220990
866221053 866221071
866221937 866221955
866224709 866224726
866224845 866224863
866224915 866224933
866225145 866225163
866225168 866225186
866226681 866226699
866227258 866227276
866227563 866227581
866227632 866227650
866227924 866227942
866228045 866228063
866228123 866228141
866228183 866228201
866228502 866228520
866228518 866228536
866228934 866228952
866228982 866229000
866229145 866229163
866229272 866229290
866229288 866229305
866229332 866229350
866229367 866229385
866229442 866229460
866229547 866229565
866229592 866229609
866229662 866229680
866229666 866229684
866229685 866229703
866229726 866229744
866229735 866229753
866229747 866229765
866230293 866230311
866230734 866230753
866230749 866230768
866230875 866230893
866230907 866230925
866230931 866230949
866230968 866230986
866231217 866231235
866231293 866231310
866231319 866231337
866231381 866231398
866231496 866231514
866231506 866231524
866231542 866231560
866233222 866233240
866233576 866233594
866234033 866234051
866234158 866234176
866234288 866234307
866234299 866234317
866234375 866234393
866234522 866234540
866234630 866234648
866234657 866234675
866234699 866234717
866235020 866235038
866235235 866235253
866235632 866235650
866235661 866235679
866235991 866236010
866238431 866238449
866238563 866238580
866238754 866238772
866238839 866238856
866239112 866239129
866239142 866239160
866239473 866239492
866240120 866240137
866240157 866240175
866240497 866240515
866240519 866240537
866240638 866240656
866240733 866240751
866240768 866240786
866240840 866240859
866241109 866241127
866241133 866241151
866241224 866241242
866241508 866241525
866241555 866241573
866259342 866259360
866300564 866300582
866300568 866300586
866300571 866300589
866301872 866301890
866302682 866302700
866321324 866321342
866325904 866325922
866333481 866333499
866353940 866353958
866354767 866354785
866355946 866355964
866386709 866386726
866396833 866396851
866410907 866410925
866413727 866413745
866477792 866477809
866497425 866497443
866524481 866524499
866560687 866560705
866567579 866567597
866571374 866571392
866576164 866576181
866578540 866578558
866583662 866583680
866586802 866586820
866586807 866586828
866593670 866593688
866600582 866600599
866601320 866601338
866603975 866603993
866605055 866605073
866656437 866656455
866672705 866672723
866698419 866698437
866711281 866711299
866718924 866718961
866736410 866736428
866762353 866762371
866770583 866770600
866770954 866770972
866774056 866774074
866776173 866776191
866824597 866824614
866836132 866836149
866839496 866839514
866905397 866905417
866905404 866905570
866905556 866905574
866905562 866905587
866905581 866905611
866905596 866905622
866905615 866905637
866906675 866906694
866933813 866933831
866941666 866941683
866952747 866952765
867000103 867000122
867008031 867008049
867014595 867014613
867017286 867017304
867019118 867019136
867021143 867021161
867027012 867027030
867027857 867027875
867056199 867056216
867078143 867078161
867089622 867089640
867092242 867092260
867109606 867109624
867120021 867120039
867143116 867143134
867172169 867172187
867174295 867174313
867174964 867174984
867174969 867174994
867175044 867175062
867175062 867175080
867175218 867175236
867175293 867175311
867175910 867175929
867175922 867175940
867175925 867175943
867176038 867176056
867178092 867178109
867191162 867191180
867206349 867206367
867212082 867212100
867246617 867246635
867275333 867275351
867277029 867277046
867278228 867278245
867281753 867281771
867285593 867285611
867298964 867298982
867319763 867319780
867364088 867364106
867378791 867378810
867449554 867449572
867501130 867501148
867510459 867510476
867510467 867510485
867539495 867539513
867548106 867548126
867550614 867550632
867558673 867558691
867619682 867619700
867628385 867628403
867685053 867685072
867685058 867685080
867685174 867685193
867687405 867687422
867692278 867692296
867693680 867693698
867706480 867706499
867708192 867708210
867710107 867710125
867719788 867719806
867771681 867771699
867774879 867774897
867777490 867777508
867779585 867779603
867782783 867782801
867789499 867789516
867791003 867791021
867795621 867795639
867797222 867797240
867815999 867816017
867956640 867956658
868045689 868045707
868054782 868054800
868060781 868060799
868114705 868114725
868123187 868123206
868143066 868143084
868144471 868144490
868213011 868213028
868216384 868216402
868224473 868224491
868224476 868224494
868224480 868224497
868224511 868224529
868224669 868224688
868232605 868232623
868236187 868236205
868247665 868247682
868253678 868253696
868262639 868262657
868300765 868300783
868305173 868305191
868391916 868391934
868399315 868399333
868472287 868472306
868527528 868527546
868540485 868540504
868584290 868584308
868602708 868602726
868608381 868608399
868612601 868612619
868631321 868631339
868651846 868651864
868655796 868655814
868656025 868656044
868661468 868661486
868701167 868701185
868720378 868720396
868728027 868728046
868731165 868731199
868731247 868731265
868734413 868734431
868735457 868735475
868735470 868735488
868735475 868735493
868740926 868740944
868745027 868745045
868753250 868753267
868835730 868835748
868837692 868837710
868839393 868839411
868851572 868851590
868897377 868897395
868909134 868909153
868919357 868919374
868930123 868930141
868930302 868930320
868931491 868931509
868932340 868932358
868933253 868933271
868934454 868934472
868934561 868934580
868941330 868941348
868942143 868942161
868943779 868943803
868987989 868988007
869006686 869006704
869020200 869020217
869060236 869060254
869068022 869068040
869089098 869089141
869164320 869164338
869177769 869177787
869234000 869234019
869255655 869255673
869282798 869282816
869326278 869326299
869327255 869327273
869342349 869342367
869367615 869367633
869442635 869442653
869464565 869464583
869469475 869469498
869469501 869469519
869469549 869469573
869469586 869469605
869469627 869469649
869469694 869469712
869469715 869469733
869469761 869469781
869469781 869469803
869469808 869469828
869469830 869469850
869469875 869469899
869469897 869469920
869469922 869469943
869469939 869469960
869470003 869470024
869470022 869470041
869470076 869470103
869470104 869470125
869470123 869470146
869470144 869470168
869470163 869470187
869470184 869470205
869470208 869470231
869470228 869470251
869470248 869470275
869470275 869470296
869470294 869470317
869470335 869470362
869470380 869470398
869470416 869470440
869470437 869470457
869470442 869470461
869470462 869470484
869470482 869470505
869470504 869470527
869470551 869470571
869470567 869470593
869470591 869470616
869470612 869470635
869470636 869470657
869470666 869470688
869470685 869470710
869470703 869470728
869470724 869470749
869470746 869470769
869470766 869470791
869470786 869470809
869470828 869470850
869470900 869470925
869470919 869470947
869470944 869470970
869470968 869471000
869470990 869471017
869471016 869471041
869471035 869471061
869471050 869471078
869471071 869471095
869471088 869471116
869471115 869471141
869471136 869471160
869471158 869471180
869471177 869471202
869471187 869471216
869471201 869471241
869471235 869471261
869471254 869471280
869471275 869471300
869471291 869471320
869471313 869471339
869471332 869471357
869471352 869471377
869471373 869471398
869471394 869471427
869471427 869471451
869471447 869471470
869471468 869471495
869471497 869471515
869471510 869471540
869471529 869471552
869471551 869471575
869471571 869471596
869471581 869471598
869471592 869471618
869471611 869471639
869471631 869471658
869471655 869471680
869471678 869471702
869471697 869471725
869471716 869471746
869471737 869471770
869471761 869471792
869471785 869471812
869471805 869471832
869471831 869471858
869471843 869471861
869471856 869471900
869471893 869471920
869471917 869471941
869471926 869471943
869471938 869471963
869471961 869471986
869471981 869472008
869472001 869472028
869472021 869472045
869472043 869472068
869472057 869472084
869472080 869472107
869472099 869472130
869472125 869472150
869472137 869472170
869472164 869472192
869472188 869472214
869472206 869472232
869472225 869472251
869472246 869472268
869472259 869472286
869472281 869472308
869472304 869472332
869472329 869472350
869505232 869505250
869512689 869512707
869524298 869524317
869535588 869535606
869540713 869540732
869547438 869547456
869547523 869547541
869547567 869547585
869547603 869547624
869547667 869547688
869548736 869548757
869548790 869548813
869549345 869549363
869557419 869557438
869557479 869557497
869557482 869557500
869557490 869557508
869567095 869567113
869567201 869567221
869567923 869567943
869567946 869567967
869567984 869568004
869568024 869568044
869568223 869568248
869568326 869568344
869568451 869568473
869568494 869568513
869568514 869568535
869568601 869568621
869568638 869568661
869568727 869568746
869568753 869568772
869568790 869568811
869568813 869568831
869568859 869568878
869568874 869568896
869568918 869568938
869568955 869568975
869568985 869569003
869569027 869569047
869569042 869569063
869569059 869569079
869569104 869569122
869569125 869569144
869569136 869569157
869569147 869569165
869569162 869569184
869569183 869569205
869569212 869569241
869569237 869569261
869569256 869569279
869569283 869569301
869569299 869569318
869569315 869569338
869569340 869569363
869569361 869569386
869569381 869569407
869569404 869569425
869569446 869569466
869569492 869569511
869569506 869569532
869569531 869569554
869569547 869569569
869569554 869569572
869569570 869569592
869569577 869569601
869569586 869569616
869569613 869569634
869569646 869569690
869569681 869569711
869569701 869569729
869569733 869569751
869569763 869569782
869569767 869569790
869569780 869569798
869569788 869569818
869569815 869569840
869569834 869569869
869569861 869569887
869569887 869569908
869569896 869569924
869569909 869569927
869569928 869569949
869569947 869569969
869570030 869570056
869570055 869570075
869570100 869570122
869570136 869570157
869570145 869570174
869570168 869570197
869570191 869570209
869570194 869570218
869570218 869570241
869570240 869570264
869570257 869570287
869570281 869570306
869570297 869570325
869570310 869570328
869570324 869570352
869570350 869570370
869570361 869570387
869570385 869570406
869570407 869570430
869570429 869570450
869570488 869570507
869570493 869570528
869570516 869570534
869570534 869570561
869570574 869570606
869570596 869570627
869570645 869570666
869570664 869570685
869570670 869570688
869570677 869570701
869570698 869570722
869570716 869570754
869570770 869570796
869570819 869570840
869570839 869570857
869570901 869570922
869570927 869570947
869570936 869570957
869570956 869570976
869571037 869571057
869571102 869571126
869572730 869572749
869573999 869574021
869574208 869574229
869574234 869574254
869574374 869574396
869574436 869574454
869574507 869574532
869574527 869574550
869574590 869574609
869574612 869574634
869574667 869574688
869574728 869574752
869574749 869574772
869574793 869574815
869574813 869574835
869574831 869574849
869574846 869574872
869574894 869574913
869574954 869574972
869575043 869575065
869575064 869575083
869575132 869575160
869575194 869575213
869575211 869575229
869575220 869575240
869575238 869575261
869575284 869575305
869575341 869575367
869575362 869575390
869575390 869575412
869575415 869575436
869575436 869575455
869575457 869575474
869575563 869575583
869575645 869575665
869576894 869576912
869576977 869576995
869577282 869577303
869577983 869578001
869577999 869578020
869578170 869578189
869578212 869578231
869578358 869578380
869578477 869578495
869578599 869578622
869578951 869578970
869578966 869578985
869579048 869579068
869579159 869579177
869579293 869579311
869579308 869579329
869579402 869579422
869579441 869579462
869579464 869579483
869579501 869579522
869579520 869579538
869579556 869579574
869579595 869579616
869579702 869579720
869579761 869579780
869579786 869579807
869579828 869579848
869579870 869579889
869579886 869579908
869579977 869579995
869579998 869580019
869580043 869580060
869580653 869580673
869580891 869580913
869580929 869580953
869580956 869580974
869580996 869581014
869581017 869581039
869581035 869581053
869581054 869581074
869581059 869581077
869581117 869581142
869581146 869581165
869581185 869581202
869581222 869581243
869581281 869581302
869581293 869581318
869581318 869581340
869581338 869581359
869581354 869581372
869581375 869581394
869581389 869581410
869581407 869581434
869581432 869581455
869581450 869581475
869581469 869581502
869581495 869581522
869581521 869581547
869581542 869581563
869581551 869581581
869581566 869581597
869581591 869581620
869581613 869581636
869581626 869581653
869581647 869581669
869581661 869581686
869581681 869581703
869581702 869581725
869581716 869581745
869581737 869581763
869581758 869581787
869581776 869581804
869581799 869581826
869581818 869581845
869581832 869581851
869581836 869581869
869581862 869581922
869581910 869581939
869581924 869581956
869581952 869581977
869581973 869582000
869581994 869582049
869582041 869582071
869582063 869582092
869582082 869582112
869582100 869582129
869582116 869582146
869582133 869582161
869582155 869582221
869582214 869582242
869582233 869582265
869582256 869582276
869582261 869582285
869583573 869583593
869583580 869583605
869583591 869583610
869583596 869583614
869600605 869600623
869604865 869604883
869612609 869612629
869612904 869612923
869612945 869612965
869613266 869613286
869613291 869613312
869613420 869613440
869613467 869613487
869613486 869613505
869613786 869613807
869613843 869613861
869613887 869613905
869616264 869616282
869617366 869617384
869648698 869648716
869659570 869659589
869659689 869659713
869659792 869659813
869659813 869659832
869659981 869660001
869660001 869660023
869660027 869660047
869660091 869660111
869660155 869660176
869660173 869660196
869660196 869660217
869660217 869660234
869660219 869660238
869660258 869660278
869660295 869660314
869660313 869660335
869660340 869660361
869660361 869660382
869660400 869660422
869660439 869660458
869660453 869660476
869660480 869660499
869660495 869660516
869660517 869660535
869660537 869660556
869660559 869660577
869660573 869660598
869660598 869660616
869660635 869660656
869660659 869660680
869660675 869660699
869660722 869660743
869660741 869660764
869660766 869660788
869660805 869660829
869660824 869660847
869660851 869660870
869660890 869660908
869660893 869660920
869660922 869660943
869660942 869660963
869660963 869660983
869660984 869661006
869661024 869661043
869661043 869661065
869661084 869661103
869661100 869661124
869661124 869661146
869661141 869661164
869661158 869661183
869661184 869661202
869663230 869663248
869665394 869665413
869665732 869665752
869665806 869665828
869666096 869666119
869666122 869666141
869666161 869666182
869666177 869666196
869666182 869666210
869666196 869666214
869666199 869666225
869666225 869666245
869666238 869666264
869666264 869666288
869666278 869666304
869666306 869666326
869666327 869666348
869666365 869666387
869666386 869666408
869666404 869666427
869666425 869666449
869666539 869666559
869666563 869666582
869666581 869666603
869666597 869666617
869666616 869666639
869666638 869666656
869666651 869666678
869666676 869666696
869666689 869666710
869666712 869666741
869666739 869666762
869666762 869666785
869666781 869666803
869666806 869666825
869666811 869666839
869666842 869666861
869666846 869666863
869666858 869666880
869666865 869666887
869666893 869666915
869666916 869666939
869666933 869666962
869666947 869666976
869666971 869666993
869666993 869667015
869667012 869667033
869667029 869667057
869667059 869667079
869667078 869667103
869667099 869667124
869667198 869667224
869667221 869667243
869667239 869667261
869667254 869667272
869667303 869667321
869667351 869667372
869667369 869667394
869667395 869667420
869667440 869667459
869667458 869667482
869667477 869667502
869667500 869667522
869667516 869667540
869667536 869667563
869667558 869667582
869667578 869667605
869667605 869667627
869667621 869667648
869667640 869667657
869667642 869667669
869667659 869667685
869667682 869667705
869667707 869667727
869667716 869667744
869667743 869667769
869667764 869667789
869667783 869667808
869667800 869667827
869667822 869667849
869667847 869667868
869667865 869667886
869668077 869668098
869668108 869668126
869669421 869669439
869669540 869669560
869669580 869669599
869669621 869669641
869669661 869669686
869669680 869669704
869720577 869720595
869773254 869773272
869776709 869776726
869868641 869868658
869871451 869871469
869922593 869922610
869929149 869929167
869954379 869954397
869986914 869986932
869992032 869992050
870024112 870024130
870034075 870034093
870038684 870038702
870058122 870058140
870060558 870060575
870067988 870068006
870071463 870071481
870103411 870103430
870122291 870122309
870137359 870137378
870137497 870137515
870138291 870138309
870138303 870138321
870211144 870211161
870214722 870214740
870261898 870261916
870273266 870273284
870290000 870290018
870292489 870292506
870342117 870342134
870453094 870453112
870467411 870467429
870526855 870526872
870535219 870535237
870544907 870544924
870545871 870545889
870545881 870545899
870546022 870546040
870546351 870546368
870548665 870548683
870560012 870560030
870568811 870568828
870578144 870578162
870626952 870626969
870627148 870627168
870629014 870629031
870645640 870645658
870716146 870716164
870788354 870788372
870813955 870813973
870815192 870815210
870824947 870824965
870891406 870891424
870905942 870905960
870939908 870939926
870956302 870956320
870980998 870981016
870991915 870991933
871061227 871061246
871075838 871075856
871105566 871105584
871140978 871140997
871150938 871150956
871176880 871176898
871176962 871176980
871177788 871177806
871182924 871182942
871182929 871182947
871184380 871184398
871187913 871187931
871236633 871236650
871243429 871243447
871257142 871257160
871272636 871272654
871277325 871277343
871289568 871289586
871293921 871293939
871300090 871300108
871312988 871313006
871329506 871329525
871441442 871441460
871522461 871522479
871590273 871590291
871597091 871597109
871619295 871619313
871653651 871653669
871672015 871672033
871679612 871679629
871685675 871685692
871686901 871686919
871695392 871695410
871695396 871695415
871718971 871718989
871745620 871745638
871755324 871755342
871803503 871803522
871857001 871857019
871920981 871920999
871933675 871933693
872015154 872015171
872016311 872016328
872016575 872016593
872016583 872016601
872016590 872016608
872016613 872016632
872049098 872049116
872092902 872092920
872103992 872104010
872129959 872129977
872142129 872142147
872167778 872167797
872183079 872183096
872201831 872201849
872299573 872299591
872304715 872304732
872315354 872315372
872331579 872331597
872345471 872345489
872367561 872367579
872373266 872373284
872419754 872419772
872442800 872442818
872461196 872461214
872635359 872635377
872643798 872643816
872704670 872704688
872712950 872712968
872731127 872731145
872816908 872816926
872871894 872871911
872885763 872885781
872886723 872886740
872894726 872894744
872918013 872918030
872953188 872953215
872953223 872953241
872977732 872977750
872977735 872977752
872977758 872977777
872979796 872979814
872997220 872997238
873039669 873039686
873057754 873057772
873060195 873060213
873104410 873104428
873137070 873137088
873141107 873141125
873148153 873148171
873222855 873222873
873245572 873245589
873257943 873257961
873271067 873271085
873274723 873274741
873318429 873318447
873413478 873413495
873424746 873424764
873436438 873436457
873489202 873489220
873489657 873489675
873561294 873561311
873583011 873583028
873618099 873618117
873631783 873631801
873645661 873645679
873648737 873648755
873651421 873651439
873657117 873657135
873665970 873665988
873668105 873668123
873669967 873669986
873670125 873670143
873677293 873677311
873689400 873689418
873690884 873690901
873713262 873713279
873733474 873733492
873736111 873736129
873745612 873745630
873749332 873749350
873769281 873769299
873786061 873786079
873806617 873806635
873814253 873814271
873834762 873834780
873844507 873844525
873903830 873903848
873915988 873916006
873964105 873964123
873995557 873995575
874015304 874015322
874023763 874023781
874087553 874087571
874162764 874162785
874162770 874162802
874163979 874163996
874163987 874164005
874189116 874189134
874265677 874265695
874272866 874272884
874275428 874275445
874313431 874313449
874347695 874347712
874352749 874352767
874354136 874354154
874360662 874360680
874436873 874436891
874439969 874439987
874478789 874478807
874501480 874501498
874514086 874514104
874524805 874524823
874526303 874526321
874530199 874530217
874536283 874536301
874567560 874567577
874622908 874622926
874650114 874650132
874682468 874682486
874687188 874687206
874695973 874695991
874706766 874706785
874768927 874768945
874782177 874782194
874802177 874802195
874817611 874817629
874844785 874844803
874846212 874846230
874867135 874867152
874867474 874867492
874867619 874867636
874878332 874878350
874901673 874901692
874925342 874925359
874952426 874952444
