1 931052708 931055109 2401
2 931076896 931078422 1526
3 931078516 931079417 901
4 931080617 931083969 3352
5 931084877 931085909 1032
6 931087097 931090398 3301
7 931091956 931094716 2760
8 931125824 931126315 491
9 931127116 931131473 4357
10 931131904 931132967 1063
11 931134040 931134057 17
12 931134555 931139711 5156
13 931150944 931153447 2503
14 931155452 931155578 126
15 931157974 931158580 606
16 931160296 931168114 7818
17 931172416 931173654 1238
18 931174456 931177008 2552
19 931178537 931191093 12556
20 931212561 931215048 2487
21 931218886 931220215 1329
22 931242056 931242063 7
23 931242123 931245477 3354
24 931250547 931252551 2004
25 931257335 931260610 3275
26 931261877 931268002 6125
27 931270026 931271679 1653
28 931275027 931275754 727
29 931283293 931285117 1824
30 931290692 931291128 436
31 931292789 931292910 121
32 931317186 931319458 2272
33 931321135 931330524 9389
34 931331181 931338588 7407
35 931340994 931351287 10293
36 931351306 931354215 2909
37 931357989 931358526 537
38 931365256 931377046 11790
39 931386256 931404478 18222
40 931413997 931415072 1075
41 931418878 931424544 5666
42 931426097 931431487 5390
43 931431492 931432940 1448
44 931434808 931435534 726
45 931436849 931436936 87
46 931439658 931439964 306
47 931443031 931443438 407
48 931446557 931457928 11371
49 931461152 931467247 6095
50 931468817 931470168 1351
51 931471301 931472783 1482
52 931479596 931480268 672
53 931483130 931483408 278
54 931484557 931488865 4308
55 931491250 931493989 2739
56 931499526 931500161 635
57 931532577 931540489 7912
58 931572684 931575486 2802
59 931576945 931577571 626
60 931582611 931586908 4297
61 931587429 931592256 4827
62 931600810 931615577 14767
63 931617383 931619011 1628
64 931657083 931657197 114
65 931658625 931659071 446
66 931660306 931663309 3003
67 931664128 931666344 2216
68 931667306 931673022 5716
69 931673608 931674755 1147
70 931685699 931686164 465
71 931699514 931699605 91
72 931704410 931706625 2215
73 931712153 931712998 845
74 931722628 931725593 2965
75 931729355 931732192 2837
76 931735500 931748232 12732
77 931755809 931757397 1588
78 931757428 931761602 4174
79 931765138 931775068 9930
80 931775338 931776362 1024
81 931776790 931777324 534
82 931778453 931785726 7273
83 931788493 931789948 1455
84 931793105 931795282 2177
85 931806644 931807091 447
86 931811212 931811707 495
87 931814270 931816107 1837
88 931817031 931819923 2892
89 931819959 931822815 2856
90 931826475 931832040 5565
91 931836793 931842637 5844
92 931842932 931843486 554
93 931845510 931846612 1102
94 931851319 931856064 4745
95 931857948 931859847 1899
96 931862953 931873915 10962
97 931876107 931878044 1937
98 931881147 931881152 5
99 931882589 931882717 128
100 931883485 931885139 1654
101 931886238 931888049 1811
102 931906891 931913697 6806
103 931914606 931941442 26836
104 931949457 931953010 3553
105 931954992 931956099 1107
106 931972859 931979336 6477
107 931983901 931985765 1864
108 931988658 931991834 3176
109 931998060 931998951 891
110 932001611 932003769 2158
111 932010680 932011112 432
112 932014809 932015472 663
113 932017822 932025262 7440
114 932033001 932038678 5677
115 932041437 932047266 5829
116 932049047 932055058 6011
117 932058572 932060587 2015
118 932062705 932074138 11433
119 932081683 932090746 9063
120 932094330 932106401 12071
121 932107168 932108653 1485
122 932108680 932109218 538
123 932109959 932112658 2699
124 932115268 932122405 7137
125 932123648 932130147 6499
126 932132100 932133122 1022
127 932144795 932146282 1487
128 932148013 932149655 1642
129 932160666 932161256 590
130 932163273 932164052 779
131 932172102 932178160 6058
132 932187087 932191441 4354
133 932196440 932202885 6445
134 932205873 932214935 9062
135 932269258 932269480 222
136 932270492 932284674 14182
137 932288665 932289857 1192
138 932293443 932308128 14685
139 932311471 932312149 678
140 932316434 932317068 634
141 932318261 932318278 17
142 932319084 932319274 190
143 932320369 932320656 287
144 932322188 932322247 59
145 932323723 932324420 697
146 932345677 932345972 295
147 932348140 932356999 8859
148 932359128 932361834 2706
149 932362651 932365837 3186
150 932370618 932373156 2538
151 932379009 932382683 3674
152 932388600 932389228 628
153 932392463 932396196 3733
154 932399191 932399549 358
155 932408671 932411335 2664
156 932417009 932417980 971
157 932418081 932418523 442
158 932419372 932419981 609
159 932420853 932421531 678
160 932422329 932422662 333
161 932425475 932428702 3227
162 932434417 932435310 893
163 932435651 932435818 167
164 932441350 932463697 22347
165 932465416 932466961 1545
166 932470756 932486982 16226
167 932492038 932494822 2784
168 932495918 932496512 594
169 932498631 932504674 6043
170 932505817 932521140 15323
171 932521942 932522273 331
172 932524282 932525229 947
173 932526160 932529588 3428
174 932530779 932537341 6562
175 932540797 932547513 6716
176 932550889 932559595 8706
177 932562483 932566399 3916
178 932587098 932592903 5805
179 932594634 932601620 6986
180 932603799 932611888 8089
181 932616154 932619001 2847
182 932619581 932623846 4265
183 932627169 932627258 89
184 932628292 932635506 7214
185 932637850 932641762 3912
186 932648123 932658501 10378
187 932662932 932664855 1923
188 932666899 932673372 6473
189 932675678 932680046 4368
190 932682523 932709376 26853
191 932711212 932713715 2503
192 932717212 932723943 6731
193 932724757 932726404 1647
194 932729381 932730308 927
195 932736772 932738407 1635
196 932758842 932759066 224
197 932760935 932761469 534
198 932763575 932765863 2288
199 932771327 932771745 418
200 932791915 932799100 7185
201 932803648 932807971 4323
202 932810102 932828440 18338
203 932935560 932936370 810
204 932939605 932948405 8800
205 932958826 932959434 608
206 932960498 932964635 4137
207 932965829 932968833 3004
208 932969810 932976045 6235
209 932976597 932978319 1722
210 932979353 932989948 10595
211 932991285 932996087 4802
212 932997233 932997815 582
213 933010476 933012257 1781
214 933012293 933012412 119
215 933014598 933014931 333
216 933015825 933018592 2767
217 933048184 933050737 2553
218 933061327 933061888 561
219 933063485 933067897 4412
220 933076358 933077741 1383
221 933078827 933085744 6917
222 933089709 933090528 819
223 933091353 933093218 1865
224 933095086 933096088 1002
225 933102655 933102712 57
226 933104983 933105996 1013
227 933106098 933109832 3734
228 933142374 933147051 4677
229 933149548 933150132 584
230 933154332 933155191 859
231 933166840 933167952 1112
232 933180305 933228575 48270
233 933234841 933236147 1306
234 933237803 933250724 12921
235 933252472 933264843 12371
236 933268926 933268991 65
237 933269425 933276385 6960
238 933278719 933289802 11083
239 933292866 933308454 15588
240 933316739 933346905 30166
241 933352584 933352981 397
242 933354387 933357405 3018
243 933369460 933373018 3558
244 933373946 933376274 2328
245 933379458 933380182 724
246 933390050 933392172 2122
247 933401132 933405773 4641
248 933411506 933416378 4872
249 933419191 933419892 701
250 933425997 933428547 2550
251 933431363 933433253 1890
252 933467398 933467473 75
253 933481667 933483047 1380
254 933498781 933499059 278
255 933504175 933507523 3348
256 933512959 933530708 17749
257 933533260 933533731 471
258 933535061 933538290 3229
259 933538317 933538318 1
260 933539631 933540368 737
261 933540661 933543271 2610
262 933545624 933547418 1794
263 933554019 933559012 4993
264 933560786 933578547 17761
265 933582359 933614159 31800
266 933623054 933623073 19
267 933626104 933631479 5375
268 933658954 933661172 2218
269 933679663 933681993 2330
270 933685797 933695265 9468
271 933697149 933697995 846
272 933701582 933704909 3327
273 933705402 933707068 1666
274 933710382 933713249 2867
275 933720060 933724188 4128
276 933726635 933732989 6354
277 933738363 933753294 14931
278 933755040 933758333 3293
279 933763551 933776703 13152
280 933777613 933796659 19046
281 933798794 933810507 11713
282 933816782 933820204 3422
283 933822603 933827232 4629
284 933829024 933844069 15045
285 933844620 933851241 6621
286 933860664 933868181 7517
287 933871738 933876868 5130
288 933880194 933882512 2318
289 933883904 933895703 11799
290 933897396 933907032 9636
291 933909120 933913217 4097
292 933919242 933927220 7978
293 933928531 933934329 5798
294 933942989 933948482 5493
295 933951212 933960023 8811
296 933965109 933970404 5295
297 933984631 933988606 3975
298 933990657 933996695 6038
299 933999363 934001566 2203
300 934004537 934011340 6803
301 934012338 934012829 491
302 934015221 934030026 14805
303 934033006 934034451 1445
304 934035818 934039962 4144
305 934065792 934066467 675
306 934079170 934081021 1851
307 934083340 934090931 7591
308 934093285 934099524 6239
309 934103335 934122971 19636
310 934126605 934153067 26462
311 934162221 934179538 17317
312 934180030 934191995 11965
313 934194572 934199684 5112
314 934199726 934207132 7406
315 934212549 934224256 11707
316 934230874 934243990 13116
317 934248432 934250640 2208
318 934257654 934261893 4239
319 934265631 934267289 1658
320 934268094 934268336 242
321 934278581 934291760 13179
322 934294840 934299178 4338
323 934302076 934307717 5641
324 934309513 934312061 2548
325 934315699 934319983 4284
326 934321640 934332597 10957
327 934333611 934337090 3479
328 934341532 934348551 7019
329 934349542 934350097 555
330 934351875 934374417 22542
331 934380729 934409208 28479
332 934413129 934444664 31535
333 934457174 934480024 22850
334 934488006 934503550 15544
335 934505241 934516079 10838
336 934518086 934531269 13183
337 934534908 934539865 4957
338 934543178 934555499 12321
339 934558569 934561537 2968
340 934566136 934566924 788
341 934570265 934575046 4781
342 934579364 934588346 8982
343 934593938 934594320 382
344 934603526 934607122 3596
345 934608260 934617379 9119
346 934618944 934623791 4847
347 934626312 934638534 12222
348 934642338 934643441 1103
349 934678632 934681632 3000
350 934683337 934687193 3856
351 934688697 934698468 9771
352 934700165 934724587 24422
353 934729106 934729918 812
354 934734882 934740272 5390
355 934749183 934759654 10471
356 934761553 934764139 2586
357 934764199 934766866 2667
358 934769511 934781817 12306
359 934782782 934785893 3111
360 934787913 934792051 4138
361 934799416 934805816 6400
362 934810005 934814838 4833
363 934816742 934822009 5267
364 934825021 934835254 10233
365 934837092 934861073 23981
366 934861380 934869535 8155
367 934883764 934887919 4155
368 934891950 934892607 657
369 934895850 934904753 8903
370 934945006 934945603 597
371 934948257 934955323 7066
372 934957381 934977770 20389
373 935129407 935139791 10384
374 935141699 935156449 14750
375 935158341 935167865 9524
376 935167907 935168409 502
377 935170647 935177366 6719
378 935179081 935187045 7964
379 935188296 935188891 595
380 935193460 935194621 1161
381 935195991 935210231 14240
382 935212593 935214377 1784
383 935215876 935221320 5444
384 935223510 935227064 3554
385 935229277 935238455 9178
386 935239579 935240653 1074
387 935241927 935244473 2546
388 935246268 935248398 2130
389 935264940 935265091 151
390 935266781 935267440 659
391 935268670 935269731 1061
392 935272939 935289446 16507
393 935294958 935296441 1483
394 935297264 935300788 3524
395 935302229 935307516 5287
396 935307581 935325157 17576
397 935327618 935329657 2039
398 935331196 935342495 11299
399 935344652 935347109 2457
400 935349860 935355107 5247
401 935358716 935363437 4721
402 935364721 935379524 14803
403 935380867 935394597 13730
404 935394642 935413833 19191
405 935416561 935419811 3250
406 935422071 935424298 2227
407 935426469 935427438 969
408 935432174 935440025 7851
409 935441697 935443997 2300
410 935453782 935456759 2977
411 935456819 935460333 3514
412 935464161 935475997 11836
413 935478488 935491275 12787
414 935494493 935494792 299
415 935495170 935497417 2247
416 935500148 935500953 805
417 935502150 935517451 15301
418 935557148 935558828 1680
419 935560001 935561731 1730
420 935564063 935570689 6626
421 935572280 935573341 1061
422 935574302 935575904 1602
423 935578012 935586478 8466
424 935589327 935596804 7477
425 935598275 935601046 2771
426 935604250 935608709 4459
427 935609962 935621984 12022
428 935622112 935637040 14928
429 935639180 935652897 13717
430 935657326 935679831 22505
431 935689166 935690117 951
432 935690224 935692920 2696
433 935694609 935700114 5505
434 935702502 935714506 12004
435 935718349 935722982 4633
436 935726672 935732848 6176
437 935734795 935746184 11389
438 935751213 935758791 7578
439 937473630 937476189 2559
440 937477622 937500399 22777
441 937542194 937556274 14080
442 937575484 937586931 11447
443 937801896 937804123 2227
444 937804181 937812174 7993
445 937833858 937847529 13671
446 937878164 937893008 14844
447 937893729 937893785 56
448 937896849 937913115 16266
449 937921459 937927071 5612
450 937929145 937940728 11583
451 937942520 937943343 823
452 938000353 938003143 2790
453 938004408 938008920 4512
454 938011265 938011284 19
455 938012306 938016943 4637
456 938021663 938024130 2467
457 938024258 938026887 2629
458 938027196 938029028 1832
459 938029312 938030759 1447
460 938035980 938042773 6793
461 938043653 938046582 2929
462 938050369 938051871 1502
463 938061400 938064731 3331
464 938068286 938096161 27875
465 938115802 938124803 9001
466 938168989 938185709 16720
467 938225855 938226151 296
468 938231454 938237833 6379
469 938238057 938252810 14753
470 938254947 938259067 4120
471 938267235 938273143 5908
472 938320179 938325461 5282
473 938335283 938335294 11
474 938337457 938337471 14
475 938353157 938363873 10716
476 938365976 938373297 7321
477 938416945 938421758 4813
478 938425329 938426679 1350
479 938430855 938432685 1830
480 938432710 938439818 7108
481 938443267 938448361 5094
482 938451380 938452236 856
483 938501272 938503876 2604
484 938533176 938534439 1263
485 938537469 938541723 4254
486 938597964 938610749 12785
487 938620069 938623936 3867
488 938629763 938632375 2612
489 938634128 938634317 189
490 938636512 938643116 6604
491 938650871 938680220 29349
492 938681540 938681661 121
493 938684218 938685003 785
494 938686353 938687318 965
495 938698765 938699323 558
496 938703016 938703510 494
497 938752801 938772062 19261
498 938774560 938784107 9547
499 938786041 938789645 3604
500 938793393 938803002 9609
501 938804704 938805597 893
502 938807495 938810317 2822
503 938814174 938814468 294
504 938820420 938823787 3367
505 938829945 938830645 700
506 938832203 938834247 2044
507 938836796 938837799 1003
508 938838951 938839962 1011
509 938853837 938854761 924
510 938857212 938867552 10340
511 938870726 938876483 5757
512 939035694 939041234 5540
513 939042180 939043599 1419
514 939046455 939046839 384
515 939048836 939066327 17491
516 939067906 939069730 1824
517 939072309 939087498 15189
518 939098292 939116936 18644
519 939119643 939120843 1200
520 939122760 939131931 9171
521 939134364 939147721 13357
522 939160593 939168105 7512
523 939171963 939199065 27102
524 939204965 939214504 9539
525 939216429 939238657 22228
526 939244085 939245669 1584
527 939247480 939262958 15478
528 939264557 939281629 17072
529 939283490 939287216 3726
530 939287264 939312269 25005
531 939323481 939334720 11239
532 939343507 939353763 10256
533 939358229 939376252 18023
534 939378243 939384753 6510
535 939387672 939389382 1710
536 939393520 939395379 1859
537 939397000 939399352 2352
538 939406812 939407107 295
539 939412536 939415104 2568
540 939421539 939424883 3344
541 939426231 939430239 4008
542 939431382 939447846 16464
543 939460728 939464778 4050
544 939467618 939469447 1829
545 939472264 939475202 2938
546 939477180 939481452 4272
547 939518254 939521179 2925
548 939533692 939561040 27348
549 939618730 939628387 9657
550 939634851 939647964 13113
551 939653334 939655748 2414
552 939657435 939660272 2837
553 939660924 939662344 1420
554 939675615 939684491 8876
555 939692632 939709632 17000
556 939713630 939732416 18786
557 939737372 939740466 3094
558 939742951 939755405 12454
559 939765730 939777194 11464
560 939786625 939792537 5912
561 939795135 939829011 33876
562 939831746 939852530 20784
563 939855971 939870505 14534
564 939885315 939892166 6851
565 939895868 939939166 43298
566 939946485 939949631 3146
567 939951632 939986659 35027
568 939991663 939993951 2288
569 939995454 940012146 16692
570 940015978 940025468 9490
571 940027889 940028522 633
572 940054090 940082301 28211
573 940132069 940132891 822
574 940139471 940160854 21383
575 940170881 940185198 14317
576 940187058 940187254 196
577 940190961 940194328 3367
578 940211183 940212919 1736
579 940214745 940255278 40533
580 940263961 940273631 9670
581 940276644 940277211 567
582 940283008 940283721 713
583 940284792 940287539 2747
584 940294715 940302482 7767
585 940304279 940307400 3121
586 940308986 940326160 17174
587 940327794 940343926 16132
588 940348074 940349067 993
589 940350937 940351460 523
590 940352388 940353124 736
591 940354851 940360540 5689
592 940362226 940362834 608
593 940365359 940368199 2840
594 940372320 940375972 3652
595 940529747 940530753 1006
596 940534854 940557107 22253
597 940559639 940576411 16772
598 940589583 940597995 8412
599 940603911 940606100 2189
600 940624312 940629500 5188
601 940641205 940644078 2873
602 940646524 940654028 7504
603 940655819 940666023 10204
604 940672486 940680824 8338
605 940710959 940717454 6495
606 940719353 940733943 14590
607 940734960 940774407 39447
608 940782543 940791423 8880
609 940843743 940861248 17505
610 940862153 940862475 322
611 940862702 940867765 5063
612 940869992 940870083 91
613 940874003 940874296 293
614 940877991 940897876 19885
615 940900175 940902305 2130
616 940903190 940922182 18992
617 940924012 940925270 1258
618 940929599 940929829 230
619 940937136 940937200 64
620 940938969 940939192 223
621 940944281 940948441 4160
622 940949373 940960741 11368
623 940962338 940963227 889
624 940963310 940966227 2917
625 940966326 940968404 2078
626 940971201 940976686 5485
627 940984501 940985244 743
628 940985352 940993014 7662
629 940994647 940995929 1282
630 941000539 941001030 491
631 941008186 941011588 3402
632 941012662 941013130 468
633 941013965 941014054 89
634 941014733 941015855 1122
635 941021244 941021604 360
636 941022458 941030727 8269
637 941032839 941036173 3334
638 941038501 941048078 9577
639 941064564 941067582 3018
640 941071831 941122937 51106
641 941127946 941130268 2322
642 941132104 941145392 13288
643 941150247 941154564 4317
644 941157969 941158306 337
645 941161815 941194824 33009
646 941197405 941227887 30482
647 941231725 941233425 1700
648 941238428 941239561 1133
649 941244407 941251321 6914
650 941252360 941275807 23447
651 941280327 941288780 8453
652 941290197 941294829 4632
653 941296421 941299514 3093
654 941336632 941344211 7579
655 941346143 941373617 27474
656 941376222 941383524 7302
657 941386056 941388646 2590
658 941391994 941395958 3964
659 941403878 941411418 7540
660 941412764 941422259 9495
661 941425135 941439078 13943
662 941446323 941453019 6696
663 941455988 941461369 5381
664 941472234 941473279 1045
665 941474811 941476173 1362
666 941477258 941477464 206
667 941479159 941479984 825
668 941485265 941490017 4752
669 941492955 941493596 641
670 941494705 941497838 3133
671 941500300 941502890 2590
672 941505841 941512102 6261
673 941515078 941524134 9056
674 941684461 941684776 315
675 941686481 941686637 156
676 941690956 941698690 7734
677 941703004 941735029 32025
678 941738578 941749308 10730
679 941754198 941757137 2939
680 941764675 941799404 34729
681 941805858 941815398 9540
682 941817296 941819445 2149
683 941837459 941839248 1789
684 941842909 941854067 11158
685 941861494 941873590 12096
686 941878077 941878080 3
687 941881500 941892102 10602
688 941897154 941899044 1890
689 941900441 941904266 3825
690 941938842 941959777 20935
691 942139555 942155423 15868
692 942156313 942158952 2639
693 942162482 942168933 6451
694 942174770 942175044 274
695 942197140 942201217 4077
696 942204139 942208714 4575
697 942210317 942214886 4569
698 942217947 942218461 514
699 942218613 942254386 35773
700 942265831 942268626 2795
701 942272234 942273509 1275
702 942274856 942276135 1279
703 942278336 942284034 5698
704 942285140 942299088 13948
705 942303214 942316874 13660
706 942318324 942361805 43481
707 942363882 942377231 13349
708 942385942 942418134 32192
709 942440116 942442417 2301
710 942450041 942450449 408
711 942451497 942456774 5277
712 942458109 942466590 8481
713 942473476 942485944 12468
714 942488996 942499374 10378
715 942571561 942576003 4442
716 942580945 942582722 1777
717 942584427 942585980 1553
718 942587928 942592551 4623
719 942593397 942595787 2390
720 942598728 942601923 3195
721 942658377 942675830 17453
722 942676886 942677287 401
723 942680676 942681245 569
724 942733339 942743551 10212
725 942746012 942756649 10637
726 942772479 942772936 457
727 942775198 942777119 1921
728 942794119 942794153 34
729 942798616 942798832 216
730 942801048 942803517 2469
731 942810518 942812249 1731
732 942812955 942826372 13417
733 942830360 942853188 22828
734 942857042 942859390 2348
735 942861879 942862969 1090
736 942865987 942867632 1645
737 942868794 942869479 685
738 942871287 942873023 1736
739 942880224 942887440 7216
740 942892315 942912011 19696
741 942930215 942935617 5402
742 942953027 942953222 195
743 942957751 942960299 2548
744 942963045 942971170 8125
745 942976578 942977576 998
746 942979026 942979550 524
747 942981728 942995780 14052
748 942997671 943001823 4152
749 943004814 943007689 2875
750 943007871 943015978 8107
751 943017945 943021950 4005
752 943033219 943034589 1370
753 943038131 943039041 910
754 943040960 943047034 6074
755 943049450 943058082 8632
756 943061975 943073081 11106
757 943076802 943102804 26002
758 943107973 943114647 6674
759 943140265 943149101 8836
760 943151000 943157353 6353
761 943161134 943168290 7156
762 943172645 943194880 22235
763 943212926 943217547 4621
764 943218539 943226391 7852
765 943227807 943232457 4650
766 943234473 943258951 24478
767 943263493 943298288 34795
768 943299778 943308117 8339
769 943309832 943338749 28917
770 943342276 943345550 3274
771 943349649 943370183 20534
772 943370417 943376215 5798
773 943380223 943384731 4508
774 943386591 943388240 1649
775 943389667 943392590 2923
776 943394089 943395693 1604
777 943398513 943398801 288
778 943400405 943401024 619
779 943404911 943410190 5279
780 943412919 943430652 17733
781 943435317 943436100 783
782 943438345 943440795 2450
783 943444537 943453785 9248
784 943459626 943470339 10713
785 943472870 943476815 3945
786 943476977 943485617 8640
787 943487118 943500954 13836
788 943503342 943537372 34030
789 943541981 943552725 10744
790 943558445 943565725 7280
791 943569756 943590797 21041
792 943592837 943595828 2991
793 943599439 943629651 30212
794 943630725 943631108 383
795 943634559 943634738 179
796 943636332 943638321 1989
797 943641339 943645776 4437
798 943648729 943662693 13964
799 943663389 943666475 3086
800 943669727 943674310 4583
801 943675881 943701628 25747
802 943703870 943709365 5495
803 943715988 943720019 4031
804 943740795 943750183 9388
805 943751516 943760893 9377
806 943764852 943769796 4944
807 943770907 943800889 29982
808 943803740 943804292 552
809 943808425 943824193 15768
810 943828486 943836178 7692
811 943843287 943851292 8005
812 943852280 943858900 6620
813 943865513 943887083 21570
814 943888887 943889801 914
815 943890977 943891049 72
816 943893349 943906203 12854
817 943907703 943914939 7236
818 943916987 943919462 2475
819 943920157 943934267 14110
820 943935866 943951195 15329
821 943952214 943955113 2899
822 943957016 943965072 8056
823 943968273 943971172 2899
824 943973209 943977762 4553
825 943980402 943983185 2783
826 943983878 944004170 20292
827 944006081 944015009 8928
828 944017658 944033544 15886
829 944035346 944044696 9350
830 944046357 944056644 10287
831 944059041 944081176 22135
832 944083917 944106024 22107
833 944108679 944126211 17532
834 944178927 944178954 27
835 944183787 944190315 6528
836 944191727 944203039 11312
837 944203261 944232074 28813
838 944235341 944235828 487
839 944236765 944237894 1129
840 944239307 944245283 5976
841 944247204 944250769 3565
842 944252326 944258058 5732
843 944259448 944261878 2430
844 944262095 944267633 5538
845 944270686 944280095 9409
846 944284485 944312402 27917
847 944315841 944319932 4091
848 944320760 944321454 694
849 944376755 944378010 1255
850 944382082 944390297 8215
851 944390585 944404929 14344
852 944406525 944407248 723
853 944423312 944423662 350
854 944429514 944430341 827
855 944435229 944437002 1773
856 944438232 944442533 4301
857 944443677 944447972 4295
858 944454060 944456103 2043
859 944456837 944465177 8340
860 944468039 944474801 6762
861 944478280 944493978 15698
862 944496027 944497411 1384
863 944500631 944502221 1590
864 944505477 944508939 3462
865 944536113 944538750 2637
866 944539836 944545083 5247
867 944551614 944570788 19174
868 944573186 944580160 6974
869 944581447 944582437 990
870 944583263 944585743 2480
871 944591884 944592520 636
872 944592597 944593317 720
873 944597320 944599188 1868
874 944601277 944602371 1094
875 944606252 944609288 3036
876 944611461 944616390 4929
877 944620780 944646883 26103
878 944657576 944672222 14646
879 944682207 944685096 2889
880 944688207 944694593 6386
881 944696281 944713713 17432
882 944722581 944725094 2513
883 944731294 944756779 25485
884 944762241 944769756 7515
885 944771613 944772096 483
886 944772652 944773497 845
887 944775605 944803991 28386
888 944806455 944808121 1666
889 944814359 944820628 6269
890 944823318 944837768 14450
891 944839778 944839792 14
892 944844775 944844975 200
893 944850230 944852445 2215
894 944853854 944854647 793
895 944854915 944855671 756
896 944859644 944863660 4016
897 944867044 944867074 30
898 944868337 944868686 349
899 944870172 944883376 13204
900 944886043 944927069 41026
901 944952966 944956572 3606
902 944958148 945010532 52384
903 945017826 945020417 2591
904 945030252 945032489 2237
905 945034449 945035312 863
906 945036592 945036843 251
907 945038173 945039847 1674
908 945040985 945041296 311
909 945044497 945049798 5301
910 945054417 945095495 41078
911 945102675 945104189 1514
912 945105537 945109855 4318
913 945121715 945124188 2473
914 945128293 945128463 170
915 945129162 945135260 6098
916 945136125 945142719 6594
917 945146316 945182419 36103
918 945184506 945185798 1292
919 945190352 945193631 3279
920 945243366 945249361 5995
921 945252716 945263735 11019
922 945266987 945275269 8282
923 945276651 945285010 8359
924 945288049 945288622 573
925 945292583 945302089 9506
926 945308839 945377249 68410
927 945381006 945386960 5954
928 945388591 945390616 2025
929 945392247 945429106 36859
930 945438966 945444608 5642
931 945447216 945448283 1067
932 945452106 945458825 6719
933 945468842 945480182 11340
934 945480668 945483780 3112
935 945489587 945491028 1441
936 945496563 945497988 1425
937 945498591 945508971 10380
938 945514448 945527118 12670
939 945583284 945589172 5888
940 945594394 945613693 19299
941 945626617 945627025 408
942 945629715 945632670 2955
943 945634901 945635622 721
944 945637588 945649445 11857
945 945655251 945669864 14613
946 945671933 945699231 27298
947 945710309 945711986 1677
948 945715152 945722500 7348
949 945724456 945765539 41083
950 945772693 945814637 41944
951 945817466 945843357 25891
952 945845664 945873469 27805
953 945875285 945904366 29081
954 945909396 945919103 9707
955 945920861 945964572 43711
956 945966285 945976440 10155
957 945978440 945995029 16589
958 945997166 945997793 627
959 945999544 946015582 16038
960 946017774 946056000 38226
961 946059034 946059550 516
962 946060313 946060882 569
963 946061994 946062174 180
964 946063370 946064629 1259
965 946065709 946067032 1323
966 946068349 946068806 457
967 946069450 946072078 2628
968 946073357 946075548 2191
969 946076460 946086263 9803
970 946087581 946088558 977
971 946092799 946097707 4908
972 946098290 946112438 14148
973 946116805 946116811 6
974 946118390 946132552 14162
975 946134779 946137551 2772
976 946146741 946146941 200
977 946149910 946150483 573
978 946152909 946154403 1494
979 946155437 946156435 998
980 946157853 946163966 6113
981 946164714 946166497 1783
982 946173418 946187467 14049
983 946191359 946201621 10262
984 946204618 946214174 9556
985 946218848 946227405 8557
986 946229631 946230095 464
987 946231020 946231075 55
988 946232581 946234194 1613
989 946236534 946240151 3617
990 946262239 946274072 11833
991 946278277 946285989 7712
992 946291963 946298218 6255
993 946310697 946329936 19239
994 946334438 946339035 4597
995 946340946 946351811 10865
996 946356479 946360633 4154
997 946362652 946369162 6510
998 946372854 946382643 9789
999 946395595 946396763 1168
1000 946400173 946404989 4816
1001 946412312 946413589 1277
1002 946415770 946422998 7228
1003 946427047 946436310 9263
1004 946439489 946447006 7517
1005 946457753 946457944 191
1006 946462986 946471011 8025
1007 946495349 946515184 19835
1008 946518234 946523277 5043
1009 946528052 946548501 20449
1010 946551509 946557712 6203
1011 946559688 946578557 18869
1012 946580738 946586820 6082
1013 946589828 946594225 4397
1014 946604804 946609147 4343
1015 946610200 946622012 11812
1016 946623931 946635405 11474
1017 946642518 946650432 7914
1018 946654066 946655299 1233
1019 946658932 946659838 906
1020 946660677 946662270 1593
1021 946663746 946664575 829
1022 946669505 946671170 1665
1023 946674008 946675814 1806
1024 946678232 946679686 1454
1025 946680407 946683176 2769
1026 946684077 946688505 4428
1027 946693053 946701498 8445
1028 946705117 946705501 384
1029 946707201 946711795 4594
1030 946712564 946722658 10094
1031 946729604 946729765 161
1032 946735405 946738415 3010
1033 946770079 946771256 1177
1034 946776739 946799031 22292
1035 946802877 946818946 16069
1036 946823971 946824770 799
1037 946830479 946831049 570
1038 946832775 946832808 33
1039 946836960 946840722 3762
1040 946845091 946846284 1193
1041 946847415 946847615 200
1042 946851386 946855058 3672
1043 946858213 946868814 10601
1044 946869580 946909297 39717
1045 946918503 946919136 633
1046 946920330 946920523 193
1047 946922189 946923152 963
1048 946925898 946928385 2487
1049 946929618 946930152 534
1050 946931167 946931281 114
1051 946933903 946934311 408
1052 946939911 946940086 175
1053 946941137 946942004 867
1054 946949672 946962963 13291
1055 946966021 946994768 28747
1056 946995332 946996113 781
1057 946997515 946997870 355
1058 947000296 947001773 1477
1059 947004009 947008275 4266
1060 947011403 947012346 943
1061 947014516 947016605 2089
1062 947023785 947026978 3193
1063 947027708 947045834 18126
1064 947054345 947059726 5381
1065 947062268 947072479 10211
1066 947073606 947073721 115
1067 947074093 947093015 18922
1068 947096822 947100296 3474
1069 947103357 947109226 5869
1070 947111560 947118577 7017
1071 947124101 947125438 1337
1072 947128357 947137741 9384
1073 947140376 947198810 58434
1074 947210536 947225172 14636
1075 947228635 947234365 5730
1076 947242458 947256890 14432
1077 947257996 947258090 94
1078 947258944 947259149 205
1079 947293537 947294464 927
1080 947294900 947297162 2262
1081 947301748 947314985 13237
1082 947317193 947318074 881
1083 947323004 947344275 21271
1084 948444884 948455066 10182
1085 948462478 948476360 13882
1086 948540482 948540581 99
1087 948544227 948544281 54
1088 948547076 948547315 239
1089 948547923 948548621 698
1090 948597702 948615683 17981
1091 948640408 948644198 3790
1092 948712708 948717776 5068
1093 948724888 948735688 10800
1094 948740849 948745461 4612
1095 949008598 949020449 11851
1096 949048288 949057744 9456
1097 949059179 949063304 4125
1098 949068025 949077671 9646
1099 949080380 949083185 2805
1100 949111704 949133516 21812
1101 949137090 949145607 8517
1102 949147849 949160769 12920
1103 949291761 949298096 6335
1104 949303943 949305079 1136
1105 949309491 949313367 3876
1106 949317318 949320976 3658
1107 949324603 949325334 731
1108 949327453 949331508 4055
1109 949381472 949405729 24257
1110 949407153 949417981 10828
1111 949460346 949467309 6963
1112 949469621 949504650 35029
1113 949506284 949507013 729
1114 949509167 949515838 6671
1115 949532733 949532877 144
1116 949535400 949559009 23609
1117 949599343 949605682 6339
1118 949617647 949617668 21
1119 949621060 949657805 36745
1120 949665369 949666916 1547
1121 949669261 949685404 16143
1122 949726733 949733344 6611
1123 949736254 949762867 26613
1124 949810685 949816112 5427
1125 949818863 949831919 13056
1126 949834010 949847725 13715
1127 949850332 949857649 7317
1128 949872936 949873206 270
1129 949874868 949877227 2359
1130 949878147 949881103 2956
1131 949888419 949893414 4995
1132 949898617 949937243 38626
1133 949939190 949942738 3548
1134 949962209 949971364 9155
1135 949972017 949972617 600
1136 949973460 949980867 7407
1137 949982483 950002688 20205
1138 950004719 950006145 1426
1139 950007820 950010151 2331
1140 950011853 950012199 346
1141 950014570 950016868 2298
1142 950018418 950019955 1537
1143 950021124 950024358 3234
1144 950025150 950026258 1108
1145 950029470 950037114 7644
1146 950043392 950050419 7027
1147 950058930 950062414 3484
1148 950064242 950064464 222
1149 950075801 950076366 565
1150 950081734 950095553 13819
1151 950098106 950108482 10376
1152 950109748 950126753 17005
1153 950128837 950170207 41370
1154 950173385 950175483 2098
1155 950176741 950197222 20481
1156 950198725 950208406 9681
1157 950209788 950227920 18132
1158 950230370 950288178 57808
1159 950296801 950297447 646
1160 950297491 950297498 7
1161 950300116 950302151 2035
1162 950303711 950309865 6154
1163 950316422 950328235 11813
1164 950331094 950358048 26954
1165 950361539 950374045 12506
1166 950414802 950456789 41987
1167 950458151 950458442 291
1168 950460093 950463891 3798
1169 950466865 950470102 3237
1170 950482057 950491442 9385
1171 950497767 950501660 3893
1172 950506584 950514085 7501
1173 950517846 950549442 31596
1174 950554845 950559185 4340
1175 950561894 950566443 4549
1176 950571375 950593751 22376
1177 950603476 950606764 3288
1178 950608628 950613810 5182
1179 950616535 950635361 18826
1180 950666417 950666775 358
1181 950669955 950671378 1423
1182 950675738 950681000 5262
1183 950681146 950695585 14439
1184 950697229 950719712 22483
1185 950724276 950744718 20442
1186 950752681 950753210 529
1187 950774055 950821831 47776
1188 950827710 950840427 12717
1189 950843186 950846153 2967
1190 950864745 950889799 25054
1191 950894122 950899032 4910
1192 950900662 950901464 802
1193 950902940 950910275 7335
1194 950912626 950966853 54227
1195 950973645 950974951 1306
1196 950999740 950999987 247
1197 951000243 951001732 1489
1198 951003618 951005178 1560
1199 951007617 951017427 9810
1200 951025168 951026511 1343
1201 951028836 951048849 20013
1202 951053214 951080263 27049
1203 951084966 951087213 2247
1204 951090751 951093433 2682
1205 951095742 951103437 7695
1206 951110708 951116616 5908
1207 951118760 951125429 6669
1208 951128294 951141989 13695
1209 951148034 951152258 4224
1210 951157872 951164427 6555
1211 951166521 951167716 1195
1212 951170468 951179393 8925
1213 951184198 951208265 24067
1214 951215448 951244912 29464
1215 951246163 951250175 4012
1216 951259754 951261590 1836
1217 951265889 951288464 22575
1218 951321159 951321532 373
1219 951326019 951329722 3703
1220 951342537 951348362 5825
1221 951351989 951353471 1482
1222 951355513 951392340 36827
1223 951395712 951434029 38317
1224 951437227 951447498 10271
1225 951449877 951508531 58654
1226 951515291 951519552 4261
1227 951519616 951521983 2367
1228 951522017 951522753 736
1229 951524562 951538800 14238
1230 951541190 951543768 2578
1231 951547648 951555282 7634
1232 951559942 951580821 20879
1233 951610420 951624600 14180
1234 951634380 951635632 1252
1235 951637017 951648485 11468
1236 951652071 951666284 14213
1237 951672374 951675938 3564
1238 951683097 951690867 7770
1239 951694371 951697943 3572
1240 951705325 951723121 17796
1241 951727386 951747342 19956
1242 951762129 951767069 4940
1243 951767106 951767457 351
1244 951777682 951778315 633
1245 951785793 951796082 10289
1246 951798533 951808638 10105
1247 951810499 951812428 1929
1248 951816511 951816795 284
1249 951820231 951825649 5418
1250 951851380 951853899 2519
1251 951855311 951855609 298
1252 951857051 951857175 124
1253 951858611 951859684 1073
1254 951861794 951861857 63
1255 951865166 951892153 26987
1256 951895268 951900532 5264
1257 951902627 951912711 10084
1258 951917697 951918158 461
1259 951920193 951923015 2822
1260 951925983 951929511 3528
1261 951932994 951939190 6196
1262 951940772 951947034 6262
1263 951950570 951951993 1423
1264 951957137 951967093 9956
1265 951968534 951981372 12838
1266 951986324 951995676 9352
1267 951998816 952000458 1642
1268 952002316 952008107 5791
1269 952041015 952050789 9774
1270 952052106 952053584 1478
1271 952056215 952057826 1611
1272 952061848 952064829 2981
1273 952066259 952066810 551
1274 952068513 952072570 4057
1275 952076792 952077536 744
1276 952079929 952083833 3904
1277 952086337 952098258 11921
1278 952100094 952101484 1390
1279 952135714 952142445 6731
1280 952146750 952161125 14375
1281 952164359 952173102 8743
1282 952177525 952179249 1724
1283 952221746 952237327 15581
1284 952244839 952247485 2646
1285 952253837 952258137 4300
1286 952261575 952265254 3679
1287 952271637 952273571 1934
1288 952293024 952294441 1417
1289 952303710 952310152 6442
1290 952311863 952338041 26178
1291 952345876 952354391 8515
1292 952363578 952363623 45
1293 952383838 952389513 5675
1294 952390541 952405324 14783
1295 952405948 952420798 14850
1296 952430714 952448608 17894
1297 952450101 952451794 1693
1298 952456053 952461222 5169
1299 952478982 952482513 3531
1300 952499821 952513182 13361
1301 952517590 952520280 2690
1302 952522276 952544873 22597
1303 952545407 952553545 8138
1304 952556487 952566160 9673
1305 952594296 952595560 1264
1306 952597799 952601556 3757
1307 952603580 952614833 11253
1308 952617757 952641068 23311
1309 952643611 952657477 13866
1310 952675980 952682495 6515
1311 952684948 952692003 7055
1312 952695103 952699212 4109
1313 952727308 952732082 4774
1314 952733312 952737930 4618
1315 952740079 952742132 2053
1316 952747367 952754524 7157
1317 952756478 952765972 9494
1318 952772215 952772360 145
1319 952775098 952775108 10
1320 952776306 952778241 1935
1321 952807342 952821905 14563
1322 952823743 952825877 2134
1323 952833746 952838777 5031
1324 952846119 952872302 26183
1325 952883188 952888104 4916
1326 952889743 952890514 771
1327 952893912 952898883 4971
1328 952903431 952923491 20060
1329 952927178 952934726 7548
1330 952934799 952952390 17591
1331 952959672 952964046 4374
1332 952967822 952974923 7101
1333 952976569 952980342 3773
1334 952982242 952983708 1466
1335 952988414 953016177 27763
1336 953021644 953050517 28873
1337 953059160 953061377 2217
1338 953062634 953069282 6648
1339 953070658 953072884 2226
1340 953075613 953076250 637
1341 953079031 953097116 18085
1342 953100702 953115943 15241
1343 953124698 953129616 4918
1344 953136629 953141283 4654
1345 953143380 953153539 10159
1346 953155477 953155924 447
1347 953157362 953160002 2640
1348 953162233 953181083 18850
1349 953186477 953192904 6427
1350 953194349 953210793 16444
1351 953215382 953232275 16893
1352 953236586 953244474 7888
1353 953270745 953303572 32827
1354 953308152 953311277 3125
1355 953312207 953313066 859
1356 953317079 953320811 3732
1357 953322199 953322418 219
1358 953323135 953323755 620
1359 953325387 953325445 58
1360 953326312 953335685 9373
1361 953339255 953366652 27397
1362 953373572 953384301 10729
1363 953412103 953427112 15009
1364 953432114 953445292 13178
1365 953448481 953461554 13073
1366 953466380 953491089 24709
1367 953498682 953505629 6947
1368 953515181 953551783 36602
1369 953554666 953576893 22227
1370 953578036 953581708 3672
1371 953594006 953596022 2016
1372 953597321 953602986 5665
1373 953616439 953626869 10430
1374 953628882 953635925 7043
1375 953637441 953651107 13666
1376 953652548 953654563 2015
1377 953670172 953670477 305
1378 953672117 953674630 2513
1379 953677854 953686249 8395
1380 953687731 953720156 32425
1381 953723264 953744472 21208
1382 953747723 953768727 21004
1383 953778450 953796290 17840
1384 953803579 953821938 18359
1385 953826693 953835689 8996
1386 953839193 953846723 7530
1387 953876264 953876297 33
1388 953876314 953898197 21883
1389 953927267 953927750 483
1390 953942055 953946846 4791
1391 953949192 953965841 16649
1392 953978947 953981335 2388
1393 953997580 953998545 965
1394 954016251 954025319 9068
1395 954026234 954026473 239
1396 954032920 954053209 20289
1397 954057145 954076002 18857
1398 954093895 954094782 887
1399 954096392 954096627 235
1400 954099305 954101882 2577
1401 954103128 954113354 10226
1402 954114426 954145426 31000
1403 954150216 954150267 51
1404 954150641 954159230 8589
1405 954168933 954174251 5318
1406 954181771 954184871 3100
1407 954186170 954192129 5959
1408 954192430 954198559 6129
1409 954199957 954235300 35343
1410 954238847 954245618 6771
1411 954248876 954252520 3644
1412 954258949 954267122 8173
1413 954268966 954269930 964
1414 954272921 954278145 5224
1415 954280782 954283580 2798
1416 954308412 954308759 347
1417 954311077 954314026 2949
1418 954323268 954342905 19637
1419 954345357 954354258 8901
1420 954357623 954365787 8164
1421 954366832 954368417 1585
1422 954370689 954386373 15684
1423 954394278 954398980 4702
1424 954401111 954401392 281
1425 954408151 954436566 28415
1426 954439391 954440068 677
1427 954441583 954443397 1814
1428 954445052 954455780 10728
1429 954479102 954482151 3049
1430 954487370 954493838 6468
1431 954495479 954498860 3381
1432 954560485 954577308 16823
1433 954581500 954584773 3273
1434 954585857 954591638 5781
1435 954592601 954598694 6093
1436 954642325 954652936 10611
1437 954655768 954662508 6740
1438 954672861 954689040 16179
1439 954704638 954705779 1141
1440 954706822 954709298 2476
1441 954710499 954713679 3180
1442 954749986 954752623 2637
1443 954753762 954754705 943
1444 954755825 954757451 1626
1445 954760131 954762016 1885
1446 954763820 954765044 1224
1447 954766645 954766775 130
1448 954803909 954805342 1433
1449 954820232 954820744 512
1450 954830637 954834319 3682
1451 954836735 954839463 2728
1452 954842034 954847956 5922
1453 954866631 954872581 5950
1454 954874200 954883488 9288
1455 954896911 954899121 2210
1456 954899817 954899823 6
1457 954899827 954905440 5613
1458 954916365 954922126 5761
1459 954923326 954932177 8851
1460 954933409 954935071 1662
1461 954938890 954942743 3853
1462 954951679 954960396 8717
1463 954975264 954975265 1
1464 954975441 954981927 6486
1465 954997783 954999350 1567
1466 955008275 955010379 2104
1467 955012128 955014831 2703
1468 955034459 955043333 8874
1469 955052309 955052459 150
1470 955054316 955059572 5256
1471 955061495 955063025 1530
1472 955082925 955086902 3977
1473 955088505 955090618 2113
1474 955094058 955098467 4409
1475 955102527 955107728 5201
1476 955113137 955113171 34
1477 955131697 955131807 110
1478 955131963 955132311 348
1479 955144047 955145794 1747
1480 955148618 955167591 18973
1481 955170783 955190281 19498
1482 955194306 955206371 12065
1483 955236927 955238625 1698
1484 955245502 955250895 5393
1485 955254306 955257765 3459
1486 955260155 955283037 22882
1487 955283110 955288554 5444
1488 955297454 955299614 2160
1489 955309168 955311061 1893
1490 955314826 955328114 13288
1491 955331729 955337123 5394
1492 955337631 955337886 255
1493 955337936 955355896 17960
1494 955365358 955366335 977
1495 955368239 955383318 15079
1496 955383386 955384775 1389
1497 955400580 955410720 10140
1498 955413788 955415305 1517
1499 955420988 955421799 811
1500 955425726 955435482 9756
1501 955436592 955459168 22576
1502 955470357 955475255 4898
1503 955475590 955480509 4919
1504 955482835 955486164 3329
1505 955486194 955489343 3149
1506 955494182 955507281 13099
1507 955509899 955509928 29
1508 955510213 955511361 1148
1509 955512633 955534328 21695
1510 955537997 955541712 3715
1511 955543207 955550255 7048
1512 955551553 955552115 562
1513 955553989 955567565 13576
1514 955567586 955570113 2527
1515 955571546 955577376 5830
1516 955579948 955588742 8794
1517 955590419 955590420 1
1518 955590744 955590773 29
1519 955590858 955591398 540
1520 955593395 955599692 6297
1521 955600949 955606347 5398
1522 955609809 955633127 23318
1523 955639966 955660911 20945
1524 955664355 955673029 8674
1525 955674039 955683832 9793
1526 955685112 955685142 30
1527 955685159 955690279 5120
1528 955693751 955696084 2333
1529 955697912 955708725 10813
1530 955710358 955719896 9538
1531 955719918 955725634 5716
1532 955731428 955733430 2002
1533 955738579 955741651 3072
1534 955743852 955750989 7137
1535 955753060 955767516 14456
1536 955768853 955783131 14278
1537 955786084 955786090 6
1538 955786173 955790496 4323
1539 955794865 955795059 194
1540 955795252 955796003 751
1541 955797581 955798988 1407
1542 955800352 955810922 10570
1543 955843908 955848906 4998
1544 955852055 955862616 10561
1545 955864486 955864901 415
1546 955866456 955869948 3492
1547 955871613 955889005 17392
1548 955890297 955902865 12568
1549 955922991 955924061 1070
1550 955925355 955928037 2682
1551 955937585 955937703 118
1552 955937770 955949085 11315
1553 955951806 955965890 14084
1554 955969182 955978577 9395
1555 955998428 956014065 15637
1556 956014176 956016240 2064
1557 956016245 956017006 761
1558 956018628 956024278 5650
1559 956026522 956028794 2272
1560 956032603 956053015 20412
1561 956056573 956060662 4089
1562 956069508 956072843 3335
1563 956075441 956077382 1941
1564 956088065 956095607 7542
1565 956098798 956112976 14178
1566 956114104 956122736 8632
1567 956124338 956130709 6371
1568 956131886 956141773 9887
1569 956145631 956179822 34191
1570 956184154 956202264 18110
1571 956203710 956205203 1493
1572 956207311 956224794 17483
1573 956226382 956229905 3523
1574 956230614 956262605 31991
1575 956264222 956273794 9572
1576 956293930 956309289 15359
1577 956310857 956328893 18036
1578 956330248 956332214 1966
1579 956337868 956340648 2780
1580 956342561 956342610 49
1581 956344692 956349120 4428
1582 956351085 956354127 3042
1583 956359542 956360918 1376
1584 956363888 956373877 9989
1585 956382841 956389293 6452
1586 956389587 956406957 17370
1587 956408393 956415903 7510
1588 956438872 956443910 5038
1589 956449001 956450213 1212
1590 956453516 956457852 4336
1591 956467065 956471172 4107
1592 956472920 956479451 6531
1593 956480733 956481269 536
1594 956482430 956505694 23264
1595 956510572 956524834 14262
1596 956526771 956528788 2017
1597 956534249 956534557 308
1598 956541135 956546385 5250
1599 956549019 956553264 4245
1600 956558820 956591416 32596
1601 956600136 956605065 4929
1602 956619520 956619636 116
1603 956627712 956628253 541
1604 956680494 956682851 2357
1605 956685767 956687889 2122
1606 956693483 956693603 120
1607 956694759 956701925 7166
1608 956704117 956704756 639
1609 956722811 956723822 1011
1610 956731032 956732683 1651
1611 956734992 956773087 38095
1612 956775615 956780772 5157
1613 956821566 956832062 10496
1614 956834947 956847972 13025
1615 956849537 956857182 7645
1616 956866838 956870695 3857
1617 956872349 956898032 25683
1618 956902180 956903871 1691
1619 956905712 956909965 4253
1620 956919553 956920301 748
1621 956923097 956929516 6419
1622 956977893 956978686 793
1623 956979708 956988705 8997
1624 956991372 956997094 5722
1625 956997701 957008022 10321
1626 957011934 957018525 6591
1627 957044868 957049283 4415
1628 957053629 957059247 5618
1629 957063549 957071895 8346
1630 957074560 957076998 2438
1631 957078168 957078264 96
1632 957080476 957092706 12230
1633 957094352 957106576 12224
1634 957110087 957113314 3227
1635 957115283 957116539 1256
1636 957124192 957129416 5224
1637 957131141 957133177 2036
1638 957136209 957144869 8660
1639 957153221 957181240 28019
1640 957187071 957199287 12216
1641 957200086 957214655 14569
1642 957217159 957222921 5762
1643 957224173 957226655 2482
1644 957231030 957233062 2032
1645 957234314 957239449 5135
1646 957241981 957280643 38662
1647 957292177 957293080 903
1648 957294895 957295362 467
1649 957296480 957297903 1423
1650 957299905 957303746 3841
1651 957318806 957330775 11969
1652 957331237 957355090 23853
1653 957357290 957379335 22045
1654 957386592 957388626 2034
1655 957394509 957404849 10340
1656 957407885 957417089 9204
1657 957433181 957467293 34112
1658 957468932 957480207 11275
1659 957481821 957494073 12252
1660 957495560 957544410 48850
1661 957551235 957554959 3724
1662 957557818 957569623 11805
1663 957587773 957603094 15321
1664 957605489 957617759 12270
1665 957618957 957625269 6312
1666 957644711 957645403 692
1667 957648255 957651925 3670
1668 957654888 957655022 134
1669 957656994 957695607 38613
1670 957697149 957732465 35316
1671 957738014 957746011 7997
1672 957748499 957764241 15742
1673 957768856 957778065 9209
1674 957786846 957797315 10469
1675 957805440 957813012 7572
1676 957813845 957813959 114
1677 957815826 957816033 207
1678 957817454 957819778 2324
1679 957831278 957837425 6147
1680 957842569 957849126 6557
1681 957852773 957892267 39494
1682 957900371 957900924 553
1683 957902440 957903055 615
1684 957904077 957908822 4745
1685 957909801 957913767 3966
1686 957915261 957915530 269
1687 957917560 957972726 55166
1688 957977815 957988023 10208
1689 957992387 958011364 18977
1690 958012911 958022724 9813
1691 958024884 958037803 12919
1692 958040365 958041763 1398
1693 958043233 958083004 39771
1694 958084611 958104176 19565
1695 958105517 958119731 14214
1696 958121010 958123815 2805
1697 958126114 958131742 5628
1698 958139084 958151904 12820
1699 958153480 958164116 10636
1700 958165259 958196016 30757
1701 958202398 958204033 1635
1702 958206411 958227163 20752
1703 958253400 958256245 2845
1704 958258354 958274601 16247
1705 958276201 958278378 2177
1706 958282277 958290526 8249
1707 958299220 958310178 10958
1708 958312011 958320978 8967
1709 958325429 958326238 809
1710 958328862 958336330 7468
1711 958337706 958352685 14979
1712 958368780 958385216 16436
1713 958387183 958392567 5384
1714 958397460 958399952 2492
1715 958400096 958401384 1288
1716 958403641 958407977 4336
1717 958411544 958421926 10382
1718 958426193 958429575 3382
1719 958431662 958433962 2300
1720 958440367 958444339 3972
1721 958446560 958448940 2380
1722 958452736 958492352 39616
1723 958492721 958503778 11057
1724 958509374 958509987 613
1725 958512657 958515248 2591
1726 958519664 958532927 13263
1727 958538559 958556891 18332
1728 958558352 958573323 14971
1729 958582929 958583029 100
1730 958588045 958608592 20547
1731 958610325 958641829 31504
1732 958644921 958690178 45257
1733 958693927 958708214 14287
1734 958716056 958720933 4877
1735 958728874 958729549 675
1736 958738118 958753736 15618
1737 958757824 958759132 1308
1738 958762500 958762721 221
1739 958771625 958771810 185
1740 958777747 958781641 3894
1741 958784723 958787037 2314
1742 958800438 958802282 1844
1743 958803828 958817988 14160
1744 958819684 958825320 5636
1745 958826663 958830102 3439
1746 958833328 958836828 3500
1747 958888571 958894445 5874
1748 958898392 958899964 1572
1749 958904293 958911771 7478
1750 958913293 958913747 454
1751 958914800 958919616 4816
1752 958922476 958926911 4435
1753 958933059 958936186 3127
1754 958938320 958938893 573
1755 958940614 958955442 14828
1756 958955650 958961942 6292
1757 958976297 958986442 10145
1758 958988331 959007810 19479
1759 959013022 959016488 3466
1760 959025483 959034000 8517
1761 959034075 959042161 8086
1762 959046814 959061265 14451
1763 959063793 959076851 13058
1764 959084353 959084556 203
1765 959087852 959091833 3981
1766 959107093 959107529 436
1767 959110522 959110577 55
1768 959110653 959110830 177
1769 959112781 959114561 1780
1770 959163351 959173421 10070
1771 959175241 959195011 19770
1772 959196563 959209905 13342
1773 959219689 959246922 27233
1774 959253952 959276097 22145
1775 959279378 959288395 9017
1776 959295244 959299326 4082
1777 959299680 959312101 12421
1778 959316532 959377571 61039
1779 959377922 959380339 2417
1780 959385983 959398510 12527
1781 959402187 959412001 9814
1782 959417973 959438733 20760
1783 959459667 959462509 2842
1784 959463987 959465527 1540
1785 959467229 959471416 4187
1786 959487824 959510525 22701
1787 959516212 959520673 4461
1788 959530243 959532695 2452
1789 959534438 959543640 9202
1790 959579437 959579610 173
1791 959581173 959582119 946
1792 959584207 959584388 181
1793 959588079 959596554 8475
1794 959598412 959603067 4655
1795 959604602 959618870 14268
1796 959622482 959622639 157
1797 959628370 959637066 8696
1798 959640731 959648316 7585
1799 959659478 959715851 56373
1800 959720253 959726092 5839
1801 959729814 959730145 331
1802 959732833 959739508 6675
1803 959739622 959742969 3347
1804 959746939 959750708 3769
1805 959752780 959764093 11313
1806 959767122 959767252 130
1807 959769528 959782186 12658
1808 959787638 959800259 12621
1809 959803849 959837097 33248
1810 959841746 959847711 5965
1811 959850405 959862341 11936
1812 959863702 959872538 8836
1813 959872614 959876240 3626
1814 959879601 959880852 1251
1815 959882662 959882830 168
1816 959885662 959889012 3350
1817 959891069 959899022 7953
1818 959900565 959901315 750
1819 959903363 959926320 22957
1820 959928130 959939222 11092
1821 959941156 959958257 17101
1822 959959780 959964974 5194
1823 959966586 959969493 2907
1824 959971304 959972565 1261
1825 959972694 959973380 686
1826 959975036 959978412 3376
1827 959982894 959991135 8241
1828 960001269 960006562 5293
1829 960006714 960019943 13229
1830 960021865 960036850 14985
1831 960038140 960044461 6321
1832 960076645 960082102 5457
1833 960085933 960087634 1701
1834 960090584 960091953 1369
1835 960094767 960097501 2734
1836 960099816 960103799 3983
1837 960105396 960128315 22919
1838 960134566 960135952 1386
1839 960169058 960171305 2247
1840 960176577 960176607 30
1841 960176733 960180177 3444
1842 960180768 960183219 2451
1843 960187219 960195954 8735
1844 960200243 960201211 968
1845 960204199 960205385 1186
1846 960209933 960212264 2331
1847 960224849 960224933 84
1848 960227129 960227134 5
1849 960230102 960231496 1394
1850 960240861 960243251 2390
1851 960245646 960246021 375
1852 960276755 960277644 889
1853 960283529 960284522 993
1854 960286288 960286687 399
1855 960288192 960289733 1541
1856 960291969 960294833 2864
1857 960295366 960295614 248
1858 960296234 960300695 4461
1859 960304791 960308364 3573
1860 960313504 960314904 1400
1861 960321863 960325403 3540
1862 960345431 960348934 3503
1863 960360940 960361808 868
1864 960370821 960371035 214
1865 960426011 960430661 4650
1866 960435015 960435873 858
1867 960438001 960444978 6977
1868 960446732 960450885 4153
1869 960452516 960455080 2564
1870 960457869 960460350 2481
1871 960461893 960462369 476
1872 960464237 960465667 1430
1873 960468014 960470753 2739
1874 960476822 960482141 5319
1875 960484902 960485507 605
1876 960486953 960489226 2273
1877 960490704 960491385 681
1878 960497359 960498406 1047
1879 960501151 960510810 9659
1880 960521440 960521782 342
1881 960525518 960526204 686
1882 960531785 960532510 725
1883 960534997 960535396 399
1884 960536846 960537825 979
1885 960539830 960548550 8720
1886 960549973 960552065 2092
1887 960554301 960556217 1916
1888 960564584 960565611 1027
1889 960570427 960574209 3782
1890 960575956 960577759 1803
1891 960586389 960593036 6647
1892 960602576 960606282 3706
1893 960619904 960649122 29218
1894 960717101 960717778 677
1895 960719602 960719902 300
1896 960721561 960732899 11338
1897 960735537 960739409 3872
1898 960741670 960744464 2794
1899 960747291 960750365 3074
1900 960757998 960760803 2805
1901 960763791 960766590 2799
1902 960794142 960798008 3866
1903 960800511 960805717 5206
1904 960807640 960819839 12199
1905 960834654 960836820 2166
1906 960840462 960842193 1731
1907 960844211 960845461 1250
1908 960847853 960850035 2182
1909 960879659 960881311 1652
1910 960885121 960888554 3433
1911 960890934 960893779 2845
1912 960895977 960896204 227
1913 960898289 960902597 4308
1914 960909516 960917094 7578
1915 960918790 960921885 3095
1916 960923049 960923497 448
1917 960926680 960931426 4746
1918 960936873 960940059 3186
1919 960942503 960944014 1511
1920 960964054 960977171 13117
1921 960979509 960983392 3883
1922 960985012 961001575 16563
1923 961002961 961028133 25172
1924 961050819 961058715 7896
1925 961210060 961214378 4318
1926 961217923 961230415 12492
1927 961234000 961243877 9877
1928 961245960 961252320 6360
1929 961279939 961288242 8303
1930 961289713 961294417 4704
1931 961311060 961312329 1269
1932 961312569 961325882 13313
1933 961327423 961350310 22887
1934 961357797 961358616 819
1935 961360864 961361280 416
1936 961364375 961364942 567
1937 961367297 961368138 841
1938 961371043 961394975 23932
1939 961396988 961404283 7295
1940 961406170 961418382 12212
1941 961421140 961431066 9926
1942 961438805 961442699 3894
1943 961444561 961450952 6391
1944 961454469 961454594 125
1945 961456142 961480564 24422
1946 961482706 961497817 15111
1947 961501108 961510215 9107
1948 961515804 961516436 632
1949 961521270 961522778 1508
1950 961524606 961525653 1047
1951 961527557 961527664 107
1952 961528948 961535820 6872
1953 961537381 961556248 18867
1954 961559720 961566220 6500
1955 961573355 961582329 8974
1956 961585019 961589261 4242
1957 961596192 961603580 7388
1958 961605811 961605991 180
1959 961607878 961615982 8104
1960 961617672 961637584 19912
1961 961641212 961642554 1342
1962 961651627 961655641 4014
1963 961657355 961659252 1897
1964 961661612 961664965 3353
1965 961669268 961683052 13784
1966 961684473 961710485 26012
1967 961712768 961717716 4948
1968 961720002 961724624 4622
1969 961737304 961742464 5160
1970 961745524 961751306 5782
1971 961754202 961757535 3333
1972 961759540 961776192 16652
1973 961778359 961780398 2039
1974 961782387 961787482 5095
1975 961789812 961792779 2967
1976 961794747 961796833 2086
1977 961798388 961798668 280
1978 961799750 961802482 2732
1979 961827382 961827833 451
1980 961835601 961837592 1991
1981 961837626 961838456 830
1982 961840192 961848159 7967
1983 961849593 961858982 9389
1984 961910386 961916431 6045
1985 961917900 961918183 283
1986 961921393 961945755 24362
1987 961946082 961959590 13508
1988 961995751 962002230 6479
1989 962006244 962008499 2255
1990 962010436 962021236 10800
1991 962023656 962031051 7395
1992 962033276 962040501 7225
1993 962079329 962089204 9875
1994 962090551 962098630 8079
1995 962099958 962101790 1832
1996 962103136 962123515 20379
1997 962218902 962225680 6778
1998 962226136 962231327 5191
1999 962238052 962239286 1234
2000 962241246 962255050 13804
2001 962256815 962276944 20129
2002 962278804 962295468 16664
2003 962302965 962310033 7068
2004 962314608 962316436 1828
2005 962344524 962358195 13671
2006 962360660 962415674 55014
2007 962430175 962434104 3929
2008 962434612 962452435 17823
2009 962453629 962461416 7787
2010 962462801 962464655 1854
2011 962484346 962489148 4802
2012 962491069 962497654 6585
2013 962512296 962532534 20238
2014 962533929 962547085 13156
2015 962549932 962551818 1886
2016 962553883 962562648 8765
2017 962565880 962567968 2088
2018 962572167 962574201 2034
2019 962600905 962608221 7316
2020 962609752 962634145 24393
2021 962641861 962645457 3596
2022 962647169 962651041 3872
2023 962652636 962655104 2468
2024 962661855 962662925 1070
2025 962697963 962706838 8875
2026 962708981 962710712 1731
2027 962712270 962729250 16980
2028 962730436 962743309 12873
2029 962745566 962749301 3735
2030 962752294 962757614 5320
2031 962761222 962767612 6390
2032 962770596 962773640 3044
2033 962778633 962798212 19579
2034 962799695 962801251 1556
2035 962801807 962814208 12401
2036 962816372 962859472 43100
2037 962861391 962881337 19946
2038 962882799 962927081 44282
2039 962933779 962944469 10690
2040 962948181 962953659 5478
2041 962959502 962979866 20364
2042 963006913 963009807 2894
2043 963012920 963014197 1277
2044 963037411 963068872 31461
2045 963201875 963242220 40345
2046 963244299 963245103 804
2047 963249966 963286102 36136
2048 963299807 963326109 26302
2049 963335750 963352177 16427
2050 963353884 963468215 114331
2051 963478836 963481531 2695
2052 963483671 963494273 10602
2053 963514650 963518101 3451
2054 963527880 963556993 29113
2055 963575140 963592476 17336
2056 963598570 963672450 73880
2057 963694542 963697865 3323
2058 963700818 963717877 17059
2059 963719161 963745933 26772
2060 963747533 963751101 3568
2061 963752286 963758984 6698
2062 963760848 963779423 18575
2063 963785011 963811046 26035
2064 963815495 963829255 13760
2065 963830679 963853723 23044
2066 963870642 963871291 649
2067 963897626 963901319 3693
2068 963901758 963902480 722
2069 963908762 963934995 26233
2070 963935945 963951602 15657
2071 963973083 964000429 27346
2072 964001388 964029079 27691
2073 964032622 964033831 1209
2074 964036809 964058096 21287
2075 964060171 964169151 108980
2076 964172581 964201446 28865
2077 964203527 964232507 28980
2078 964233015 964280001 46986
2079 964315151 964318068 2917
2080 964318695 964320331 1636
2081 964321814 964329505 7691
2082 964330255 964343695 13440
2083 964343911 964368822 24911
2084 964373425 964383950 10525
2085 964387835 964412236 24401
2086 964414280 964443357 29077
2087 964444243 964465936 21693
2088 964469181 964474334 5153
2089 964476445 964488875 12430
2090 964489510 964496867 7357
2091 964497784 964497934 150
2092 964505764 964522248 16484
2093 964524534 964526144 1610
2094 964530930 964596872 65942
2095 964601408 964615349 13941
2096 964618458 964632239 13781
2097 964634737 964723914 89177
2098 964726450 964826081 99631
2099 964829879 964871823 41944
2100 964872417 964883173 10756
2101 964908968 964933211 24243
2102 964934695 964962363 27668
2103 964969304 964977516 8212
2104 964979291 964993780 14489
2105 965043531 965044617 1086
2106 965046108 965055709 9601
2107 965060380 965085309 24929
2108 965098147 965102623 4476
2109 965106489 965125891 19402
2110 965127908 965144305 16397
2111 965146355 965148800 2445
2112 965504788 965508638 3850
2113 965529827 965533752 3925
2114 965541133 965545820 4687
2115 965546074 965553144 7070
2116 965553527 965583892 30365
2117 965584699 965594467 9768
2118 965596365 965601213 4848
2119 965601982 965641827 39845
2120 965645826 965649860 4034
2121 965658742 965666564 7822
2122 965673037 965673312 275
2123 965675528 965681003 5475
2124 965691494 965694784 3290
2125 965699646 965750745 51099
2126 965753873 965763830 9957
2127 965768076 965770367 2291
2128 965781288 965797299 16011
2129 965797779 965807061 9282
2130 965811674 965830948 19274
2131 965832600 965835264 2664
2132 965836828 965862323 25495
2133 965868363 965874012 5649
2134 965876809 965921245 44436
2135 965923163 965944757 21594
2136 965959324 965965906 6582
2137 965967787 965969427 1640
2138 965971585 965984648 13063
2139 965984827 965991899 7072
2140 965992451 965995644 3193
2141 965997338 966023279 25941
2142 966047120 966048735 1615
2143 966055558 966080606 25048
2144 966082620 966092446 9826
2145 966119231 966136221 16990
2146 966138174 966184914 46740
2147 966194457 966196255 1798
2148 966198259 966216644 18385
2149 966217200 966286874 69674
2150 966305401 966308421 3020
2151 966311909 966365102 53193
2152 966369221 966371341 2120
2153 966388140 966414867 26727
2154 966416641 966437781 21140
2155 966441389 966457137 15748
2156 966460486 966467685 7199
2157 966471228 966490668 19440
2158 966493081 966505527 12446
2159 966507409 966550278 42869
2160 966551748 966554687 2939
2161 966565457 966566556 1099
2162 966568416 966613786 45370
2163 966616104 966637431 21327
2164 966642146 966651541 9395
2165 966657442 966697660 40218
2166 966723378 966727740 4362
2167 966729881 966779966 50085
2168 966782217 966783238 1021
2169 966785151 966800709 15558
2170 966803258 966804650 1392
2171 966812926 966871178 58252
2172 966872466 966889521 17055
2173 966912834 966916658 3824
2174 966920757 966945729 24972
2175 966947490 967054549 107059
2176 967056247 967060107 3860
2177 967061880 967144173 82293
2178 967147000 967200106 53106
2179 967201703 967245873 44170
2180 967247330 967269441 22111
2181 967271201 967272412 1211
2182 967357045 967357522 477
2183 967361430 967361630 200
2184 967366781 967367479 698
2185 967369771 967383791 14020
2186 967385565 967385656 91
2187 967388167 967390256 2089
2188 967391965 967393793 1828
2189 967414776 967486812 72036
2190 967663096 967665581 2485
2191 967668392 967679994 11602
2192 967704535 967742073 37538
2193 967749348 967759439 10091
2194 967762112 967766523 4411
2195 967771817 967816864 45047
2196 967820168 967827277 7109
2197 967829196 967832904 3708
2198 967834564 967835614 1050
2199 967837483 967845900 8417
2200 967848140 967850707 2567
2201 967853803 967877896 24093
2202 967880357 967885463 5106
2203 967889388 967889497 109
2204 967891699 967893514 1815
2205 967895471 967895831 360
2206 967897568 967899016 1448
2207 967903073 967905733 2660
2208 967930478 967931467 989
2209 967946924 967951149 4225
2210 967953605 967981906 28301
2211 967983752 968004056 20304
2212 968005742 968016905 11163
2213 968020385 968029059 8674
2214 968031954 968032032 78
2215 968035241 968037555 2314
2216 968042392 968042476 84
2217 968049156 968057526 8370
2218 968059194 968059518 324
2219 968062582 968067428 4846
2220 968073269 968076671 3402
2221 968081304 968081514 210
2222 968088779 968089488 709
2223 968098510 968099350 840
2224 968101272 968106400 5128
2225 968123315 968173339 50024
2226 968178685 968188834 10149
2227 968190279 968199849 9570
2228 968200823 968230989 30166
2229 968232954 968267933 34979
2230 968279879 968282906 3027
2231 968286821 968287027 206
2232 968293822 968312921 19099
2233 968315002 968356337 41335
2234 968356625 968356975 350
2235 968366905 968369404 2499
2236 968380383 968381188 805
2237 968383115 968392753 9638
2238 968394475 968398052 3577
2239 968399606 968459018 59412
2240 968463190 968463987 797
2241 968469840 968489501 19661
2242 968490873 968492382 1509
2243 968495044 968495266 222
2244 968507607 968508770 1163
2245 968559470 968560658 1188
2246 968564839 968564854 15
2247 968564990 968566447 1457
2248 968569775 968572468 2693
2249 968576594 968597632 21038
2250 968605094 968607619 2525
2251 968609629 968609944 315
2252 968613339 968614108 769
2253 968616456 968624002 7546
2254 968626943 968630179 3236
2255 968632249 968641010 8761
2256 968642871 968644430 1559
2257 968646220 968681205 34985
2258 968686357 968686575 218
2259 968688760 968690950 2190
2260 968692881 968714403 21522
2261 968719346 968778123 58777
2262 968780608 968786178 5570
2263 968796318 968829116 32798
2264 968832459 968873476 41017
2265 968874869 968874963 94
2266 968876500 968949287 72787
2267 968950937 968955444 4507
2268 968957054 968959255 2201
2269 968960842 968963872 3030
2270 968965334 968979085 13751
2271 968981134 968990857 9723
2272 968992828 968997887 5059
2273 969004524 969042931 38407
2274 969044519 969050478 5959
2275 969058001 969058572 571
2276 969060677 969116717 56040
2277 969139130 969144098 4968
2278 969144595 969154548 9953
2279 969171767 969178308 6541
2280 969179808 969206228 26420
2281 969215864 969217264 1400
2282 969220206 969222196 1990
2283 969224615 969226913 2298
2284 969229037 969232391 3354
2285 969237881 969238505 624
2286 969240547 969240630 83
2287 969244075 969255364 11289
2288 969258313 969288262 29949
2289 969290995 969295734 4739
2290 969299257 969302501 3244
2291 969308158 969317665 9507
2292 969322761 969329869 7108
2293 969332622 969343665 11043
2294 969345158 969380039 34881
2295 969382579 969383867 1288
2296 969383938 969387522 3584
2297 969389217 969390753 1536
2298 969393044 969424040 30996
2299 969425872 969451903 26031
2300 969455030 969506077 51047
2301 969508725 969517829 9104
2302 969526275 969542699 16424
2303 969544984 969561322 16338
2304 969563467 969563680 213
2305 969565506 969574474 8968
2306 969576461 969582428 5967
2307 969586001 969630963 44962
2308 969636722 969652528 15806
2309 969658202 969713812 55610
2310 969717809 969721228 3419
2311 969741560 969744589 3029
2312 969747238 969749242 2004
2313 969750734 969753956 3222
2314 969757018 969773038 16020
2315 969781218 969792873 11655
2316 969794909 969798804 3895
2317 969806271 969814652 8381
2318 969816076 969816642 566
2319 969824554 969824751 197
2320 969826868 969828889 2021
2321 969831521 969837067 5546
2322 969839325 969871377 32052
2323 969872854 969914518 41664
2324 969917004 969918430 1426
2325 969920035 969959088 39053
2326 969960759 970006454 45695
2327 970007824 970026375 18551
2328 970027693 970041257 13564
2329 970042980 970084305 41325
2330 970085607 970090176 4569
2331 970091735 970093192 1457
2332 970097402 970134243 36841
2333 970137093 970144864 7771
2334 970146859 970168282 21423
2335 970170027 970207203 37176
2336 970208876 970227434 18558
2337 970228894 970234916 6022
2338 970236649 970239251 2602
2339 970242019 970254142 12123
2340 970294911 970306390 11479
2341 970309583 970326186 16603
2342 970375709 970376463 754
2343 970377488 970379983 2495
2344 970387059 970397256 10197
2345 970398564 970414166 15602
2346 970415821 970417458 1637
2347 970419465 970420108 643
2348 970421809 970426269 4460
2349 970460478 970463303 2825
2350 970465974 970474722 8748
2351 970489242 970492284 3042
2352 970496463 970497253 790
2353 970539326 970544022 4696
2354 970554692 970565713 11021
2355 970584625 970586381 1756
2356 970592304 970592491 187
2357 970596480 970608647 12167
2358 970636027 970670056 34029
2359 970672642 970692106 19464
2360 970694627 970696775 2148
2361 970715552 970717706 2154
2362 970724199 970724791 592
2363 970731804 970858696 126892
2364 970891547 970900379 8832
2365 970901164 970922784 21620
2366 970926997 970931207 4210
2367 970958958 970965075 6117
2368 970966115 971002362 36247
2369 971004792 971014282 9490
2370 971026186 971030348 4162
2371 971044771 971046496 1725
2372 971068791 971084705 15914
2373 971085391 971098784 13393
2374 971110609 971110821 212
2375 971114263 971114327 64
2376 971148838 971172026 23188
2377 971175352 971178585 3233
2378 971181822 971187568 5746
2379 971193550 971193604 54
2380 971198668 971201637 2969
2381 971231745 971241018 9273
2382 971244991 971259153 14162
2383 971265717 971271669 5952
2384 971283721 971291138 7417
2385 971291952 971292280 328
2386 971293866 971297521 3655
2387 971321073 971351857 30784
2388 971354464 971361506 7042
2389 971363682 971385649 21967
2390 971387354 971427311 39957
2391 971430972 971450805 19833
2392 971460805 971462611 1806
2393 971502047 971530773 28726
2394 971596522 971622052 25530
