1 1164087769 1164089199 1430
1 1164094997 1164120774 25777
1 1164189280 1164190707 1427
1 1164192120 1164202781 10661
1 1164282707 1164293671 10964
1 1164294747 1164301819 7072
1 1164302025 1164305052 3027
1 1164365225 1164368130 2905
1 1164368507 1164372319 3812
1 1164372707 1164374170 1463
1 1164530854 1164532520 1666
1 1164532604 1164532814 210
1 1164532846 1164536735 3889
1 1164537270 1164537641 371
1 1164600796 1164603464 2668
1 1164664646 1164665292 646
1 1164667196 1164667796 600
1 1164683452 1164686894 3442
1 1164686978 1164700285 13307
1 1164700371 1164710983 10612
1 1164711301 1164720685 9384
1 1164736109 1164737113 1004
1 1164737230 1164740200 2970
1 1164753652 1164755132 1480
1 1164755467 1164756097 630
1 1164756505 1164756770 265
1 1164757095 1164758199 1104
1 1164769702 1164770018 316
1 1164770145 1164774480 4335
1 1164777977 1164782047 4070
1 1164786172 1164791079 4907
1 1164791282 1164793474 2192
1 1164811952 1164812487 535
1 1164815676 1164816998 1322
1 1164817017 1164818178 1161
1 1164820071 1164823070 2999
1 1164823146 1164825365 2219
1 1164825425 1164826375 950
1 1164828755 1164829601 846
1 1164829658 1164833253 3595
1 1165066621 1165071622 5001
1 1165116670 1165117344 674
1 1165117370 1165136316 18946
1 1165142623 1165155683 13060
1 1165155711 1165161123 5412
1 1165161143 1165171827 10684
1 1165171922 1165178869 6947
1 1165178910 1165191024 12114
1 1165191086 1165191419 333
1 1165193311 1165197631 4320
1 1165207624 1165208522 898
1 1165209610 1165211010 1400
1 1165221253 1165226046 4793
1 1165229999 1165230356 357
1 1165232738 1165234173 1435
1 1165237669 1165240613 2944
1 1165309002 1165309205 203
1 1165341122 1165343062 1940
1 1165372614 1165374017 1403
1 1165374049 1165376273 2224
1 1165385939 1165416474 30535
1 1165441494 1165445043 3549
1 1165447384 1165448948 1564
1 1165453495 1165456308 2813
1 1165459287 1165462285 2998
1 1165464183 1165465525 1342
1 1165471951 1165473447 1496
1 1165482091 1165486466 4375
1 1165495987 1165497687 1700
1 1165531683 1165533085 1402
1 1165536840 1165537764 924
1 1165560592 1165564888 4296
1 1165564913 1165566144 1231
1 1165578351 1165591465 13114
1 1165593870 1165594445 575
1 1165618017 1165624794 6777
1 1165626214 1165645269 19055
1 1165654827 1165671634 16807
1 1165702039 1165702624 585
1 1165703030 1165712714 9684
1 1165712782 1165715197 2415
1 1165715236 1165717873 2637
1 1165727654 1165728496 842
1 1165728661 1165729094 433
1 1165729211 1165730211 1000
1 1165730238 1165751638 21400
1 1165753461 1165754540 1079
1 1165759692 1165760979 1287
1 1165764858 1165765381 523
1 1165766257 1165769184 2927
1 1165776564 1165781556 4992
1 1165794104 1165797974 3870
1 1165804250 1165806691 2441
1 1165813743 1165819025 5282
1 1165822045 1165822892 847
1 1165823191 1165823931 740
1 1165824158 1165829538 5380
1 1165831528 1165842926 11398
1 1165844729 1165852715 7986
1 1165853118 1165855614 2496
1 1165866333 1165879416 13083
1 1165889250 1165890632 1382
1 1165892400 1165901544 9144
1 1165901908 1165923570 21662
1 1165929865 1165930213 348
1 1165930319 1165932770 2451
1 1165942401 1165949510 7109
1 1165957050 1165967631 10581
1 1165973419 1165981018 7599
1 1165986498 1165987876 1378
1 1165989595 1165990327 732
1 1165991982 1165992884 902
1 1165994149 1165994759 610
1 1165996695 1165997696 1001
1 1165999733 1166000631 898
1 1166335797 1166337588 1791
1 1166338853 1166342769 3916
1 1166344678 1166345560 882
1 1166358061 1166360595 2534
1 1166362909 1166364478 1569
1 1166365851 1166368397 2546
1 1166387430 1166394981 7551
1 1166398760 1166402755 3995
1 1166405056 1166411640 6584
1 1166413220 1166414886 1666
1 1166426598 1166460326 33728
1 1166470232 1166482852 12620
1 1167940596 1167942010 1414
1 1168046718 1168065110 18392
1 1168127733 1168141494 13761
1 1168217448 1168227039 9591
1 1168230759 1168253752 22993
1 1168257977 1168258405 428
1 1168261760 1168262273 513
1 1168262312 1168274142 11830
1 1168277984 1168278684 700
1 1168278792 1168280050 1258
1 1168280194 1168283394 3200
1 1168286560 1168287443 883
1 1168287559 1168287783 224
1 1168287898 1168288111 213
1 1168288141 1168288688 547
1 1168290656 1168291355 699
1 1168301794 1168324637 22843
1 1168331848 1168347760 15912
1 1168348105 1168353018 4913
1 1168359318 1168362018 2700
1 1168386624 1168388892 2268
1 1168396517 1168399096 2579
1 1168400092 1168411186 11094
1 1168491502 1168500203 8701
1 1168503785 1168510582 6797
1 1168650416 1168651600 1184
1 1168652839 1168668970 16131
1 1168693174 1168695812 2638
1 1168807996 1168813588 5592
1 1168813609 1168817473 3864
1 1168825165 1168825873 708
1 1168826836 1168833703 6867
1 1168849240 1168878582 29342
1 1168878949 1168883629 4680
1 1168883786 1168902680 18894
1 1168921412 1168940100 18688
1 1168949178 1168950618 1440
1 1168952418 1168972317 19899
1 1168977021 1168978382 1361
1 1168981271 1169010110 28839
1 1169018804 1169024592 5788
1 1169035114 1169058225 23111
1 1169069018 1169075954 6936
1 1169086767 1169095413 8646
1 1169209435 1169218062 8627
1 1169237106 1169237834 728
1 1169238942 1169241014 2072
1 1169241197 1169249464 8267
1 1169256221 1169272948 16727
1 1169281141 1169288484 7343
1 1169298517 1169305200 6683
1 1169347116 1169353719 6603
1 1169353884 1169357578 3694
1 1169361481 1169370308 8827
1 1169375262 1169376328 1066
1 1169377877 1169378611 734
1 1169385574 1169386921 1347
1 1169487890 1169489567 1677
1 1169498393 1169499410 1017
1 1169501177 1169503929 2752
1 1169504717 1169547547 42830
1 1169548291 1169561512 13221
1 1169570982 1169574220 3238
1 1169581338 1169584818 3480
1 1169590976 1169601817 10841
1 1169605089 1169616026 10937
1 1169619328 1169656065 36737
1 1169664600 1169664928 328
1 1169674283 1169675640 1357
1 1169679131 1169680643 1512
1 1169685350 1169695954 10604
1 1169701251 1169731140 29889
1 1169733764 1169734565 801
1 1169736357 1169738875 2518
1 1169778586 1169798047 19461
1 1169803380 1169820366 16986
1 1169825229 1169829189 3960
1 1169831018 1169831300 282
1 1169831393 1169838186 6793
1 1169843788 1169859173 15385
1 1169866555 1169908883 42328
1 1169949032 1169991714 42682
1 1169997320 1170003158 5838
1 1170011701 1170013140 1439
1 1170042397 1170042905 508
1 1170059392 1170081383 21991
1 1170086184 1170090181 3997
1 1170092664 1170118554 25890
1 1170122547 1170130731 8184
1 1170131948 1170134371 2423
1 1170139817 1170145789 5972
1 1170145969 1170172048 26079
1 1170197302 1170197756 454
1 1170197989 1170210466 12477
1 1170211872 1170212476 604
1 1170213047 1170223413 10366
1 1170226173 1170232509 6336
1 1170233131 1170234990 1859
1 1170237258 1170255322 18064
1 1170284487 1170329012 44525
1 1170338301 1170342744 4443
1 1170343306 1170356098 12792
1 1170360661 1170368062 7401
1 1170370054 1170382168 12114
1 1170382711 1170386755 4044
1 1170386804 1170387500 696
1 1170387671 1170388055 384
1 1170390525 1170391603 1078
1 1170408849 1170412537 3688
1 1170412717 1170417427 4710
1 1170426776 1170434160 7384
1 1170434162 1170436244 2082
1 1170439061 1170440387 1326
1 1170444087 1170444542 455
1 1170470864 1170473681 2817
1 1170480438 1170481111 673
1 1170488670 1170488895 225
1 1170489010 1170504805 15795
1 1170507083 1170512877 5794
1 1170577681 1170578038 357
1 1170578043 1170578437 394
1 1170578445 1170579078 633
1 1170579080 1170581954 2874
1 1170581957 1170584166 2209
1 1170584171 1170584876 705
1 1170584888 1170585238 350
1 1170585243 1170600465 15222
1 1170602987 1170615326 12339
1 1170618968 1170642623 23655
1 1170645532 1170654624 9092
1 1170658154 1170670569 12415
1 1170677524 1170680718 3194
1 1170695269 1170700523 5254
1 1170703539 1170704557 1018
1 1170708413 1170744979 36566
1 1170745206 1170745847 641
1 1170745893 1170746344 451
1 1170758963 1170772165 13202
1 1170786113 1170789021 2908
1 1170789518 1170802818 13300
1 1170802947 1170814112 11165
1 1170819742 1170820925 1183
1 1170822684 1170823695 1011
1 1170827432 1170827651 219
1 1170831581 1170855238 23657
1 1170860065 1170896413 36348
1 1170899353 1170906761 7408
1 1170910931 1170911531 600
1 1170911658 1170945704 34046
1 1170952435 1170977668 25233
1 1170980981 1171006100 25119
1 1171012571 1171030633 18062
1 1171030725 1171057506 26781
1 1171057510 1171102345 44835
1 1171105407 1171114636 9229
1 1171162565 1171163861 1296
1 1171164074 1171166741 2667
1 1171207956 1171217094 9138
1 1171219353 1171284208 64855
1 1171290226 1171300944 10718
1 1171324463 1171326992 2529
1 1171327997 1171329199 1202
1 1171331871 1171375246 43375
1 1171375653 1171376550 897
1 1171377387 1171378054 667
1 1171378499 1171381591 3092
1 1171382078 1171386522 4444
1 1171388168 1171392584 4416
1 1171394766 1171402164 7398
1 1171402283 1171402975 692
1 1171403078 1171431030 27952
1 1171442037 1171453417 11380
1 1171462355 1171529223 66868
1 1171529388 1171529645 257
1 1171531845 1171618584 86739
1 1171620580 1171629790 9210
1 1171636288 1171637008 720
1 1171643813 1171646616 2803
1 1171657019 1171666295 9276
1 1171672707 1171683060 10353
1 1171685441 1171697059 11618
1 1171700302 1171710460 10158
1 1171714107 1171722309 8202
1 1171745140 1171752780 7640
1 1171755184 1171782384 27200
1 1171784637 1171787501 2864
1 1171789248 1171789963 715
1 1171792198 1171795511 3313
1 1171797657 1171798098 441
1 1171800258 1171817988 17730
1 1171824058 1171829701 5643
1 1171851591 1171863777 12186
1 1171872741 1171907095 34354
1 1171907366 1171917326 9960
1 1171917426 1171922674 5248
1 1171924945 1171935304 10359
1 1171940802 1171957198 16396
1 1171958820 1171974803 15983
1 1171978367 1171991975 13608
1 1172024209 1172046891 22682
1 1172058299 1172062779 4480
1 1172071226 1172075434 4208
1 1172080824 1172083130 2306
1 1172083219 1172085000 1781
1 1172087774 1172090423 2649
1 1172092768 1172134323 41555
1 1172138591 1172141666 3075
1 1172146055 1172152802 6747
1 1172154189 1172155614 1425
1 1172162617 1172209770 47153
1 1172214834 1172223895 9061
1 1172228911 1172276821 47910
1 1172276823 1172291457 14634
1 1172297380 1172329436 32056
1 1172362756 1172370992 8236
1 1172371031 1172376215 5184
1 1172381828 1172387194 5366
1 1172388885 1172395489 6604
1 1172395492 1172396324 832
1 1172397672 1172402517 4845
1 1172402521 1172404228 1707
1 1172410479 1172418810 8331
1 1172425477 1172425773 296
1 1172425777 1172431159 5382
1 1172448394 1172448823 429
1 1172448828 1172457783 8955
1 1172460358 1172463760 3402
1 1172470242 1172472786 2544
1 1172476621 1172486013 9392
1 1172486083 1172490026 3943
1 1172496533 1172499451 2918
1 1172523755 1172534016 10261
1 1172536171 1172552345 16174
1 1172553948 1172564416 10468
1 1172570528 1172594834 24306
1 1172601847 1172602719 872
1 1172602727 1172606424 3697
1 1172615948 1172616282 334
1 1172619601 1172634627 15026
1 1172634702 1172635040 338
1 1172642601 1172643344 743
1 1172644107 1172688161 44054
1 1172695344 1172709598 14254
1 1172712317 1172724659 12342
1 1172728066 1172732295 4229
1 1172773832 1172785517 11685
1 1172803369 1172812066 8697
1 1172818798 1172822368 3570
1 1172826558 1172835843 9285
1 1172835862 1172844087 8225
1 1172844089 1172849131 5042
1 1172878203 1172934078 55875
1 1172965988 1172973746 7758
1 1172977198 1172979423 2225
1 1172986824 1172987467 643
1 1172987695 1173013560 25865
1 1173038500 1173053149 14649
1 1173054470 1173054841 371
1 1173059277 1173059717 440
1 1173059743 1173060213 470
1 1173061367 1173070650 9283
1 1173075301 1173076082 781
1 1173076321 1173097632 21311
1 1173102377 1173113944 11567
1 1173116734 1173121411 4677
1 1173141411 1173141783 372
1 1173141793 1173165552 23759
1 1173171305 1173171605 300
1 1173171730 1173187652 15922
1 1173194216 1173194887 671
1 1173196821 1173203041 6220
1 1173203113 1173203660 547
1 1173207540 1173231577 24037
1 1173233672 1173267230 33558
1 1173269805 1173272929 3124
1 1173272994 1173297618 24624
1 1173351833 1173354361 2528
1 1173354431 1173355387 956
1 1173360370 1173360746 376
1 1173393698 1173400845 7147
1 1173408328 1173414733 6405
1 1173423067 1173469551 46484
1 1173472498 1173500025 27527
1 1173505813 1173524175 18362
1 1173526941 1173535269 8328
1 1173573159 1173574008 849
1 1173579290 1173579561 271
1 1173579619 1173580476 857
1 1173585059 1173587082 2023
1 1173587159 1173589107 1948
1 1173590757 1173593675 2918
1 1173595426 1173607280 11854
1 1173611047 1173616737 5690
1 1173641571 1173643602 2031
1 1173644419 1173653021 8602
1 1173659464 1173673886 14422
1 1173673887 1173715473 41586
1 1173715619 1173715859 240
1 1173716134 1173716441 307
1 1173720336 1173729836 9500
1 1173729935 1173750209 20274
1 1173753145 1173807041 53896
1 1173812944 1173826277 13333
1 1173826675 1173843999 17324
1 1173847351 1173850108 2757
1 1173852774 1173855162 2388
1 1173855207 1173856825 1618
1 1173859322 1173900023 40701
1 1173900026 1173900481 455
1 1173900493 1173901324 831
1 1173901325 1173901843 518
1 1173906028 1173906375 347
1 1173919167 1173976546 57379
1 1173985537 1173989054 3517
1 1173989200 1173997197 7997
1 1173997280 1174006252 8972
1 1174006375 1174063138 56763
1 1174065275 1174065550 275
1 1174073913 1174124159 50246
1 1174127198 1174130423 3225
1 1174131981 1174133484 1503
1 1174133576 1174140257 6681
1 1174172662 1174178893 6231
1 1174180671 1174183658 2987
1 1174192622 1174240984 48362
1 1174257200 1174261927 4727
1 1174265120 1174272527 7407
1 1174355712 1174356391 679
1 1174356404 1174382465 26061
1 1174388836 1174404643 15807
1 1174407096 1174420517 13421
1 1174423520 1174424386 866
1 1174424389 1174445831 21442
1 1174449011 1174467894 18883
1 1174471213 1174490438 19225
1 1174493038 1174525560 32522
1 1174536201 1174556510 20309
1 1174559558 1174563059 3501
1 1174564398 1174642669 78271
1 1174644171 1174648294 4123
1 1174659798 1174683225 23427
1 1174685834 1174694542 8708
1 1174697048 1174701498 4450
1 1174701581 1174711372 9791
1 1174713285 1174716299 3014
1 1174718425 1174744823 26398
1 1174770805 1174775677 4872
1 1174778042 1174786997 8955
1 1174786998 1174796291 9293
1 1174816069 1174817126 1057
1 1174819351 1174830982 11631
1 1174880965 1174882764 1799
1 1174885521 1174900383 14862
1 1174924785 1174936629 11844
1 1174938887 1174951189 12302
1 1174953063 1174963250 10187
1 1174966499 1174989107 22608
1 1174991571 1175005926 14355
1 1175008116 1175017888 9772
1 1175026468 1175048869 22401
1 1175056349 1175076776 20427
1 1175081059 1175092749 11690
1 1175095225 1175110716 15491
1 1175114102 1175115502 1400
1 1175124884 1175185598 60714
1 1175188914 1175213494 24580
1 1175226600 1175241282 14682
1 1175254842 1175270151 15309
1 1175272976 1175278307 5331
1 1175291233 1175305940 14707
1 1175307788 1175346161 38373
1 1175387900 1175389791 1891
1 1175390314 1175407684 17370
1 1175417166 1175437176 20010
1 1175440952 1175458673 17721
1 1175459072 1175482205 23133
1 1175555219 1175557562 2343
1 1175559003 1175572254 13251
1 1175576431 1175577939 1508
1 1175578372 1175590797 12425
1 1175592587 1175607111 14524
1 1175608134 1175608437 303
1 1175613195 1175622299 9104
1 1175650658 1175653529 2871
1 1175653827 1175661471 7644
1 1175661479 1175661948 469
1 1175664974 1175674868 9894
1 1175681408 1175693186 11778
1 1175696574 1175705334 8760
1 1175707280 1175713577 6297
1 1175714372 1175726426 12054
1 1175730193 1175761375 31182
1 1175763829 1175771194 7365
1 1175773467 1175787563 14096
1 1175789620 1175805747 16127
1 1175809042 1175826548 17506
1 1175829132 1175861674 32542
1 1175864533 1175882057 17524
1 1175882058 1175894543 12485
1 1175896934 1175901242 4308
1 1175908888 1175920863 11975
1 1175924115 1175925000 885
1 1175927593 1175948590 20997
1 1175951739 1175954199 2460
1 1175987192 1175993267 6075
1 1176003108 1176007600 4492
1 1176007616 1176008256 640
1 1176008272 1176009968 1696
1 1176009984 1176013616 3632
1 1176013632 1176017952 4320
1 1176017968 1176018608 640
1 1176018624 1176019248 624
1 1176019328 1176020960 1632
1 1176021216 1176022032 816
1 1176022048 1176022336 288
1 1176022352 1176028294 5942
1 1176035500 1176048028 12528
1 1176161618 1176192490 30872
1 1176196960 1176214183 17223
1 1176215133 1176240003 24870
1 1176240818 1176243552 2734
1 1176246666 1176255831 9165
1 1176258787 1176262900 4113
1 1176268867 1176280677 11810
1 1176289567 1176294579 5012
1 1176300290 1176339845 39555
1 1176342081 1176350520 8439
1 1176352582 1176372510 19928
1 1176395856 1176423307 27451
1 1176425174 1176441422 16248
1 1176450667 1176472218 21551
1 1176476070 1176489507 13437
1 1176497736 1176516597 18861
1 1176518959 1176531370 12411
1 1176533644 1176553681 20037
1 1176598899 1176607332 8433
1 1176609893 1176622773 12880
1 1176625291 1176652815 27524
1 1176678262 1176680834 2572
1 1176684149 1176696387 12238
1 1176698654 1176703191 4537
1 1176705963 1176722647 16684
1 1176724139 1176739227 15088
1 1176755414 1176764180 8766
1 1176764853 1176767385 2532
1 1176767569 1176778112 10543
1 1176786440 1176803591 17151
1 1176804232 1176810803 6571
1 1176812777 1176841982 29205
1 1176846827 1176847623 796
1 1176848015 1176858685 10670
1 1176860565 1176886853 26288
1 1176889021 1176902816 13795
1 1176907015 1176922463 15448
1 1176922521 1176926963 4442
1 1176926965 1176952447 25482
1 1176959011 1177018950 59939
1 1177026739 1177049130 22391
1 1177074678 1177105788 31110
1 1177123526 1177164045 40519
1 1177209746 1177223289 13543
1 1177225925 1177258288 32363
1 1177281673 1177329082 47409
1 1177331081 1177333845 2764
1 1177369164 1177369720 556
1 1177370095 1177392010 21915
1 1177394964 1177406716 11752
1 1177409232 1177418668 9436
1 1177434057 1177435023 966
1 1177435264 1177447335 12071
1 1177520308 1177541567 21259
1 1177654078 1177656078 2000
1 1177658597 1177672779 14182
1 1177733102 1177768904 35802
1 1177796486 1177803870 7384
1 1177811496 1177821009 9513
1 1177824246 1177825125 879
1 1177839098 1177859718 20620
1 1177877718 1177884996 7278
1 1177980643 1177982476 1833
1 1177985323 1177988567 3244
1 1178019619 1178027601 7982
1 1178029473 1178031433 1960
1 1178066630 1178067033 403
1 1178071712 1178084106 12394
1 1178086457 1178088584 2127
1 1178106583 1178109462 2879
1 1178112398 1178140496 28098
1 1178145614 1178193204 47590
1 1178196470 1178209034 12564
1 1178209133 1178254016 44883
1 1178269976 1178285782 15806
1 1178287651 1178290830 3179
1 1180982425 1180995429 13004
1 1180998096 1181022600 24504
1 1181029950 1181030945 995
1 1181047872 1181057421 9549
1 1181092531 1181107145 14614
1 1181113427 1181138186 24759
1 1181143878 1181156249 12371
1 1181172991 1181210134 37143
1 1181239268 1181251370 12102
1 1181254134 1181285196 31062
1 1181290540 1181307521 16981
1 1181326180 1181351746 25566
1 1181355209 1181365061 9852
1 1181383156 1181386009 2853
1 1181390091 1181392342 2251
1 1181445240 1181450466 5226
1 1181453120 1181458095 4975
1 1181477167 1181477595 428
1 1181480212 1181490871 10659
1 1181500456 1181520526 20070
1 1181529193 1181577191 47998
1 1181577312 1181580023 2711
1 1181615023 1181629244 14221
1 1181640958 1181641666 708
1 1181641722 1181641965 243
1 1181642685 1181644122 1437
1 1181644587 1181650170 5583
1 1181650230 1181656290 6060
1 1181656350 1181659530 3180
1 1181659650 1181660987 1337
1 1181666517 1181681075 14558
1 1181681173 1181689072 7899
1 1181692782 1181696938 4156
1 1181697009 1181730817 33808
1 1181767534 1181776118 8584
1 1181779748 1181845005 65257
1 1181848883 1181851859 2976
1 1181859793 1181889848 30055
1 1181895746 1181909722 13976
1 1181911829 1181927860 16031
1 1181953922 1181982263 28341
1 1181984880 1181985668 788
1 1181998222 1182002508 4286
1 1182212336 1182214344 2008
1 1182215940 1182312477 96537
1 1182320159 1182334732 14573
1 1182337374 1182350175 12801
1 1182353210 1182373478 20268
1 1182375875 1182402820 26945
1 1182404853 1182422272 17419
1 1182424943 1182426062 1119
1 1182427665 1182450914 23249
1 1182459995 1182466732 6737
1 1182468832 1182471466 2634
1 1182474559 1182478039 3480
1 1182483357 1182493243 9886
1 1182500432 1182513308 12876
1 1182524287 1182532815 8528
1 1182537944 1182538730 786
1 1182540664 1182553786 13122
1 1182555704 1182558443 2739
1 1182583304 1182587249 3945
1 1182604433 1182607274 2841
1 1182648962 1182653017 4055
1 1182657344 1182666816 9472
1 1182670054 1182710105 40051
1 1182710220 1182712423 2203
1 1182718673 1182726561 7888
1 1182726725 1182727538 813
1 1182727983 1182732811 4828
1 1182738989 1182803613 64624
1 1182803680 1182817363 13683
1 1182817423 1182817783 360
1 1182817903 1182818743 840
1 1182818863 1182822816 3953
1 1182836861 1182839696 2835
1 1182839716 1182844687 4971
1 1182851242 1182876756 25514
1 1182878244 1182882985 4741
1 1182890630 1182893526 2896
1 1182893540 1182897723 4183
1 1182907848 1182968079 60231
1 1182978693 1182980413 1720
1 1182991164 1182992669 1505
1 1182994476 1182998512 4036
1 1183000565 1183000953 388
1 1183003246 1183008871 5625
1 1183012258 1183086109 73851
1 1183090199 1183093427 3228
1 1183101507 1183144268 42761
1 1183146911 1183161428 14517
1 1183164668 1183175579 10911
1 1183175765 1183194808 19043
1 1183196907 1183207449 10542
1 1183211486 1183220807 9321
1 1183226260 1183241629 15369
1 1183244287 1183273715 29428
1 1183277870 1183298457 20587
1 1183324519 1183335264 10745
1 1183336509 1183337172 663
1 1183337292 1183338263 971
1 1183344636 1183357910 13274
1 1184033240 1184072323 39083
1 1184098680 1184101352 2672
1 1184101627 1184102995 1368
1 1184103002 1184107052 4050
1 1184151849 1184202810 50961
1 1184204772 1184212989 8217
1 1184462587 1184475182 12595
1 1184479264 1184528380 49116
1 1184537237 1184538428 1191
1 1184538452 1184539877 1425
1 1184540344 1184558101 17757
1 1184563526 1184566384 2858
1 1184567976 1184577383 9407
1 1184581315 1184604591 23276
1 1184608167 1184608485 318
1 1184610648 1184612256 1608
1 1184612306 1184612976 670
1 1184615860 1184616790 930
1 1184616813 1184625908 9095
1 1184648800 1184682939 34139
1 1184687955 1184688494 539
1 1184688520 1184689546 1026
1 1184689570 1184702340 12770
1 1184720612 1184723915 3303
1 1184723975 1184734465 10490
1 1184738828 1184753291 14463
1 1184766352 1184766593 241
1 1184767673 1184769173 1500
1 1184780153 1184784541 4388
1 1184794970 1184796474 1504
1 1184798166 1184812365 14199
1 1184843190 1184854322 11132
1 1184857169 1184864855 7686
1 1184867933 1184914218 46285
1 1184916631 1184926573 9942
1 1184930810 1184975570 44760
1 1184979977 1184980231 254
1 1184982205 1185009050 26845
1 1185083105 1185094268 11163
1 1185094508 1185097448 2940
1 1185097688 1185098048 360
1 1185098348 1185099008 660
1 1185099668 1185100448 780
1 1185100508 1185102411 1903
1 1185144018 1185154003 9985
1 1185157515 1185160868 3353
1 1185179383 1185209254 29871
1 1185210951 1185212379 1428
1 1185244709 1185258236 13527
1 1185258283 1185307302 49019
1 1185335781 1185380559 44778
1 1185382893 1185395109 12216
1 1185422899 1185454497 31598
1 1185456195 1185480149 23954
1 1185502632 1185509870 7238
1 1185511780 1185566556 54776
1 1185582175 1185583816 1641
1 1185583939 1185608718 24779
1 1185615253 1185631465 16212
1 1185657012 1185657618 606
1 1185658405 1185661973 3568
1 1185663125 1185667694 4569
1 1185667824 1185686035 18211
1 1185688132 1185692842 4710
1 1185694830 1185703715 8885
1 1185706559 1185714093 7534
1 1185717213 1185725680 8467
1 1185752703 1185764509 11806
1 1185766527 1185813600 47073
1 1185834803 1185841804 7001
1 1185844430 1185852415 7985
1 1185859289 1185877297 18008
1 1185884855 1185898649 13794
1 1185908557 1185909696 1139
1 1185911226 1185912267 1041
1 1185919760 1185924698 4938
1 1185928394 1185935428 7034
1 1185938678 1185961200 22522
1 1185963700 1185999074 35374
1 1186004105 1186037161 33056
1 1186037177 1186054457 17280
1 1186058184 1186061163 2979
1 1186062778 1186081491 18713
1 1186091991 1186095020 3029
1 1186099167 1186107557 8390
1 1186108971 1186119405 10434
1 1186124539 1186181960 57421
1 1186192238 1186201219 8981
1 1186203173 1186235394 32221
1 1186295253 1186304054 8801
1 1186307186 1186329783 22597
1 1186352757 1186418824 66067
1 1186447247 1186460391 13144
1 1186461993 1186490403 28410
1 1186492564 1186499610 7046
1 1186525342 1186528322 2980
1 1186531497 1186546594 15097
1 1186549117 1186561208 12091
1 1186567274 1186609762 42488
1 1186642718 1186664342 21624
1 1186670535 1186676273 5738
1 1186678228 1186679835 1607
1 1186683520 1186694318 10798
1 1186696763 1186707549 10786
1 1186711196 1186719874 8678
1 1186723943 1186733720 9777
1 1186735200 1186767946 32746
1 1186772033 1186818067 46034
1 1186823203 1186825265 2062
1 1186825445 1186840847 15402
1 1186876228 1186876539 311
1 1186878951 1186893397 14446
1 1186896637 1186939867 43230
1 1186953082 1187001382 48300
1 1187004229 1187018570 14341
1 1187023759 1187039542 15783
1 1187041639 1187048797 7158
1 1187050446 1187052164 1718
1 1187053501 1187061743 8242
1 1187083263 1187124167 40904
1 1187127296 1187141918 14622
1 1187143810 1187144699 889
1 1187150318 1187225084 74766
1 1187227032 1187232087 5055
1 1187242738 1187243529 791
1 1187247638 1187276788 29150
1 1187278803 1187300383 21580
1 1187304896 1187307747 2851
1 1187310864 1187312020 1156
1 1187313588 1187353743 40155
1 1187356678 1187360176 3498
1 1187366006 1187440026 74020
1 1187441993 1187443322 1329
1 1187483745 1187494760 11015
1 1187499243 1187517063 17820
1 1187523988 1187600980 76992
1 1187606122 1187606810 688
1 1187609751 1187617289 7538
1 1187618770 1187619133 363
1 1187619153 1187627224 8071
1 1187634942 1187651493 16551
1 1187652923 1187656721 3798
1 1187681364 1187693287 11923
1 1187695571 1187733618 38047
