831520925 831520942
831676747 831676764
832144714 832144732
832144737 832144754
832144760 832144777
832144766 832144783
832144775 832144792
832145421 832145438
832145432 832145449
832145437 832145454
832175303 832175320
832179229 832179246
832179250 832179267
832180518 832180535
832180531 832180548
832180535 832180552
832180544 832180561
832180549 832180567
832180572 832180589
832180578 832180595
832180602 832180619
832180609 832180626
832180617 832180637
832180628 832180645
832180639 832180656
832180650 832180667
832180658 832180675
832180687 832180704
832180695 832180712
832200939 832200962
832200965 832200983
832200975 832200994
832201811 832201834
832201835 832201852
832283647 832283664
832342029 832342046
832360645 832360662
832360650 832360670
832360670 832360687
832360677 832360694
832360684 832360701
832360695 832360715
832367008 832367025
832367025 832367044
832373222 832373239
832373249 832373266
832373256 832373274
832373273 832373290
832373277 832373294
832373285 832373302
832373301 832373318
832373306 832373323
832373310 832373327
832712998 832713015
832713503 832713520
832856677 832856694
832953061 832953078
833304670 833304687
833304688 833304705
833304697 833304719
833304714 833304731
833304726 833304743
833304737 833304755
833304755 833304772
833304761 833304778
833304766 833304783
833304788 833304805
833340782 833340799
833537747 833537764
833591425 833591442
833624724 833624741
833667702 833667719
833688487 833688504
833692475 833692492
833744885 833744902
833757846 833757863
833832965 833832982
833853341 833853358
833913707 833913724
833917801 833917818
834040675 834040692
834285003 834285020
834409744 834409761
834439880 834439897
834623781 834623798
834740937 834740954
834874357 834874374
834874400 834874417
834932845 834932862
835148477 835148494
835154018 835154035
835267947 835267964
835372507 835372524
835392187 835392204
835479395 835479412
835555559 835555576
835557045 835557063
835574355 835574372
835638725 835638742
835731773 835731790
835738651 835738668
835814450 835814469
835814461 835814478
835999719 835999738
835999736 835999753
836034662 836034679
836081943 836081960
836164332 836164349
836167237 836167254
836183875 836183894
836183883 836183900
836183891 836183908
836183916 836183933
836236114 836236131
836236655 836236672
836237176 836237193
836243532 836243549
836273717 836273734
836515678 836515695
836560932 836560949
836564666 836564683
836588781 836588798
836632783 836632800
836632787 836632806
836632806 836632824
836632827 836632844
836632833 836632850
836632839 836632856
836632852 836632869
836632865 836632882
836632875 836632892
836632880 836632897
836632892 836632910
836632901 836632918
836632907 836632924
836632955 836632973
836632966 836632983
836633197 836633214
836718578 836718595
836724025 836724042
836725641 836725658
836728872 836728889
836768998 836769015
836772008 836772025
836772020 836772037
836798104 836798121
836798889 836798906
836803711 836803728
836934871 836934888
837028353 837028370
837154369 837154386
837155011 837155028
837155160 837155177
837155185 837155202
837155284 837155301
837155460 837155477
837155520 837155537
837162888 837162906
837162894 837162911
837162904 837162921
837162913 837162930
837162958 837162975
837162963 837162980
837162968 837162985
837162974 837162991
837163042 837163059
837163075 837163092
837209808 837209825
837218906 837218923
837223421 837223438
837223441 837223458
837229681 837229698
837373609 837373626
837376490 837376507
837457200 837457217
837509132 837509149
837510004 837510021
837592818 837592835
837597491 837597508
837780243 837780260
837797072 837797089
837831140 837831157
837934505 837934522
837954746 837954763
838086375 838086392
838130905 838130922
838160332 838160349
838160337 838160354
838165067 838165084
838200074 838200091
838261984 838262001
838388666 838388683
838410423 838410440
838421331 838421348
838428896 838428913
838450901 838450918
838578149 838578166
838578169 838578186
838596641 838596658
838598561 838598578
838601418 838601435
838753551 838753568
838910822 838910839
839033939 839033956
839102701 839102718
839102748 839102765
839102902 839102919
839151777 839151794
839160777 839160794
839166943 839166960
839166961 839166978
839166989 839167006
839167150 839167167
839169324 839169341
839169914 839169931
839172416 839172433
839191198 839191215
839191301 839191318
839191352 839191369
839192138 839192155
839198880 839198898
839198888 839198905
839204967 839204984
839264453 839264470
839270803 839270820
839273260 839273277
839273275 839273292
839289172 839289189
839296494 839296511
839305517 839305534
839305588 839305605
839305604 839305621
839305655 839305672
839305665 839305682
839311113 839311130
839311120 839311137
839311139 839311156
839311176 839311193
839359552 839359569
839370754 839370771
839596761 839596778
839629311 839629328
839780703 839780720
839783098 839783115
839796103 839796120
839961208 839961225
840130899 840130916
840144738 840144755
840189722 840189739
840270105 840270122
840320348 840320365
840332332 840332349
840332342 840332359
840332357 840332374
840332372 840332389
840332376 840332393
840406172 840406189
840417651 840417671
840418544 840418561
840418565 840418583
840418582 840418599
840431089 840431106
840474597 840474614
840585709 840585726
840648651 840648668
840648657 840648674
840648710 840648727
840824145 840824162
840825402 840825419
840830081 840830098
840837460 840837477
841002691 841002708
841003011 841003028
841023796 841023813
841050508 841050528
841050521 841050538
841050525 841050542
841050535 841050553
841050541 841050561
841050594 841050611
841073090 841073107
841080198 841080215
841181521 841181538
841213560 841213577
841231047 841231064
841251687 841251704
841476642 841476659
841528426 841528443
841609156 841609173
841689229 841689246
841769426 841769443
841915462 841915479
842272442 842272459
842275706 842275723
842285268 842285285
842309465 842309482
842340485 842340502
842447043 842447060
842533737 842533755
842533742 842533759
842574698 842574715
842577039 842577056
842627980 842627997
842636811 842636828
842660295 842660312
842710774 842710791
842772586 842772603
842791860 842791877
842796365 842796382
842800761 842800778
842831231 842831248
842834610 842834627
842863210 842863227
842871725 842871742
842881699 842881716
842902565 842902582
842902574 842902591
842913586 842913603
842913607 842913624
842913646 842913663
842914204 842914221
842947621 842947638
842978889 842978906
842987096 842987113
842990935 842990952
843000767 843000784
843148419 843148436
843154952 843154969
843171827 843171844
843199353 843199370
843236752 843236769
843494775 843494793
843508539 843508556
843526529 843526546
843664198 843664215
843713618 843713635
843726705 843726722
843848428 843848445
843855501 843855518
843896520 843896537
843910225 843910244
843949407 843949424
843949506 843949525
843957206 843957223
843960962 843960979
843965544 843965561
843982207 843982224
843986110 843986127
843986193 843986210
844031867 844031884
844032156 844032173
844035128 844035145
844039398 844039415
844095879 844095896
844096680 844096697
844096753 844096770
844182988 844183005
844189232 844189249
844204387 844204404
844221661 844221678
844223715 844223732
844377408 844377425
844377422 844377439
844378155 844378172
844378731 844378748
844378787 844378804
844393262 844393279
844419534 844419551
844420359 844420376
844420430 844420447
844420457 844420474
844420488 844420505
844420563 844420580
844420594 844420611
844442210 844442227
845411541 845411558
845462855 845462872
845475631 845475648
845495318 845495335
845540489 845540506
845540493 845540510
845540499 845540516
845899007 845899024
846282406 846282423
846504219 846504236
846504443 846504460
846642349 846642366
846642357 846642374
846642424 846642441
846642436 846642453
846642442 846642459
846642456 846642473
846642468 846642485
846646204 846646221
846684057 846684074
846919955 846919972
846922931 846922948
847002721 847002738
847003046 847003063
847123169 847123186
847197556 847197573
847347572 847347589
847499656 847499673
847516240 847516257
