847651127 847651144
847658566 847658583
847827107 847827124
847827602 847827619
847850331 847850348
847881994 847882011
847985212 847985229
847998119 847998136
848007189 848007206
848011273 848011290
848345320 848345337
848594192 848594209
848812603 848812621
848823118 848823135
849018042 849018059
849465591 849465608
849538834 849538851
849905752 849905769
850111217 850111234
850437870 850437887
850735610 850735627
850738802 850738819
850738933 850738950
850748389 850748406
851280651 851280668
851291738 851291755
851918275 851918292
851969821 851969838
852064714 852064731
852329292 852329309
852487716 852487733
852587088 852587105
853098905 853098922
853349305 853349322
853358868 853358885
853390631 853390648
853405759 853405776
853518599 853518616
853668649 853668666
854475208 854475225
854744107 854744124
856056987 856057004
856058048 856058065
856153641 856153658
856725849 856725866
857661383 857661400
857735179 857735196
857741813 857741830
857748803 857748820
858081047 858081064
858111116 858111133
858197561 858197578
858274329 858274346
858369133 858369150
858372388 858372405
858541506 858541523
859074305 859074322
859098382 859098399
859215249 859215266
859758235 859758252
859821856 859821873
859926200 859926217
859931623 859931640
860359114 860359131
860367291 860367308
860441406 860441423
860447857 860447874
860968204 860968221
861035831 861035848
861035896 861035913
861118437 861118454
861997934 861997951
