831360070 831360087
832015088 832015105
833056326 833056343
834356410 834356427
835725112 835725129
836760598 836760615
836836513 836836530
836841254 836841271
836841672 836841689
836841848 836841865
836841974 836841991
836842247 836842264
836843831 836843848
837448178 837448196
837449518 837449535
837451444 837451461
837451574 837451591
837451648 837451665
837451654 837451671
837539718 837539735
837550507 837550524
838499722 838499739
838657240 838657257
838660550 838660567
839084218 839084235
839106114 839106131
839119053 839119070
839609304 839609321
839772868 839772885
840749138 840749155
840828914 840828931
841009796 841009813
842372393 842372410
842811035 842811055
842811079 842811096
842811129 842811146
842811333 842811350
842811361 842811382
842827082 842827099
843586227 843586244
843850514 843850531
843862177 843862194
844101613 844101630
844122495 844122512
844180398 844180415
845416709 845416726
845664168 845664185
845671881 845671898
846313258 846313275
847119839 847119856
847123459 847123476
