831407589 831407606
832856677 832856694
833624883 833624900
836164332 836164349
836167237 836167254
836236114 836236131
836236655 836236672
836237176 836237193
836256667 836256684
836844555 836844572
836998162 836998179
837134245 837134262
837205210 837205227
837498702 837498719
837597491 837597508
837948445 837948462
838121878 838121895
838200074 838200091
838428896 838428913
838601418 838601435
838870592 838870609
838943999 838944016
838960776 838960793
839057623 839057640
839164190 839164207
839166377 839166394
839270803 839270820
839289172 839289189
839296494 839296511
839370754 839370771
840650388 840650405
840825402 840825419
840830081 840830098
841073339 841073356
841231047 841231064
842272442 842272459
842447043 842447060
842574698 842574715
842577039 842577056
842627980 842627997
842660295 842660312
842772586 842772603
842791860 842791877
842800761 842800778
842834610 842834627
842863210 842863227
842871725 842871742
842881699 842881716
842947621 842947638
842978889 842978906
842990935 842990952
843148419 843148436
843154952 843154969
843199353 843199370
843236752 843236769
844221661 844221678
846250098 846250115
846333216 846333233
847197556 847197573
