848233316 848233333
848318439 848318456
848365644 848365661
848491199 848491216
849465721 849465738
849519023 849519040
849615024 849615041
850127089 850127106
850521538 850521555
850735607 850735624
850908052 850908069
850959994 850960011
851214091 851214108
851257889 851257906
851732235 851732252
851778963 851778980
851998667 851998684
852377943 852377960
852438601 852438618
852463462 852463479
852551777 852551794
853029177 853029194
853068403 853068420
853164622 853164639
853241525 853241542
853285172 853285189
853682142 853682159
853849729 853849746
854624357 854624374
854792948 854792965
854884760 854884777
855149821 855149838
855494023 855494040
855573378 855573395
855782145 855782162
855921701 855921718
856378463 856378480
856380648 856380665
856380656 856380673
856418513 856418530
856787864 856787881
857060957 857060974
857228481 857228498
857327201 857327218
857394755 857394772
858448553 858448570
858600571 858600588
858656271 858656288
858660352 858660369
858662158 858662175
858664044 858664061
858665862 858665879
858667719 858667736
858671392 858671409
858673200 858673217
858675087 858675104
858676903 858676920
858678771 858678788
858680577 858680594
858682415 858682432
858684214 858684231
858686071 858686088
858687877 858687894
858689715 858689732
858733529 858733546
858735840 858735857
858737893 858737910
858739850 858739867
858741865 858741882
858743652 858743669
858745558 858745575
858747366 858747383
858749233 858749250
858751041 858751058
858754704 858754721
858756601 858756618
858758398 858758415
858760256 858760273
858762034 858762051
858763940 858763957
858765797 858765814
858767645 858767662
858769639 858769656
858771713 858771730
858773540 858773557
858775447 858775464
858777413 858777430
858779289 858779306
858781313 858781330
858783358 858783375
858785294 858785311
858787674 858787691
858789975 858789992
858835192 858835209
858837117 858837134
858839113 858839130
858841464 858841481
858844467 858844484
858846898 858846915
858849356 858849373
858851144 858851161
858853080 858853097
858855055 858855072
858856999 858857016
858858977 858858994
858860959 858860976
858862985 858863002
858865257 858865274
858867242 858867259
858874906 858874923
858877268 858877285
858906859 858906876
858909180 858909197
858911274 858911291
858913231 858913248
858915247 858915264
858917249 858917266
858919127 858919144
858920954 858920971
858922840 858922857
858924678 858924695
858928363 858928380
858930238 858930255
858932044 858932061
858933931 858933948
858935750 858935767
858937635 858937652
858939423 858939440
858941299 858941316
858943127 858943144
858944976 858944993
858946803 858946820
858948658 858948675
858952362 858952379
858954398 858954415
858956441 858956458
858961142 858961159
858963889 858963906
858996098 858996115
858998525 858998542
859001461 859001478
859004008 859004025
859007128 859007145
859009776 859009793
859012315 859012332
859014714 859014731
859017124 859017141
859019131 859019148
859021303 859021320
859023555 859023572
859025610 859025627
859027694 859027711
859030026 859030043
859032267 859032284
859039220 859039237
859041581 859041598
859081375 859081392
859083381 859083398
859085790 859085807
859088160 859088177
859091085 859091102
859093435 859093452
859095904 859095921
859097909 859097926
859099962 859099979
859102273 859102290
859104290 859104307
859106394 859106411
859108478 859108495
859110285 859110302
859112350 859112367
859114164 859114181
859116132 859116149
859118098 859118115
859119984 859120001
859122039 859122056
859132617 859132634
859175195 859175212
859177576 859177593
859179630 859179647
859181391 859181408
859183474 859183491
859185291 859185308
859187199 859187216
859191118 859191135
859192926 859192943
859194792 859194809
859198496 859198513
859200334 859200351
859202169 859202186
859204155 859204172
859206031 859206048
859209993 859210010
859212147 859212164
859214190 859214207
859216235 859216252
859254401 859254418
859256454 859256471
859258529 859258546
859260485 859260502
859262460 859262477
859264277 859264294
859266134 859266151
859267962 859267979
859269886 859269903
859271714 859271731
859273571 859273588
859275387 859275404
859277244 859277261
859279052 859279069
859280898 859280915
859282707 859282724
859284612 859284629
859286420 859286437
859288277 859288294
859290095 859290112
859292009 859292026
859293839 859293856
859295723 859295740
859297523 859297540
859299566 859299583
859301938 859301955
859304695 859304712
859342810 859342827
859345157 859345174
859347638 859347655
859350008 859350025
859352763 859352780
859355391 859355408
859358236 859358253
859363866 859363883
859366196 859366213
859368576 859368593
859370700 859370717
859372863 859372880
859375292 859375309
859377594 859377611
859379552 859379569
859381694 859381711
859390267 859390284
859406061 859406078
859409041 859409058
859411442 859411459
859413774 859413791
859416519 859416536
859418949 859418966
859421398 859421415
859423434 859423451
859425853 859425870
859427819 859427836
859429747 859429764
859431722 859431739
859433775 859433792
859435750 859435767
859437617 859437634
859439621 859439638
859441497 859441514
859443287 859443304
859445380 859445397
859447186 859447203
859449105 859449122
859450951 859450968
859452839 859452856
859454802 859454819
859456659 859456676
859458556 859458573
859460481 859460498
859462278 859462295
859464313 859464330
859466103 859466120
859467997 859468014
859470034 859470051
859472305 859472322
859474479 859474496
859517244 859517261
859519960 859519977
859524258 859524275
859526193 859526210
859528306 859528323
859530144 859530161
859534075 859534092
859536140 859536157
859540899 859540916
859542925 859542942
859544940 859544957
859547061 859547078
859549474 859549491
859564060 859564077
859566778 859566795
859580814 859580831
859603501 859603518
859605495 859605512
859607581 859607598
859609593 859609610
859611658 859611675
859613972 859613989
859616014 859616031
859618009 859618026
859622365 859622382
859624171 859624188
859626524 859626541
859629605 859629622
859632065 859632082
859635234 859635251
859637565 859637582
859640627 859640644
859690545 859690562
859690693 859690710
859692819 859692836
859695109 859695126
859697144 859697161
859699149 859699166
859701450 859701467
859703257 859703274
859705153 859705170
859716521 859716538
859718368 859718385
859736354 859736371
859738707 859738724
859745985 859746002
859751189 859751206
859753558 859753575
859755991 859756008
859758243 859758260
859760632 859760649
859762677 859762694
859764602 859764619
859766429 859766446
859768316 859768333
859770154 859770171
859772039 859772056
859773866 859773883
859775715 859775732
859777532 859777549
859779389 859779406
859781177 859781194
859788564 859788581
859790411 859790428
859794095 859794112
859795911 859795928
859797768 859797785
859799578 859799595
859801434 859801451
859803243 859803260
859805147 859805164
859806925 859806942
859808782 859808799
859809740 859809757
859810590 859810607
859814671 859814688
859816517 859816534
859818354 859818371
859827419 859827436
859829257 859829274
859831063 859831080
859838344 859838361
859840203 859840220
859845989 859846006
859847816 859847833
859849554 859849571
859851381 859851398
859853119 859853136
859854937 859854954
859856627 859856644
859858512 859858529
859860290 859860307
859862168 859862185
859864006 859864023
859865871 859865888
859867679 859867696
859869555 859869572
859871393 859871410
859873220 859873237
859875047 859875064
859876913 859876930
859878761 859878778
859879047 859879064
859882731 859882748
859884558 859884575
859884814 859884831
859886691 859886708
859886909 859886926
859888824 859888841
859890694 859890711
859892538 859892555
859894405 859894422
859899976 859899993
859900252 859900269
859902090 859902107
859911325 859911342
859913142 859913159
859916766 859916783
859918663 859918680
859920588 859920605
859928055 859928072
859930021 859930038
859931810 859931827
859933678 859933695
859935425 859935442
859937212 859937229
859939020 859939037
859940855 859940872
859942595 859942612
859944383 859944400
859944651 859944668
859946497 859946514
859948294 859948311
859950230 859950247
859952076 859952093
859952295 859952312
859954180 859954197
859954399 859954416
859956286 859956303
859956551 859956568
859958418 859958435
859958626 859958643
859960521 859960538
859960729 859960746
859961064 859961081
859962970 859962987
859964808 859964825
859965085 859965102
859972483 859972500
859974299 859974316
859976158 859976175
859977953 859977970
859985204 859985221
859987091 859987108
859988977 859988994
859990863 859990880
859992720 859992737
859994576 859994593
859996403 859996420
860000050 860000067
860001937 860001954
860003773 860003790
860005640 860005657
860007418 860007435
860009305 860009322
860011121 860011138
860012998 860013015
860014795 860014812
860016682 860016699
860018470 860018487
860018728 860018745
860020573 860020590
860020850 860020867
860022618 860022635
860024445 860024462
860026302 860026319
860026569 860026586
860028456 860028473
860030322 860030339
860032149 860032166
860032435 860032452
860034283 860034300
860036110 860036127
860037866 860037883
860039774 860039791
860041681 860041698
860043566 860043583
860045415 860045432
860051054 860051071
860052891 860052908
860054677 860054694
860056595 860056612
860058471 860058488
860060316 860060333
860062214 860062231
860064013 860064030
860065870 860065887
860067657 860067674
860069553 860069570
860071380 860071397
860073267 860073284
860075114 860075131
860077011 860077028
860078847 860078864
860080755 860080772
860082591 860082608
860084457 860084474
860086254 860086271
860088162 860088179
860089968 860089985
860091786 860091803
860097071 860097088
860098809 860098826
860100527 860100544
860102324 860102341
860104033 860104050
860105773 860105790
860107480 860107497
860109367 860109384
860111123 860111140
860113003 860113020
860113269 860113286
860115167 860115184
860117032 860117049
860118918 860118935
860120668 860120685
860122593 860122610
860124382 860124399
860126266 860126283
860128084 860128101
860129980 860129997
860131787 860131804
860133625 860133642
860137339 860137356
860139157 860139174
860141053 860141070
860142818 860142835
860144686 860144703
860144975 860144992
860146850 860146867
860148667 860148684
860150533 860150550
860150761 860150778
860152648 860152665
860152924 860152941
860154781 860154798
860155057 860155074
860156953 860156970
860160589 860160606
860162396 860162413
860166029 860166046
860167886 860167903
860169636 860169653
860171483 860171500
860173290 860173307
860175117 860175134
860178741 860178758
860180520 860180537
860182526 860182543
860184489 860184506
860186328 860186345
860188312 860188329
860190328 860190345
860192125 860192142
860194151 860194168
860195948 860195965
860197794 860197811
860199543 860199560
860201370 860201387
860203188 860203205
860205005 860205022
860206815 860206832
860208659 860208676
860210447 860210464
860212266 860212283
860214033 860214050
860215950 860215967
860217727 860217744
860219573 860219590
860221392 860221409
860223238 860223255
860225057 860225074
860226903 860226920
860228731 860228748
860230565 860230582
860232365 860232382
860234231 860234248
860236038 860236055
860237915 860237932
860239733 860239750
860243409 860243426
860245253 860245270
860250696 860250713
860252544 860252561
860276512 860276529
860279338 860279355
860284207 860284224
860286607 860286624
860288937 860288954
860290982 860290999
860293184 860293201
860295250 860295267
860297521 860297538
860299626 860299643
860301975 860301992
860304268 860304285
860306500 860306517
860308771 860308788
860310983 860311000
860313303 860313320
860315298 860315315
860317372 860317389
860322064 860322081
860324444 860324461
860326607 860326624
860332140 860332157
860335634 860335651
860340584 860340601
860355717 860355734
860355772 860355789
860355927 860355944
860358262 860358279
860373639 860373656
860373788 860373805
860375804 860375821
860377709 860377726
860379496 860379513
860381323 860381340
860383112 860383129
860384939 860384956
860386766 860386783
860388613 860388630
860390400 860390417
860392318 860392335
860392593 860392610
860394518 860394535
860396337 860396354
860398202 860398219
860400011 860400028
860400228 860400245
860404090 860404107
860405917 860405934
860407714 860407731
860409631 860409648
860413688 860413705
860415556 860415573
860417394 860417411
860417601 860417618
860419477 860419494
860426886 860426903
860428979 860428996
860435478 860435495
860458997 860459014
860460783 860460800
860462573 860462590
860464347 860464364
860466197 860466214
860468024 860468041
860469851 860469868
860471668 860471685
860477219 860477236
860482710 860482727
860484576 860484593
860493802 860493819
860495629 860495646
860501181 860501198
860503066 860503083
860504876 860504893
860506733 860506750
860514455 860514472
860516380 860516397
860519137 860519154
860521556 860521573
860553647 860553664
860555800 860555817
860558544 860558561
860561045 860561062
860564047 860564064
860566712 860566729
860569182 860569199
860575493 860575510
860580521 860580538
860582894 860582911
860585735 860585752
860588108 860588125
860589360 860589377
860591702 860591719
860594450 860594467
860597540 860597557
860661828 860661845
860663627 860663644
860667666 860667683
860669455 860669472
860671331 860671348
860674975 860674992
860676843 860676860
860677118 860677135
860678975 860678992
860682580 860682597
860684407 860684424
860687982 860687999
860702453 860702470
860704231 860704248
860706205 860706222
860708022 860708039
860710037 860710054
860711815 860711832
860713634 860713651
860715401 860715418
860717187 860717204
860718976 860718993
860720812 860720829
860722571 860722588
860724469 860724486
860726195 860726212
860728025 860728042
860729822 860729839
860731679 860731696
860733545 860733562
860733821 860733838
860735659 860735676
860737455 860737472
860739343 860739360
860741230 860741247
860743067 860743084
860744992 860745009
860746849 860746866
860748745 860748762
860750642 860750659
860752539 860752556
860754386 860754403
860758030 860758047
860759906 860759923
860761812 860761829
860765477 860765494
860767315 860767332
860776262 860776279
860778129 860778146
860779926 860779943
860783987 860784004
860786111 860786128
860788154 860788171
860790248 860790265
860795918 860795935
860798279 860798296
860800806 860800823
860802832 860802849
860804798 860804815
860806535 860806552
860808374 860808391
860810110 860810127
860811948 860811965
860813745 860813762
860815662 860815679
860817441 860817458
860819326 860819343
860821125 860821142
860823010 860823027
860824857 860824874
860828470 860828487
860830350 860830367
860832116 860832133
860833964 860833981
860834231 860834248
860836127 860836144
860837934 860837951
860839811 860839828
860843465 860843482
860850774 860850791
860852590 860852607
860854439 860854456
860856274 860856291
860856490 860856507
860884233 860884250
860886743 860886760
860889082 860889099
860891157 860891174
860893013 860893030
860894988 860895005
860896886 860896903
860898901 860898918
860901083 860901100
860902959 860902976
860904807 860904824
860906692 860906709
860908511 860908528
860910366 860910383
860912174 860912191
860913991 860914008
860915819 860915836
860917665 860917682
860919482 860919499
860924917 860924934
860926771 860926788
860930388 860930405
860932243 860932260
860934071 860934088
860935928 860935945
860941577 860941594
860952708 860952725
860955237 860955254
860960127 860960144
860960283 860960300
860960550 860960567
860967444 860967461
860971543 860971560
860973904 860973921
860976225 860976242
860978397 860978414
860980454 860980471
860982437 860982454
860984246 860984263
860986064 860986081
860987859 860987876
860989639 860989656
860991424 860991441
860993214 860993231
860995059 860995076
860996847 860996864
860998705 860998722
861000482 861000499
861002299 861002316
861004077 861004094
861005865 861005882
861007752 861007769
861009580 861009597
861011535 861011552
861015595 861015612
861017450 861017467
861017706 861017723
861023573 861023590
861025361 861025378
861027199 861027216
861029163 861029180
861031258 861031275
861033589 861033606
861036088 861036105
861040097 861040114
861065253 861065270
861067545 861067562
861080612 861080629
861082429 861082446
861084384 861084401
861086203 861086220
861088050 861088067
861091703 861091720
861093629 861093646
861095429 861095446
861097274 861097291
861097530 861097547
861099300 861099317
861099556 861099573
861101402 861101419
861103269 861103286
861105195 861105212
861105461 861105478
861107338 861107355
861109157 861109174
861111053 861111070
861112928 861112945
861114766 861114783
861118804 861118821
861121057 861121074
861123389 861123406
861150303 861150320
861150450 861150467
861152544 861152561
861154598 861154615
861156593 861156610
861158401 861158418
861160209 861160226
861162144 861162161
861164011 861164028
861165798 861165815
861167596 861167613
861169502 861169519
861175193 861175210
861177089 861177106
861177325 861177342
861179133 861179150
861181058 861181075
861182994 861183011
861184940 861184957
861186875 861186892
861187132 861187149
861188990 861189007
861191094 861191111
861193049 861193066
861193316 861193333
861196989 861197006
861198808 861198825
861202984 861203001
861205858 861205875
861208406 861208423
861227151 861227168
861236279 861236296
861236428 861236445
861236694 861236711
861238056 861238073
861240141 861240158
861242116 861242133
861244063 861244080
861246037 861246054
861247845 861247862
861249652 861249669
861251430 861251447
861253207 861253224
861254996 861255013
861256814 861256831
861258659 861258676
861260497 861260514
861264231 861264248
861266047 861266064
861267953 861267970
861269869 861269886
861271785 861271802
861273692 861273709
861275668 861275685
861277603 861277620
861279489 861279506
861279746 861279763
861281584 861281601
861283371 861283388
861285305 861285322
861287380 861287397
861290263 861290280
861294696 861294713
861307459 861307476
861318417 861318434
861329966 861329983
861334134 861334151
861337504 861337521
861339903 861339920
861342638 861342655
861348240 861348257
861350747 861350764
861353068 861353085
861357740 861357757
861359776 861359793
861367213 861367230
861370421 861370438
861388923 861388940
861418838 861418855
861418986 861419003
861421781 861421798
861424240 861424257
861427263 861427280
861430107 861430124
861432734 861432751
861435066 861435083
861437131 861437148
861439401 861439418
861441269 861441286
861443334 861443351
861445395 861445412
861448783 861448800
861449219 861449236
861451075 861451092
861455393 861455410
861481925 861481942
861515284 861515301
861519784 861519801
861520324 861520341
861523691 861523708
861558508 861558525
861587870 861587887
861597414 861597431
861597923 861597940
861598125 861598142
861598172 861598189
861598836 861598853
861602146 861602163
861648796 861648813
861648967 861648984
861652825 861652842
861656462 861656479
861663582 861663599
861673149 861673166
861727243 861727260
861734702 861734719
861734942 861734959
861737897 861737914
861739670 861739687
861747601 861747618
861752041 861752058
861759952 861759969
861810641 861810658
861847740 861847757
861850220 861850237
861891689 861891706
861908099 861908116
861915839 861915856
861927419 861927436
861937019 861937036
861942719 861942736
861944400 861944417
861945299 861945316
861945732 861945749
861977839 861977857
861981299 861981316
861986924 861986941
861989758 861989775
861990919 861990936
862004578 862004595
