%!PS-Adobe-3.0 EPSF-3.0
%%Creator: MATLAB, The Mathworks, Inc. Version 7.4.0.287 (R2007a). Operating System: Linux 2.6.32-220.13.1.el6.x86_64 #1 SMP Tue Apr 17 15:16:22 CDT 2012 x86_64.
%%Title: ./all_clusters.eps
%%CreationDate: 07/05/2012  12:45:43
%%DocumentNeededFonts: Helvetica
%%DocumentProcessColors: Cyan Magenta Yellow Black
%%LanguageLevel: 2
%%Pages: 1
%%BoundingBox:    26   180   543   616
%%EndComments

%%BeginProlog
% MathWorks dictionary
/MathWorks 160 dict begin
% definition operators
/bdef {bind def} bind def
/ldef {load def} bind def
/xdef {exch def} bdef
/xstore {exch store} bdef
% operator abbreviations
/c  /clip ldef
/cc /concat ldef
/cp /closepath ldef
/gr /grestore ldef
/gs /gsave ldef
/mt /moveto ldef
/np /newpath ldef
/cm /currentmatrix ldef
/sm /setmatrix ldef
/rm /rmoveto ldef
/rl /rlineto ldef
/s {show newpath} bdef
/sc {setcmykcolor} bdef
/sr /setrgbcolor ldef
/sg /setgray ldef
/w /setlinewidth ldef
/j /setlinejoin ldef
/cap /setlinecap ldef
/rc {rectclip} bdef
/rf {rectfill} bdef
% page state control
/pgsv () def
/bpage {/pgsv save def} bdef
/epage {pgsv restore} bdef
/bplot /gsave ldef
/eplot {stroke grestore} bdef
% orientation switch
/portraitMode 0 def /landscapeMode 1 def /rotateMode 2 def
% coordinate system mappings
/dpi2point 0 def
% font control
/FontSize 0 def
/FMS {/FontSize xstore findfont [FontSize 0 0 FontSize neg 0 0]
  makefont setfont} bdef
/reencode {exch dup where {pop load} {pop StandardEncoding} ifelse
  exch dup 3 1 roll findfont dup length dict begin
  { 1 index /FID ne {def}{pop pop} ifelse } forall
  /Encoding exch def currentdict end definefont pop} bdef
/isroman {findfont /CharStrings get /Agrave known} bdef
/FMSR {3 1 roll 1 index dup isroman {reencode} {pop pop} ifelse
  exch FMS} bdef
/csm {1 dpi2point div -1 dpi2point div scale neg translate
 dup landscapeMode eq {pop -90 rotate}
  {rotateMode eq {90 rotate} if} ifelse} bdef
% line types: solid, dotted, dashed, dotdash
/SO { [] 0 setdash } bdef
/DO { [.5 dpi2point mul 4 dpi2point mul] 0 setdash } bdef
/DA { [6 dpi2point mul] 0 setdash } bdef
/DD { [.5 dpi2point mul 4 dpi2point mul 6 dpi2point mul 4
  dpi2point mul] 0 setdash } bdef
% macros for lines and objects
/L {lineto stroke} bdef
/MP {3 1 roll moveto 1 sub {rlineto} repeat} bdef
/AP {{rlineto} repeat} bdef
/PDlw -1 def
/W {/PDlw currentlinewidth def setlinewidth} def
/PP {closepath eofill} bdef
/DP {closepath stroke} bdef
/MR {4 -2 roll moveto dup  0 exch rlineto exch 0 rlineto
  neg 0 exch rlineto closepath} bdef
/FR {MR stroke} bdef
/PR {MR fill} bdef
/L1i {{currentfile picstr readhexstring pop} image} bdef
/tMatrix matrix def
/MakeOval {newpath tMatrix currentmatrix pop translate scale
0 0 1 0 360 arc tMatrix setmatrix} bdef
/FO {MakeOval stroke} bdef
/PO {MakeOval fill} bdef
/PD {currentlinewidth 2 div 0 360 arc fill
   PDlw -1 eq not {PDlw w /PDlw -1 def} if} def
/FA {newpath tMatrix currentmatrix pop translate scale
  0 0 1 5 -2 roll arc tMatrix setmatrix stroke} bdef
/PA {newpath tMatrix currentmatrix pop	translate 0 0 moveto scale
  0 0 1 5 -2 roll arc closepath tMatrix setmatrix fill} bdef
/FAn {newpath tMatrix currentmatrix pop translate scale
  0 0 1 5 -2 roll arcn tMatrix setmatrix stroke} bdef
/PAn {newpath tMatrix currentmatrix pop translate 0 0 moveto scale
  0 0 1 5 -2 roll arcn closepath tMatrix setmatrix fill} bdef
/vradius 0 def /hradius 0 def /lry 0 def
/lrx 0 def /uly 0 def /ulx 0 def /rad 0 def
/MRR {/vradius xdef /hradius xdef /lry xdef /lrx xdef /uly xdef
  /ulx xdef newpath tMatrix currentmatrix pop ulx hradius add uly
  vradius add translate hradius vradius scale 0 0 1 180 270 arc 
  tMatrix setmatrix lrx hradius sub uly vradius add translate
  hradius vradius scale 0 0 1 270 360 arc tMatrix setmatrix
  lrx hradius sub lry vradius sub translate hradius vradius scale
  0 0 1 0 90 arc tMatrix setmatrix ulx hradius add lry vradius sub
  translate hradius vradius scale 0 0 1 90 180 arc tMatrix setmatrix
  closepath} bdef
/FRR {MRR stroke } bdef
/PRR {MRR fill } bdef
/MlrRR {/lry xdef /lrx xdef /uly xdef /ulx xdef /rad lry uly sub 2 div def
  newpath tMatrix currentmatrix pop ulx rad add uly rad add translate
  rad rad scale 0 0 1 90 270 arc tMatrix setmatrix lrx rad sub lry rad
  sub translate rad rad scale 0 0 1 270 90 arc tMatrix setmatrix
  closepath} bdef
/FlrRR {MlrRR stroke } bdef
/PlrRR {MlrRR fill } bdef
/MtbRR {/lry xdef /lrx xdef /uly xdef /ulx xdef /rad lrx ulx sub 2 div def
  newpath tMatrix currentmatrix pop ulx rad add uly rad add translate
  rad rad scale 0 0 1 180 360 arc tMatrix setmatrix lrx rad sub lry rad
  sub translate rad rad scale 0 0 1 0 180 arc tMatrix setmatrix
  closepath} bdef
/FtbRR {MtbRR stroke } bdef
/PtbRR {MtbRR fill } bdef
/stri 6 array def /dtri 6 array def
/smat 6 array def /dmat 6 array def
/tmat1 6 array def /tmat2 6 array def /dif 3 array def
/asub {/ind2 exch def /ind1 exch def dup dup
  ind1 get exch ind2 get sub exch } bdef
/tri_to_matrix {
  2 0 asub 3 1 asub 4 0 asub 5 1 asub
  dup 0 get exch 1 get 7 -1 roll astore } bdef
/compute_transform {
  dmat dtri tri_to_matrix tmat1 invertmatrix 
  smat stri tri_to_matrix tmat2 concatmatrix } bdef
/ds {stri astore pop} bdef
/dt {dtri astore pop} bdef
/db {2 copy /cols xdef /rows xdef mul dup 3 mul string
  currentfile 
  3 index 0 eq {/ASCIIHexDecode filter}
  {/ASCII85Decode filter 3 index 2 eq {/RunLengthDecode filter} if }
  ifelse exch readstring pop
  dup 0 3 index getinterval /rbmap xdef
  dup 2 index dup getinterval /gbmap xdef
  1 index dup 2 mul exch getinterval /bbmap xdef pop pop}bdef
/it {gs np dtri aload pop moveto lineto lineto cp c
  cols rows 8 compute_transform 
  rbmap gbmap bbmap true 3 colorimage gr}bdef
/il {newpath moveto lineto stroke}bdef
currentdict end def
%%EndProlog

%%BeginSetup
MathWorks begin

0 cap

end
%%EndSetup

%%Page: 1 1
%%BeginPageSetup
%%PageBoundingBox:    26   180   543   616
MathWorks begin
bpage
%%EndPageSetup

%%BeginObject: obj1
bplot

/dpi2point 12 def
portraitMode 0216 7344 csm

  107   -48  6198  5230 rc
76 dict begin %Colortable dictionary
/c0 { 0.000000 0.000000 0.000000 sr} bdef
/c1 { 1.000000 1.000000 1.000000 sr} bdef
/c2 { 0.900000 0.000000 0.000000 sr} bdef
/c3 { 0.000000 0.820000 0.000000 sr} bdef
/c4 { 0.000000 0.000000 0.800000 sr} bdef
/c5 { 0.910000 0.820000 0.320000 sr} bdef
/c6 { 1.000000 0.260000 0.820000 sr} bdef
/c7 { 0.000000 0.820000 0.820000 sr} bdef
c0
1 j
1 sg
   0    0 6913 5186 rf
6 w
0 4201 5356 0 0 -4201 899 4615 4 MP
PP
-5356 0 0 4201 5356 0 0 -4201 899 4615 5 MP stroke
4 w
DO
SO
6 w
0 sg
 899 4615 mt 6255 4615 L
 899 4615 mt  899  414 L
1788 4615 mt 1788 4561 L
%%IncludeResource: font Helvetica
/Helvetica /ISOLatin1Encoding 240 FMSR

1655 4872 mt 
(50) s
2682 4615 mt 2682 4561 L
2482 4872 mt 
(100) s
3577 4615 mt 3577 4561 L
3377 4872 mt 
(150) s
4471 4615 mt 4471 4561 L
4271 4872 mt 
(200) s
5365 4615 mt 5365 4561 L
5165 4872 mt 
(250) s
 899 4615 mt  952 4615 L
 464 4704 mt 
(100) s
 899 3564 mt  952 3564 L
 464 3653 mt 
(150) s
 899 2514 mt  952 2514 L
 464 2603 mt 
(200) s
 899 1464 mt  952 1464 L
 464 1553 mt 
(250) s
 899  414 mt  952  414 L
 464  503 mt 
(300) s
3369 5103 mt 
(t \(s\)) s
 355 2808 mt  -90 rotate
(f \(Hz\)) s
90 rotate
gs 899 414 5357 4202 rc
gr

/c8 { 1.000000 0.000000 0.000000 sr} bdef
c8
  60   60 1095 3018 PO
  60   60 1095 2997 PO
  60   60 1104 3165 PO
  60   60 1104 3144 PO
  60   60 1104 3123 PO
  60   60 1104 3102 PO
  60   60 1104 3081 PO
  60   60 1104 3060 PO
  60   60 1104 3039 PO
  60   60 1113 3123 PO
  60   60 1113 3102 PO
  60   60 1113 3081 PO
  60   60 1122 3270 PO
  60   60 1131 3249 PO
  60   60 1131 3228 PO
  60   60 1131 3207 PO
  60   60 1131 3186 PO
  60   60 1131 3165 PO
  60   60 1131 3144 PO
  60   60 1131 3123 PO
  60   60 1131 3102 PO
  60   60 1131 2997 PO
  60   60 1140 3165 PO
  60   60 1140 3081 PO
  60   60 1140 3039 PO
  60   60 1140 2997 PO
  60   60 1149 3207 PO
  60   60 1149 3186 PO
  60   60 1149 3165 PO
  60   60 1149 3144 PO
  60   60 1167 3228 PO
  60   60 1167 3207 PO
  60   60 1176 3207 PO
  60   60 1194 3207 PO
  60   60 1194 3186 PO
  60   60 1194 3165 PO
  60   60 1203 3186 PO
  60   60 1203 3165 PO
  60   60 1211 3144 PO
  60   60 1220 3270 PO
  60   60 1220 3249 PO
  60   60 1220 3186 PO
  60   60 1220 3123 PO
  60   60 1238 3270 PO
  60   60 1238 3249 PO
  60   60 1238 3186 PO
  60   60 1238 3165 PO
  60   60 1238 3144 PO
  60   60 1247 3249 PO
  60   60 1247 3123 PO
  60   60 1247 3102 PO
  60   60 1247 3081 PO
  60   60 1256 3228 PO
  60   60 1256 3207 PO
  60   60 1256 3186 PO
  60   60 1256 3165 PO
  60   60 1256 3144 PO
  60   60 1256 3123 PO
  60   60 1256 3081 PO
  60   60 1265 3123 PO
  60   60 1274 3102 PO
  60   60 1274 3060 PO
  60   60 1274 3039 PO
  60   60 1274 3018 PO
  60   60 1283 3081 PO
  60   60 1283 3060 PO
  60   60 1292 3249 PO
  60   60 1292 3228 PO
  60   60 1292 3060 PO
  60   60 1292 3039 PO
  60   60 1301 3228 PO
  60   60 1301 3207 PO
  60   60 1301 3186 PO
  60   60 1301 3165 PO
  60   60 1301 3144 PO
  60   60 1301 3123 PO
  60   60 1301 3102 PO
  60   60 1310 3081 PO
  60   60 1310 3060 PO
  60   60 1310 3039 PO
  60   60 1310 3018 PO
  60   60 1319 3039 PO
  60   60 1328 3081 PO
  60   60 1328 3060 PO
  60   60 1328 3039 PO
  60   60 1337 3165 PO
  60   60 1337 3144 PO
  60   60 1337 3123 PO
  60   60 1337 3102 PO
  60   60 1337 3081 PO
  60   60 1337 3018 PO
  60   60 1337 2997 PO
  60   60 1095 3018 FO
  60   60 1095 2997 FO
  60   60 1104 3165 FO
  60   60 1104 3144 FO
  60   60 1104 3123 FO
  60   60 1104 3102 FO
  60   60 1104 3081 FO
  60   60 1104 3060 FO
  60   60 1104 3039 FO
  60   60 1113 3123 FO
  60   60 1113 3102 FO
  60   60 1113 3081 FO
  60   60 1122 3270 FO
  60   60 1131 3249 FO
  60   60 1131 3228 FO
  60   60 1131 3207 FO
  60   60 1131 3186 FO
  60   60 1131 3165 FO
  60   60 1131 3144 FO
  60   60 1131 3123 FO
  60   60 1131 3102 FO
  60   60 1131 2997 FO
  60   60 1140 3165 FO
  60   60 1140 3081 FO
  60   60 1140 3039 FO
  60   60 1140 2997 FO
  60   60 1149 3207 FO
  60   60 1149 3186 FO
  60   60 1149 3165 FO
  60   60 1149 3144 FO
  60   60 1167 3228 FO
  60   60 1167 3207 FO
  60   60 1176 3207 FO
  60   60 1194 3207 FO
  60   60 1194 3186 FO
  60   60 1194 3165 FO
  60   60 1203 3186 FO
  60   60 1203 3165 FO
  60   60 1211 3144 FO
  60   60 1220 3270 FO
  60   60 1220 3249 FO
  60   60 1220 3186 FO
  60   60 1220 3123 FO
  60   60 1238 3270 FO
  60   60 1238 3249 FO
  60   60 1238 3186 FO
  60   60 1238 3165 FO
  60   60 1238 3144 FO
  60   60 1247 3249 FO
  60   60 1247 3123 FO
  60   60 1247 3102 FO
  60   60 1247 3081 FO
  60   60 1256 3228 FO
  60   60 1256 3207 FO
  60   60 1256 3186 FO
  60   60 1256 3165 FO
  60   60 1256 3144 FO
  60   60 1256 3123 FO
  60   60 1256 3081 FO
  60   60 1265 3123 FO
  60   60 1274 3102 FO
  60   60 1274 3060 FO
  60   60 1274 3039 FO
  60   60 1274 3018 FO
  60   60 1283 3081 FO
  60   60 1283 3060 FO
  60   60 1292 3249 FO
  60   60 1292 3228 FO
  60   60 1292 3060 FO
  60   60 1292 3039 FO
  60   60 1301 3228 FO
  60   60 1301 3207 FO
  60   60 1301 3186 FO
  60   60 1301 3165 FO
  60   60 1301 3144 FO
  60   60 1301 3123 FO
  60   60 1301 3102 FO
  60   60 1310 3081 FO
  60   60 1310 3060 FO
  60   60 1310 3039 FO
  60   60 1310 3018 FO
  60   60 1319 3039 FO
  60   60 1328 3081 FO
  60   60 1328 3060 FO
  60   60 1328 3039 FO
  60   60 1337 3165 FO
  60   60 1337 3144 FO
  60   60 1337 3123 FO
  60   60 1337 3102 FO
  60   60 1337 3081 FO
  60   60 1337 3018 FO
  60   60 1337 2997 FO
gs 899 414 5357 4202 rc
gr

/c9 { 0.000000 1.000000 0.000000 sr} bdef
c9
  60   60 1641 1737 PO
  60   60 1641 1716 PO
  60   60 1650 1863 PO
  60   60 1650 1779 PO
  60   60 1650 1758 PO
  60   60 1650 1737 PO
  60   60 1650 1716 PO
  60   60 1659 1842 PO
  60   60 1659 1821 PO
  60   60 1659 1800 PO
  60   60 1659 1779 PO
  60   60 1659 1758 PO
  60   60 1659 1737 PO
  60   60 1667 1884 PO
  60   60 1667 1863 PO
  60   60 1667 1842 PO
  60   60 1667 1821 PO
  60   60 1667 1800 PO
  60   60 1667 1779 PO
  60   60 1676 1905 PO
  60   60 1676 1884 PO
  60   60 1676 1863 PO
  60   60 1676 1842 PO
  60   60 1685 1947 PO
  60   60 1685 1926 PO
  60   60 1685 1905 PO
  60   60 1685 1884 PO
  60   60 1685 1863 PO
  60   60 1694 1989 PO
  60   60 1694 1968 PO
  60   60 1694 1947 PO
  60   60 1694 1926 PO
  60   60 1703 2031 PO
  60   60 1703 2010 PO
  60   60 1703 1989 PO
  60   60 1703 1968 PO
  60   60 1703 1947 PO
  60   60 1712 2052 PO
  60   60 1712 2031 PO
  60   60 1712 2010 PO
  60   60 1712 1989 PO
  60   60 1721 2094 PO
  60   60 1721 2073 PO
  60   60 1721 2052 PO
  60   60 1721 2031 PO
  60   60 1730 2115 PO
  60   60 1730 2094 PO
  60   60 1730 2073 PO
  60   60 1730 2052 PO
  60   60 1739 2136 PO
  60   60 1739 2115 PO
  60   60 1739 2094 PO
  60   60 1748 2178 PO
  60   60 1748 2157 PO
  60   60 1748 2136 PO
  60   60 1748 2115 PO
  60   60 1757 2199 PO
  60   60 1757 2178 PO
  60   60 1757 2157 PO
  60   60 1757 2136 PO
  60   60 1766 2241 PO
  60   60 1766 2220 PO
  60   60 1766 2199 PO
  60   60 1766 2178 PO
  60   60 1775 2262 PO
  60   60 1775 2241 PO
  60   60 1775 2220 PO
  60   60 1775 2199 PO
  60   60 1784 2283 PO
  60   60 1784 2262 PO
  60   60 1784 2241 PO
  60   60 1784 2220 PO
  60   60 1793 2304 PO
  60   60 1793 2283 PO
  60   60 1793 2262 PO
  60   60 1802 2346 PO
  60   60 1802 2325 PO
  60   60 1802 2304 PO
  60   60 1802 2283 PO
  60   60 1811 2367 PO
  60   60 1811 2346 PO
  60   60 1811 2325 PO
  60   60 1811 2304 PO
  60   60 1819 2388 PO
  60   60 1819 2367 PO
  60   60 1819 2346 PO
  60   60 1819 2325 PO
  60   60 1828 2409 PO
  60   60 1828 2388 PO
  60   60 1828 2367 PO
  60   60 1837 2430 PO
  60   60 1837 2409 PO
  60   60 1837 2388 PO
  60   60 1837 2367 PO
  60   60 1846 2451 PO
  60   60 1846 2430 PO
  60   60 1846 2409 PO
  60   60 1846 2388 PO
  60   60 1855 2472 PO
  60   60 1855 2451 PO
  60   60 1855 2430 PO
  60   60 1864 2493 PO
  60   60 1864 2472 PO
  60   60 1864 2451 PO
  60   60 1873 2514 PO
  60   60 1873 2493 PO
  60   60 1873 2472 PO
  60   60 1882 2535 PO
  60   60 1882 2514 PO
  60   60 1882 2493 PO
  60   60 1891 2556 PO
  60   60 1891 2535 PO
  60   60 1891 2514 PO
  60   60 1891 2493 PO
  60   60 1900 2577 PO
  60   60 1900 2556 PO
  60   60 1900 2535 PO
  60   60 1900 2514 PO
  60   60 1909 2577 PO
  60   60 1909 2556 PO
  60   60 1909 2535 PO
  60   60 1918 2598 PO
  60   60 1918 2577 PO
  60   60 1918 2556 PO
  60   60 1927 2619 PO
  60   60 1927 2598 PO
  60   60 1927 2577 PO
  60   60 1936 2640 PO
  60   60 1936 2619 PO
  60   60 1936 2598 PO
  60   60 1945 2661 PO
  60   60 1945 2640 PO
  60   60 1945 2619 PO
  60   60 1954 2661 PO
  60   60 1954 2640 PO
  60   60 1954 2619 PO
  60   60 1963 2682 PO
  60   60 1963 2661 PO
  60   60 1963 2640 PO
  60   60 1971 2703 PO
  60   60 1971 2682 PO
  60   60 1971 2661 PO
  60   60 1980 2724 PO
  60   60 1980 2703 PO
  60   60 1980 2682 PO
  60   60 1989 2724 PO
  60   60 1989 2703 PO
  60   60 1998 2745 PO
  60   60 1998 2724 PO
  60   60 1998 2703 PO
  60   60 2007 2766 PO
  60   60 2007 2745 PO
  60   60 2007 2724 PO
  60   60 2016 2766 PO
  60   60 2016 2745 PO
  60   60 2016 2724 PO
  60   60 2025 2787 PO
  60   60 2025 2766 PO
  60   60 2025 2745 PO
  60   60 2034 2808 PO
  60   60 2034 2787 PO
  60   60 2034 2766 PO
  60   60 2043 2808 PO
  60   60 2043 2787 PO
  60   60 2043 2766 PO
  60   60 2052 2829 PO
  60   60 2052 2808 PO
  60   60 2052 2787 PO
  60   60 2061 2850 PO
  60   60 2061 2829 PO
  60   60 2061 2808 PO
  60   60 2070 2850 PO
  60   60 2070 2829 PO
  60   60 2070 2808 PO
  60   60 2079 2871 PO
  60   60 2079 2850 PO
  60   60 2079 2829 PO
  60   60 2088 2871 PO
  60   60 2088 2850 PO
  60   60 2097 2871 PO
  60   60 2097 2850 PO
  60   60 2106 2871 PO
  60   60 2115 2871 PO
  60   60 2168 2997 PO
  60   60 2177 2997 PO
  60   60 2186 3018 PO
  60   60 2186 2997 PO
  60   60 2195 3018 PO
  60   60 2195 2997 PO
  60   60 2204 3018 PO
  60   60 2204 2997 PO
  60   60 2213 3039 PO
  60   60 2213 3018 PO
  60   60 2213 2997 PO
  60   60 2222 3060 PO
  60   60 2222 3039 PO
  60   60 2222 3018 PO
  60   60 2231 3060 PO
  60   60 2231 3039 PO
  60   60 2231 3018 PO
  60   60 2240 3081 PO
  60   60 2240 3060 PO
  60   60 2240 3039 PO
  60   60 2249 3081 PO
  60   60 2249 3060 PO
  60   60 2249 3039 PO
  60   60 2258 3081 PO
  60   60 2258 3060 PO
  60   60 2267 3102 PO
  60   60 2267 3081 PO
  60   60 2267 3060 PO
  60   60 2276 3102 PO
  60   60 2276 3081 PO
  60   60 2284 3123 PO
  60   60 2284 3102 PO
  60   60 2284 3081 PO
  60   60 2293 3123 PO
  60   60 2293 3102 PO
  60   60 2302 3144 PO
  60   60 2302 3123 PO
  60   60 2302 3102 PO
  60   60 2311 3144 PO
  60   60 2311 3123 PO
  60   60 2311 3102 PO
  60   60 2320 3144 PO
  60   60 2320 3123 PO
  60   60 2329 3165 PO
  60   60 2329 3144 PO
  60   60 2329 3123 PO
  60   60 2338 3186 PO
  60   60 2338 3165 PO
  60   60 2338 3144 PO
  60   60 2347 3186 PO
  60   60 2347 3165 PO
  60   60 2347 3144 PO
  60   60 2356 3186 PO
  60   60 2356 3165 PO
  60   60 2365 3207 PO
  60   60 2365 3186 PO
  60   60 2365 3165 PO
  60   60 2374 3207 PO
  60   60 2374 3186 PO
  60   60 2374 3165 PO
  60   60 2383 3207 PO
  60   60 2383 3186 PO
  60   60 2392 3228 PO
  60   60 2392 3207 PO
  60   60 2392 3186 PO
  60   60 2401 3228 PO
  60   60 2401 3207 PO
  60   60 2410 3249 PO
  60   60 2410 3228 PO
  60   60 2410 3207 PO
  60   60 2419 3249 PO
  60   60 2419 3228 PO
  60   60 2419 3207 PO
  60   60 2428 3249 PO
  60   60 2428 3228 PO
  60   60 2436 3270 PO
  60   60 2436 3249 PO
  60   60 2436 3228 PO
  60   60 2445 3270 PO
  60   60 2445 3249 PO
  60   60 2445 3228 PO
  60   60 2454 3270 PO
  60   60 2454 3249 PO
  60   60 2463 3291 PO
  60   60 2463 3270 PO
  60   60 2463 3249 PO
  60   60 2472 3291 PO
  60   60 2472 3270 PO
  60   60 2481 3291 PO
  60   60 2481 3270 PO
  60   60 2490 3312 PO
  60   60 2490 3291 PO
  60   60 2490 3270 PO
  60   60 2499 3312 PO
  60   60 2499 3291 PO
  60   60 2508 3333 PO
  60   60 2508 3312 PO
  60   60 2508 3291 PO
  60   60 2517 3333 PO
  60   60 2517 3312 PO
  60   60 2517 3291 PO
  60   60 2526 3333 PO
  60   60 2526 3312 PO
  60   60 2535 3354 PO
  60   60 2535 3333 PO
  60   60 2535 3312 PO
  60   60 2544 3354 PO
  60   60 2544 3333 PO
  60   60 2544 3312 PO
  60   60 2553 3354 PO
  60   60 2553 3333 PO
  60   60 2562 3375 PO
  60   60 2562 3354 PO
  60   60 2562 3333 PO
  60   60 2571 3375 PO
  60   60 2571 3354 PO
  60   60 2571 3333 PO
  60   60 2580 3375 PO
  60   60 2580 3354 PO
  60   60 2588 3396 PO
  60   60 2588 3375 PO
  60   60 2588 3354 PO
  60   60 2597 3396 PO
  60   60 2597 3375 PO
  60   60 2597 3354 PO
  60   60 2606 3396 PO
  60   60 2606 3375 PO
  60   60 2606 3354 PO
  60   60 2615 3396 PO
  60   60 2615 3375 PO
  60   60 2624 3417 PO
  60   60 2624 3396 PO
  60   60 2624 3375 PO
  60   60 2633 3417 PO
  60   60 2633 3396 PO
  60   60 2633 3375 PO
  60   60 2642 3417 PO
  60   60 2642 3396 PO
  60   60 2651 3438 PO
  60   60 2651 3417 PO
  60   60 2651 3396 PO
  60   60 2660 3438 PO
  60   60 2660 3417 PO
  60   60 2660 3396 PO
  60   60 2669 3438 PO
  60   60 2669 3417 PO
  60   60 2678 3459 PO
  60   60 2678 3438 PO
  60   60 2678 3417 PO
  60   60 2687 3459 PO
  60   60 2687 3438 PO
  60   60 2687 3417 PO
  60   60 2696 3459 PO
  60   60 2696 3438 PO
  60   60 2705 3459 PO
  60   60 2705 3438 PO
  60   60 2714 3480 PO
  60   60 2714 3459 PO
  60   60 2714 3438 PO
  60   60 2723 3480 PO
  60   60 2723 3459 PO
  60   60 2723 3438 PO
  60   60 2732 3480 PO
  60   60 2732 3459 PO
  60   60 2740 3501 PO
  60   60 2740 3480 PO
  60   60 2740 3459 PO
  60   60 2749 3501 PO
  60   60 2749 3480 PO
  60   60 2749 3459 PO
  60   60 2758 3501 PO
  60   60 2758 3480 PO
  60   60 2767 3501 PO
  60   60 2767 3480 PO
  60   60 2776 3501 PO
  60   60 2776 3480 PO
  60   60 2785 3522 PO
  60   60 2785 3501 PO
  60   60 2794 3522 PO
  60   60 2794 3501 PO
  60   60 2803 3522 PO
  60   60 2803 3501 PO
  60   60 2812 3522 PO
  60   60 2812 3501 PO
  60   60 2821 3543 PO
  60   60 2821 3522 PO
  60   60 2821 3501 PO
  60   60 2830 3543 PO
  60   60 2830 3522 PO
  60   60 2839 3543 PO
  60   60 2839 3522 PO
  60   60 2848 3564 PO
  60   60 2848 3543 PO
  60   60 2848 3522 PO
  60   60 2857 3564 PO
  60   60 2857 3543 PO
  60   60 2866 3564 PO
  60   60 2866 3543 PO
  60   60 2875 3564 PO
  60   60 2875 3543 PO
  60   60 2884 3585 PO
  60   60 2884 3564 PO
  60   60 2884 3543 PO
  60   60 2892 3585 PO
  60   60 2892 3564 PO
  60   60 2892 3543 PO
  60   60 2901 3585 PO
  60   60 2901 3564 PO
  60   60 2910 3606 PO
  60   60 2910 3585 PO
  60   60 2910 3564 PO
  60   60 2919 3606 PO
  60   60 2919 3585 PO
  60   60 2919 3564 PO
  60   60 2928 3606 PO
  60   60 2928 3585 PO
  60   60 2937 3606 PO
  60   60 2937 3585 PO
  60   60 2946 3606 PO
  60   60 2946 3585 PO
  60   60 2955 3627 PO
  60   60 2955 3606 PO
  60   60 2955 3585 PO
  60   60 2964 3627 PO
  60   60 2964 3606 PO
  60   60 2964 3585 PO
  60   60 2973 3627 PO
  60   60 2973 3606 PO
  60   60 2982 3627 PO
  60   60 2982 3606 PO
  60   60 2991 3627 PO
  60   60 2991 3606 PO
  60   60 3000 3648 PO
  60   60 3000 3627 PO
  60   60 3000 3606 PO
  60   60 3009 3648 PO
  60   60 3009 3627 PO
  60   60 3018 3648 PO
  60   60 3018 3627 PO
  60   60 3027 3669 PO
  60   60 3027 3648 PO
  60   60 3027 3627 PO
  60   60 3036 3669 PO
  60   60 3036 3648 PO
  60   60 3036 3627 PO
  60   60 3044 3669 PO
  60   60 3044 3648 PO
  60   60 3044 3627 PO
  60   60 3053 3669 PO
  60   60 3053 3648 PO
  60   60 3062 3669 PO
  60   60 3062 3648 PO
  60   60 3071 3669 PO
  60   60 3071 3648 PO
  60   60 3080 3690 PO
  60   60 3080 3669 PO
  60   60 3089 3774 PO
  60   60 3089 3753 PO
  60   60 3089 3732 PO
  60   60 3089 3690 PO
  60   60 3089 3669 PO
  60   60 3098 3795 PO
  60   60 3098 3690 PO
  60   60 3098 3669 PO
  60   60 3107 3690 PO
  60   60 3107 3669 PO
  60   60 3116 3690 PO
  60   60 3116 3669 PO
  60   60 3125 3690 PO
  60   60 3125 3669 PO
  60   60 3134 3711 PO
  60   60 3134 3690 PO
  60   60 3143 3711 PO
  60   60 3143 3690 PO
  60   60 3152 3711 PO
  60   60 3152 3690 PO
  60   60 3161 3711 PO
  60   60 3161 3690 PO
  60   60 3170 3732 PO
  60   60 3170 3711 PO
  60   60 3170 3690 PO
  60   60 3179 3732 PO
  60   60 3179 3711 PO
  60   60 3188 3732 PO
  60   60 3188 3711 PO
  60   60 3196 3732 PO
  60   60 3196 3711 PO
  60   60 3205 3732 PO
  60   60 3205 3711 PO
  60   60 3214 3753 PO
  60   60 3214 3732 PO
  60   60 3223 3753 PO
  60   60 3223 3732 PO
  60   60 3232 3858 PO
  60   60 3232 3837 PO
  60   60 3232 3753 PO
  60   60 3232 3732 PO
  60   60 3241 3753 PO
  60   60 3241 3732 PO
  60   60 3250 3858 PO
  60   60 3250 3816 PO
  60   60 3250 3753 PO
  60   60 3250 3732 PO
  60   60 3259 3837 PO
  60   60 3259 3816 PO
  60   60 3259 3774 PO
  60   60 3259 3753 PO
  60   60 3259 3732 PO
  60   60 3259 3690 PO
  60   60 3259 3669 PO
  60   60 3259 3648 PO
  60   60 3268 3774 PO
  60   60 3268 3753 PO
  60   60 3277 3837 PO
  60   60 3277 3774 PO
  60   60 3277 3753 PO
  60   60 3286 3837 PO
  60   60 3286 3774 PO
  60   60 3286 3753 PO
  60   60 3295 3774 PO
  60   60 3295 3753 PO
  60   60 3304 3795 PO
  60   60 3304 3774 PO
  60   60 3304 3753 PO
  60   60 3313 3795 PO
  60   60 3313 3774 PO
  60   60 3313 3753 PO
  60   60 3322 3795 PO
  60   60 3322 3774 PO
  60   60 3331 3795 PO
  60   60 3331 3774 PO
  60   60 3340 3795 PO
  60   60 3340 3774 PO
  60   60 3348 3816 PO
  60   60 3348 3795 PO
  60   60 3348 3774 PO
  60   60 3357 3816 PO
  60   60 3357 3795 PO
  60   60 3357 3774 PO
  60   60 3366 3816 PO
  60   60 3366 3795 PO
  60   60 3375 3816 PO
  60   60 3375 3795 PO
  60   60 3384 3816 PO
  60   60 3384 3795 PO
  60   60 3384 3774 PO
  60   60 3384 3753 PO
  60   60 3393 3816 PO
  60   60 3393 3795 PO
  60   60 3402 3816 PO
  60   60 3402 3795 PO
  60   60 3411 3879 PO
  60   60 3411 3837 PO
  60   60 3411 3816 PO
  60   60 3411 3795 PO
  60   60 3420 3879 PO
  60   60 3420 3837 PO
  60   60 3420 3816 PO
  60   60 3429 3837 PO
  60   60 3429 3816 PO
  60   60 3438 3837 PO
  60   60 3438 3816 PO
  60   60 3447 3900 PO
  60   60 3447 3879 PO
  60   60 3447 3858 PO
  60   60 3447 3837 PO
  60   60 3447 3816 PO
  60   60 3456 3858 PO
  60   60 3456 3837 PO
  60   60 3456 3816 PO
  60   60 3465 3837 PO
  60   60 3465 3816 PO
  60   60 3474 3858 PO
  60   60 3474 3837 PO
  60   60 3474 3816 PO
  60   60 3483 3858 PO
  60   60 3483 3837 PO
  60   60 3492 3858 PO
  60   60 3492 3837 PO
  60   60 3500 3858 PO
  60   60 3500 3837 PO
  60   60 3509 3879 PO
  60   60 3509 3858 PO
  60   60 3509 3837 PO
  60   60 3518 3879 PO
  60   60 3518 3858 PO
  60   60 3518 3837 PO
  60   60 3527 3921 PO
  60   60 3527 3879 PO
  60   60 3527 3858 PO
  60   60 3536 3921 PO
  60   60 3536 3879 PO
  60   60 3536 3858 PO
  60   60 3545 3879 PO
  60   60 3545 3858 PO
  60   60 3554 3879 PO
  60   60 3554 3858 PO
  60   60 3563 3900 PO
  60   60 3563 3879 PO
  60   60 3563 3858 PO
  60   60 3572 3900 PO
  60   60 3572 3879 PO
  60   60 3572 3858 PO
  60   60 3581 3900 PO
  60   60 3581 3879 PO
  60   60 3581 3858 PO
  60   60 3590 3900 PO
  60   60 3590 3879 PO
  60   60 3599 3900 PO
  60   60 3599 3879 PO
  60   60 3608 3900 PO
  60   60 3608 3879 PO
  60   60 3608 3816 PO
  60   60 3608 3795 PO
  60   60 3608 3774 PO
  60   60 3617 3900 PO
  60   60 3617 3879 PO
  60   60 3617 3837 PO
  60   60 3626 3900 PO
  60   60 3626 3879 PO
  60   60 3635 3921 PO
  60   60 3635 3900 PO
  60   60 3635 3879 PO
  60   60 3635 3816 PO
  60   60 3635 3795 PO
  60   60 3644 3921 PO
  60   60 3644 3900 PO
  60   60 3644 3816 PO
  60   60 3644 3795 PO
  60   60 3644 3774 PO
  60   60 3653 3921 PO
  60   60 3653 3900 PO
  60   60 3653 3774 PO
  60   60 3661 3921 PO
  60   60 3661 3900 PO
  60   60 3661 3858 PO
  60   60 3661 3837 PO
  60   60 3661 3816 PO
  60   60 3670 3921 PO
  60   60 3670 3900 PO
  60   60 3670 3795 PO
  60   60 3679 3921 PO
  60   60 3679 3900 PO
  60   60 3679 3858 PO
  60   60 3679 3774 PO
  60   60 3688 4005 PO
  60   60 3688 3984 PO
  60   60 3688 3942 PO
  60   60 3688 3921 PO
  60   60 3697 3984 PO
  60   60 3697 3942 PO
  60   60 3697 3921 PO
  60   60 3697 3858 PO
  60   60 3706 3942 PO
  60   60 3706 3921 PO
  60   60 3715 3942 PO
  60   60 3715 3921 PO
  60   60 3724 3942 PO
  60   60 3724 3921 PO
  60   60 3724 3900 PO
  60   60 3724 3879 PO
  60   60 3733 3942 PO
  60   60 3733 3921 PO
  60   60 3742 3963 PO
  60   60 3742 3942 PO
  60   60 3742 3921 PO
  60   60 3751 3963 PO
  60   60 3751 3942 PO
  60   60 3751 3921 PO
  60   60 3760 3942 PO
  60   60 3760 3921 PO
  60   60 3760 3879 PO
  60   60 3760 3858 PO
  60   60 3769 3963 PO
  60   60 3769 3942 PO
  60   60 3769 3837 PO
  60   60 3769 3816 PO
  60   60 3778 4068 PO
  60   60 3778 3963 PO
  60   60 3778 3942 PO
  60   60 3778 3879 PO
  60   60 3787 4131 PO
  60   60 3787 4110 PO
  60   60 3787 4068 PO
  60   60 3787 4026 PO
  60   60 3787 3963 PO
  60   60 3787 3942 PO
  60   60 3796 4026 PO
  60   60 3796 4005 PO
  60   60 3796 3984 PO
  60   60 3796 3963 PO
  60   60 3796 3942 PO
  60   60 3805 4068 PO
  60   60 3805 4047 PO
  60   60 3805 4026 PO
  60   60 3805 3984 PO
  60   60 3805 3963 PO
  60   60 3805 3942 PO
  60   60 3813 3984 PO
  60   60 3813 3963 PO
  60   60 3813 3942 PO
  60   60 3822 3984 PO
  60   60 3822 3963 PO
  60   60 3831 3963 PO
  60   60 3840 3984 PO
  60   60 3840 3963 PO
  60   60 3849 3984 PO
  60   60 3849 3963 PO
  60   60 3858 3984 PO
  60   60 3858 3963 PO
  60   60 3867 3984 PO
  60   60 3867 3963 PO
  60   60 3876 4005 PO
  60   60 3876 3984 PO
  60   60 3876 3963 PO
  60   60 3885 4005 PO
  60   60 3885 3984 PO
  60   60 3885 3963 PO
  60   60 3885 3921 PO
  60   60 3894 4005 PO
  60   60 3894 3984 PO
  60   60 3894 3963 PO
  60   60 3903 4005 PO
  60   60 3903 3984 PO
  60   60 3912 4026 PO
  60   60 3912 4005 PO
  60   60 3912 3984 PO
  60   60 3921 4005 PO
  60   60 3921 3984 PO
  60   60 3930 4005 PO
  60   60 3930 3984 PO
  60   60 3939 4026 PO
  60   60 3939 4005 PO
  60   60 3939 3984 PO
  60   60 3948 4005 PO
  60   60 3948 3984 PO
  60   60 3957 4026 PO
  60   60 3957 4005 PO
  60   60 3957 3984 PO
  60   60 3957 3963 PO
  60   60 3957 3942 PO
  60   60 3965 4026 PO
  60   60 3965 4005 PO
  60   60 3965 3984 PO
  60   60 3974 4026 PO
  60   60 3974 4005 PO
  60   60 3974 3942 PO
  60   60 3974 3921 PO
  60   60 3983 4026 PO
  60   60 3983 4005 PO
  60   60 3992 4026 PO
  60   60 3992 4005 PO
  60   60 3992 3963 PO
  60   60 3992 3942 PO
  60   60 4001 4026 PO
  60   60 4001 4005 PO
  60   60 4010 4026 PO
  60   60 4010 4005 PO
  60   60 4019 4047 PO
  60   60 4019 4026 PO
  60   60 4019 4005 PO
  60   60 4028 4131 PO
  60   60 4028 4110 PO
  60   60 4028 4089 PO
  60   60 4028 4047 PO
  60   60 4028 4026 PO
  60   60 4028 4005 PO
  60   60 4037 4047 PO
  60   60 4037 4026 PO
  60   60 4037 3963 PO
  60   60 4046 4047 PO
  60   60 4046 4026 PO
  60   60 4046 4005 PO
  60   60 4046 3984 PO
  60   60 4055 4047 PO
  60   60 4055 4026 PO
  60   60 4064 4047 PO
  60   60 4064 4026 PO
  60   60 4073 4068 PO
  60   60 4073 4047 PO
  60   60 4073 4026 PO
  60   60 4082 4047 PO
  60   60 4082 4026 PO
  60   60 4091 4068 PO
  60   60 4091 4047 PO
  60   60 4091 4026 PO
  60   60 4100 4047 PO
  60   60 4100 4026 PO
  60   60 4109 4068 PO
  60   60 4109 4047 PO
  60   60 4109 4026 PO
  60   60 4109 4005 PO
  60   60 4109 3984 PO
  60   60 4117 4068 PO
  60   60 4117 4047 PO
  60   60 4126 4068 PO
  60   60 4126 4047 PO
  60   60 4135 4068 PO
  60   60 4135 4047 PO
  60   60 4135 3963 PO
  60   60 4135 3942 PO
  60   60 4144 4089 PO
  60   60 4144 4068 PO
  60   60 4144 4047 PO
  60   60 4144 3984 PO
  60   60 4144 3963 PO
  60   60 4153 4089 PO
  60   60 4153 4068 PO
  60   60 4153 4047 PO
  60   60 4153 4005 PO
  60   60 4162 4089 PO
  60   60 4162 4068 PO
  60   60 4162 4047 PO
  60   60 4162 4026 PO
  60   60 4171 4068 PO
  60   60 4171 4047 PO
  60   60 4180 4089 PO
  60   60 4180 4068 PO
  60   60 4180 4047 PO
  60   60 4189 4110 PO
  60   60 4189 4089 PO
  60   60 4189 4068 PO
  60   60 4189 4047 PO
  60   60 4198 4089 PO
  60   60 4198 4068 PO
  60   60 4207 4131 PO
  60   60 4207 4089 PO
  60   60 4207 4068 PO
  60   60 4216 4110 PO
  60   60 4216 4089 PO
  60   60 4216 4068 PO
  60   60 4225 4110 PO
  60   60 4225 4089 PO
  60   60 4225 4068 PO
  60   60 4225 3942 PO
  60   60 4225 3921 PO
  60   60 4225 3900 PO
  60   60 4234 4110 PO
  60   60 4234 4089 PO
  60   60 4234 4068 PO
  60   60 4234 4026 PO
  60   60 4234 4005 PO
  60   60 4234 3984 PO
  60   60 4234 3963 PO
  60   60 4234 3942 PO
  60   60 4234 3900 PO
  60   60 4243 4110 PO
  60   60 4243 4089 PO
  60   60 4243 4068 PO
  60   60 4243 4026 PO
  60   60 4252 4089 PO
  60   60 4252 4026 PO
  60   60 4261 4110 PO
  60   60 4261 4089 PO
  60   60 4261 4068 PO
  60   60 4261 4047 PO
  60   60 4269 4131 PO
  60   60 4269 4110 PO
  60   60 4269 4089 PO
  60   60 4269 4026 PO
  60   60 4269 4005 PO
  60   60 4278 4110 PO
  60   60 4278 4089 PO
  60   60 4287 4131 PO
  60   60 4287 4110 PO
  60   60 4287 4089 PO
  60   60 4296 4131 PO
  60   60 4296 4110 PO
  60   60 4296 4089 PO
  60   60 4305 4131 PO
  60   60 4305 4110 PO
  60   60 4305 4089 PO
  60   60 4314 4131 PO
  60   60 4314 4110 PO
  60   60 4314 4089 PO
  60   60 4314 4047 PO
  60   60 4323 4131 PO
  60   60 4323 4110 PO
  60   60 4323 4089 PO
  60   60 4332 4131 PO
  60   60 4332 4110 PO
  60   60 4341 4131 PO
  60   60 4341 4110 PO
  60   60 4341 4089 PO
  60   60 4350 4131 PO
  60   60 4350 4110 PO
  60   60 4350 4089 PO
  60   60 4359 4131 PO
  60   60 4359 4110 PO
  60   60 4359 3942 PO
  60   60 4359 3921 PO
  60   60 4368 4131 PO
  60   60 4368 4110 PO
  60   60 4368 4068 PO
  60   60 4368 4026 PO
  60   60 4368 4005 PO
  60   60 4368 3942 PO
  60   60 4368 3921 PO
  60   60 4377 4131 PO
  60   60 4377 4110 PO
  60   60 4377 4005 PO
  60   60 4377 3984 PO
  60   60 4377 3963 PO
  60   60 4386 4131 PO
  60   60 4386 4110 PO
  60   60 4386 4068 PO
  60   60 4386 3963 PO
  60   60 4386 3921 PO
  60   60 4395 4131 PO
  60   60 4395 4110 PO
  60   60 4395 4026 PO
  60   60 4404 4131 PO
  60   60 4404 4110 PO
  60   60 4404 4068 PO
  60   60 4404 4047 PO
  60   60 4404 3984 PO
  60   60 4404 3963 PO
  60   60 4404 3921 PO
  60   60 4413 4131 PO
  60   60 4421 4131 PO
  60   60 4421 4110 PO
  60   60 4430 4131 PO
  60   60 4439 4131 PO
  60   60 4439 4110 PO
  60   60 4448 4131 PO
  60   60 4457 4131 PO
  60   60 4466 4131 PO
  60   60 4475 4131 PO
  60   60 4484 4131 PO
  60   60 4886 4320 PO
  60   60 4886 4299 PO
  60   60 4886 4257 PO
  60   60 4895 4299 PO
  60   60 4895 4257 PO
  60   60 4904 4257 PO
  60   60 4913 4278 PO
  60   60 4913 4257 PO
  60   60 4922 4278 PO
  60   60 4922 4257 PO
  60   60 4931 4341 PO
  60   60 4931 4320 PO
  60   60 4931 4299 PO
  60   60 4931 4257 PO
  60   60 4940 4257 PO
  60   60 4949 4278 PO
  60   60 4949 4257 PO
  60   60 4958 4299 PO
  60   60 4958 4278 PO
  60   60 4958 4257 PO
  60   60 4967 4278 PO
  60   60 4967 4257 PO
  60   60 4985 4278 PO
  60   60 4985 4257 PO
  60   60 4994 4278 PO
  60   60 4994 4257 PO
  60   60 5003 4278 PO
  60   60 5003 4257 PO
  60   60 5012 4278 PO
  60   60 5012 4257 PO
  60   60 5021 4278 PO
  60   60 5021 4257 PO
  60   60 5030 4320 PO
  60   60 5030 4299 PO
  60   60 5030 4278 PO
  60   60 5030 4257 PO
  60   60 5038 4320 PO
  60   60 5038 4299 PO
  60   60 5038 4278 PO
  60   60 5038 4257 PO
  60   60 5047 4341 PO
  60   60 5047 4299 PO
  60   60 5047 4278 PO
  60   60 5047 4257 PO
  60   60 5056 4278 PO
  60   60 5056 4257 PO
  60   60 5065 4299 PO
  60   60 5065 4278 PO
  60   60 5065 4257 PO
  60   60 5074 4299 PO
  60   60 5074 4278 PO
  60   60 5074 4257 PO
  60   60 5083 4299 PO
  60   60 5083 4278 PO
  60   60 5083 4257 PO
  60   60 5092 4299 PO
  60   60 5092 4278 PO
  60   60 5092 4257 PO
  60   60 5101 4299 PO
  60   60 5101 4278 PO
  60   60 5101 4257 PO
  60   60 5110 4341 PO
  60   60 5110 4299 PO
  60   60 5110 4278 PO
  60   60 5110 4257 PO
  60   60 5119 4299 PO
  60   60 5119 4278 PO
  60   60 5119 4257 PO
  60   60 5128 4320 PO
  60   60 5128 4299 PO
  60   60 5128 4278 PO
  60   60 5137 4383 PO
  60   60 5137 4362 PO
  60   60 5137 4341 PO
  60   60 5137 4320 PO
  60   60 5137 4299 PO
  60   60 5146 4404 PO
  60   60 5146 4383 PO
  60   60 5146 4320 PO
  60   60 5146 4299 PO
  60   60 5146 4278 PO
  60   60 5155 4320 PO
  60   60 5155 4299 PO
  60   60 5155 4278 PO
  60   60 5164 4383 PO
  60   60 5164 4362 PO
  60   60 5164 4320 PO
  60   60 5164 4299 PO
  60   60 5164 4278 PO
  60   60 5173 4320 PO
  60   60 5173 4299 PO
  60   60 5173 4278 PO
  60   60 5182 4320 PO
  60   60 5182 4299 PO
  60   60 5182 4278 PO
  60   60 5182 4257 PO
  60   60 5190 4320 PO
  60   60 5190 4299 PO
  60   60 5190 4278 PO
  60   60 5190 4257 PO
  60   60 5199 4299 PO
  60   60 5199 4278 PO
  60   60 5208 4341 PO
  60   60 5208 4320 PO
  60   60 5208 4299 PO
  60   60 5208 4278 PO
  60   60 5217 4320 PO
  60   60 5217 4299 PO
  60   60 5217 4278 PO
  60   60 5226 4341 PO
  60   60 5226 4320 PO
  60   60 5226 4299 PO
  60   60 5226 4278 PO
  60   60 5235 4341 PO
  60   60 5235 4320 PO
  60   60 5235 4299 PO
  60   60 5244 4320 PO
  60   60 5244 4299 PO
  60   60 5253 4362 PO
  60   60 5253 4320 PO
  60   60 5253 4299 PO
  60   60 5262 4341 PO
  60   60 5262 4320 PO
  60   60 5271 4404 PO
  60   60 5271 4383 PO
  60   60 5271 4362 PO
  60   60 5271 4320 PO
  60   60 5280 4488 PO
  60   60 5280 4467 PO
  60   60 5280 4446 PO
  60   60 5280 4425 PO
  60   60 5280 4341 PO
  60   60 5280 4320 PO
  60   60 5280 4299 PO
  60   60 5289 4467 PO
  60   60 5289 4446 PO
  60   60 5289 4425 PO
  60   60 5289 4341 PO
  60   60 5289 4320 PO
  60   60 5289 4299 PO
  60   60 5298 4509 PO
  60   60 5298 4488 PO
  60   60 5298 4467 PO
  60   60 5298 4383 PO
  60   60 5298 4362 PO
  60   60 5298 4341 PO
  60   60 5298 4320 PO
  60   60 5298 4299 PO
  60   60 5307 4320 PO
  60   60 5316 4509 PO
  60   60 5316 4341 PO
  60   60 5316 4320 PO
  60   60 5316 4299 PO
  60   60 5325 4341 PO
  60   60 5325 4320 PO
  60   60 5334 4362 PO
  60   60 5334 4341 PO
  60   60 5342 4341 PO
  60   60 5351 4341 PO
  60   60 5351 4320 PO
  60   60 5360 4341 PO
  60   60 5360 4320 PO
  60   60 5369 4341 PO
  60   60 5369 4320 PO
  60   60 5369 4299 PO
  60   60 5369 4257 PO
  60   60 5378 4362 PO
  60   60 5378 4341 PO
  60   60 5378 4320 PO
  60   60 5387 4341 PO
  60   60 5387 4320 PO
  60   60 5396 4362 PO
  60   60 5396 4341 PO
  60   60 5396 4320 PO
  60   60 5405 4362 PO
  60   60 5405 4341 PO
  60   60 5405 4320 PO
  60   60 5405 4299 PO
  60   60 5414 4362 PO
  60   60 5414 4341 PO
  60   60 5414 4320 PO
  60   60 5423 4362 PO
  60   60 5423 4341 PO
  60   60 5423 4320 PO
  60   60 5432 4341 PO
  60   60 5432 4320 PO
  60   60 5432 4299 PO
  60   60 5432 4278 PO
  60   60 5432 4257 PO
  60   60 5441 4341 PO
  60   60 5441 4320 PO
  60   60 5450 4383 PO
  60   60 5450 4362 PO
  60   60 5450 4341 PO
  60   60 5459 4362 PO
  60   60 5459 4341 PO
  60   60 5459 4320 PO
  60   60 5459 4278 PO
  60   60 5459 4257 PO
  60   60 5468 4362 PO
  60   60 5468 4341 PO
  60   60 5468 4320 PO
  60   60 5468 4299 PO
  60   60 5468 4278 PO
  60   60 5468 4257 PO
  60   60 5477 4362 PO
  60   60 5477 4341 PO
  60   60 5477 4320 PO
  60   60 5486 4383 PO
  60   60 5486 4362 PO
  60   60 5486 4341 PO
  60   60 5486 4320 PO
  60   60 5494 4425 PO
  60   60 5494 4404 PO
  60   60 5494 4362 PO
  60   60 5494 4341 PO
  60   60 5494 4320 PO
  60   60 5494 4299 PO
  60   60 5494 4278 PO
  60   60 5503 4383 PO
  60   60 5503 4362 PO
  60   60 5503 4341 PO
  60   60 5503 4278 PO
  60   60 5503 4257 PO
  60   60 5512 4362 PO
  60   60 5512 4341 PO
  60   60 5512 4320 PO
  60   60 5521 4383 PO
  60   60 5521 4362 PO
  60   60 5521 4341 PO
  60   60 5530 4383 PO
  60   60 5539 4404 PO
  60   60 5539 4383 PO
  60   60 5539 4362 PO
  60   60 5539 4341 PO
  60   60 5539 4320 PO
  60   60 5548 4383 PO
  60   60 5548 4362 PO
  60   60 5548 4341 PO
  60   60 5557 4383 PO
  60   60 5557 4362 PO
  60   60 5557 4341 PO
  60   60 5566 4383 PO
  60   60 5566 4362 PO
  60   60 5566 4341 PO
  60   60 5575 4383 PO
  60   60 5575 4362 PO
  60   60 5575 4341 PO
  60   60 5584 4467 PO
  60   60 5584 4446 PO
  60   60 5584 4425 PO
  60   60 5584 4404 PO
  60   60 5584 4383 PO
  60   60 5584 4362 PO
  60   60 5584 4341 PO
  60   60 5593 4404 PO
  60   60 5593 4383 PO
  60   60 5593 4362 PO
  60   60 5593 4320 PO
  60   60 5593 4299 PO
  60   60 5602 4488 PO
  60   60 5602 4467 PO
  60   60 5602 4404 PO
  60   60 5602 4383 PO
  60   60 5602 4362 PO
  60   60 5611 4362 PO
  60   60 5611 4341 PO
  60   60 5620 4404 PO
  60   60 5620 4383 PO
  60   60 5620 4362 PO
  60   60 5620 4341 PO
  60   60 5620 4320 PO
  60   60 5629 4404 PO
  60   60 5629 4383 PO
  60   60 5629 4362 PO
  60   60 5629 4320 PO
  60   60 5638 4404 PO
  60   60 5638 4383 PO
  60   60 5638 4362 PO
  60   60 5646 4404 PO
  60   60 5646 4383 PO
  60   60 5646 4362 PO
  60   60 5655 4404 PO
  60   60 5655 4383 PO
  60   60 5655 4362 PO
  60   60 5664 4404 PO
  60   60 5664 4362 PO
  60   60 5673 4404 PO
  60   60 5673 4383 PO
  60   60 5673 4362 PO
  60   60 5682 4404 PO
  60   60 5682 4383 PO
  60   60 5682 4362 PO
  60   60 5691 4509 PO
  60   60 5691 4488 PO
  60   60 5691 4404 PO
  60   60 5691 4383 PO
  60   60 5691 4362 PO
  60   60 5700 4488 PO
  60   60 5700 4446 PO
  60   60 5700 4425 PO
  60   60 5700 4404 PO
  60   60 5700 4383 PO
  60   60 5700 4362 PO
  60   60 5709 4488 PO
  60   60 5709 4467 PO
  60   60 5709 4425 PO
  60   60 5709 4404 PO
  60   60 5709 4383 PO
  60   60 5709 4362 PO
  60   60 5709 4341 PO
  60   60 5718 4488 PO
  60   60 5718 4425 PO
  60   60 5718 4404 PO
  60   60 5718 4383 PO
  60   60 5718 4362 PO
  60   60 5727 4404 PO
  60   60 5727 4383 PO
  60   60 5727 4362 PO
  60   60 5736 4425 PO
  60   60 5736 4404 PO
  60   60 5745 4404 PO
  60   60 1641 1737 FO
  60   60 1641 1716 FO
  60   60 1650 1863 FO
  60   60 1650 1779 FO
  60   60 1650 1758 FO
  60   60 1650 1737 FO
  60   60 1650 1716 FO
  60   60 1659 1842 FO
  60   60 1659 1821 FO
  60   60 1659 1800 FO
  60   60 1659 1779 FO
  60   60 1659 1758 FO
  60   60 1659 1737 FO
  60   60 1667 1884 FO
  60   60 1667 1863 FO
  60   60 1667 1842 FO
  60   60 1667 1821 FO
  60   60 1667 1800 FO
  60   60 1667 1779 FO
  60   60 1676 1905 FO
  60   60 1676 1884 FO
  60   60 1676 1863 FO
  60   60 1676 1842 FO
  60   60 1685 1947 FO
  60   60 1685 1926 FO
  60   60 1685 1905 FO
  60   60 1685 1884 FO
  60   60 1685 1863 FO
  60   60 1694 1989 FO
  60   60 1694 1968 FO
  60   60 1694 1947 FO
  60   60 1694 1926 FO
  60   60 1703 2031 FO
  60   60 1703 2010 FO
  60   60 1703 1989 FO
  60   60 1703 1968 FO
  60   60 1703 1947 FO
  60   60 1712 2052 FO
  60   60 1712 2031 FO
  60   60 1712 2010 FO
  60   60 1712 1989 FO
  60   60 1721 2094 FO
  60   60 1721 2073 FO
  60   60 1721 2052 FO
  60   60 1721 2031 FO
  60   60 1730 2115 FO
  60   60 1730 2094 FO
  60   60 1730 2073 FO
  60   60 1730 2052 FO
  60   60 1739 2136 FO
  60   60 1739 2115 FO
  60   60 1739 2094 FO
  60   60 1748 2178 FO
  60   60 1748 2157 FO
  60   60 1748 2136 FO
  60   60 1748 2115 FO
  60   60 1757 2199 FO
  60   60 1757 2178 FO
  60   60 1757 2157 FO
  60   60 1757 2136 FO
  60   60 1766 2241 FO
  60   60 1766 2220 FO
  60   60 1766 2199 FO
  60   60 1766 2178 FO
  60   60 1775 2262 FO
  60   60 1775 2241 FO
  60   60 1775 2220 FO
  60   60 1775 2199 FO
  60   60 1784 2283 FO
  60   60 1784 2262 FO
  60   60 1784 2241 FO
  60   60 1784 2220 FO
  60   60 1793 2304 FO
  60   60 1793 2283 FO
  60   60 1793 2262 FO
  60   60 1802 2346 FO
  60   60 1802 2325 FO
  60   60 1802 2304 FO
  60   60 1802 2283 FO
  60   60 1811 2367 FO
  60   60 1811 2346 FO
  60   60 1811 2325 FO
  60   60 1811 2304 FO
  60   60 1819 2388 FO
  60   60 1819 2367 FO
  60   60 1819 2346 FO
  60   60 1819 2325 FO
  60   60 1828 2409 FO
  60   60 1828 2388 FO
  60   60 1828 2367 FO
  60   60 1837 2430 FO
  60   60 1837 2409 FO
  60   60 1837 2388 FO
  60   60 1837 2367 FO
  60   60 1846 2451 FO
  60   60 1846 2430 FO
  60   60 1846 2409 FO
  60   60 1846 2388 FO
  60   60 1855 2472 FO
  60   60 1855 2451 FO
  60   60 1855 2430 FO
  60   60 1864 2493 FO
  60   60 1864 2472 FO
  60   60 1864 2451 FO
  60   60 1873 2514 FO
  60   60 1873 2493 FO
  60   60 1873 2472 FO
  60   60 1882 2535 FO
  60   60 1882 2514 FO
  60   60 1882 2493 FO
  60   60 1891 2556 FO
  60   60 1891 2535 FO
  60   60 1891 2514 FO
  60   60 1891 2493 FO
  60   60 1900 2577 FO
  60   60 1900 2556 FO
  60   60 1900 2535 FO
  60   60 1900 2514 FO
  60   60 1909 2577 FO
  60   60 1909 2556 FO
  60   60 1909 2535 FO
  60   60 1918 2598 FO
  60   60 1918 2577 FO
  60   60 1918 2556 FO
  60   60 1927 2619 FO
  60   60 1927 2598 FO
  60   60 1927 2577 FO
  60   60 1936 2640 FO
  60   60 1936 2619 FO
  60   60 1936 2598 FO
  60   60 1945 2661 FO
  60   60 1945 2640 FO
  60   60 1945 2619 FO
  60   60 1954 2661 FO
  60   60 1954 2640 FO
  60   60 1954 2619 FO
  60   60 1963 2682 FO
  60   60 1963 2661 FO
  60   60 1963 2640 FO
  60   60 1971 2703 FO
  60   60 1971 2682 FO
  60   60 1971 2661 FO
  60   60 1980 2724 FO
  60   60 1980 2703 FO
  60   60 1980 2682 FO
  60   60 1989 2724 FO
  60   60 1989 2703 FO
  60   60 1998 2745 FO
  60   60 1998 2724 FO
  60   60 1998 2703 FO
  60   60 2007 2766 FO
  60   60 2007 2745 FO
  60   60 2007 2724 FO
  60   60 2016 2766 FO
  60   60 2016 2745 FO
  60   60 2016 2724 FO
  60   60 2025 2787 FO
  60   60 2025 2766 FO
  60   60 2025 2745 FO
  60   60 2034 2808 FO
  60   60 2034 2787 FO
  60   60 2034 2766 FO
  60   60 2043 2808 FO
  60   60 2043 2787 FO
  60   60 2043 2766 FO
  60   60 2052 2829 FO
  60   60 2052 2808 FO
  60   60 2052 2787 FO
  60   60 2061 2850 FO
  60   60 2061 2829 FO
  60   60 2061 2808 FO
  60   60 2070 2850 FO
  60   60 2070 2829 FO
  60   60 2070 2808 FO
  60   60 2079 2871 FO
  60   60 2079 2850 FO
  60   60 2079 2829 FO
  60   60 2088 2871 FO
  60   60 2088 2850 FO
  60   60 2097 2871 FO
  60   60 2097 2850 FO
  60   60 2106 2871 FO
  60   60 2115 2871 FO
  60   60 2168 2997 FO
  60   60 2177 2997 FO
  60   60 2186 3018 FO
  60   60 2186 2997 FO
  60   60 2195 3018 FO
  60   60 2195 2997 FO
  60   60 2204 3018 FO
  60   60 2204 2997 FO
  60   60 2213 3039 FO
  60   60 2213 3018 FO
  60   60 2213 2997 FO
  60   60 2222 3060 FO
  60   60 2222 3039 FO
  60   60 2222 3018 FO
  60   60 2231 3060 FO
  60   60 2231 3039 FO
  60   60 2231 3018 FO
  60   60 2240 3081 FO
  60   60 2240 3060 FO
  60   60 2240 3039 FO
  60   60 2249 3081 FO
  60   60 2249 3060 FO
  60   60 2249 3039 FO
  60   60 2258 3081 FO
  60   60 2258 3060 FO
  60   60 2267 3102 FO
  60   60 2267 3081 FO
  60   60 2267 3060 FO
  60   60 2276 3102 FO
  60   60 2276 3081 FO
  60   60 2284 3123 FO
  60   60 2284 3102 FO
  60   60 2284 3081 FO
  60   60 2293 3123 FO
  60   60 2293 3102 FO
  60   60 2302 3144 FO
  60   60 2302 3123 FO
  60   60 2302 3102 FO
  60   60 2311 3144 FO
  60   60 2311 3123 FO
  60   60 2311 3102 FO
  60   60 2320 3144 FO
  60   60 2320 3123 FO
  60   60 2329 3165 FO
  60   60 2329 3144 FO
  60   60 2329 3123 FO
  60   60 2338 3186 FO
  60   60 2338 3165 FO
  60   60 2338 3144 FO
  60   60 2347 3186 FO
  60   60 2347 3165 FO
  60   60 2347 3144 FO
  60   60 2356 3186 FO
  60   60 2356 3165 FO
  60   60 2365 3207 FO
  60   60 2365 3186 FO
  60   60 2365 3165 FO
  60   60 2374 3207 FO
  60   60 2374 3186 FO
  60   60 2374 3165 FO
  60   60 2383 3207 FO
  60   60 2383 3186 FO
  60   60 2392 3228 FO
  60   60 2392 3207 FO
  60   60 2392 3186 FO
  60   60 2401 3228 FO
  60   60 2401 3207 FO
  60   60 2410 3249 FO
  60   60 2410 3228 FO
  60   60 2410 3207 FO
  60   60 2419 3249 FO
  60   60 2419 3228 FO
  60   60 2419 3207 FO
  60   60 2428 3249 FO
  60   60 2428 3228 FO
  60   60 2436 3270 FO
  60   60 2436 3249 FO
  60   60 2436 3228 FO
  60   60 2445 3270 FO
  60   60 2445 3249 FO
  60   60 2445 3228 FO
  60   60 2454 3270 FO
  60   60 2454 3249 FO
  60   60 2463 3291 FO
  60   60 2463 3270 FO
  60   60 2463 3249 FO
  60   60 2472 3291 FO
  60   60 2472 3270 FO
  60   60 2481 3291 FO
  60   60 2481 3270 FO
  60   60 2490 3312 FO
  60   60 2490 3291 FO
  60   60 2490 3270 FO
  60   60 2499 3312 FO
  60   60 2499 3291 FO
  60   60 2508 3333 FO
  60   60 2508 3312 FO
  60   60 2508 3291 FO
  60   60 2517 3333 FO
  60   60 2517 3312 FO
  60   60 2517 3291 FO
  60   60 2526 3333 FO
  60   60 2526 3312 FO
  60   60 2535 3354 FO
  60   60 2535 3333 FO
  60   60 2535 3312 FO
  60   60 2544 3354 FO
  60   60 2544 3333 FO
  60   60 2544 3312 FO
  60   60 2553 3354 FO
  60   60 2553 3333 FO
  60   60 2562 3375 FO
  60   60 2562 3354 FO
  60   60 2562 3333 FO
  60   60 2571 3375 FO
  60   60 2571 3354 FO
  60   60 2571 3333 FO
  60   60 2580 3375 FO
  60   60 2580 3354 FO
  60   60 2588 3396 FO
  60   60 2588 3375 FO
  60   60 2588 3354 FO
  60   60 2597 3396 FO
  60   60 2597 3375 FO
  60   60 2597 3354 FO
  60   60 2606 3396 FO
  60   60 2606 3375 FO
  60   60 2606 3354 FO
  60   60 2615 3396 FO
  60   60 2615 3375 FO
  60   60 2624 3417 FO
  60   60 2624 3396 FO
  60   60 2624 3375 FO
  60   60 2633 3417 FO
  60   60 2633 3396 FO
  60   60 2633 3375 FO
  60   60 2642 3417 FO
  60   60 2642 3396 FO
  60   60 2651 3438 FO
  60   60 2651 3417 FO
  60   60 2651 3396 FO
  60   60 2660 3438 FO
  60   60 2660 3417 FO
  60   60 2660 3396 FO
  60   60 2669 3438 FO
  60   60 2669 3417 FO
  60   60 2678 3459 FO
  60   60 2678 3438 FO
  60   60 2678 3417 FO
  60   60 2687 3459 FO
  60   60 2687 3438 FO
  60   60 2687 3417 FO
  60   60 2696 3459 FO
  60   60 2696 3438 FO
  60   60 2705 3459 FO
  60   60 2705 3438 FO
  60   60 2714 3480 FO
  60   60 2714 3459 FO
  60   60 2714 3438 FO
  60   60 2723 3480 FO
  60   60 2723 3459 FO
  60   60 2723 3438 FO
  60   60 2732 3480 FO
  60   60 2732 3459 FO
  60   60 2740 3501 FO
  60   60 2740 3480 FO
  60   60 2740 3459 FO
  60   60 2749 3501 FO
  60   60 2749 3480 FO
  60   60 2749 3459 FO
  60   60 2758 3501 FO
  60   60 2758 3480 FO
  60   60 2767 3501 FO
  60   60 2767 3480 FO
  60   60 2776 3501 FO
  60   60 2776 3480 FO
  60   60 2785 3522 FO
  60   60 2785 3501 FO
  60   60 2794 3522 FO
  60   60 2794 3501 FO
  60   60 2803 3522 FO
  60   60 2803 3501 FO
  60   60 2812 3522 FO
  60   60 2812 3501 FO
  60   60 2821 3543 FO
  60   60 2821 3522 FO
  60   60 2821 3501 FO
  60   60 2830 3543 FO
  60   60 2830 3522 FO
  60   60 2839 3543 FO
  60   60 2839 3522 FO
  60   60 2848 3564 FO
  60   60 2848 3543 FO
  60   60 2848 3522 FO
  60   60 2857 3564 FO
  60   60 2857 3543 FO
  60   60 2866 3564 FO
  60   60 2866 3543 FO
  60   60 2875 3564 FO
  60   60 2875 3543 FO
  60   60 2884 3585 FO
  60   60 2884 3564 FO
  60   60 2884 3543 FO
  60   60 2892 3585 FO
  60   60 2892 3564 FO
  60   60 2892 3543 FO
  60   60 2901 3585 FO
  60   60 2901 3564 FO
  60   60 2910 3606 FO
  60   60 2910 3585 FO
  60   60 2910 3564 FO
  60   60 2919 3606 FO
  60   60 2919 3585 FO
  60   60 2919 3564 FO
  60   60 2928 3606 FO
  60   60 2928 3585 FO
  60   60 2937 3606 FO
  60   60 2937 3585 FO
  60   60 2946 3606 FO
  60   60 2946 3585 FO
  60   60 2955 3627 FO
  60   60 2955 3606 FO
  60   60 2955 3585 FO
  60   60 2964 3627 FO
  60   60 2964 3606 FO
  60   60 2964 3585 FO
  60   60 2973 3627 FO
  60   60 2973 3606 FO
  60   60 2982 3627 FO
  60   60 2982 3606 FO
  60   60 2991 3627 FO
  60   60 2991 3606 FO
  60   60 3000 3648 FO
  60   60 3000 3627 FO
  60   60 3000 3606 FO
  60   60 3009 3648 FO
  60   60 3009 3627 FO
  60   60 3018 3648 FO
  60   60 3018 3627 FO
  60   60 3027 3669 FO
  60   60 3027 3648 FO
  60   60 3027 3627 FO
  60   60 3036 3669 FO
  60   60 3036 3648 FO
  60   60 3036 3627 FO
  60   60 3044 3669 FO
  60   60 3044 3648 FO
  60   60 3044 3627 FO
  60   60 3053 3669 FO
  60   60 3053 3648 FO
  60   60 3062 3669 FO
  60   60 3062 3648 FO
  60   60 3071 3669 FO
  60   60 3071 3648 FO
  60   60 3080 3690 FO
  60   60 3080 3669 FO
  60   60 3089 3774 FO
  60   60 3089 3753 FO
  60   60 3089 3732 FO
  60   60 3089 3690 FO
  60   60 3089 3669 FO
  60   60 3098 3795 FO
  60   60 3098 3690 FO
  60   60 3098 3669 FO
  60   60 3107 3690 FO
  60   60 3107 3669 FO
  60   60 3116 3690 FO
  60   60 3116 3669 FO
  60   60 3125 3690 FO
  60   60 3125 3669 FO
  60   60 3134 3711 FO
  60   60 3134 3690 FO
  60   60 3143 3711 FO
  60   60 3143 3690 FO
  60   60 3152 3711 FO
  60   60 3152 3690 FO
  60   60 3161 3711 FO
  60   60 3161 3690 FO
  60   60 3170 3732 FO
  60   60 3170 3711 FO
  60   60 3170 3690 FO
  60   60 3179 3732 FO
  60   60 3179 3711 FO
  60   60 3188 3732 FO
  60   60 3188 3711 FO
  60   60 3196 3732 FO
  60   60 3196 3711 FO
  60   60 3205 3732 FO
  60   60 3205 3711 FO
  60   60 3214 3753 FO
  60   60 3214 3732 FO
  60   60 3223 3753 FO
  60   60 3223 3732 FO
  60   60 3232 3858 FO
  60   60 3232 3837 FO
  60   60 3232 3753 FO
  60   60 3232 3732 FO
  60   60 3241 3753 FO
  60   60 3241 3732 FO
  60   60 3250 3858 FO
  60   60 3250 3816 FO
  60   60 3250 3753 FO
  60   60 3250 3732 FO
  60   60 3259 3837 FO
  60   60 3259 3816 FO
  60   60 3259 3774 FO
  60   60 3259 3753 FO
  60   60 3259 3732 FO
  60   60 3259 3690 FO
  60   60 3259 3669 FO
  60   60 3259 3648 FO
  60   60 3268 3774 FO
  60   60 3268 3753 FO
  60   60 3277 3837 FO
  60   60 3277 3774 FO
  60   60 3277 3753 FO
  60   60 3286 3837 FO
  60   60 3286 3774 FO
  60   60 3286 3753 FO
  60   60 3295 3774 FO
  60   60 3295 3753 FO
  60   60 3304 3795 FO
  60   60 3304 3774 FO
  60   60 3304 3753 FO
  60   60 3313 3795 FO
  60   60 3313 3774 FO
  60   60 3313 3753 FO
  60   60 3322 3795 FO
  60   60 3322 3774 FO
  60   60 3331 3795 FO
  60   60 3331 3774 FO
  60   60 3340 3795 FO
  60   60 3340 3774 FO
  60   60 3348 3816 FO
  60   60 3348 3795 FO
  60   60 3348 3774 FO
  60   60 3357 3816 FO
  60   60 3357 3795 FO
  60   60 3357 3774 FO
  60   60 3366 3816 FO
  60   60 3366 3795 FO
  60   60 3375 3816 FO
  60   60 3375 3795 FO
  60   60 3384 3816 FO
  60   60 3384 3795 FO
  60   60 3384 3774 FO
  60   60 3384 3753 FO
  60   60 3393 3816 FO
  60   60 3393 3795 FO
  60   60 3402 3816 FO
  60   60 3402 3795 FO
  60   60 3411 3879 FO
  60   60 3411 3837 FO
  60   60 3411 3816 FO
  60   60 3411 3795 FO
  60   60 3420 3879 FO
  60   60 3420 3837 FO
  60   60 3420 3816 FO
  60   60 3429 3837 FO
  60   60 3429 3816 FO
  60   60 3438 3837 FO
  60   60 3438 3816 FO
  60   60 3447 3900 FO
  60   60 3447 3879 FO
  60   60 3447 3858 FO
  60   60 3447 3837 FO
  60   60 3447 3816 FO
  60   60 3456 3858 FO
  60   60 3456 3837 FO
  60   60 3456 3816 FO
  60   60 3465 3837 FO
  60   60 3465 3816 FO
  60   60 3474 3858 FO
  60   60 3474 3837 FO
  60   60 3474 3816 FO
  60   60 3483 3858 FO
  60   60 3483 3837 FO
  60   60 3492 3858 FO
  60   60 3492 3837 FO
  60   60 3500 3858 FO
  60   60 3500 3837 FO
  60   60 3509 3879 FO
  60   60 3509 3858 FO
  60   60 3509 3837 FO
  60   60 3518 3879 FO
  60   60 3518 3858 FO
  60   60 3518 3837 FO
  60   60 3527 3921 FO
  60   60 3527 3879 FO
  60   60 3527 3858 FO
  60   60 3536 3921 FO
  60   60 3536 3879 FO
  60   60 3536 3858 FO
  60   60 3545 3879 FO
  60   60 3545 3858 FO
  60   60 3554 3879 FO
  60   60 3554 3858 FO
  60   60 3563 3900 FO
  60   60 3563 3879 FO
  60   60 3563 3858 FO
  60   60 3572 3900 FO
  60   60 3572 3879 FO
  60   60 3572 3858 FO
  60   60 3581 3900 FO
  60   60 3581 3879 FO
  60   60 3581 3858 FO
  60   60 3590 3900 FO
  60   60 3590 3879 FO
  60   60 3599 3900 FO
  60   60 3599 3879 FO
  60   60 3608 3900 FO
  60   60 3608 3879 FO
  60   60 3608 3816 FO
  60   60 3608 3795 FO
  60   60 3608 3774 FO
  60   60 3617 3900 FO
  60   60 3617 3879 FO
  60   60 3617 3837 FO
  60   60 3626 3900 FO
  60   60 3626 3879 FO
  60   60 3635 3921 FO
  60   60 3635 3900 FO
  60   60 3635 3879 FO
  60   60 3635 3816 FO
  60   60 3635 3795 FO
  60   60 3644 3921 FO
  60   60 3644 3900 FO
  60   60 3644 3816 FO
  60   60 3644 3795 FO
  60   60 3644 3774 FO
  60   60 3653 3921 FO
  60   60 3653 3900 FO
  60   60 3653 3774 FO
  60   60 3661 3921 FO
  60   60 3661 3900 FO
  60   60 3661 3858 FO
  60   60 3661 3837 FO
  60   60 3661 3816 FO
  60   60 3670 3921 FO
  60   60 3670 3900 FO
  60   60 3670 3795 FO
  60   60 3679 3921 FO
  60   60 3679 3900 FO
  60   60 3679 3858 FO
  60   60 3679 3774 FO
  60   60 3688 4005 FO
  60   60 3688 3984 FO
  60   60 3688 3942 FO
  60   60 3688 3921 FO
  60   60 3697 3984 FO
  60   60 3697 3942 FO
  60   60 3697 3921 FO
  60   60 3697 3858 FO
  60   60 3706 3942 FO
  60   60 3706 3921 FO
  60   60 3715 3942 FO
  60   60 3715 3921 FO
  60   60 3724 3942 FO
  60   60 3724 3921 FO
  60   60 3724 3900 FO
  60   60 3724 3879 FO
  60   60 3733 3942 FO
  60   60 3733 3921 FO
  60   60 3742 3963 FO
  60   60 3742 3942 FO
  60   60 3742 3921 FO
  60   60 3751 3963 FO
  60   60 3751 3942 FO
  60   60 3751 3921 FO
  60   60 3760 3942 FO
  60   60 3760 3921 FO
  60   60 3760 3879 FO
  60   60 3760 3858 FO
  60   60 3769 3963 FO
  60   60 3769 3942 FO
  60   60 3769 3837 FO
  60   60 3769 3816 FO
  60   60 3778 4068 FO
  60   60 3778 3963 FO
  60   60 3778 3942 FO
  60   60 3778 3879 FO
  60   60 3787 4131 FO
  60   60 3787 4110 FO
  60   60 3787 4068 FO
  60   60 3787 4026 FO
  60   60 3787 3963 FO
  60   60 3787 3942 FO
  60   60 3796 4026 FO
  60   60 3796 4005 FO
  60   60 3796 3984 FO
  60   60 3796 3963 FO
  60   60 3796 3942 FO
  60   60 3805 4068 FO
  60   60 3805 4047 FO
  60   60 3805 4026 FO
  60   60 3805 3984 FO
  60   60 3805 3963 FO
  60   60 3805 3942 FO
  60   60 3813 3984 FO
  60   60 3813 3963 FO
  60   60 3813 3942 FO
  60   60 3822 3984 FO
  60   60 3822 3963 FO
  60   60 3831 3963 FO
  60   60 3840 3984 FO
  60   60 3840 3963 FO
  60   60 3849 3984 FO
  60   60 3849 3963 FO
  60   60 3858 3984 FO
  60   60 3858 3963 FO
  60   60 3867 3984 FO
  60   60 3867 3963 FO
  60   60 3876 4005 FO
  60   60 3876 3984 FO
  60   60 3876 3963 FO
  60   60 3885 4005 FO
  60   60 3885 3984 FO
  60   60 3885 3963 FO
  60   60 3885 3921 FO
  60   60 3894 4005 FO
  60   60 3894 3984 FO
  60   60 3894 3963 FO
  60   60 3903 4005 FO
  60   60 3903 3984 FO
  60   60 3912 4026 FO
  60   60 3912 4005 FO
  60   60 3912 3984 FO
  60   60 3921 4005 FO
  60   60 3921 3984 FO
  60   60 3930 4005 FO
  60   60 3930 3984 FO
  60   60 3939 4026 FO
  60   60 3939 4005 FO
  60   60 3939 3984 FO
  60   60 3948 4005 FO
  60   60 3948 3984 FO
  60   60 3957 4026 FO
  60   60 3957 4005 FO
  60   60 3957 3984 FO
  60   60 3957 3963 FO
  60   60 3957 3942 FO
  60   60 3965 4026 FO
  60   60 3965 4005 FO
  60   60 3965 3984 FO
  60   60 3974 4026 FO
  60   60 3974 4005 FO
  60   60 3974 3942 FO
  60   60 3974 3921 FO
  60   60 3983 4026 FO
  60   60 3983 4005 FO
  60   60 3992 4026 FO
  60   60 3992 4005 FO
  60   60 3992 3963 FO
  60   60 3992 3942 FO
  60   60 4001 4026 FO
  60   60 4001 4005 FO
  60   60 4010 4026 FO
  60   60 4010 4005 FO
  60   60 4019 4047 FO
  60   60 4019 4026 FO
  60   60 4019 4005 FO
  60   60 4028 4131 FO
  60   60 4028 4110 FO
  60   60 4028 4089 FO
  60   60 4028 4047 FO
  60   60 4028 4026 FO
  60   60 4028 4005 FO
  60   60 4037 4047 FO
  60   60 4037 4026 FO
  60   60 4037 3963 FO
  60   60 4046 4047 FO
  60   60 4046 4026 FO
  60   60 4046 4005 FO
  60   60 4046 3984 FO
  60   60 4055 4047 FO
  60   60 4055 4026 FO
  60   60 4064 4047 FO
  60   60 4064 4026 FO
  60   60 4073 4068 FO
  60   60 4073 4047 FO
  60   60 4073 4026 FO
  60   60 4082 4047 FO
  60   60 4082 4026 FO
  60   60 4091 4068 FO
  60   60 4091 4047 FO
  60   60 4091 4026 FO
  60   60 4100 4047 FO
  60   60 4100 4026 FO
  60   60 4109 4068 FO
  60   60 4109 4047 FO
  60   60 4109 4026 FO
  60   60 4109 4005 FO
  60   60 4109 3984 FO
  60   60 4117 4068 FO
  60   60 4117 4047 FO
  60   60 4126 4068 FO
  60   60 4126 4047 FO
  60   60 4135 4068 FO
  60   60 4135 4047 FO
  60   60 4135 3963 FO
  60   60 4135 3942 FO
  60   60 4144 4089 FO
  60   60 4144 4068 FO
  60   60 4144 4047 FO
  60   60 4144 3984 FO
  60   60 4144 3963 FO
  60   60 4153 4089 FO
  60   60 4153 4068 FO
  60   60 4153 4047 FO
  60   60 4153 4005 FO
  60   60 4162 4089 FO
  60   60 4162 4068 FO
  60   60 4162 4047 FO
  60   60 4162 4026 FO
  60   60 4171 4068 FO
  60   60 4171 4047 FO
  60   60 4180 4089 FO
  60   60 4180 4068 FO
  60   60 4180 4047 FO
  60   60 4189 4110 FO
  60   60 4189 4089 FO
  60   60 4189 4068 FO
  60   60 4189 4047 FO
  60   60 4198 4089 FO
  60   60 4198 4068 FO
  60   60 4207 4131 FO
  60   60 4207 4089 FO
  60   60 4207 4068 FO
  60   60 4216 4110 FO
  60   60 4216 4089 FO
  60   60 4216 4068 FO
  60   60 4225 4110 FO
  60   60 4225 4089 FO
  60   60 4225 4068 FO
  60   60 4225 3942 FO
  60   60 4225 3921 FO
  60   60 4225 3900 FO
  60   60 4234 4110 FO
  60   60 4234 4089 FO
  60   60 4234 4068 FO
  60   60 4234 4026 FO
  60   60 4234 4005 FO
  60   60 4234 3984 FO
  60   60 4234 3963 FO
  60   60 4234 3942 FO
  60   60 4234 3900 FO
  60   60 4243 4110 FO
  60   60 4243 4089 FO
  60   60 4243 4068 FO
  60   60 4243 4026 FO
  60   60 4252 4089 FO
  60   60 4252 4026 FO
  60   60 4261 4110 FO
  60   60 4261 4089 FO
  60   60 4261 4068 FO
  60   60 4261 4047 FO
  60   60 4269 4131 FO
  60   60 4269 4110 FO
  60   60 4269 4089 FO
  60   60 4269 4026 FO
  60   60 4269 4005 FO
  60   60 4278 4110 FO
  60   60 4278 4089 FO
  60   60 4287 4131 FO
  60   60 4287 4110 FO
  60   60 4287 4089 FO
  60   60 4296 4131 FO
  60   60 4296 4110 FO
  60   60 4296 4089 FO
  60   60 4305 4131 FO
  60   60 4305 4110 FO
  60   60 4305 4089 FO
  60   60 4314 4131 FO
  60   60 4314 4110 FO
  60   60 4314 4089 FO
  60   60 4314 4047 FO
  60   60 4323 4131 FO
  60   60 4323 4110 FO
  60   60 4323 4089 FO
  60   60 4332 4131 FO
  60   60 4332 4110 FO
  60   60 4341 4131 FO
  60   60 4341 4110 FO
  60   60 4341 4089 FO
  60   60 4350 4131 FO
  60   60 4350 4110 FO
  60   60 4350 4089 FO
  60   60 4359 4131 FO
  60   60 4359 4110 FO
  60   60 4359 3942 FO
  60   60 4359 3921 FO
  60   60 4368 4131 FO
  60   60 4368 4110 FO
  60   60 4368 4068 FO
  60   60 4368 4026 FO
  60   60 4368 4005 FO
  60   60 4368 3942 FO
  60   60 4368 3921 FO
  60   60 4377 4131 FO
  60   60 4377 4110 FO
  60   60 4377 4005 FO
  60   60 4377 3984 FO
  60   60 4377 3963 FO
  60   60 4386 4131 FO
  60   60 4386 4110 FO
  60   60 4386 4068 FO
  60   60 4386 3963 FO
  60   60 4386 3921 FO
  60   60 4395 4131 FO
  60   60 4395 4110 FO
  60   60 4395 4026 FO
  60   60 4404 4131 FO
  60   60 4404 4110 FO
  60   60 4404 4068 FO
  60   60 4404 4047 FO
  60   60 4404 3984 FO
  60   60 4404 3963 FO
  60   60 4404 3921 FO
  60   60 4413 4131 FO
  60   60 4421 4131 FO
  60   60 4421 4110 FO
  60   60 4430 4131 FO
  60   60 4439 4131 FO
  60   60 4439 4110 FO
  60   60 4448 4131 FO
  60   60 4457 4131 FO
  60   60 4466 4131 FO
  60   60 4475 4131 FO
  60   60 4484 4131 FO
  60   60 4886 4320 FO
  60   60 4886 4299 FO
  60   60 4886 4257 FO
  60   60 4895 4299 FO
  60   60 4895 4257 FO
  60   60 4904 4257 FO
  60   60 4913 4278 FO
  60   60 4913 4257 FO
  60   60 4922 4278 FO
  60   60 4922 4257 FO
  60   60 4931 4341 FO
  60   60 4931 4320 FO
  60   60 4931 4299 FO
  60   60 4931 4257 FO
  60   60 4940 4257 FO
  60   60 4949 4278 FO
  60   60 4949 4257 FO
  60   60 4958 4299 FO
  60   60 4958 4278 FO
  60   60 4958 4257 FO
  60   60 4967 4278 FO
  60   60 4967 4257 FO
  60   60 4985 4278 FO
  60   60 4985 4257 FO
  60   60 4994 4278 FO
  60   60 4994 4257 FO
  60   60 5003 4278 FO
  60   60 5003 4257 FO
  60   60 5012 4278 FO
  60   60 5012 4257 FO
  60   60 5021 4278 FO
  60   60 5021 4257 FO
  60   60 5030 4320 FO
  60   60 5030 4299 FO
  60   60 5030 4278 FO
  60   60 5030 4257 FO
  60   60 5038 4320 FO
  60   60 5038 4299 FO
  60   60 5038 4278 FO
  60   60 5038 4257 FO
  60   60 5047 4341 FO
  60   60 5047 4299 FO
  60   60 5047 4278 FO
  60   60 5047 4257 FO
  60   60 5056 4278 FO
  60   60 5056 4257 FO
  60   60 5065 4299 FO
  60   60 5065 4278 FO
  60   60 5065 4257 FO
  60   60 5074 4299 FO
  60   60 5074 4278 FO
  60   60 5074 4257 FO
  60   60 5083 4299 FO
  60   60 5083 4278 FO
  60   60 5083 4257 FO
  60   60 5092 4299 FO
  60   60 5092 4278 FO
  60   60 5092 4257 FO
  60   60 5101 4299 FO
  60   60 5101 4278 FO
  60   60 5101 4257 FO
  60   60 5110 4341 FO
  60   60 5110 4299 FO
  60   60 5110 4278 FO
  60   60 5110 4257 FO
  60   60 5119 4299 FO
  60   60 5119 4278 FO
  60   60 5119 4257 FO
  60   60 5128 4320 FO
  60   60 5128 4299 FO
  60   60 5128 4278 FO
  60   60 5137 4383 FO
  60   60 5137 4362 FO
  60   60 5137 4341 FO
  60   60 5137 4320 FO
  60   60 5137 4299 FO
  60   60 5146 4404 FO
  60   60 5146 4383 FO
  60   60 5146 4320 FO
  60   60 5146 4299 FO
  60   60 5146 4278 FO
  60   60 5155 4320 FO
  60   60 5155 4299 FO
  60   60 5155 4278 FO
  60   60 5164 4383 FO
  60   60 5164 4362 FO
  60   60 5164 4320 FO
  60   60 5164 4299 FO
  60   60 5164 4278 FO
  60   60 5173 4320 FO
  60   60 5173 4299 FO
  60   60 5173 4278 FO
  60   60 5182 4320 FO
  60   60 5182 4299 FO
  60   60 5182 4278 FO
  60   60 5182 4257 FO
  60   60 5190 4320 FO
  60   60 5190 4299 FO
  60   60 5190 4278 FO
  60   60 5190 4257 FO
  60   60 5199 4299 FO
  60   60 5199 4278 FO
  60   60 5208 4341 FO
  60   60 5208 4320 FO
  60   60 5208 4299 FO
  60   60 5208 4278 FO
  60   60 5217 4320 FO
  60   60 5217 4299 FO
  60   60 5217 4278 FO
  60   60 5226 4341 FO
  60   60 5226 4320 FO
  60   60 5226 4299 FO
  60   60 5226 4278 FO
  60   60 5235 4341 FO
  60   60 5235 4320 FO
  60   60 5235 4299 FO
  60   60 5244 4320 FO
  60   60 5244 4299 FO
  60   60 5253 4362 FO
  60   60 5253 4320 FO
  60   60 5253 4299 FO
  60   60 5262 4341 FO
  60   60 5262 4320 FO
  60   60 5271 4404 FO
  60   60 5271 4383 FO
  60   60 5271 4362 FO
  60   60 5271 4320 FO
  60   60 5280 4488 FO
  60   60 5280 4467 FO
  60   60 5280 4446 FO
  60   60 5280 4425 FO
  60   60 5280 4341 FO
  60   60 5280 4320 FO
  60   60 5280 4299 FO
  60   60 5289 4467 FO
  60   60 5289 4446 FO
  60   60 5289 4425 FO
  60   60 5289 4341 FO
  60   60 5289 4320 FO
  60   60 5289 4299 FO
  60   60 5298 4509 FO
  60   60 5298 4488 FO
  60   60 5298 4467 FO
  60   60 5298 4383 FO
  60   60 5298 4362 FO
  60   60 5298 4341 FO
  60   60 5298 4320 FO
  60   60 5298 4299 FO
  60   60 5307 4320 FO
  60   60 5316 4509 FO
  60   60 5316 4341 FO
  60   60 5316 4320 FO
  60   60 5316 4299 FO
  60   60 5325 4341 FO
  60   60 5325 4320 FO
  60   60 5334 4362 FO
  60   60 5334 4341 FO
  60   60 5342 4341 FO
  60   60 5351 4341 FO
  60   60 5351 4320 FO
  60   60 5360 4341 FO
  60   60 5360 4320 FO
  60   60 5369 4341 FO
  60   60 5369 4320 FO
  60   60 5369 4299 FO
  60   60 5369 4257 FO
  60   60 5378 4362 FO
  60   60 5378 4341 FO
  60   60 5378 4320 FO
  60   60 5387 4341 FO
  60   60 5387 4320 FO
  60   60 5396 4362 FO
  60   60 5396 4341 FO
  60   60 5396 4320 FO
  60   60 5405 4362 FO
  60   60 5405 4341 FO
  60   60 5405 4320 FO
  60   60 5405 4299 FO
  60   60 5414 4362 FO
  60   60 5414 4341 FO
  60   60 5414 4320 FO
  60   60 5423 4362 FO
  60   60 5423 4341 FO
  60   60 5423 4320 FO
  60   60 5432 4341 FO
  60   60 5432 4320 FO
  60   60 5432 4299 FO
  60   60 5432 4278 FO
  60   60 5432 4257 FO
  60   60 5441 4341 FO
  60   60 5441 4320 FO
  60   60 5450 4383 FO
  60   60 5450 4362 FO
  60   60 5450 4341 FO
  60   60 5459 4362 FO
  60   60 5459 4341 FO
  60   60 5459 4320 FO
  60   60 5459 4278 FO
  60   60 5459 4257 FO
  60   60 5468 4362 FO
  60   60 5468 4341 FO
  60   60 5468 4320 FO
  60   60 5468 4299 FO
  60   60 5468 4278 FO
  60   60 5468 4257 FO
  60   60 5477 4362 FO
  60   60 5477 4341 FO
  60   60 5477 4320 FO
  60   60 5486 4383 FO
  60   60 5486 4362 FO
  60   60 5486 4341 FO
  60   60 5486 4320 FO
  60   60 5494 4425 FO
  60   60 5494 4404 FO
  60   60 5494 4362 FO
  60   60 5494 4341 FO
  60   60 5494 4320 FO
  60   60 5494 4299 FO
  60   60 5494 4278 FO
  60   60 5503 4383 FO
  60   60 5503 4362 FO
  60   60 5503 4341 FO
  60   60 5503 4278 FO
  60   60 5503 4257 FO
  60   60 5512 4362 FO
  60   60 5512 4341 FO
  60   60 5512 4320 FO
  60   60 5521 4383 FO
  60   60 5521 4362 FO
  60   60 5521 4341 FO
  60   60 5530 4383 FO
  60   60 5539 4404 FO
  60   60 5539 4383 FO
  60   60 5539 4362 FO
  60   60 5539 4341 FO
  60   60 5539 4320 FO
  60   60 5548 4383 FO
  60   60 5548 4362 FO
  60   60 5548 4341 FO
  60   60 5557 4383 FO
  60   60 5557 4362 FO
  60   60 5557 4341 FO
  60   60 5566 4383 FO
  60   60 5566 4362 FO
  60   60 5566 4341 FO
  60   60 5575 4383 FO
  60   60 5575 4362 FO
  60   60 5575 4341 FO
  60   60 5584 4467 FO
  60   60 5584 4446 FO
  60   60 5584 4425 FO
  60   60 5584 4404 FO
  60   60 5584 4383 FO
  60   60 5584 4362 FO
  60   60 5584 4341 FO
  60   60 5593 4404 FO
  60   60 5593 4383 FO
  60   60 5593 4362 FO
  60   60 5593 4320 FO
  60   60 5593 4299 FO
  60   60 5602 4488 FO
  60   60 5602 4467 FO
  60   60 5602 4404 FO
  60   60 5602 4383 FO
  60   60 5602 4362 FO
  60   60 5611 4362 FO
  60   60 5611 4341 FO
  60   60 5620 4404 FO
  60   60 5620 4383 FO
  60   60 5620 4362 FO
  60   60 5620 4341 FO
  60   60 5620 4320 FO
  60   60 5629 4404 FO
  60   60 5629 4383 FO
  60   60 5629 4362 FO
  60   60 5629 4320 FO
  60   60 5638 4404 FO
  60   60 5638 4383 FO
  60   60 5638 4362 FO
  60   60 5646 4404 FO
  60   60 5646 4383 FO
  60   60 5646 4362 FO
  60   60 5655 4404 FO
  60   60 5655 4383 FO
  60   60 5655 4362 FO
  60   60 5664 4404 FO
  60   60 5664 4362 FO
  60   60 5673 4404 FO
  60   60 5673 4383 FO
  60   60 5673 4362 FO
  60   60 5682 4404 FO
  60   60 5682 4383 FO
  60   60 5682 4362 FO
  60   60 5691 4509 FO
  60   60 5691 4488 FO
  60   60 5691 4404 FO
  60   60 5691 4383 FO
  60   60 5691 4362 FO
  60   60 5700 4488 FO
  60   60 5700 4446 FO
  60   60 5700 4425 FO
  60   60 5700 4404 FO
  60   60 5700 4383 FO
  60   60 5700 4362 FO
  60   60 5709 4488 FO
  60   60 5709 4467 FO
  60   60 5709 4425 FO
  60   60 5709 4404 FO
  60   60 5709 4383 FO
  60   60 5709 4362 FO
  60   60 5709 4341 FO
  60   60 5718 4488 FO
  60   60 5718 4425 FO
  60   60 5718 4404 FO
  60   60 5718 4383 FO
  60   60 5718 4362 FO
  60   60 5727 4404 FO
  60   60 5727 4383 FO
  60   60 5727 4362 FO
  60   60 5736 4425 FO
  60   60 5736 4404 FO
  60   60 5745 4404 FO
gs 899 414 5357 4202 rc
gr

0 sg
2387  223 mt 
(number of clusters = 2) s

end %%Color Dict

eplot
%%EndObject

epage
end

showpage

%%Trailer
%%EOF
