815580747 815580750
815586554 815586556
815592255 815592258
815726828 815726831
815798536 815798539
815890241 815890244
815890422 815890425
815890464 815890467
815890661 815890664
815904963 815904965
815913215 815913218
815917035 815917037
815927380 815927384
815962840 815962842
815963921 815963923
816092017 816092020
816092076 816092079
816099156 816099159
816099179 816099182
816103351 816103354
816103359 816103362
816103365 816103369
816183174 816183177
816183193 816183196
816189817 816189820
816208496 816208499
816209618 816209621
816212176 816212179
816214255 816214258
816271599 816271602
816271608 816271611
816271642 816271645
816271646 816271650
816277100 816277103
816353497 816353500
816353535 816353538
816353545 816353548
816353620 816353626
816363837 816363840
816430825 816430828
816457127 816457130
816457647 816457650
816534986 816534989
816535114 816535117
817077860 817077863
817252456 817252459
817404998 817405001
817940319 817940322
817943232 817943234
818093542 818093544
818096086 818096088
818346865 818346868
818439002 818439005
818454115 818454117
818635044 818635047
818636579 818636582
818712059 818712061
818723647 818723650
818734880 818734882
818790362 818790364
818831851 818831853
818878585 818878588
818945603 818945606
818969166 818969170
819055264 819055267
819061927 819061929
819128035 819128038
819218622 819218624
819228490 819228492
819230127 819230130
819234398 819234400
819238105 819238107
819313079 819313081
819358312 819358315
819362042 819362044
819377832 819377834
819400757 819400759
819424102 819424104
819468371 819468373
819515372 819515375
819560094 819560097
819573193 819573195
819579925 819579928
819697644 819697646
819850782 819850785
819894216 819894218
819909125 819909127
819914476 819914479
819916251 819916254
819930870 819930873
819941673 819941676
820002954 820002957
820051547 820051550
820052974 820052976
820087102 820087104
820097606 820097609
820106731 820106733
820141599 820141601
820144403 820144405
820148563 820148565
820172005 820172008
820173980 820173982
820175693 820175695
820231365 820231367
820382001 820382003
820420567 820420570
820423009 820423012
820450961 820450964
820473244 820473246
820481446 820481449
820522061 820522063
820522780 820522782
820528761 820528763
820626137 820626140
820635249 820635252
820695680 820695682
820751001 820751004
820756089 820756091
820856848 820856850
820866338 820866340
820866805 820866807
820868639 820868642
820876858 820876860
820877268 820877270
820893540 820893542
820893794 820893797
820913514 820913516
820921292 820921295
820940708 820940710
820997815 820997818
821027277 821027279
821031108 821031111
821034557 821034559
821037383 821037386
821037573 821037576
821052931 821052934
821055870 821055872
821125042 821125044
821138156 821138159
821221359 821221362
821227281 821227283
821239362 821239364
821287448 821287451
821326324 821326326
821388575 821388577
821480154 821480157
821483397 821483400
821528694 821528696
821536060 821536062
821538624 821538626
821564854 821564856
821625188 821625190
821653473 821653476
821725821 821725824
821796474 821796476
821906409 821906411
821992727 821992730
822092529 822092532
822152221 822152223
822435584 822435587
822567103 822567105
824217447 824217449
824314382 824314385
824454268 824454271
824502080 824502083
824674557 824674560
824678718 824678720
824729844 824729847
824729961 824729964
824729999 824730002
824825560 824825563
824825564 824825566
824825966 824825968
824837230 824837233
824858246 824858248
824872766 824872770
824959240 824959242
824996778 824996783
825014708 825014712
825097923 825097928
825099452 825099456
825099468 825099473
825101859 825101868
825106314 825106317
825106378 825106384
825106394 825106400
825110376 825110379
825110388 825110391
825110973 825110980
825170449 825170452
825170479 825170482
825170485 825170489
825170490 825170493
825170498 825170504
825176864 825176867
825240638 825240641
825246104 825246106
825482234 825482237
825582017 825582020
825615223 825615226
825700112 825700115
825701643 825701647
825711358 825711361
825714000 825714003
825714044 825714052
825714054 825714060
825714076 825714080
825780700 825780703
825780706 825780709
825822819 825822822
825869738 825869741
825873711 825873714
825873720 825873723
825873741 825873744
825873750 825873755
825873765 825873768
825873771 825873782
825880425 825880428
825889619 825889622
825910632 825910635
825913209 825913212
825915069 825915071
825915179 825915182
825941046 825941049
825965891 825965894
825966588 825966593
825975594 825975597
825978091 825978094
825979433 825979436
825980957 825980960
826045219 826045222
826045228 826045231
826062512 826062515
826229399 826229402
826273987 826273990
826305324 826305327
826310177 826310180
826310186 826310189
826310190 826310196
826310693 826310696
826316362 826316369
826320939 826320942
826334450 826334454
826356795 826356797
826368321 826368324
826477712 826477715
826478650 826478653
826478654 826478657
826564574 826564578
826564582 826564585
826564586 826564589
826564605 826564610
826564648 826564683
826573779 826573782
826574350 826574353
826648917 826648920
826656833 826656837
826662103 826662107
826735294 826735297
826739234 826739236
826822028 826822031
826824696 826824699
826837352 826837355
826910069 826910072
826910074 826910078
826911398 826911401
826913976 826913983
826936920 826936923
826936924 826936939
826936945 826936948
827031853 827031856
827032380 827032383
827082814 827082818
827082823 827082827
827082831 827082835
827082846 827082849
827082853 827082860
827082866 827082872
827082873 827082879
827082884 827082898
827093010 827093012
827101414 827101417
827291899 827291902
827447829 827447833
827458085 827458088
827460241 827460244
827510675 827510680
827510693 827510696
827510702 827510709
827510720 827510725
827596687 827596690
827687659 827687673
827687674 827687678
827697347 827697350
827703912 827703915
827771588 827771591
827773060 827773064
828136099 828136102
828153415 828153418
828192656 828192658
828619900 828619903
828799000 828799003
828889471 828889474
828995023 828995026
829240921 829240924
829260639 829260642
829328754 829328757
829347161 829347164
829380213 829380216
829501599 829501602
829504792 829504795
829505303 829505306
829516026 829516029
829672679 829672682
829793552 829793557
830194157 830194163
830194183 830194188
830194189 830194199
830194203 830194210
830202001 830202015
830202019 830202029
830204942 830204946
830209825 830209831
830209837 830209840
830209842 830209849
830273401 830273404
830277628 830277631
830277661 830277664
830277668 830277671
830277673 830277679
830281888 830281891
830286479 830286486
830286490 830286493
830286494 830286504
830320710 830320714
830342820 830342823
830394478 830394484
830534161 830534164
830537658 830537662
830537663 830537665
830538388 830538391
830538430 830538433
830538434 830538438
830540567 830540569
830545273 830545288
830547784 830547788
830547797 830547800
830547801 830547807
830547808 830547817
830547828 830547833
830548471 830548474
830551846 830551852
830551862 830551866
830705953 830705955
830722088 830722091
830722718 830722721
830722778 830722780
830723080 830723083
830723240 830723243
830723247 830723250
830723253 830723256
830800854 830800856
830811447 830811449
830815452 830815455
830833522 830833525
830895310 830895315
830904873 830904876
830985446 830985450
830985452 830985455
830985457 830985460
831062060 831062063
831096938 831096940
831104667 831104670
831104680 831104683
831134238 831134241
831134246 831134249
831134325 831134328
831134364 831134371
831134374 831134377
831134387 831134392
831134408 831134411
831134412 831134436
831142244 831142247
831142252 831142255
831142474 831142477
831144455 831144459
831144489 831144496
831144497 831144508
831149989 831149992
831151236 831151240
831162111 831162114
831162345 831162348
831163053 831163056
831163470 831163473
831163894 831163897
831164540 831164544
831165007 831165010
831165376 831165380
831165511 831165514
831165608 831165611
831165612 831165615
831165618 831165622
831166172 831166175
831166957 831166962
831167098 831167101
831167135 831167138
831167179 831167187
831167189 831167192
831167538 831167541
831167545 831167551
831167960 831167964
831167989 831167993
831168046 831168049
831168101 831168109
831168146 831168149
831168172 831168175
831168189 831168196
831171519 831171522
831171601 831171604
831176470 831176473
831208277 831208280
831208282 831208285
831208316 831208319
831208320 831208323
831208333 831208335
831242147 831242151
831242154 831242157
831247147 831247150
831264584 831264588
831277172 831277175
831323521 831323525
831331592 831331595
831344033 831344036
831344044 831344047
831387816 831387819
831396067 831396070
831396081 831396084
831396085 831396088
831412660 831412662
831419090 831419093
831420997 831421003
831465602 831465604
831475533 831475536
831498840 831498842
831510552 831510556
831582611 831582613
831588829 831588832
831616694 831616697
831621237 831621240
831631001 831631006
831669189 831669195
831669198 831669200
831673915 831673918
831695872 831695917
831765209 831765211
831811971 831811974
831851688 831851690
831857861 831857864
831924012 831924017
831924023 831924028
831924036 831924042
831924047 831924051
831924054 831924057
831924059 831924065
831934043 831934045
832008901 832008903
832017726 832017728
832045289 832045292
832045420 832045424
832045532 832045535
832045711 832045720
832049759 832049762
832089815 832089820
832109382 832109386
832111395 832111398
832116482 832116485
832284925 832284929
832296457 832296460
832300427 832300430
832339014 832339017
832427264 832427266
832454606 832454609
832465150 832465157
832465172 832465175
832465253 832465256
832465457 832465460
832539542 832539545
832540270 832540273
832540883 832540886
832545055 832545058
832561885 832561889
832601938 832601941
832613858 832613860
832627556 832627559
832643916 832643920
832658078 832658081
832667461 832667467
832688421 832688424
832690162 832690167
832699054 832699057
832716693 832716699
832801966 832801970
832821968 832821971
832889625 832889628
833051363 833051366
833054485 833054488
833054494 833054497
833057380 833057385
833075166 833075169
833124560 833124564
833134333 833134336
833134342 833134350
833137605 833137611
833140816 833140821
833144699 833144702
833147270 833147273
833148483 833148486
833221512 833221515
833221556 833221561
833227330 833227332
833230705 833230709
833235214 833235217
833269412 833269415
833296403 833296409
833307770 833307773
833320146 833320149
833369510 833369515
833396805 833396809
833396810 833396814
833396818 833396822
833396828 833396831
833414802 833414805
833446739 833446741
833451133 833451135
833580709 833580712
833580714 833580717
833663499 833663502
833667700 833667709
833681858 833681861
833728667 833728673
833742353 833742356
833756547 833756550
833756551 833756557
833756567 833756570
833811843 833811846
833815604 833815607
833815608 833815611
833836646 833836649
833845588 833845591
833845592 833845596
833845614 833845617
833845626 833845635
833868632 833868635
833885546 833885548
834040677 834040680
834047986 834047989
834092008 834092011
834163753 834163756
834189235 834189238
834282053 834282056
834294409 834294412
834322705 834322708
834322713 834322716
834323001 834323004
834333336 834333339
834333353 834333356
834340033 834340036
834340037 834340040
834350583 834350586
834358428 834358433
834390175 834390178
834418162 834418165
834422486 834422489
834435526 834435533
834460784 834460787
834524288 834524293
834596645 834596647
834691116 834691119
834731726 834731729
834744445 834744448
834765453 834765456
834765460 834765463
834779961 834779964
834779965 834779968
834781894 834781897
834800006 834800009
834800146 834800149
834800224 834800227
834801530 834801533
834811148 834811151
834811190 834811193
834954843 834954846
834963576 834963581
835009414 835009416
835039737 835039740
835099660 835099663
835148462 835148465
835148484 835148488
835372514 835372516
835392124 835392129
835411657 835411660
835443419 835443422
835455196 835455202
835480055 835480059
835501929 835501932
835567487 835567492
835643703 835643707
835648033 835648036
835731780 835731783
835818152 835818154
835848163 835848166
835895154 835895157
835954345 835954348
835969093 835969099
835970602 835970605
835976636 835976643
835976647 835976651
835988688 835988691
835989614 835989619
835989639 835989652
835989659 835989664
835991556 835991559
835997884 835997887
835997890 835997894
835997906 835997909
835997914 835997917
835997925 835997928
836039523 836039526
836039553 836039556
836039640 836039643
836067088 836067091
836146931 836146935
836188666 836188668
836233424 836233427
836243539 836243541
836252925 836252928
836252929 836252935
836259728 836259731
836261541 836261545
836272792 836272795
836293131 836293134
836331629 836331631
836335212 836335214
836356483 836356486
836375225 836375228
836395968 836395971
836412537 836412540
836426861 836426863
836459684 836459687
836461560 836461563
836558377 836558380
836558407 836558410
836586674 836586677
836586678 836586683
836588789 836588791
836664960 836664963
836769005 836769008
836769057 836769063
836769088 836769090
836774206 836774209
836775537 836775540
836776358 836776360
836782092 836782095
836848172 836848174
836858162 836858164
836859606 836859609
836860367 836860370
836860375 836860385
836929021 836929024
836934878 836934880
836939134 836939147
836939165 836939170
836939171 836939174
836948870 836948872
837025904 837025907
837033738 837033741
837078632 837078635
837135039 837135042
837185581 837185585
837185601 837185604
837188434 837188438
837193213 837193215
837196120 837196123
837212489 837212492
837226479 837226482
837227687 837227690
837267842 837267846
837269113 837269116
837269264 837269271
837269274 837269277
837269306 837269315
837361200 837361203
837361205 837361208
837361216 837361219
837361223 837361226
837361228 837361231
837361236 837361239
837361240 837361244
837363714 837363718
837363743 837363746
837363758 837363762
837455648 837455652
837456836 837456839
837457213 837457218
837458453 837458456
837464771 837464777
837464778 837464784
837464788 837464791
837544496 837544504
837544512 837544517
837544528 837544531
837600204 837600207
837641688 837641691
837723752 837723754
837785616 837785618
837790234 837790240
837790244 837790247
837790254 837790266
837792520 837792523
837792822 837792826
837792835 837792838
837792842 837792845
837792851 837792856
837792867 837792870
837797030 837797033
837799581 837799584
837806470 837806473
837806475 837806485
837815486 837815489
837831212 837831215
837832190 837832195
837843256 837843261
837958877 837958881
837958885 837958893
837958899 837958902
837958903 837958909
837986960 837986962
838041821 838041824
838049570 838049573
838051646 838051648
838054200 838054207
838057212 838057215
838057219 838057222
838061988 838061992
838061998 838062005
838062009 838062012
838064429 838064432
838064440 838064443
838064569 838064572
838071520 838071523
838078973 838078975
838131124 838131130
838131131 838131139
838131140 838131148
838131150 838131153
838138896 838138911
838138913 838138924
838141011 838141014
838141022 838141025
838145803 838145806
838145808 838145813
838145817 838145822
838148564 838148567
838153987 838153990
838157825 838157828
838157841 838157845
838157849 838157860
838174533 838174536
838238575 838238577
838257954 838257962
838373693 838373696
838406369 838406372
838410407 838410410
838415437 838415444
838419185 838419191
838469781 838469783
838503355 838503358
838568613 838568616
838569193 838569198
838569208 838569211
838569440 838569442
838576646 838576649
838576655 838576658
838577980 838577984
838583316 838583319
838584333 838584336
838584342 838584345
838607550 838607553
838621776 838621779
838629614 838629617
838635774 838635777
838653453 838653456
838653464 838653467
838654920 838654923
838654925 838654930
838654936 838654940
838662422 838662425
838662429 838662433
838662447 838662450
838664384 838664387
838669386 838669389
838670213 838670216
838675962 838675965
838678656 838678659
838678666 838678669
838678674 838678680
838678681 838678687
838678691 838678694
838678698 838678702
838683798 838683802
838688378 838688381
838742030 838742033
838742035 838742040
838742044 838742061
838742062 838742065
838742074 838742078
838742092 838742105
838750876 838750881
838750883 838750886
838750893 838750896
838822626 838822629
838831636 838831639
838907488 838907491
838910809 838910813
838910822 838910825
838911819 838911822
838911831 838911834
838924128 838924131
838997117 838997122
838997125 838997133
838997135 838997146
838999524 838999527
838999528 838999531
838999537 838999540
839004277 839004280
839004295 839004300
839006915 839006918
839006925 839006928
839020540 839020543
839020552 839020555
839020558 839020561
839025078 839025083
839082854 839082857
839101488 839101491
839101493 839101496
839101501 839101504
839101510 839101524
839102744 839102748
839102754 839102758
839103150 839103153
839104072 839104075
839104077 839104082
839104083 839104089
839104096 839104106
839105512 839105515
839108729 839108735
839108751 839108754
839108760 839108763
839111138 839111141
839111144 839111147
839111158 839111161
839119560 839119565
839127743 839127746
839184667 839184670
839193205 839193207
839201775 839201778
839229059 839229062
839255870 839255875
839256384 839256387
839267114 839267116
839273140 839273145
839274243 839274246
839279644 839279647
839279654 839279657
839284958 839284962
839296484 839296487
839300107 839300110
839301703 839301706
839302217 839302221
839303124 839303127
839303368 839303371
839304173 839304176
839304206 839304214
839304321 839304324
839305515 839305518
839305523 839305526
839305592 839305595
839305609 839305613
839305659 839305662
839305667 839305670
839337937 839337940
839340578 839340581
839340582 839340594
839342265 839342268
839349940 839349943
839349944 839349958
839371054 839371056
839512082 839512085
839596842 839596845
839626505 839626510
839628931 839628934
839629316 839629321
839629600 839629603
839630690 839630701
839630702 839630705
839680447 839680450
839689640 839689651
839712466 839712472
839712477 839712480
839718679 839718682
839721978 839721980
839777298 839777301
839777319 839777323
839777326 839777330
839780608 839780611
839780626 839780635
839780707 839780717
839783089 839783102
839783169 839783171
839788025 839788028
839801327 839801331
839808222 839808225
839828580 839828583
839863879 839863881
839868071 839868074
839871316 839871321
839871325 839871338
839871341 839871352
839883345 839883348
839883687 839883690
839885322 839885325
839983684 839983686
840039692 840039699
840081737 840081740
840176710 840176713
840176716 840176719
840176731 840176736
840217101 840217104
840217121 840217152
840220378 840220382
840220386 840220389
840222294 840222298
840238344 840238347
840244000 840244003
840287161 840287164
840312024 840312027
840317044 840317047
840317227 840317230
840320360 840320363
840336351 840336354
840373122 840373125
840390299 840390302
840403941 840403947
840481307 840481309
840488423 840488426
840502638 840502641
840568442 840568444
840576661 840576664
840580797 840580802
840737681 840737684
840740757 840740763
840752611 840752614
840822039 840822051
840822053 840822056
840826330 840826336
840828647 840828652
840828661 840828664
840832658 840832661
840832668 840832671
840857943 840857945
840931174 840931177
840931192 840931194
840932399 840932402
840932662 840932667
841046797 841046800
841079893 841079895
841141962 841141964
841236739 841236742
841251324 841251327
841253948 841253951
841261008 841261011
841262336 841262339
841342895 841342898
841586017 841586019
841688636 841688640
841688641 841688644
841688645 841688649
841688650 841688653
841688676 841688679
841688680 841688687
841689235 841689238
841705499 841705502
841706253 841706256
841792455 841792458
841827859 841827862
841922221 841922223
842027538 842027541
842028017 842028020
842028050 842028053
842028382 842028385
842028386 842028389
842035627 842035630
842037041 842037045
842043855 842043858
842047008 842047011
842048312 842048316
842048462 842048466
842055748 842055750
842057297 842057300
842103829 842103832
842106034 842106037
842108238 842108243
842219608 842219610
842236272 842236275
842275713 842275716
842300564 842300568
842300569 842300595
842300596 842300599
842303197 842303200
842303209 842303214
842303985 842303987
842309463 842309466
842310627 842310630
842340492 842340495
842365148 842365151
842366884 842366903
842366904 842366914
842368878 842368881
842373173 842373178
842373180 842373184
842378599 842378602
842378814 842378817
842378832 842378838
842383985 842383987
842385182 842385185
842385187 842385191
842388397 842388400
842388450 842388453
842409261 842409264
842450293 842450295
842463937 842463944
842463952 842463955
842465055 842465058
842465291 842465294
842468479 842468482
842521640 842521645
842561788 842561791
842808098 842808100
842815151 842815154
842815159 842815162
842816130 842816133
842816141 842816143
842820352 842820356
842820361 842820364
842821924 842821928
842823268 842823271
842823614 842823617
842825885 842825889
842832933 842832939
842891514 842891517
842894991 842894993
842898233 842898236
842903346 842903356
842903358 842903364
842903365 842903378
842903602 842903607
842903609 842903615
842903616 842903620
842906614 842906617
842910509 842910514
842910520 842910523
842910524 842910534
842911018 842911021
842911307 842911310
842913566 842913569
842916075 842916078
842916275 842916277
842916730 842916733
842916779 842916781
842928274 842928277
842969776 842969778
842981163 842981165
842987110 842987113
842997996 842998000
843167742 843167745
843237210 843237213
843240055 843240065
843247855 843247858
843317275 843317278
843404866 843404869
843408652 843408657
843408668 843408671
843408677 843408680
843408681 843408691
843408693 843408700
843411574 843411577
843414263 843414266
843417567 843417572
843417574 843417583
843417590 843417593
843421662 843421665
843425036 843425039
843427563 843427566
843435868 843435871
843489641 843489645
843493898 843493901
843496371 843496374
843496382 843496385
843501080 843501085
843501088 843501090
843582137 843582142
843604919 843604923
843744448 843744453
843744460 843744464
843744466 843744474
843744475 843744479
843744480 843744490
843744503 843744506
843744508 843744520
843744521 843744524
843744531 843744538
843744539 843744543
843753467 843753474
843754576 843754578
843851681 843851684
844020966 844020971
844095882 844095889
844096688 844096691
844097072 844097078
844103688 844103694
844103695 844103698
844103713 844103717
844103720 844103730
844103732 844103744
844112150 844112153
844112170 844112182
844112186 844112196
844120677 844120680
844120683 844120686
844120689 844120693
844120699 844120702
844120710 844120713
844120716 844120719
844120720 844120725
844122038 844122042
844183010 844183014
844245211 844245214
844310947 844310950
844348105 844348108
844424174 844424177
844445692 844445695
844457492 844457495
844457496 844457499
844508479 844508487
844617731 844617734
844617742 844617745
844618515 844618518
844618860 844618864
844619525 844619529
844620382 844620385
844620408 844620417
844620426 844620429
844620431 844620439
844620482 844620485
844620598 844620602
844623113 844623117
844623118 844623133
844705141 844705143
844706944 844706947
844707866 844707869
844707889 844707898
844783185 844783189
844788182 844788185
844788188 844788191
844788199 844788202
844792662 844792666
844792672 844792675
844818773 844818779
844870265 844870268
844878836 844878839
844880689 844880692
844883408 844883411
844885577 844885580
844967738 844967740
845064371 845064374
845065046 845065049
845066395 845066398
845155534 845155537
845158692 845158695
845158696 845158701
845160100 845160103
845163949 845163952
845216180 845216184
845221788 845221796
845238288 845238290
845315016 845315022
845320241 845320244
845329967 845329976
845332849 845332852
845398958 845398962
845486782 845486785
845492597 845492602
845503699 845503702
845504073 845504075
845590659 845590662
845659356 845659358
845995660 845995663
846001388 846001391
846003515 846003518
846005986 846005992
846008440 846008443
846008446 846008450
846008479 846008485
846008494 846008498
846008524 846008527
846012575 846012578
846013230 846013232
846013441 846013444
846016709 846016713
846016717 846016724
846016726 846016730
846095572 846095574
846101668 846101670
846194711 846194714
846194774 846194777
846194779 846194781
846198055 846198058
846255399 846255402
846256564 846256568
846257323 846257329
846257662 846257665
846262079 846262082
846262086 846262099
846262107 846262116
846262118 846262121
846262875 846262878
846262880 846262883
846262898 846262903
846262904 846262911
846262912 846262920
846264337 846264340
846265258 846265261
846268856 846268859
846268863 846268867
846269434 846269441
846269444 846269465
846270503 846270506
846270517 846270526
846271841 846271844
846275988 846275991
846276011 846276016
846276018 846276029
846276031 846276039
846277143 846277146
846277226 846277230
846278007 846278010
846278011 846278023
846278037 846278045
846279942 846279945
846281274 846281278
846281298 846281301
846282134 846282137
846282810 846282813
846324333 846324336
846340974 846340977
846341006 846341014
846341015 846341018
846341019 846341025
846344747 846344750
846385742 846385745
846388350 846388353
846388397 846388400
846388795 846388798
846421098 846421101
846435820 846435822
846440191 846440193
846457826 846457828
846517647 846517650
846521319 846521322
846525340 846525343
846525348 846525354
846525356 846525361
846525368 846525374
846529175 846529179
846539957 846539960
846539978 846539981
846539988 846539991
846600921 846600924
846600933 846600936
846600937 846600940
846601736 846601752
846601753 846601764
846601809 846601813
846601868 846601873
846602219 846602229
846602233 846602242
846602766 846602769
846605317 846605320
846605324 846605327
846605332 846605341
846605651 846605654
846605655 846605658
846606110 846606126
846606730 846606733
846607085 846607094
846607097 846607109
846607110 846607113
846607393 846607396
846607438 846607441
846607451 846607457
846607509 846607515
846607620 846607631
846608260 846608264
846608267 846608270
846608274 846608284
846608480 846608483
846610300 846610304
846610593 846610599
846611066 846611069
846611376 846611383
846611974 846611977
846611993 846611996
846612208 846612215
846612453 846612457
846612466 846612469
846613612 846613621
846613627 846613632
846615042 846615045
846617322 846617325
846617331 846617337
846618209 846618215
846618277 846618283
846622390 846622393
846623794 846623797
846698867 846698871
846746041 846746044
846826566 846826572
846861864 846861874
846861876 846861879
846861898 846861901
847120141 847120144
847120283 847120286
847120686 847120688
847120966 847120969
847216319 847216322
847221400 847221403
847221749 847221753
847221758 847221762
847221817 847221820
847221836 847221839
847222489 847222492
847222859 847222862
847223213 847223217
847223833 847223841
847223844 847223850
847223854 847223857
847224784 847224787
847226270 847226275
847227891 847227894
847227898 847227903
847227908 847227911
847229781 847229788
847384684 847384686
847483463 847483466
847492938 847492941
847604963 847604967
847625065 847625071
847653002 847653005
847661548 847661551
847661553 847661558
847717971 847717974
847718003 847718006
847718009 847718012
847732596 847732599
847736943 847736948
847737190 847737193
847737306 847737310
847737321 847737324
847737330 847737333
847737476 847737479
847738184 847738187
847738629 847738633
847745676 847745680
847745702 847745705
847751508 847751511
847753136 847753139
847797139 847797144
847820780 847820783
847836109 847836114
847836326 847836331
847836356 847836359
847839565 847839571
847839575 847839590
847839645 847839648
847840871 847840874
847883730 847883733
847883739 847883742
847911269 847911274
847911284 847911287
847915275 847915280
847915378 847915381
847922257 847922262
847945288 847945291
847955158 847955162
847998436 847998439
847998458 847998464
847998479 847998482
848004656 848004659
848069438 848069442
848069452 848069459
848069461 848069468
848069475 848069485
848084415 848084418
848086244 848086253
848095227 848095230
848159615 848159617
848320215 848320218
848320281 848320292
848326118 848326121
848347193 848347196
848347310 848347313
848466318 848466320
848516060 848516064
848638930 848638933
848764338 848764341
848764349 848764353
848764405 848764409
848812610 848812612
848865371 848865374
848896840 848896842
848949439 848949443
848949449 848949452
848952462 848952465
849018050 849018052
849035126 849035128
849050348 849050350
849053475 849053478
849208739 849208741
849213046 849213049
849214801 849214804
849309509 849309512
849309741 849309744
849463511 849463513
849465598 849465600
849478705 849478709
849479896 849479899
849480660 849480664
849568099 849568102
849729318 849729321
849787310 849787313
849908417 849908420
849926181 849926185
849958682 849958685
849958807 849958810
850066095 850066099
850066273 850066275
850066774 850066776
850101593 850101597
850111307 850111309
850137783 850137786
850146596 850146599
850153373 850153376
850155262 850155265
850161576 850161579
850166519 850166522
850166540 850166545
850166546 850166549
850166556 850166559
850182187 850182190
850187443 850187446
850317451 850317462
850324890 850324895
850325115 850325118
850325161 850325175
850329261 850329264
850329291 850329294
850330570 850330573
850331193 850331201
850332395 850332401
850495032 850495037
850500443 850500446
850504270 850504276
850512517 850512524
850512526 850512529
850518005 850518007
850532647 850532650
850578442 850578446
850578448 850578451
850602970 850602973
850603098 850603101
850603104 850603109
850603113 850603117
850603127 850603130
850603131 850603134
850643034 850643037
850672920 850672923
850672934 850672937
850677420 850677422
850679385 850679387
850690789 850690794
850694601 850694605
850697188 850697192
850851095 850851098
850853419 850853425
850940457 850940460
851038877 851038880
851408107 851408110
851507045 851507048
851698053 851698057
851787970 851787973
851787975 851787978
851878780 851878783
851897673 851897678
851934661 851934665
852051486 852051489
852065679 852065682
852143440 852143443
852144755 852144757
852149520 852149523
852313547 852313551
852313565 852313569
852316686 852316689
852317193 852317196
852317200 852317203
852319647 852319656
852320587 852320590
852323454 852323457
852324543 852324546
852324557 852324560
852324952 852324955
852325463 852325467
852331283 852331286
852332274 852332277
852334768 852334772
852334778 852334784
852414554 852414576
852414577 852414590
852414591 852414594
852414630 852414633
852414635 852414641
852414642 852414646
852414653 852414667
852414669 852414679
852414682 852414685
852414690 852414693
852415274 852415287
852415288 852415298
852416597 852416601
852417491 852417505
852417508 852417511
852417551 852417554
852418849 852418852
852420639 852420644
852440092 852440094
852483007 852483010
852483020 852483028
852483889 852483893
852483896 852483899
852484664 852484668
852484670 852484673
852484967 852484971
852484972 852484978
852484983 852484990
852487554 852487573
852487704 852487707
852487734 852487737
852487739 852487742
852489506 852489509
852489752 852489761
852489762 852489765
852489771 852489774
852490034 852490037
852490038 852490041
852490046 852490057
852492916 852492919
852493274 852493277
852495248 852495254
852495260 852495267
852495727 852495730
852495738 852495741
852496388 852496391
852496395 852496398
852498251 852498254
852498666 852498669
852498678 852498681
852500221 852500225
852500299 852500302
852500304 852500309
852500315 852500321
852501185 852501188
852501194 852501199
852501201 852501206
852501494 852501498
852505403 852505406
852505414 852505417
852507544 852507547
852563148 852563151
852563153 852563156
852563735 852563738
852564512 852564521
852564545 852564548
852566259 852566263
852568994 852568997
852569637 852569640
852570010 852570013
852570016 852570021
852570045 852570049
852571039 852571042
852574706 852574709
852574786 852574789
852574795 852574798
852574957 852574960
852574971 852574974
852575029 852575034
852576866 852576870
852578423 852578426
852578431 852578435
852578436 852578440
852578441 852578446
852578448 852578451
852578452 852578457
852580478 852580481
852580483 852580486
852580492 852580498
852581065 852581070
852581071 852581074
852581086 852581091
852583588 852583591
852583921 852583925
852583948 852583951
852585857 852585859
852587095 852587097
852587678 852587681
852590632 852590634
852632930 852632933
852660417 852660419
852663964 852663966
852679334 852679341
852926258 852926261
852993710 852993713
852993719 852993723
852996438 852996442
852998047 852998050
853093700 853093703
853196731 853196734
853272982 853272984
853276489 853276491
853277212 853277215
853344468 853344471
853351204 853351206
853358875 853358877
853444758 853444761
853453261 853453264
853479064 853479066
853483088 853483090
853518606 853518609
853601663 853601666
854050934 854050937
854122145 854122148
854123082 854123085
854128862 854128865
854128889 854128891
854165824 854165827
854171882 854171885
854196183 854196186
854198113 854198118
854198136 854198139
854198145 854198150
854198151 854198157
854198170 854198175
854198179 854198182
854198184 854198198
854198199 854198202
854198207 854198215
854198216 854198228
854198230 854198237
854198242 854198246
854251270 854251273
854311877 854311879
854403345 854403348
854408776 854408778
854427614 854427616
854482249 854482252
854483454 854483457
854584203 854584205
854653395 854653398
854706570 854706573
854834090 854834093
854834095 854834102
854836816 854836824
854837196 854837201
854837379 854837383
854837437 854837440
854916995 854916998
854919418 854919420
854923358 854923367
854923389 854923398
854923977 854923981
854923982 854923987
854923988 854923993
854923995 854923998
854926297 854926300
855000512 855000515
855004729 855004732
855004899 855004902
855005494 855005497
855005501 855005504
855067987 855067990
855086958 855086960
855243397 855243400
855246134 855246137
855268100 855268102
855345742 855345745
855347963 855347966
855414409 855414412
855417066 855417069
855417075 855417078
855532347 855532350
855532351 855532356
855532367 855532371
855535140 855535143
855535144 855535154
855585988 855585991
855585992 855586000
855586006 855586009
855606355 855606357
855607860 855607864
855609914 855609916
855689337 855689339
855747282 855747285
855766934 855766937
855769094 855769098
855778739 855778742
855782204 855782208
855862442 855862446
855864885 855864887
855901524 855901527
855949020 855949023
855952463 855952466
855952783 855952786
855954977 855954979
855955332 855955337
856013457 856013460
856013503 856013506
856013681 856013684
856014969 856014972
856015024 856015030
856015289 856015292
856015329 856015334
856015398 856015401
856015403 856015406
856015409 856015413
856015428 856015434
856015435 856015440
856015446 856015450
856015451 856015454
856015470 856015473
856015478 856015484
856015485 856015491
856015506 856015509
856015595 856015598
856015605 856015608
856015699 856015702
856015744 856015747
856015749 856015752
856016036 856016040
856016045 856016050
856016061 856016064
856016135 856016139
856016151 856016158
856016206 856016209
856016253 856016256
856016295 856016298
856016304 856016307
856016394 856016399
856016600 856016603
856016826 856016829
856016849 856016854
856016890 856016893
856017355 856017358
856017538 856017543
856112291 856112294
856114557 856114560
856135777 856135780
856201783 856201785
856258839 856258842
856258859 856258862
856289358 856289361
856292015 856292018
856305150 856305153
856305171 856305174
856305228 856305233
856320444 856320447
856383012 856383014
856411009 856411011
856544304 856544307
856561165 856561168
856571538 856571540
856623210 856623213
856716719 856716722
856716724 856716729
856716744 856716747
856720912 856720915
856720924 856720927
856724625 856724628
856725857 856725859
856727505 856727507
856728400 856728403
856729099 856729105
856729129 856729132
856729680 856729682
856729832 856729836
856731285 856731288
856740378 856740380
856806468 856806470
856822379 856822382
856824193 856824196
856987276 856987279
857022000 857022003
857022069 857022072
857022111 857022113
857094674 857094676
857168114 857168117
857168990 857168995
857169281 857169287
857258012 857258017
857264647 857264650
857321203 857321206
857344821 857344824
857349500 857349503
857362649 857362651
857402385 857402388
857406307 857406310
857412761 857412763
857423822 857423825
857424444 857424446
857428815 857428818
857429071 857429074
857429235 857429238
857429798 857429801
857430859 857430862
857430945 857430948
857431783 857431786
857431864 857431867
857432037 857432040
857432283 857432286
857433189 857433192
857434618 857434621
857434683 857434686
857434699 857434702
857435466 857435468
857516256 857516259
857517774 857517777
857517947 857517950
857592085 857592087
857636316 857636319
857673246 857673248
857686283 857686285
857733440 857733443
857733790 857733794
857734228 857734231
857735658 857735661
857739206 857739209
857742753 857742757
857742763 857742767
857742768 857742774
857743087 857743090
857743180 857743183
857755120 857755124
857755137 857755140
857755161 857755164
857755498 857755501
857755507 857755512
857755521 857755526
857755989 857755992
857756022 857756026
857763377 857763383
857764581 857764585
857766585 857766588
857772386 857772389
857790248 857790251
857832917 857832922
857927503 857927517
857927524 857927528
858009635 858009639
858009641 858009644
858031506 858031508
858101541 858101544
858106374 858106377
858106384 858106388
858107582 858107586
858112425 858112427
858165189 858165192
858207179 858207181
858360125 858360129
858390355 858390358
858429001 858429006
858465711 858465714
858467832 858467835
858531600 858531603
858535235 858535238
858539795 858539800
858540053 858540056
858541511 858541516
858594473 858594477
858607776 858607778
858615765 858615770
858615931 858615937
858620390 858620393
858625227 858625230
858637464 858637467
858741282 858741285
858784086 858784088
858805275 858805278
858805280 858805283
858819211 858819213
858885531 858885534
858892084 858892087
858900060 858900063
858956618 858956621
858957894 858957897
858964079 858964082
858971772 858971775
858973811 858973814
859064356 859064359
859065182 859065185
859065187 859065191
859065197 859065200
859068994 859068997
859075137 859075140
859075313 859075316
859075320 859075323
859077138 859077141
859078190 859078194
859078633 859078635
859079392 859079395
859084702 859084705
859085007 859085016
859085180 859085183
859085584 859085586
859085906 859085910
859085916 859085919
859123621 859123623
859132490 859132496
859132513 859132516
859136946 859136949
859139321 859139328
859139355 859139358
859139365 859139371
859145480 859145483
859147607 859147610
859153720 859153723
859154446 859154450
859155212 859155215
859155256 859155269
859155270 859155273
859155275 859155287
859182080 859182082
859221081 859221084
859225419 859225422
859228933 859228936
859228973 859228976
859228978 859228986
859228992 859228997
859230422 859230425
859236948 859236951
859281378 859281381
859307384 859307387
859311974 859311977
859312559 859312563
859348556 859348558
859399947 859399950
859477547 859477549
859480946 859480948
859490561 859490566
859564232 859564237
859567441 859567445
859573857 859573860
859664355 859664358
859687942 859687945
859715266 859715268
859739391 859739394
859743108 859743111
859747144 859747147
859747198 859747202
859755151 859755154
859758240 859758242
859821863 859821866
859824471 859824474
859826268 859826271
859828436 859828439
859829047 859829050
859830228 859830231
859834999 859835002
859835976 859835980
859841739 859841746
859844614 859844617
859852117 859852120
859911821 859911824
859913731 859913734
859926207 859926210
859934496 859934499
860010999 860011002
860106352 860106354
860163261 860163263
860170958 860170961
860170974 860170976
860271151 860271154
860271157 860271161
860271167 860271170
860280093 860280095
860341174 860341179
860341204 860341207
860342700 860342705
860342706 860342710
860342725 860342730
860342737 860342743
860342778 860342781
860342821 860342824
860342832 860342835
860342837 860342842
860342848 860342852
860342853 860342859
860342974 860342980
860342995 860342999
860347160 860347163
860352393 860352396
860357877 860357880
860371203 860371205
860422861 860422864
860432653 860432656
860444022 860444025
860445427 860445430
860445434 860445439
860447584 860447589
860447863 860447866
860448410 860448413
860489511 860489513
860527308 860527311
860675504 860675506
860710819 860710822
860710823 860710826
860772088 860772092
860879028 860879031
860894440 860894443
860921075 860921077
860968211 860968213
861035344 861035347
861035687 861035690
861035838 861035842
861035859 861035863
861035895 861035901
861038254 861038257
861041969 861041974
861042678 861042681
861043357 861043360
861043460 861043463
861064817 861064819
861122991 861122995
861123001 861123004
861150581 861150583
861155835 861155838
861158550 861158553
861164486 861164489
861168329 861168332
861175559 861175562
861176779 861176781
861178246 861178249
861179779 861179782
861226157 861226160
861278797 861278800
861386370 861386373
861390968 861390970
861490646 861490649
861490657 861490660
861490746 861490749
861573485 861573488
861573503 861573507
861625601 861625604
861646594 861646597
861685301 861685304
861739626 861739629
861739776 861739778
861824208 861824210
861843052 861843054
861866601 861866604
861985166 861985169
861990506 861990509
861990537 861990544
861990546 861990551
861990552 861990557
861992538 861992541
861997941 861997947
861998420 861998426
861998427 861998432
862000138 862000143
862000776 862000779
862064919 862064922
862064928 862064931
862139823 862139825
862150598 862150601
862156822 862156825
862169717 862169720
862173670 862173674
862173680 862173683
862177046 862177049
862179450 862179453
862242834 862242837
862245533 862245536
862246250 862246253
862250253 862250256
862250271 862250275
862262554 862262556
862330186 862330189
862350555 862350559
862381091 862381093
862384745 862384747
862414158 862414161
862417355 862417358
862524772 862524775
862556195 862556197
862587490 862587493
862599904 862599907
862668095 862668098
862671608 862671614
862693733 862693736
862697392 862697394
862700906 862700909
862701601 862701608
862701611 862701613
862702106 862702109
862704860 862704869
862704870 862704875
862706840 862706847
862713433 862713436
862732328 862732330
862759903 862759907
862762888 862762895
862763069 862763072
862768806 862768809
862770031 862770033
862772316 862772319
862773085 862773088
862773101 862773104
862849023 862849026
862870019 862870021
862897021 862897024
862935544 862935547
862944122 862944124
862946976 862946980
862954146 862954149
863051978 863051981
863053274 863053277
863120479 863120482
863185137 863185139
863195896 863195900
863197850 863197856
863215947 863215950
863216962 863216965
863294487 863294490
863301806 863301809
863377905 863377908
863398038 863398040
863461077 863461080
863532182 863532184
863534880 863534882
863544082 863544085
863547547 863547549
863637350 863637352
863683958 863683960
863718382 863718385
863770802 863770804
863791622 863791630
863830870 863830873
863831480 863831482
863931135 863931137
863975043 863975048
863979294 863979296
863981914 863981920
863984376 863984378
864062667 864062669
864151203 864151206
864153761 864153778
864153784 864153787
864153791 864153796
864153802 864153812
864253443 864253446
864314469 864314471
864339265 864339267
864340465 864340467
864341333 864341336
864341340 864341343
864341374 864341376
864341627 864341630
864341781 864341784
864341812 864341815
864353415 864353418
864418221 864418224
864464151 864464153
864486132 864486135
864507621 864507624
864584595 864584601
864595773 864595776
864612161 864612163
864671209 864671222
864673455 864673458
864751178 864751181
864771387 864771390
864771392 864771395
864778545 864778548
864859060 864859063
864921843 864921846
864999255 864999258
864999300 864999303
865014855 865014858
865015109 865015113
865015434 865015441
865015549 865015552
865019923 865019925
865028242 865028247
865029066 865029069
865079310 865079312
865121120 865121123
865131598 865131601
865172559 865172562
865172567 865172570
865172571 865172574
865177835 865177840
865177853 865177856
865177871 865177875
865177879 865177882
865184983 865184986
865188947 865188950
865189184 865189187
865190319 865190322
865193629 865193632
865193998 865194001
865194447 865194450
865194463 865194468
865199777 865199781
865199803 865199806
865199840 865199843
865200183 865200186
865200647 865200650
865200654 865200657
865200659 865200664
865200675 865200678
865200680 865200683
865200896 865200899
865201423 865201426
865202093 865202096
865202097 865202100
865259200 865259203
865259204 865259212
865274334 865274337
865274346 865274350
865277834 865277838
865277839 865277844
865288850 865288855
865345196 865345199
865361529 865361533
865455257 865455260
865465069 865465072
865474647 865474652
865490996 865491000
865544476 865544479
865605899 865605902
865612119 865612122
865613986 865613988
865619683 865619686
865619707 865619713
865625311 865625314
865630925 865630928
865630952 865630956
865635991 865635994
865635998 865636003
865684205 865684208
865684218 865684221
865695372 865695375
865695502 865695505
865777642 865777649
865783363 865783366
865785154 865785156
865788710 865788715
865793122 865793128
865793138 865793141
865793142 865793144
865795322 865795327
865798655 865798657
865807155 865807158
865807160 865807163
865808673 865808676
865864022 865864025
865864035 865864042
865869633 865869638
865870222 865870225
865874665 865874668
865874672 865874677
865875206 865875212
865875215 865875218
865875220 865875223
865876528 865876533
865876535 865876538
865883669 865883672
865883676 865883689
865885147 865885153
865885154 865885158
865885167 865885170
865885171 865885174
865893520 865893523
865949783 865949786
865949826 865949829
865949834 865949837
866032223 866032225
866053479 866053482
866131759 866131762
866134917 866134921
866160775 866160778
866160783 866160786
866160822 866160825
866165397 866165400
866165420 866165423
866165447 866165450
866165510 866165515
866165516 866165522
866166508 866166510
866166874 866166877
866167111 866167114
866167270 866167273
866167334 866167337
866167339 866167342
866167754 866167757
866167770 866167773
866168678 866168681
866168687 866168690
866168706 866168709
866169964 866169967
866169988 866169991
866169992 866169996
866171439 866171442
866172795 866172797
866197312 866197316
866210052 866210061
866210082 866210085
866216620 866216627
866221899 866221903
866229753 866229761
866236117 866236120
866236440 866236443
866236456 866236459
866237065 866237068
866240127 866240129
866257173 866257176
866261336 866261341
866295815 866295825
866295829 866295844
866298606 866298609
866298653 866298663
866324766 866324769
866324781 866324787
866325505 866325515
866325518 866325524
866325910 866325913
866325914 866325917
866328703 866328708
866328710 866328715
866328717 866328720
866328724 866328729
866333491 866333494
866333495 866333498
866382184 866382188
866382194 866382204
866386579 866386593
866389698 866389700
866409204 866409209
866413918 866413921
866413922 866413925
866468986 866468993
866474977 866474981
866475433 866475438
866475439 866475442
866475444 866475454
866497429 866497432
866601706 866601709
866605036 866605038
866672717 866672720
866726650 866726653
866736414 866736417
866736422 866736425
866762365 866762369
866762375 866762379
866770876 866770879
866771014 866771017
866774069 866774071
866822592 866822595
866823074 866823077
866847588 866847593
866847933 866847936
866848499 866848502
866848813 866848818
866848847 866848852
866848860 866848864
866848919 866848922
867089633 867089637
867191168 867191171
867298981 867298983
867309069 867309072
867364098 867364101
867450223 867450226
867510966 867510969
867511054 867511057
867626521 867626551
867680905 867680908
867685061 867685064
867685065 867685071
867689550 867689563
867689588 867689591
867689600 867689607
867766562 867766565
867771706 867771709
867782791 867782795
867795635 867795638
867836864 867836867
868036342 868036347
868036366 868036369
868039865 868039868
868039877 868039882
868039894 868039898
868039913 868039916
868039919 868039925
868039926 868039932
868039935 868039939
868041752 868041755
868041774 868041779
868044849 868044853
868044873 868044876
868046311 868046315
868046332 868046335
868046544 868046549
868054789 868054792
868054797 868054802
868113480 868113486
868113524 868113528
868114691 868114698
868210675 868210681
868223672 868223685
868223686 868223691
868223693 868223702
868234306 868234309
868247689 868247692
868253686 868253688
868262644 868262647
868388249 868388252
868389886 868389889
868399207 868399210
868472302 868472304
868631328 868631331
868651856 868651858
868654759 868654761
868656032 868656037
868662759 868662762
868745034 868745037
868753256 868753259
868753261 868753264
868753271 868753273
868902697 868902700
868902703 868902708
868909149 868909152
868916425 868916428
868919374 868919376
868985093 868985096
869005206 869005208
869060243 869060246
869089097 869089105
869089106 869089109
869164329 869164332
869234025 869234028
869406987 869406990
869413835 869413838
869441214 869441217
869441313 869441316
869442344 869442349
869442649 869442651
869444044 869444047
869469277 869469280
869473213 869473216
869493982 869493985
869501465 869501470
869505249 869505251
869508588 869508591
869508594 869508604
869517740 869517749
869517752 869517755
869522719 869522722
869522931 869522934
869524305 869524308
869526710 869526713
869527147 869527150
869528242 869528245
869528318 869528321
869528411 869528414
869535607 869535611
869581028 869581033
869588467 869588470
869588481 869588484
869588491 869588494
869596293 869596299
869596308 869596312
869600608 869600613
869604872 869604876
869604879 869604882
869604888 869604891
869604904 869604908
869613893 869613895
869616288 869616291
869616312 869616314
869617376 869617378
869845061 869845064
869845070 869845075
869845079 869845085
869853741 869853744
869853757 869853762
869858169 869858171
869863127 869863130
869882540 869882577
869882580 869882586
869925566 869925569
869925581 869925584
869925586 869925589
869925600 869925603
869926909 869926912
869947444 869947447
869948848 869948851
869949466 869949473
869951906 869951911
869951922 869951925
869951926 869951929
869951932 869951935
869951937 869951940
869951941 869951944
869951946 869951949
869952132 869952137
869952187 869952192
869952912 869952921
869952931 869952938
870011525 870011528
870030784 870030786
870031573 870031576
870038699 870038702
870103427 870103429
870110612 870110614
870132727 870132729
870197506 870197509
870273273 870273276
870290012 870290015
870290017 870290020
870467419 870467422
870553075 870553078
870560013 870560016
870568240 870568243
870624393 870624396
870624398 870624401
870627155 870627160
870627195 870627198
870627202 870627206
870642466 870642469
870891421 870891423
870905947 870905952
870939916 870939919
870991922 870991924
871046600 871046604
871047241 871047244
871047249 871047256
871054554 871054558
871054559 871054562
871057168 871057170
871061217 871061220
871061225 871061230
871067551 871067562
871067563 871067571
871067575 871067578
871070462 871070464
871073975 871073979
871073987 871073990
871075842 871075845
871105597 871105599
871158628 871158631
871165895 871165897
871221097 871221102
871236634 871236637
871243437 871243440
871277326 871277329
871277330 871277334
871300441 871300443
871304789 871304793
871304794 871304800
871320341 871320344
871329512 871329515
871346444 871346450
871346460 871346463
871346487 871346490
871392599 871392603
871393968 871393971
871393978 871393989
871409404 871409406
871414326 871414328
871597096 871597101
871619302 871619304
871657267 871657270
871679618 871679620
871681970 871681974
871764753 871764756
871767713 871767716
871834392 871834395
871836647 871836651
871837553 871837558
871837571 871837576
871837580 871837584
871837595 871837603
871839398 871839401
871839409 871839412
871842171 871842175
871842663 871842666
871842903 871842910
871842913 871842917
871842924 871842927
871842929 871842932
871842939 871842951
871845552 871845555
871845559 871845562
871847854 871847865
871847867 871847875
871847881 871847889
871847897 871847907
871847909 871847912
871847919 871847922
871850443 871850448
871850489 871850492
871852749 871852752
871852779 871852787
871852790 871852803
871852805 871852815
871852817 871852820
871920987 871920990
871927343 871927346
871927590 871927593
871927603 871927607
871928654 871928660
871936799 871936807
871945429 871945432
872000434 872000437
872008140 872008143
872010546 872010549
872014319 872014322
872014953 872014955
872019967 872019970
872021854 872021857
872021983 872021986
872022043 872022046
872022799 872022802
872023162 872023165
872028220 872028223
872030694 872030697
872030836 872030838
872032315 872032318
872033800 872033803
872043080 872043083
872049095 872049098
872127234 872127238
872129381 872129384
872129879 872129882
872131651 872131654
872167788 872167791
872201841 872201844
872255670 872255673
872260695 872260698
872263027 872263030
872267903 872267906
872269565 872269568
872343059 872343062
872343079 872343086
872343750 872343753
872345687 872345692
872345693 872345696
872345697 872345700
872348396 872348399
872348461 872348463
872367571 872367574
872367576 872367579
872373268 872373273
872438872 872438875
872441221 872441224
872443131 872443136
872443138 872443141
872443415 872443418
872446414 872446418
872446611 872446614
872446615 872446618
872446648 872446652
872448019 872448022
872451747 872451753
872451757 872451761
872451766 872451776
872451789 872451792
872451940 872451943
872451961 872451964
872458940 872458945
872458946 872458951
872458957 872458960
872458963 872458968
872458969 872458972
872458980 872458984
872515647 872515650
872519123 872519127
872519133 872519136
872519143 872519147
872519152 872519155
872519157 872519162
872524720 872524724
872526226 872526229
872526230 872526233
872526236 872526241
872530451 872530460
872530461 872530464
872532458 872532463
872532470 872532476
872532488 872532491
872635368 872635371
872643801 872643804
872645310 872645314
872645367 872645370
872706969 872706972
872885771 872885774
872950760 872950763
872950764 872950767
872950803 872950810
872953111 872953120
872953122 872953125
872953139 872953142
872975084 872975087
872977765 872977769
873039693 873039698
873039705 873039708
873048156 873048159
873048167 873048177
873048178 873048181
873048190 873048200
873048201 873048205
873048207 873048210
873051511 873051515
873051560 873051564
873052069 873052072
873053037 873053040
873053045 873053053
873053056 873053074
873053080 873053084
873053091 873053096
873060202 873060205
873066459 873066462
873128817 873128822
873133946 873133949
873133960 873133963
873134840 873134844
873135565 873135571
873135573 873135576
873135586 873135590
873135602 873135614
873137077 873137080
873141120 873141124
873143780 873143785
873145443 873145446
873145470 873145476
873145489 873145493
873145500 873145509
873151833 873151837
873154649 873154651
873214448 873214451
873219938 873219941
873222861 873222864
873229956 873229960
873230695 873230699
873239433 873239437
873262668 873262672
873263034 873263039
873274743 873274746
873300005 873300008
873489209 873489212
873489708 873489711
873578411 873578414
873579224 873579227
873586026 873586030
873586031 873586034
873586041 873586044
873587175 873587178
873648748 873648750
873650459 873650468
873651191 873651194
873651204 873651212
873651468 873651475
873651494 873651502
873651507 873651510
873651514 873651520
873652562 873652565
873652567 873652575
873655971 873655974
873657122 873657129
873657310 873657315
873658298 873658301
873658305 873658308
873665977 873665980
873668654 873668661
873668662 873668665
873668738 873668744
873668745 873668748
873668851 873668854
873669897 873669905
873669974 873669980
873670117 873670120
873677304 873677306
873690898 873690901
873731212 873731217
873731223 873731227
873735579 873735586
873745618 873745624
873759399 873759401
873999417 873999420
874083305 874083308
874087677 874087681
874087686 874087690
874087696 874087699
874087712 874087715
874087933 874087938
874101114 874101117
874101161 874101164
874160585 874160590
874160633 874160636
874162755 874162758
874181368 874181371
874181475 874181479
874181504 874181516
874181517 874181522
874181542 874181545
874181546 874181558
874189125 874189128
874227035 874227038
874256037 874256040
874256050 874256056
874271948 874271953
874272888 874272890
874275433 874275438
874316936 874316939
874333004 874333007
874342386 874342389
874342397 874342402
874342957 874342961
874345494 874345497
874349484 874349486
874354143 874354145
874358460 874358463
874358474 874358477
874360671 874360688
874428121 874428124
874436899 874436902
874501492 874501495
874501510 874501515
874509840 874509843
874510237 874510240
874510247 874510253
874510258 874510263
874510269 874510273
874514092 874514095
874526312 874526315
874526324 874526327
874622924 874622927
874650123 874650126
874695984 874695986
874706779 874706782
874787738 874787744
874790498 874790501
874790525 874790533
874802187 874802189
874817618 874817621
874851103 874851106
874851523 874851526
874851545 874851549
874851552 874851557
874851561 874851571
874852125 874852131
874874433 874874436
874874442 874874446
874874447 874874450
874874539 874874543
874875496 874875501
874875969 874875972
874875977 874875980
874875981 874875984
874875985 874875989
874875990 874875993
874876000 874876004
874878342 874878345
874935182 874935192
874937634 874937637
874937655 874937661
874945039 874945042
874945044 874945047
874954771 874954775
874955787 874955790
874955803 874955806
874958946 874958951
874959296 874959299
874965549 874965556
874979373 874979376
875022248 875022251
875022257 875022261
875022265 875022268
875022271 875022283
875022285 875022295
875022652 875022655
875032287 875032290
875032314 875032317
875032320 875032323
875032873 875032876
875032885 875032888
875041718 875041726
875043934 875043937
875103205 875103207
875104059 875104062
875119450 875119453
875121292 875121296
