862130469 862130482
862139813 862139825
862158440 862158454
862167817 862167833
862177035 862177049
862179438 862179453
862258332 862258346
862356135 862356144
862384735 862384747
862521804 862521816
862524769 862524776
862556184 862556197
862599894 862599907
862668084 862668098
862698685 862698699
862704864 862704875
862732317 862732330
862768797 862768809
862870598 862870604
862880086 862880090
862944115 862944124
862947239 862947252
862957981 862957995
863053264 863053278
863202517 863202531
863216952 863216965
863295686 863295692
863301801 863301809
863344399 863344413
863377895 863377908
863457765 863457777
863476558 863476569
863532182 863532184
863534878 863534882
863547547 863547549
863637344 863637352
863669764 863669777
863683947 863683960
863770791 863770804
863979283 863979296
863982942 863982955
863984366 863984378
864058985 864058999
864069321 864069330
864253432 864253446
864257753 864257766
864325515 864325518
864434084 864434099
864464147 864464153
864592272 864592285
864594237 864594252
864606921 864606935
864612149 864612163
864673445 864673458
864751172 864751181
864777336 864777349
864778535 864778549
864859053 864859063
865015541 865015552
865019911 865019925
865029061 865029069
865030607 865030612
865034981 865034995
865057151 865057165
865079299 865079312
865185436 865185450
865345185 865345199
865361881 865361886
865474642 865474652
865490986 865491001
865645712 865645725
865668369 865668382
865743319 865743333
865795314 865795327
865798644 865798657
865808663 865808676
865824199 865824200
865864234 865864248
865876525 865876538
865885235 865885250
865893509 865893523
866134912 866134921
866168696 866168709
866169982 866169996
866172785 866172797
866223860 866223874
866386580 866386593
866413912 866413926
866447387 866447401
866468981 866468993
866497420 866497433
866583658 866583671
866736411 866736425
866738352 866738367
866774060 866774071
866958175 866958190
867035149 867035157
867036670 867036683
867121299 867121311
867170833 867170847
867191158 867191172
867353134 867353148
867364312 867364313
867450215 867450226
867689594 867689607
867766550 867766565
867782783 867782795
867795624 867795638
867836854 867836867
868054788 868054802
868216386 868216398
868247683 868247692
868262643 868262647
868399196 868399210
868527646 868527656
868540491 868540496
868584295 868584302
868631317 868631331
868651844 868651858
868662748 868662762
868745024 868745037
868753261 868753273
868794197 868794213
868864967 868864981
868919362 868919376
869051369 869051383
869060233 869060246
869068020 869068030
869234015 869234028
869323312 869323472
869413824 869413838
869442639 869442651
869466220 869466236
869524297 869524308
869535603 869535611
869613884 869613895
869617365 869617378
869720577 869720586
869831481 869831496
869858155 869858171
870007500 870007514
870024116 870024128
870038688 870038702
870059869 870059883
870177887 870177901
870273263 870273276
870274330 870274345
870342121 870342134
870403861 870403874
870467408 870467422
870560004 870560016
870568229 870568243
870629014 870629026
870743020 870743033
870763683 870763697
870815188 870815201
870905938 870905952
870939905 870939919
870960068 870960082
870980988 870980999
870991911 870991924
871016633 871016646
871032510 871032524
871075831 871075845
871243427 871243440
871272682 871272696
871277332 871277334
871291507 871291521
871329502 871329516
871392589 871392603
871409405 871409406
871414327 871414328
871441449 871441457
871597087 871597101
871672014 871672024
871685671 871685685
871695396 871695404
871920982 871920990
872049095 872049098
872103989 872104003
872167783 872167792
872201835 872201844
872242591 872242605
872367568 872367582
872373261 872373275
872515636 872515650
872534383 872534397
872564687 872564700
872626252 872626264
872635359 872635371
872706963 872706973
872709113 872709126
872731816 872731828
872871895 872871905
872885762 872885774
872979800 872979808
873060202 873060205
873081656 873081670
873103483 873103496
873119792 873119805
873137071 873137080
873141112 873141124
873145497 873145509
873147564 873147578
873179437 873179451
873222854 873222864
873424744 873424758
873631789 873631802
873645300 873645314
873648739 873648750
873665971 873665980
873670107 873670120
873677300 873677306
873690892 873690901
873745613 873745625
873959125 873959139
873994932 873994945
874132554 874132569
874272877 874272890
874275426 874275440
874313452 874313466
874316926 874316940
874347689 874347703
874352747 874352761
874354133 874354145
874360677 874360688
874436890 874436903
874501501 874501515
874514084 874514097
874622913 874622927
874650122 874650126
874695974 874695986
874706769 874706783
874817608 874817621
874848004 874848011
874857668 874857676
874878340 874878345
874979361 874979376
874984880 874984893
875022640 875022655
875041712 875041726
875104047 875104062
875154092 875154096
875167220 875167234
875184821 875184836
