BNS_16384Hz_m1-1.4000000e+00_m2-1.4000000e+00_ecc-2.0000000e-01 NCSACAM_A
BNS_16384Hz_m1-1.4000000e+00_m2-1.4000000e+00_ecc-4.0000000e-01 NCSACAM_B
BNS_16384Hz_m1-1.4000000e+00_m2-1.4000000e+00_ecc-6.0000000e-01 NCSACAM_C
HM_BNS_16384Hz_m1-3.0000000e+00_m2-3.0000000e+00_ecc-2.0000000e-01 NCSACAM_D
HM_BNS_16384Hz_m1-3.0000000e+00_m2-3.0000000e+00_ecc-4.0000000e-01 NCSACAM_E
HM_BNS_16384Hz_m1-3.0000000e+00_m2-3.0000000e+00_ecc-6.0000000e-01 NCSACAM_F
f_10Hz_m1-5.0000000e+00_m2-5.0000000e+00_ecc-2.0000000e-01 NCSACAM_G
f_10Hz_m1-5.0000000e+00_m2-5.0000000e+00_ecc-4.0000000e-01 NCSACAM_H
f_10Hz_m1-5.0000000e+00_m2-5.0000000e+00_ecc-6.0000000e-01 NCSACAM_I
