847651127 847651144
847654914 847654931
847657882 847657899
847940675 847940692
847985212 847985229
848133954 848133971
848251103 848251120
848251113 848251130
848327857 848327874
848337152 848337169
848345320 848345337
848387589 848387606
848387594 848387611
848387787 848387804
848594192 848594209
848690468 848690485
848791393 848791410
848812602 848812621
848823118 848823136
848878888 848878905
848935255 848935272
848950174 848950191
848953900 848953917
849035119 849035136
849290904 849290921
849465592 849465609
849479056 849479073
849480654 849480671
849629479 849629496
849803512 849803529
849898137 849898154
849900146 849900163
849903751 849903768
849904456 849904473
849908599 849908616
849909339 849909356
849910671 849910689
849911419 849911436
849917253 849917270
849918587 849918604
849961270 849961287
849961369 849961386
849961451 849961468
850058287 850058304
850058441 850058458
850098878 850098895
850099089 850099106
850102825 850102842
850104259 850104276
850109871 850109888
850110099 850110116
850112647 850112664
850155272 850155289
850156635 850156652
850156646 850156663
850162875 850162892
850165429 850165446
850165881 850165898
850279157 850279174
850317063 850317081
850437870 850437887
850461592 850461609
850495114 850495131
850500204 850500221
850500389 850500406
850510067 850510084
850690825 850690842
850698480 850698497
850704568 850704585
850721338 850721355
850738802 850738820
850738933 850738950
850740233 850740251
850742396 850742413
850751377 850751394
850754112 850754129
850768758 850768775
850768778 850768795
850769363 850769380
850772133 850772150
850772943 850772960
850814344 850814361
851279042 851279059
851280652 851280669
851283418 851283435
851289664 851289681
851291738 851291755
851295649 851295666
851359784 851359801
851380102 851380119
851380183 851380200
851808529 851808546
851812554 851812571
851825074 851825091
851896405 851896422
851961939 851961956
851994296 851994313
852055130 852055147
852056328 852056345
852057235 852057252
852062238 852062255
852062367 852062384
852064714 852064731
852159478 852159495
852212137 852212154
852257615 852257632
852269239 852269256
852327680 852327697
852331115 852331132
852332286 852332303
852459928 852459945
852483944 852483961
852487716 852487733
852493032 852493049
852495633 852495650
852496682 852496699
852499371 852499388
852501494 852501511
852572976 852572993
852586019 852586036
852587088 852587105
852590598 852590615
852592371 852592388
852592727 852592744
852660460 852660477
852665300 852665317
852758294 852758311
852838640 852838657
852893413 852893430
852971218 852971235
853111338 853111355
853178535 853178552
853200183 853200200
853201560 853201577
853276366 853276383
853276482 853276499
853349306 853349323
853353895 853353912
853358868 853358885
853366279 853366296
853430370 853430387
853489725 853489742
853510086 853510103
853518599 853518616
853587678 853587695
853598162 853598179
853601660 853601677
853666533 853666550
853668649 853668666
854122137 854122154
854122784 854122801
854154929 854154946
854331471 854331488
854383160 854383177
854391527 854391544
854394323 854394340
854399484 854399501
854481659 854481676
854485862 854485879
854487392 854487409
854490161 854490178
854550879 854550896
854621463 854621480
854832491 854832508
854834207 854834224
854835049 854835066
854836810 854836827
854837190 854837207
854837443 854837460
854993985 854994002
855089618 855089635
855152160 855152177
855333911 855333928
855512721 855512738
855591610 855591627
855623044 855623061
855630045 855630062
855641972 855641989
855660473 855660490
855676674 855676691
855679367 855679384
855817931 855817948
856072753 856072770
856124682 856124699
856129200 856129217
856198683 856198700
856275773 856275790
856317853 856317870
856393215 856393233
856474954 856474971
856546710 856546727
856547123 856547140
856548201 856548218
856562375 856562392
856659118 856659135
856659245 856659264
856724618 856724635
856764506 856764523
856804552 856804569
856845781 856845798
857022105 857022122
857169502 857169519
857169507 857169524
857433183 857433200
857571609 857571626
857605276 857605293
857655502 857655519
857678225 857678242
857735179 857735196
857741814 857741831
857741821 857741838
857742756 857742773
857746748 857746765
857746914 857746931
857832911 857832928
858111116 858111134
858182877 858182894
858182891 858182908
858191278 858191295
858274329 858274346
858368231 858368248
858369242 858369259
858372388 858372405
858428788 858428805
858428996 858429013
858539787 858539804
858541504 858541523
858614093 858614110
858614132 858614149
858614724 858614741
858615539 858615556
858615925 858615945
858742583 858742600
858801213 858801230
858849811 858849828
858955811 858955828
858985562 858985579
858991193 858991210
859068244 859068261
859074332 859074349
859074839 859074856
859099537 859099554
859215234 859215251
859252353 859252370
859302669 859302686
859440569 859440586
859564225 859564243
859758235 859758252
859759387 859759404
859820138 859820155
859821812 859821829
859821851 859821868
859821856 859821873
859926200 859926217
859931623 859931640
860071413 860071430
860340867 860340884
860340947 860340964
860367291 860367308
860441405 860441422
860447856 860447874
860448402 860448419
860643134 860643151
860958998 860959015
860975192 860975209
860987759 860987776
861035831 861035848
861035896 861035913
861386363 861386380
861492790 861492807
861697318 861697335
861718880 861718897
861997940 861997957
862002603 862002620
862018803 862018820
862019119 862019136
