L1:PEM-CS_ACC_IOT1_TABLE_X_OUT_DQ 2048
L1:PEM-CS_ACC_IOT1_TABLE_Y_OUT_DQ 2048
L1:PEM-CS_ACC_IOT1_TABLE_Z_OUT_DQ 2048
L1:PEM-CS_ACC_PSL_PERISCOPE_X_OUT_DQ 2048
L1:PEM-CS_ACC_PSL_TABLE1_X_OUT_DQ 2048
L1:PEM-CS_ACC_PSL_TABLE1_Y_OUT_DQ 2048
L1:PEM-CS_ACC_PSL_TABLE1_Z_OUT_DQ 2048
L1:PEM-CS_MAG_VERTEX_X_OUT_DQ 2048
L1:PEM-CS_MAG_VERTEX_Y_OUT_DQ 2048
L1:PEM-CS_MAG_VERTEX_Z_OUT_DQ 2048
L1:PEM-CS_MIC_PSL_CENTER_OUT_DQ 2048
L1:PEM-CS_VMON_EBAY_V1_OUT_DQ 2048
L1:PEM-CS_VMON_EBAY_V2_OUT_DQ 2048
L1:PEM-EX_ADC_DT_OUT_DQ 2048
L1:PEM-EX_BAYMIC_OUT_DQ 2048
L1:PEM-EX_BSC4_ACCX_OUT_DQ 2048
L1:PEM-EX_BSC4_ACCY_OUT_DQ 2048
L1:PEM-EX_BSC4_ACCZ_OUT_DQ 2048
L1:PEM-EX_BSC4_MIC_OUT_DQ 2048
L1:PEM-EX_BSC4_TEMP_OUT_DQ 256
L1:PEM-EX_MAGX_OUT_DQ 2048
L1:PEM-EX_MAGY_OUT_DQ 2048
L1:PEM-EX_MAGZ_OUT_DQ 2048
L1:PEM-EX_OPLEV_TEMP_OUT_DQ 2048
L1:PEM-EX_SEISX_OUT_DQ 256
L1:PEM-EX_SEISY_OUT_DQ 256
L1:PEM-EX_SEISZ_OUT_DQ 256
L1:PEM-EY_ADC_DT_OUT_DQ 16384
L1:PEM-EY_BAYMIC_OUT_DQ 16384
L1:PEM-EY_BSC5_ACCX_OUT_DQ 16384
L1:PEM-EY_BSC5_ACCY_OUT_DQ 16384
L1:PEM-EY_BSC5_ACCZ_OUT_DQ 16384
L1:PEM-EY_BSC5_MIC_OUT_DQ 16384
L1:PEM-EY_BSC5_TEMP_OUT_DQ 16384
L1:PEM-EY_MAGX_OUT_DQ 16384
L1:PEM-EY_MAGY_OUT_DQ 16384
L1:PEM-EY_MAGZ_OUT_DQ 16384
L1:PEM-EY_OPLEV_TEMP_OUT_DQ 16384
L1:PEM-EY_SEISX_OUT_DQ 16384
L1:PEM-EY_SEISY_OUT_DQ 16384
L1:PEM-EY_SEISZ_OUT_DQ 16384
