862139823 862139824
862158443 862158457
862163221 862163235
862167817 862167833
862177026 862177041
862179432 862179446
862187301 862187317
862207599 862207613
862258331 862258345
862262544 862262558
862278831 862278845
862312803 862312817
862324856 862324870
862351889 862351903
862381094 862381107
862384721 862384736
862404446 862404460
862408488 862408503
862462604 862462618
862521803 862521816
862524758 862524772
862533377 862533392
862543204 862543218
862556177 862556191
862565803 862565817
862568009 862568023
862583630 862583643
862599886 862599901
862605861 862605876
862646151 862646165
862668083 862668098
862689696 862689710
862698682 862698697
862701042 862701056
862704848 862704862
862705960 862705974
862716224 862716239
862732316 862732330
862768791 862768806
862773079 862773094
862813910 862813924
862855423 862855437
862858298 862858313
862870007 862870022
862880078 862880092
862897001 862897015
862942187 862942203
862944111 862944127
862947238 862947253
862948332 862948348
862954130 862954145
862976639 862976654
863034381 863034395
863052299 863052314
863073109 863073124
863091498 863091512
863119433 863119448
863201542 863201556
863202516 863202530
863205198 863205211
863216951 863216965
863295675 863295688
863301795 863301810
863317374 863317387
863371784 863371797
863377891 863377906
863457764 863457777
863539871 863539885
863547527 863547541
863635494 863635508
863637338 863637353
863669763 863669778
863683946 863683960
863713656 863713670
863734106 863734120
863770790 863770804
863805578 863805594
863830580 863830594
863848313 863848327
863931134 863931147
863945541 863945556
863979276 863979290
863982943 863982956
863984365 863984379
863993744 863993758
864014649 864014663
864058981 864058995
864069316 864069330
864131977 864131992
864146463 864146477
864149866 864149880
864158790 864158804
864168557 864168571
864253426 864253441
864280521 864280535
864305746 864305760
864314457 864314471
864325504 864325518
864328180 864328194
864339194 864339208
864340121 864340135
864416209 864416224
864434083 864434098
864436592 864436605
864464149 864464153
864585213 864585227
864592271 864592286
864594234 864594249
864604548 864604562
864606920 864606935
864612152 864612166
864628198 864628212
864673444 864673459
864678541 864678554
864751164 864751177
864761255 864761270
864777335 864777349
864778532 864778547
864859050 864859064
864921828 864921843
864963091 864963105
864969400 864969414
865019913 865019926
865029056 865029071
865030602 865030617
865055960 865055973
865085841 865085854
865129582 865129595
865134172 865134186
865181803 865181818
865183432 865183446
865196745 865196759
865198278 865198292
865199393 865199407
865345183 865345197
865364602 865364617
865374020 865374032
865397984 865397999
865465048 865465061
865474630 865474645
865490971 865490985
865542460 865542474
865557033 865557047
865613973 865613987
865621440 865621920
865625898 865625913
865668367 865668381
865684194 865684209
865695514 865695529
865720707 865720722
865743320 865743334
865795305 865795320
865798643 865798658
865808660 865808675
865824186 865824200
865828734 865828749
865829357 865829372
865853735 865853749
865864235 865864249
865876520 865876533
865893508 865893523
865947208 865947222
865971913 865971927
865982203 865982217
866032206 866032221
866075658 866075673
866078352 866078366
866086256 866086260
866110351 866110365
866123128 866123143
866150392 866150407
866159751 866159764
866160690 866160705
866162804 866162818
866164155 866164168
866183540 866183554
866209933 866209948
866231538 866231552
866235988 866236000
866259337 866259344
866325898 866325914
866333476 866333491
866410903 866410917
866524476 866524490
866583657 866583672
866593666 866593680
866600576 866600590
866601315 866601329
866603970 866603984
866605050 866605065
866672700 866672714
866698414 866698428
866711278 866711291
866736406 866736420
866762348 866762363
866770951 866770963
866774052 866774065
866776167 866776182
867029728 867030240
867056193 867056208
867120029 867120031
867143112 867143125
867206343 867206358
867212077 867212092
867246613 867246627
867275328 867275343
867285588 867285601
867298959 867298973
867319757 867319771
867364083 867364097
867378787 867378800
867449549 867449564
867501125 867501139
867558668 867558682
867628380 867628395
867687399 867687414
867708187 867708201
867710103 867710117
867771677 867771690
867795616 867795630
867815994 867816009
868045685 868045698
868054777 868054792
868060776 868060790
868114704 868114712
868143062 868143076
868144467 868144482
868213005 868213019
868216379 868216394
868232601 868232615
868236182 868236196
868247659 868247674
868253673 868253688
868262634 868262648
868300760 868300774
868305168 868305182
868391911 868391925
868399310 868399325
868472284 868472296
868527524 868527538
868540480 868540495
868584287 868584299
868602704 868602717
868608376 868608391
868612597 868612611
868631316 868631330
868651840 868651856
868661463 868661477
868701163 868701176
868745023 868745037
868753244 868753258
868794198 868794214
868851567 868851581
868909130 868909144
868919352 868919366
868987986 868987999
869006682 869006696
869020194 869020209
869060232 869060246
869068018 869068032
869164315 869164329
869177765 869177779
869233996 869234010
869255650 869255664
869282793 869282807
869342344 869342358
869367611 869367624
869442630 869442644
869464560 869464574
869505229 869505242
869524294 869524308
869535583 869535598
869540709 869540724
869600601 869600615
869604860 869604874
869613882 869613896
869616259 869616274
869617361 869617376
869648694 869648708
869661179 869661191
869720573 869720586
869773249 869773263
869858195 869858211
869868635 869868650
869871447 869871461
869922590 869922601
869954374 869954389
869986909 869986923
869992028 869992042
870024108 870024122
870038679 870038693
870058117 870058131
870060552 870060566
870067982 870067998
870071458 870071472
870103407 870103421
870122286 870122300
870214717 870214731
870261893 870261908
870273261 870273276
870289996 870290010
870292482 870292498
870342111 870342126
870453089 870453104
870467407 870467421
870526849 870526864
870560008 870560022
870568804 870568819
870578140 870578154
870629009 870629022
870645635 870645650
870716142 870716155
870788350 870788364
870813950 870813964
870815187 870815201
870824942 870824957
870891401 870891415
870905939 870905952
870939903 870939918
870956297 870956311
870980993 870981008
870991910 870991925
871061225 871061238
871075832 871075846
871105560 871105575
871236627 871236642
871243426 871243439
871257137 871257151
871272632 871272646
871277320 871277334
871289563 871289578
871293916 871293931
871300085 871300099
871312983 871312997
871352659 871352674
871356225 871356240
871392584 871392599
871404354 871404368
871409392 871409406
871414309 871414323
871441437 871441451
871522458 871522470
871590268 871590282
871597086 871597101
871619290 871619304
871653647 871653661
871672010 871672024
871679606 871679621
871685670 871685683
871695392 871695406
871718967 871718980
871803499 871803513
871920977 871920991
871933671 871933684
872015149 872015162
872049094 872049108
872092910 872092911
872103987 872104002
872129955 872129969
872142125 872142138
872167774 872167788
872183074 872183088
872201827 872201840
872299570 872299582
872304710 872304723
872315350 872315364
872331574 872331589
872345466 872345480
872367556 872367571
872373262 872373275
872419749 872419762
872442798 872442810
872461191 872461205
872635354 872635368
872643796 872643808
872704665 872704679
872712945 872712959
872731123 872731136
872816904 872816917
872871888 872871902
872885759 872885773
872894721 872894735
872918008 872918023
872979792 872979805
872997216 872997230
873039664 873039678
873060190 873060205
873137066 873137079
873141102 873141117
873222850 873222864
873245566 873245581
873257938 873257952
873274718 873274733
873318424 873318438
873413473 873413486
873424743 873424756
873489654 873489665
873583005 873583019
873618095 873618109
873631779 873631793
873645656 873645671
873648732 873648747
873651417 873651431
873657113 873657127
873665965 873665979
873670120 873670133
873677288 873677302
873689395 873689410
873690878 873690893
873713256 873713271
873733469 873733484
873736107 873736120
873745608 873745622
873769276 873769291
873786055 873786070
873806613 873806626
873814248 873814262
873834757 873834771
873844502 873844516
873903825 873903839
873964099 873964114
873995551 873995566
874015300 874015313
874023757 874023772
874087548 874087561
874189111 874189126
874272862 874272875
874275422 874275437
874313427 874313441
874347690 874347704
874352746 874352758
874354130 874354145
874360657 874360672
874436881 874436882
874439964 874439980
874478784 874478798
874501476 874501489
874514081 874514096
874524801 874524815
874526299 874526313
874530194 874530208
874536278 874536292
874567554 874567568
874622903 874622917
874650109 874650123
874687183 874687197
874695969 874695983
874706762 874706777
874802172 874802186
874817606 874817621
874846207 874846221
874867612 874867627
874878327 874878341
874901670 874901683
874952420 874952435
874959065 874959080
874977366 874977380
874979353 874979368
874985573 874985587
874987912 874987926
875022639 875022654
875041707 875041722
875056048 875056063
875104038 875104053
875109321 875109336
875120291 875120304
875154079 875154092
875166367 875166381
875167225 875167240
875182052 875182066
875200553 875200568
875230303 875230317
