L1:ALS-X_ARM_IN1_DQ    16384
L1:ALS-X_REFL_CTRL_OUT_DQ    16384
L1:ALS-X_FIBR_CTRL_OUT_DQ    16384
L1:ALS-X_FIBR_A_LF_OUT_DQ    2048
L1:ALS-X_FIBR_REJECTED_LF_OUT_DQ    2048
L1:ALS-X_FIBR_TRANS_LF_OUT_DQ    2048
L1:ALS-X_LASER_GR_LF_OUT_DQ    2048
L1:ALS-X_LASER_IR_LF_OUT_DQ    2048
L1:ALS-X_REFL_B_LF_OUT_DQ    2048
L1:ALS-X_SPARE_B_LF_OUT_DQ    2048
L1:ASC-X_TR_A_NSUM_OUT_DQ    2048
L1:ISI-HAM3_BLND_GS13RX_IN1_DQ    2048
L1:ISI-HAM3_BLND_GS13RY_IN1_DQ    2048
L1:ISI-HAM3_BLND_GS13RZ_IN1_DQ    2048
L1:ISI-HAM3_BLND_GS13X_IN1_DQ    2048
L1:ISI-HAM3_BLND_GS13Y_IN1_DQ    2048
L1:ISI-HAM3_BLND_GS13Z_IN1_DQ    2048
L1:ISI-HAM3_MASTER_H1_DRIVE_DQ    2048
L1:ISI-HAM3_MASTER_H2_DRIVE_DQ    2048
L1:ISI-HAM3_MASTER_H3_DRIVE_DQ    2048
L1:ISI-HAM3_MASTER_V1_DRIVE_DQ    2048
L1:ISI-HAM3_MASTER_V2_DRIVE_DQ    2048
L1:ISI-HAM3_MASTER_V3_DRIVE_DQ    2048
L1:ISI-ITMX_ST1_BLND_RX_L4C_CUR_IN1_DQ    2048
L1:ISI-ITMX_ST1_BLND_RY_L4C_CUR_IN1_DQ    2048
L1:ISI-ITMX_ST1_BLND_RZ_L4C_CUR_IN1_DQ    2048
L1:ISI-ITMX_ST1_BLND_X_L4C_CUR_IN1_DQ    2048
L1:ISI-ITMX_ST1_BLND_Y_L4C_CUR_IN1_DQ    2048
L1:ISI-ITMX_ST1_BLND_Z_L4C_CUR_IN1_DQ    2048
L1:ISI-ITMX_ST2_BLND_RX_GS13_CUR_IN1_DQ    2048
L1:ISI-ITMX_ST2_BLND_RY_GS13_CUR_IN1_DQ    2048
L1:ISI-ITMX_ST2_BLND_RZ_GS13_CUR_IN1_DQ    2048
L1:ISI-ITMX_ST2_BLND_X_GS13_CUR_IN1_DQ    2048
L1:ISI-ITMX_ST2_BLND_Y_GS13_CUR_IN1_DQ    2048
L1:ISI-ITMX_ST2_BLND_Z_GS13_CUR_IN1_DQ    2048
L1:ISI-ITMX_ST1_MASTER_H1_DRIVE_DQ    512
L1:ISI-ITMX_ST1_MASTER_H2_DRIVE_DQ    512
L1:ISI-ITMX_ST1_MASTER_H3_DRIVE_DQ    512
L1:ISI-ITMX_ST1_MASTER_V1_DRIVE_DQ    512
L1:ISI-ITMX_ST1_MASTER_V2_DRIVE_DQ    512
L1:ISI-ITMX_ST1_MASTER_V3_DRIVE_DQ    512
L1:ISI-ITMX_ST2_MASTER_H1_DRIVE_DQ    512
L1:ISI-ITMX_ST2_MASTER_H2_DRIVE_DQ    512
L1:ISI-ITMX_ST2_MASTER_H3_DRIVE_DQ    512
L1:ISI-ITMX_ST2_MASTER_V1_DRIVE_DQ    512
L1:ISI-ITMX_ST2_MASTER_V2_DRIVE_DQ    512
L1:ISI-ITMX_ST2_MASTER_V3_DRIVE_DQ    512
L1:ISI-ETMX_ST1_BLND_RX_L4C_CUR_IN1_DQ    2048
L1:ISI-ETMX_ST1_BLND_RY_L4C_CUR_IN1_DQ    2048
L1:ISI-ETMX_ST1_BLND_RZ_L4C_CUR_IN1_DQ    2048
L1:ISI-ETMX_ST1_BLND_X_L4C_CUR_IN1_DQ    2048
L1:ISI-ETMX_ST1_BLND_Y_L4C_CUR_IN1_DQ    2048
L1:ISI-ETMX_ST1_BLND_Z_L4C_CUR_IN1_DQ    2048
L1:ISI-ETMX_ST2_BLND_RX_GS13_CUR_IN1_DQ    2048
L1:ISI-ETMX_ST2_BLND_RY_GS13_CUR_IN1_DQ    2048
L1:ISI-ETMX_ST2_BLND_RZ_GS13_CUR_IN1_DQ    2048
L1:ISI-ETMX_ST2_BLND_X_GS13_CUR_IN1_DQ    2048
L1:ISI-ETMX_ST2_BLND_Y_GS13_CUR_IN1_DQ    2048
L1:ISI-ETMX_ST2_BLND_Z_GS13_CUR_IN1_DQ    2048
L1:ISI-ETMX_ST1_MASTER_H1_DRIVE_DQ    512
L1:ISI-ETMX_ST1_MASTER_H2_DRIVE_DQ    512
L1:ISI-ETMX_ST1_MASTER_H3_DRIVE_DQ    512
L1:ISI-ETMX_ST1_MASTER_V1_DRIVE_DQ    512
L1:ISI-ETMX_ST1_MASTER_V2_DRIVE_DQ    512
L1:ISI-ETMX_ST1_MASTER_V3_DRIVE_DQ    512
L1:ISI-ETMX_ST2_MASTER_H1_DRIVE_DQ    512
L1:ISI-ETMX_ST2_MASTER_H2_DRIVE_DQ    512
L1:ISI-ETMX_ST2_MASTER_H3_DRIVE_DQ    512
L1:ISI-ETMX_ST2_MASTER_V1_DRIVE_DQ    512
L1:ISI-ETMX_ST2_MASTER_V2_DRIVE_DQ    512
L1:ISI-ETMX_ST2_MASTER_V3_DRIVE_DQ    512
L1:SUS-MC2_M3_LOCK_L_IN1_DQ    2048
L1:SUS-MC2_M2_MASTER_OUT_LL_DQ    1024
L1:SUS-MC2_M2_MASTER_OUT_LR_DQ    1024
L1:SUS-MC2_M2_MASTER_OUT_UL_DQ    1024
L1:SUS-MC2_M2_MASTER_OUT_UR_DQ    1024
L1:SUS-MC2_M3_MASTER_OUT_LL_DQ    2048
L1:SUS-MC2_M3_MASTER_OUT_LR_DQ    2048
L1:SUS-MC2_M3_MASTER_OUT_UL_DQ    2048
L1:SUS-MC2_M3_MASTER_OUT_UR_DQ    2048
L1:SUS-ITMX_M0_NOISEMON_F1_DQ    512
L1:SUS-ITMX_M0_NOISEMON_F2_DQ    512
L1:SUS-ITMX_M0_NOISEMON_F3_DQ    512
L1:SUS-ITMX_M0_NOISEMON_LF_DQ    512
L1:SUS-ITMX_M0_NOISEMON_RT_DQ    512
L1:SUS-ITMX_M0_NOISEMON_SD_DQ    512
L1:SUS-ITMX_L1_NOISEMON_LL_DQ    1024
L1:SUS-ITMX_L1_NOISEMON_LR_DQ    1024
L1:SUS-ITMX_L1_NOISEMON_UL_DQ    1024
L1:SUS-ITMX_L1_NOISEMON_UR_DQ    1024
L1:SUS-ITMX_L2_NOISEMON_LL_DQ    1024
L1:SUS-ITMX_L2_NOISEMON_LR_DQ    1024
L1:SUS-ITMX_L2_NOISEMON_UL_DQ    1024
L1:SUS-ITMX_L2_NOISEMON_UR_DQ    1024
L1:SUS-ITMX_L1_MASTER_OUT_UL_DQ    1024
L1:SUS-ITMX_L1_MASTER_OUT_LL_DQ    1024
L1:SUS-ITMX_L1_MASTER_OUT_UR_DQ    1024
L1:SUS-ITMX_L1_MASTER_OUT_LR_DQ    1024
L1:SUS-ITMX_L2_MASTER_OUT_UL_DQ    2048
L1:SUS-ITMX_L2_MASTER_OUT_LL_DQ    2048
L1:SUS-ITMX_L2_MASTER_OUT_UR_DQ    2048
L1:SUS-ITMX_L2_MASTER_OUT_LR_DQ    2048
L1:SUS-ITMX_L3_OPLEV_PIT_OUT_DQ    256
L1:SUS-ITMX_L3_OPLEV_YAW_OUT_DQ    256
L1:SUS-ITMX_L3_MASTER_OUT_UL_DQ    2048
L1:SUS-ITMX_L3_MASTER_OUT_LL_DQ    2048
L1:SUS-ITMX_L3_MASTER_OUT_UR_DQ    2048
L1:SUS-ITMX_L3_MASTER_OUT_LR_DQ    2048
L1:SUS-ITMX_L3_MASTER_OUT_DC_DQ    256
L1:SUS-ETMX_M0_NOISEMON_F1_DQ    512
L1:SUS-ETMX_M0_NOISEMON_F2_DQ    512
L1:SUS-ETMX_M0_NOISEMON_F3_DQ    512
L1:SUS-ETMX_M0_NOISEMON_LF_DQ    512
L1:SUS-ETMX_M0_NOISEMON_RT_DQ    512
L1:SUS-ETMX_M0_NOISEMON_SD_DQ    512
L1:SUS-ETMX_L1_NOISEMON_LL_DQ    1024
L1:SUS-ETMX_L1_NOISEMON_LR_DQ    1024
L1:SUS-ETMX_L1_NOISEMON_UL_DQ    1024
L1:SUS-ETMX_L1_NOISEMON_UR_DQ    1024
L1:SUS-ETMX_L2_NOISEMON_LL_DQ    1024
L1:SUS-ETMX_L2_NOISEMON_LR_DQ    1024
L1:SUS-ETMX_L2_NOISEMON_UL_DQ    1024
L1:SUS-ETMX_L2_NOISEMON_UR_DQ    1024
L1:SUS-ETMX_L1_MASTER_OUT_UL_DQ    1024
L1:SUS-ETMX_L1_MASTER_OUT_LL_DQ    1024
L1:SUS-ETMX_L1_MASTER_OUT_UR_DQ    1024
L1:SUS-ETMX_L1_MASTER_OUT_LR_DQ    1024
L1:SUS-ETMX_L2_MASTER_OUT_UL_DQ    2048
L1:SUS-ETMX_L2_MASTER_OUT_LL_DQ    2048
L1:SUS-ETMX_L2_MASTER_OUT_UR_DQ    2048
L1:SUS-ETMX_L2_MASTER_OUT_LR_DQ    2048
L1:SUS-ETMX_L3_OPLEV_PIT_OUT_DQ    256
L1:SUS-ETMX_L3_OPLEV_YAW_OUT_DQ    256
L1:SUS-ETMX_L3_MASTER_OUT_UL_DQ    2048
L1:SUS-ETMX_L3_MASTER_OUT_LL_DQ    2048
L1:SUS-ETMX_L3_MASTER_OUT_UR_DQ    2048
L1:SUS-ETMX_L3_MASTER_OUT_LR_DQ    2048
L1:SUS-ETMX_L3_MASTER_OUT_DC_DQ    256
L1:IMC-F_OUT_DQ    16384
L1:IMC-I_OUT_DQ    16384
L1:IMC-L_OUT_DQ    16384
L1:IMC-REFL_DC_OUT_DQ    16384
L1:IMC-TRANS_OUT_DQ    16384
L1:IMC-MC2_TRANS_PIT_OUT_DQ    2048
L1:IMC-MC2_TRANS_SUM_IN1_DQ    2048
L1:IMC-MC2_TRANS_SUM_OUT_DQ    2048
L1:IMC-MC2_TRANS_YAW_OUT_DQ    2048
L1:IMC-MC2_PIT_OUT_DQ    2048
L1:IMC-MC2_YAW_OUT_DQ    2048
L1:PEM-CS_ACC_BSC1_ITMY_X_OUT_DQ    2048
L1:PEM-CS_ACC_BSC1_ITMY_Y_OUT_DQ    2048
L1:PEM-CS_ACC_BSC2_BS_Y_OUT_DQ    2048
L1:PEM-CS_ACC_BSC3_ITMX_X_OUT_DQ    2048
L1:PEM-CS_ACC_BSC3_ITMX_Y_OUT_DQ    2048
L1:PEM-CS_ACC_HAM2_PRM_Y_OUT_DQ    2048
L1:PEM-CS_ACC_HAM2_PRM_Z_OUT_DQ    2048
L1:PEM-CS_ACC_HAM3_PR2_Y_OUT_DQ    2048
L1:PEM-CS_ACC_HAM4_SR2_X_OUT_DQ    2048
L1:PEM-CS_ACC_HAM5_SRM_X_OUT_DQ    2048
L1:PEM-CS_ACC_HAM6_OMC_X_OUT_DQ    2048
L1:PEM-CS_ACC_HAM6_OMC_Z_OUT_DQ    2048
L1:PEM-CS_ACC_IOT1_IMC_X_OUT_DQ    2048
L1:PEM-CS_ACC_IOT1_IMC_Y_OUT_DQ    2048
L1:PEM-CS_ACC_IOT1_IMC_Z_OUT_DQ    2048
L1:PEM-CS_ACC_ISCT6_OMC_X_OUT_DQ    2048
L1:PEM-CS_ACC_LVEA_FLOORBS_Z_OUT_DQ    2048
L1:PEM-CS_ACC_PSL_PERISCOPE_X_OUT_DQ    2048
L1:PEM-CS_ACC_PSL_TABLE1_X_OUT_DQ    2048
L1:PEM-CS_ACC_PSL_TABLE1_Y_OUT_DQ    2048
L1:PEM-CS_ACC_PSL_TABLE1_Z_OUT_DQ    2048
L1:PEM-CS_MAG_OUTPUTOPTICS_X_OUT_DQ    8192
L1:PEM-CS_MAG_OUTPUTOPTICS_Y_OUT_DQ    8192
L1:PEM-CS_MAG_OUTPUTOPTICS_Z_OUT_DQ    8192
L1:PEM-CS_MAG_VERTEX_X_OUT_DQ    8192
L1:PEM-CS_MAG_VERTEX_Y_OUT_DQ    8192
L1:PEM-CS_MAG_VERTEX_Z_OUT_DQ    8192
L1:PEM-CS_MAINSMON_EBAY_V1_OUT_DQ    2048
L1:PEM-CS_MAINSMON_EBAY_V2_OUT_DQ    2048
L1:PEM-CS_MIC_LVEA_BS_OUT_DQ    16384
L1:PEM-CS_MIC_PSL_CENTER_OUT_DQ    16384
L1:PEM-EX_BAYMIC_OUT_DQ    16384
L1:PEM-EX_BSC4_ACCX_OUT_DQ    2048
L1:PEM-EX_BSC4_ACCY_OUT_DQ    2048
L1:PEM-EX_BSC4_ACCZ_OUT_DQ    2048
L1:PEM-EX_BSC4_MIC_OUT_DQ    16384
L1:PEM-EX_BSC4_TEMP_OUT_DQ    256
L1:PEM-EX_MAGX_OUT_DQ    8192
L1:PEM-EX_MAGY_OUT_DQ    8192
L1:PEM-EX_MAGZ_OUT_DQ    8192
L1:PEM-EX_OPLEV_TEMP_OUT_DQ    256
L1:PEM-EX_SEISX_OUT_DQ    256
L1:PEM-EX_SEISY_OUT_DQ    256
L1:PEM-EX_SEISZ_OUT_DQ    256
