831421781 831421798
831421847 831421865
831471796 831471813
831472724 831472741
831474717 831474734
831475903 831475920
831475950 831475969
831476749 831476768
831476776 831476793
831476796 831476814
831479925 831479942
831484832 831484849
831485315 831485333
831485327 831485344
831485497 831485514
831485746 831485763
831485830 831485847
831485881 831485898
831488794 831488811
831488839 831488859
831488861 831488879
831492215 831492232
831510038 831510055
831571739 831571756
831578221 831578238
831578323 831578340
831578433 831578450
831578441 831578458
831578457 831578474
831578476 831578493
831583622 831583639
831583712 831583731
831583778 831583795
831583802 831583819
831583838 831583855
831584053 831584070
831584082 831584101
831584311 831584328
831584353 831584374
831584515 831584534
831584541 831584558
831585171 831585190
831585335 831585352
831585387 831585404
831585500 831585517
831586189 831586206
831586341 831586358
831586372 831586390
831586468 831586485
831586971 831586988
831587015 831587032
831587035 831587053
831587073 831587091
831587091 831587108
831587178 831587196
831587895 831587912
831588170 831588187
831588346 831588364
831588363 831588381
831588384 831588402
831588417 831588434
831589469 831589486
831589512 831589529
831589549 831589566
831589555 831589574
831589607 831589626
831589673 831589690
831590423 831590440
831590439 831590456
831590617 831590634
831649682 831649699
831649907 831649924
831649930 831649947
831670370 831670387
831670433 831670451
831670438 831670455
831671028 831671045
831671032 831671049
831671992 831672010
831672010 831672030
831672115 831672132
831672146 831672163
831672175 831672192
831672185 831672202
831672208 831672225
831672219 831672236
831672521 831672538
831672633 831672650
831672648 831672665
831673783 831673801
831673897 831673914
831673953 831673970
831673975 831673994
831674000 831674017
831674021 831674038
831674075 831674092
831674637 831674655
831674687 831674704
831674696 831674713
831674714 831674731
831674752 831674769
831725848 831725865
831725900 831725917
831725917 831725935
831756671 831756689
831756712 831756729
831756721 831756738
831756853 831756872
831757020 831757037
831757083 831757100
831757122 831757139
831757439 831757456
831757483 831757501
831757589 831757606
831757610 831757627
831757819 831757836
831757825 831757842
831757893 831757910
831757914 831757933
831757980 831757997
831758006 831758023
831758162 831758179
831758186 831758205
831758208 831758225
831758274 831758291
831758324 831758341
831758457 831758474
831758467 831758484
831758492 831758509
831759639 831759656
831759756 831759773
831933582 831933599
831933706 831933723
831933737 831933756
831933779 831933799
831933811 831933831
831933853 831933872
831934024 831934041
831934039 831934057
831984830 831984847
831984893 831984910
831984900 831984917
832071720 832071737
832158386 832158403
832247376 832247393
832418166 832418184
832418217 832418234
832418234 832418251
832418246 832418263
832448855 832448872
832448905 832448922
832531588 832531605
832531909 832531926
832531963 832531980
832534276 832534293
832536632 832536649
832539613 832539630
832539658 832539675
832678892 832678910
832678940 832678957
832678944 832678961
832705151 832705168
832714869 832714886
832746601 832746618
832936145 832936162
832936226 832936243
832936237 832936254
832936255 832936273
832946918 832946935
832962070 832962087
832962090 832962108
832962116 832962133
832962150 832962169
833021579 833021596
833021647 833021664
833108462 833108479
833108530 833108547
833108542 833108559
833145218 833145235
833145259 833145276
833145265 833145282
833145320 833145337
833162694 833162711
833273016 833273033
833281061 833281078
833285225 833285242
833285282 833285299
833285495 833285512
833285606 833285624
833285762 833285779
833287096 833287113
833287121 833287138
833288206 833288223
833288265 833288283
833303318 833303335
833303366 833303383
833303403 833303422
833305759 833305776
833311112 833311129
833311147 833311165
833311152 833311169
833311236 833311253
833312410 833312427
833312821 833312838
833312844 833312861
833312868 833312886
833312885 833312902
833312904 833312922
833317264 833317282
833317323 833317343
833317345 833317362
833318977 833318994
833319595 833319612
833320513 833320530
833321347 833321364
833327106 833327123
833327261 833327278
833327376 833327393
833337250 833337267
833337277 833337294
833337487 833337504
833337647 833337664
833338786 833338803
833339565 833339582
833339631 833339648
833339640 833339657
833339874 833339891
833339889 833339906
833339944 833339961
833340911 833340928
833340938 833340955
833340973 833340990
833341039 833341056
833341364 833341384
833341482 833341499
833341496 833341513
833341618 833341635
833341637 833341654
833341648 833341665
833341653 833341670
833342702 833342719
833342743 833342760
833342772 833342789
833342897 833342915
833342904 833342921
833342940 833342959
833342991 833343010
833343004 833343021
833343427 833343444
833343473 833343490
833368278 833368296
833368328 833368346
833377962 833377979
833377971 833377988
833378308 833378325
833378349 833378366
833379006 833379023
833379130 833379147
833379385 833379402
833379504 833379521
833379613 833379630
833379625 833379642
833379637 833379654
833379652 833379670
833379677 833379695
833379688 833379707
833379694 833379711
833379797 833379814
833380945 833380962
833381169 833381186
833381528 833381545
833381696 833381713
833381731 833381748
833381757 833381774
833381790 833381807
833381798 833381815
833381814 833381831
833381877 833381894
833383067 833383084
833383111 833383128
833383138 833383155
833383191 833383208
833386114 833386131
833386166 833386185
833386172 833386189
833386192 833386210
833541400 833541417
833541450 833541467
833541477 833541494
833561392 833561409
833561431 833561448
833561453 833561470
833561473 833561490
833562794 833562811
833562844 833562861
833562859 833562879
833564558 833564575
833564605 833564622
833564610 833564627
833566156 833566175
833566203 833566221
833571376 833571393
833627722 833627739
833627768 833627785
833627772 833627789
833634183 833634201
833634205 833634222
833634216 833634233
833634345 833634362
833634367 833634384
833636631 833636648
833636682 833636699
833636755 833636772
833636940 833636958
833636992 833637009
833637012 833637029
833637019 833637036
833637510 833637527
833637515 833637534
833637576 833637594
833638852 833638869
833714645 833714662
833714695 833714712
833714734 833714751
833800628 833800645
833800677 833800694
833804778 833804795
833806820 833806837
833806837 833806854
833806880 833806902
833884779 833884796
833884842 833884859
833884847 833884864
833886846 833886864
833886904 833886921
833886915 833886933
833886930 833886947
833893630 833893647
833894678 833894695
833910696 833910713
833911071 833911088
833911148 833911166
833911767 833911784
833919669 833919686
833920226 833920244
833920287 833920306
833920336 833920353
833932335 833932353
833932381 833932399
833953661 833953678
833953847 833953864
833953863 833953880
833954456 833954473
833954484 833954501
833954494 833954511
833954504 833954521
833954512 833954529
833964668 833964685
833964674 833964691
833967037 833967054
833967189 833967206
833967197 833967214
833972860 833972879
833972940 833972957
833993022 833993039
833993046 833993065
833993093 833993111
833993098 833993116
833993119 833993136
833995860 833995877
833995925 833995942
834180014 834180031
834181755 834181773
834181805 834181822
834181810 834181829
834181826 834181843
834181840 834181857
834181860 834181877
834181951 834181968
834235051 834235068
834236468 834236486
834275870 834275888
834318367 834318384
834318392 834318411
834318440 834318460
834337096 834337114
834337135 834337152
834337141 834337158
834341211 834341228
834355149 834355168
834404881 834404898
834404905 834404924
834404954 834404975
834408532 834408549
834408593 834408610
834408636 834408653
834438836 834438854
834438887 834438904
834439940 834439957
834441125 834441142
834441145 834441162
834441149 834441166
834441192 834441209
834441204 834441222
834494824 834494841
834494925 834494945
834494946 834494963
834495012 834495029
834499558 834499575
834508124 834508141
834752663 834752680
834760257 834760274
834761993 834762010
834817108 834817125
834847367 834847384
834848500 834848517
834848515 834848532
834848586 834848604
834848593 834848610
834848612 834848629
834849223 834849240
834849317 834849334
834849414 834849431
834870854 834870871
834870879 834870896
834870883 834870900
834870931 834870949
834870956 834870974
834925633 834925650
834925678 834925696
834925699 834925719
834925717 834925734
834926173 834926190
834928704 834928724
834943683 834943700
834945977 834945994
834948638 834948656
834950395 834950412
834950421 834950438
834950463 834950480
834950477 834950494
834950499 834950518
834950516 834950534
834951762 834951779
834951813 834951830
834955458 834955475
834955598 834955616
834955632 834955649
834955642 834955659
834955738 834955755
834955973 834955991
834956029 834956048
834956041 834956059
834956053 834956071
834956113 834956130
834957850 834957868
834959675 834959692
834959679 834959696
834959690 834959707
835045834 835045851
835046319 835046336
835046345 835046362
835046394 835046411
835096027 835096045
835096077 835096094
835099839 835099856
835101808 835101825
835101881 835101898
835101904 835101921
835102709 835102727
835112843 835112860
835112866 835112885
835112914 835112933
835122393 835122410
835124982 835124999
835125361 835125378
835126036 835126053
835126040 835126059
835126061 835126079
835126087 835126105
835127112 835127129
835127763 835127780
835129375 835129392
835131446 835131463
835135975 835135992
835136034 835136052
835184922 835184939
835184926 835184944
835199275 835199292
835201152 835201169
835277727 835277744
835282652 835282669
835357517 835357534
835359345 835359362
835360427 835360444
835360495 835360514
835360526 835360543
835361479 835361497
835362323 835362340
835364219 835364236
835366632 835366649
835366648 835366666
835366695 835366713
835366774 835366791
835366801 835366818
835370615 835370634
835370639 835370656
835370662 835370683
835370683 835370701
835373345 835373362
835373773 835373790
835373830 835373847
835373839 835373856
835374222 835374240
835374269 835374287
835381730 835381747
835381761 835381778
835381978 835381996
835381993 835382010
835383247 835383264
835383270 835383288
835383677 835383694
835388031 835388048
835392699 835392716
835392716 835392733
835392740 835392757
835393359 835393376
835478587 835478604
835539534 835539551
835540738 835540755
835546109 835546127
835546157 835546174
835546171 835546189
835547565 835547583
835547614 835547632
835557271 835557289
835560286 835560304
835572831 835572848
835614767 835614784
835614809 835614826
835614855 835614872
835614907 835614924
835614916 835614933
835614926 835614943
835614936 835614953
835614940 835614957
835614966 835614983
835623008 835623026
835623036 835623053
835626932 835626949
835639976 835639993
835641390 835641407
835641405 835641424
835644762 835644780
835710855 835710872
835710897 835710914
835711267 835711284
835712154 835712171
835712180 835712197
835722444 835722461
835722496 835722516
835731626 835731644
835731730 835731747
835733816 835733833
835733906 835733923
835735515 835735532
835736551 835736568
835736575 835736592
835741703 835741720
835743614 835743633
835743642 835743660
835743753 835743770
835802886 835802904
835812783 835812800
835812841 835812858
835817233 835817250
835817258 835817275
835817305 835817322
835825424 835825441
835827947 835827965
835828359 835828376
835828405 835828422
835875471 835875488
835878723 835878740
835881599 835881616
835966244 835966261
835966249 835966266
836070408 836070425
836073952 836073969
836073968 836073988
836073988 836074005
836138884 836138902
836138959 836138976
836140740 836140758
836140794 836140812
836141437 836141454
836145494 836145511
836167708 836167725
836168001 836168018
836168051 836168068
836169049 836169067
836177310 836177327
836219814 836219831
836219860 836219878
836219867 836219885
836219889 836219906
836225472 836225491
836225518 836225535
836229958 836229977
836230146 836230164
836230220 836230237
836230237 836230254
836230260 836230277
836241630 836241647
836242378 836242395
836245833 836245851
836245879 836245898
836245885 836245903
836245907 836245924
836247301 836247318
836247361 836247379
836249902 836249919
836249945 836249962
836249950 836249969
836253110 836253129
836253173 836253191
836253210 836253228
836253379 836253396
836253422 836253439
836253448 836253465
836253465 836253482
836255110 836255128
836255186 836255203
836255213 836255230
836306489 836306506
836306514 836306531
836306561 836306582
836306570 836306587
836309405 836309423
836314229 836314246
836317605 836317622
836323470 836323487
836323494 836323511
836323517 836323535
836323543 836323560
836323560 836323577
836341847 836341865
836341899 836341919
836341927 836341946
836406430 836406447
836410230 836410247
836410295 836410312
836410318 836410336
836515295 836515312
836516886 836516903
836565898 836565918
836565956 836565973
836565980 836565997
836596637 836596654
836596647 836596664
836596659 836596676
836601408 836601425
836601412 836601429
836652260 836652277
836652270 836652287
836748514 836748532
836748558 836748575
836750587 836750604
836750644 836750661
836752278 836752295
836759055 836759073
836759136 836759153
836770193 836770210
836770218 836770237
836770251 836770269
836826192 836826209
836826266 836826283
836826282 836826300
836826295 836826312
836832882 836832899
836833646 836833664
836833677 836833694
836833716 836833733
836833734 836833751
836833756 836833773
836840397 836840415
836840474 836840492
836842721 836842738
836842767 836842784
836863880 836863898
836863951 836863968
836911929 836911947
836911953 836911970
836912005 836912023
836912010 836912027
836920008 836920025
836920089 836920106
836920264 836920281
836920278 836920295
836920289 836920306
836920303 836920320
836920352 836920370
836920382 836920400
836920401 836920418
836925400 836925417
836925440 836925458
836925515 836925533
836926236 836926254
837001824 837001841
837002907 837002924
837005049 837005066
837014520 837014537
837014573 837014590
837014599 837014616
837014604 837014621
837023091 837023108
837023180 837023197
837206355 837206372
837206359 837206376
837256702 837256719
837256763 837256781
837266884 837266901
837364481 837364499
837364533 837364550
837364549 837364566
837364987 837365005
837365014 837365031
837365073 837365090
837378737 837378755
837395600 837395617
837448602 837448619
837448607 837448624
837448631 837448648
837457436 837457455
837457510 837457528
837458509 837458530
837459744 837459761
837459748 837459765
837460553 837460573
837460572 837460589
837460602 837460619
837460619 837460636
837464054 837464071
837464104 837464124
837464131 837464148
837465479 837465497
837465504 837465522
837465573 837465590
837465578 837465595
837465593 837465612
837466025 837466042
837466029 837466046
837466048 837466065
837518299 837518316
837518359 837518378
837522388 837522408
837522449 837522466
837522470 837522488
837522743 837522760
837522869 837522888
837522931 837522948
837527012 837527029
837527046 837527063
837527079 837527096
837527873 837527890
837527919 837527936
837527987 837528004
837529607 837529624
837529845 837529864
837529888 837529905
837532842 837532859
837532861 837532878
837533136 837533153
837533592 837533610
837533638 837533658
837533658 837533675
837533719 837533737
837533765 837533782
837533786 837533803
837535696 837535713
837535824 837535841
837535879 837535896
837535901 837535919
837537659 837537676
837539127 837539145
837539148 837539165
837539174 837539193
837539201 837539219
837544880 837544899
837544949 837544966
837544969 837544986
837546361 837546378
837546396 837546414
837546443 837546460
837546456 837546473
837546472 837546489
837548100 837548117
837548178 837548195
837550679 837550696
837550719 837550737
837550727 837550745
837550749 837550766
837606717 837606734
837606785 837606803
837607573 837607590
837612102 837612119
837614130 837614147
837614167 837614184
837617023 837617040
837617071 837617089
837617114 837617133
837617318 837617335
837620250 837620267
837620328 837620345
837620498 837620515
837620567 837620585
837620605 837620622
837620630 837620647
837626303 837626321
837626327 837626344
837626378 837626396
837626399 837626416
837627077 837627095
837627120 837627137
837629423 837629441
837629470 837629489
837629493 837629510
837631521 837631538
837631598 837631617
837632532 837632549
837632575 837632595
837633205 837633222
837633248 837633265
837635919 837635937
837635943 837635960
837636019 837636036
837636071 837636088
837638400 837638417
837638490 837638507
837639514 837639531
837783108 837783125
837788411 837788429
837829047 837829065
838044161 838044179
838044441 838044458
838063824 838063841
838063903 838063920
838065256 838065273
838124642 838124659
838126451 838126468
838126499 838126516
838127520 838127537
838225699 838225716
838391231 838391249
838391255 838391272
838391302 838391320
838395428 838395445
838396650 838396667
838396723 838396740
838404349 838404366
838404360 838404377
838404371 838404388
838404599 838404616
838414344 838414361
838415025 838415042
838415044 838415062
838415106 838415124
838415139 838415156
838457440 838457457
838459512 838459529
838472948 838472965
838502154 838502171
838502180 838502198
838502230 838502247
838502245 838502262
838502499 838502516
838502679 838502696
838506316 838506334
838506385 838506402
838552480 838552497
838559184 838559201
838590855 838590872
838596369 838596386
838599165 838599182
838646868 838646889
838656769 838656786
838725458 838725477
838725509 838725527
838725539 838725556
838728600 838728617
838731014 838731032
838731113 838731130
838733693 838733710
838733969 838733986
838735003 838735020
838735981 838735998
838737188 838737205
838746392 838746409
838752530 838752548
838752594 838752611
838753142 838753161
838754757 838754776
838756750 838756767
838756806 838756823
838756820 838756837
838756831 838756849
838761489 838761506
838761574 838761591
838761755 838761772
838812774 838812791
838813919 838813937
838813977 838813994
838825791 838825808
838825841 838825858
838825857 838825874
838984830 838984847
838984892 838984910
838984897 838984914
838984912 838984930
838986944 838986961
838987000 838987017
838988199 838988217
838988251 838988268
838989291 838989308
838990743 838990760
838991670 838991687
838992876 838992893
838993837 838993856
838995285 838995302
838995299 838995316
838998590 838998608
839000461 839000480
839001655 839001673
839011434 839011451
839011461 839011478
839014683 839014700
839015029 839015046
839015061 839015078
839015083 839015100
839015130 839015147
839015137 839015154
839015156 839015173
839017201 839017218
839019559 839019576
839019618 839019635
839019641 839019660
839020341 839020358
839020363 839020380
839021102 839021119
839021123 839021141
839021186 839021205
839023761 839023778
839023810 839023827
839070841 839070858
839070867 839070884
839070943 839070960
839078707 839078724
839078749 839078768
839100314 839100332
839102367 839102384
839106463 839106481
839106480 839106497
839106737 839106755
839106789 839106806
839106794 839106811
839106820 839106838
839106947 839106966
839157759 839157776
839157806 839157823
839157849 839157866
839158208 839158225
839158231 839158252
839158279 839158296
839158289 839158307
839162345 839162363
839163417 839163435
839163461 839163478
839163465 839163485
839165805 839165822
839168725 839168742
839176669 839176686
839176744 839176761
839178941 839178959
839178968 839178985
839178996 839179013
839179004 839179022
839190113 839190130
839190222 839190240
839247669 839247686
839252537 839252555
839252564 839252583
839252606 839252623
839252640 839252657
839257838 839257855
839258364 839258381
839258772 839258789
839259140 839259157
839259221 839259239
839259248 839259265
839259259 839259276
839266951 839266968
839268587 839268604
839268657 839268676
839268694 839268711
839269042 839269059
839278046 839278064
839279496 839279514
839279542 839279559
839279548 839279565
839279577 839279594
839279620 839279637
839287178 839287196
839287204 839287221
839287280 839287297
839287306 839287323
839329788 839329805
839329836 839329853
839329843 839329860
839329887 839329904
839329910 839329927
839332668 839332685
839340669 839340687
839340768 839340785
839340774 839340791
839341730 839341747
839356444 839356461
839358310 839358327
839358334 839358351
839358477 839358494
839359171 839359188
839360209 839360226
839426929 839426946
839433142 839433159
839434599 839434619
839434662 839434679
839434667 839434684
839435639 839435659
839437173 839437193
839437293 839437310
839438326 839438343
839438348 839438365
839438409 839438426
839438431 839438448
839532103 839532121
839595024 839595041
839595048 839595067
839595094 839595111
839595098 839595116
839595121 839595138
839595140 839595157
839606001 839606018
839606039 839606056
839606061 839606078
839606077 839606094
839608264 839608281
839608326 839608343
839608573 839608590
839613164 839613181
839613214 839613232
839613228 839613245
839613240 839613258
839613257 839613274
839614622 839614639
839615366 839615383
839615651 839615668
839617739 839617757
839617840 839617858
839622892 839622909
839624974 839624991
839625043 839625060
839678740 839678757
839681802 839681820
839681869 839681886
839681882 839681900
839681889 839681907
839681910 839681927
839681927 839681944
839766238 839766255
839782257 839782274
839783956 839783975
839785624 839785641
839785669 839785686
839785673 839785690
839785686 839785703
839785701 839785720
839787509 839787526
839787857 839787874
839789351 839789368
839790285 839790302
839872981 839872998
839873447 839873464
839876912 839876930
839876963 839876980
839876998 839877015
839884401 839884419
839884415 839884432
839942795 839942813
839942865 839942882
839943166 839943184
839943216 839943235
839943549 839943568
839943595 839943613
839943650 839943668
839946499 839946516
839946550 839946567
839946575 839946593
839947757 839947774
839948030 839948048
839948081 839948098
839948107 839948125
839949395 839949412
840025642 840025660
840179793 840179810
840179856 840179873
840194120 840194140
840200410 840200427
840213813 840213832
840214528 840214545
840214580 840214597
840214607 840214624
840219588 840219605
840220168 840220185
840222281 840222298
840222326 840222343
840222348 840222365
840222363 840222380
840372209 840372226
840372232 840372250
840372281 840372298
840452717 840452735
840452785 840452802
840456751 840456768
840458041 840458060
840458677 840458694
840458736 840458753
840458893 840458910
840458903 840458920
840459895 840459912
840460205 840460222
840460302 840460319
840460402 840460419
840460624 840460641
840460865 840460882
840461091 840461108
840461648 840461665
840461787 840461804
840461907 840461924
840462077 840462094
840471667 840471684
840471691 840471709
840471728 840471745
840471765 840471782
840471802 840471819
840471853 840471870
840539832 840539850
840539856 840539874
840539903 840539922
840539909 840539927
840539930 840539948
840568944 840568964
840568990 840569007
840568999 840569016
840569150 840569167
840569213 840569231
840569279 840569296
840570818 840570837
840570850 840570867
840570886 840570904
840570914 840570932
840573697 840573714
840575890 840575907
840575948 840575965
840630896 840630913
840631066 840631083
840643552 840643569
840648300 840648317
840648315 840648332
840729067 840729084
840798588 840798605
840798608 840798625
841057907 841057924
841186490 841186507
841194532 841194549
841231852 841231869
841271768 841271785
841283112 841283129
841289080 841289097
841289364 841289381
841411144 841411161
841421743 841421761
841432612 841432629
841577517 841577534
841672309 841672327
841681840 841681857
841681886 841681903
841681904 841681921
841681916 841681933
841681927 841681944
841682526 841682543
841685581 841685598
841692780 841692797
841694358 841694375
841696561 841696578
841697981 841697999
841698031 841698048
841698085 841698105
841698170 841698187
841698252 841698269
841698644 841698661
841758623 841758640
841758654 841758671
841761815 841761833
841767431 841767449
841780833 841780850
841784801 841784819
841784825 841784842
841784891 841784909
841784905 841784922
841786581 841786598
841811541 841811558
841838918 841838936
841838991 841839008
841839008 841839026
841839019 841839036
841839037 841839054
841839447 841839465
841844304 841844321
842020036 842020053
842020113 842020131
842020778 842020795
842020864 842020881
842025761 842025778
842028182 842028199
842032052 842032069
842035437 842035456
842035502 842035524
842044568 842044585
842052256 842052273
842057422 842057440
842057485 842057502
842096411 842096429
842102486 842102503
842102587 842102604
842181295 842181312
842181346 842181363
842181351 842181368
842207740 842207757
842217829 842217846
842267117 842267134
842283867 842283884
842304746 842304763
842304805 842304822
842304809 842304826
842353813 842353830
842353838 842353855
842353900 842353918
842353918 842353935
842362394 842362411
842364284 842364301
842371570 842371587
842375385 842375403
842386180 842386197
842445872 842445889
842521566 842521583
842535897 842535914
842537536 842537554
842560905 842560923
842613761 842613778
842613814 842613833
842613850 842613867
842616483 842616500
842616579 842616596
842618089 842618106
842618204 842618221
842619299 842619318
842619305 842619322
842626897 842626914
842630826 842630844
842630919 842630936
842630943 842630961
842630992 842631009
842631000 842631017
842631017 842631034
842638573 842638590
842650151 842650169
842701608 842701625
842710070 842710087
842710120 842710137
842712037 842712056
842780777 842780794
842781037 842781055
842781058 842781075
842781104 842781121
842781217 842781234
842781228 842781245
842781246 842781263
842781251 842781268
842790291 842790308
842790306 842790323
842791901 842791919
842794210 842794227
842795181 842795200
842795207 842795224
842795244 842795262
842795251 842795268
842796423 842796440
842796566 842796583
842799865 842799882
842799945 842799962
842800241 842800258
842800537 842800554
842801238 842801255
842802771 842802788
842802820 842802837
842802833 842802850
842805452 842805469
842805532 842805549
842805580 842805599
842805604 842805622
842805807 842805824
842807303 842807320
842807320 842807337
842817947 842817964
842819695 842819713
842819744 842819761
842819757 842819774
842820829 842820846
842820846 842820863
842821306 842821324
842853217 842853235
842853231 842853248
842853464 842853481
842856952 842856969
842856957 842856974
842856978 842856995
842872921 842872939
842872944 842872962
842873002 842873019
842873013 842873030
842877899 842877918
842877962 842877980
842881775 842881792
842890378 842890395
842890451 842890469
842890459 842890477
842890480 842890497
842890582 842890599
842890604 842890621
842897543 842897560
842901437 842901454
842908662 842908680
842908727 842908745
842908746 842908763
842910991 842911009
842945634 842945651
842959211 842959229
842959234 842959251
842959295 842959312
842964063 842964080
842964141 842964158
842964779 842964796
842964979 842964996
842965152 842965169
842966726 842966743
842967945 842967962
842968012 842968029
842968053 842968070
842968238 842968255
842970947 842970964
842971373 842971390
842972347 842972364
842972500 842972517
843008194 843008211
843018901 843018920
843040545 843040564
843040597 843040614
843053129 843053147
843121554 843121571
843141777 843141794
843141937 843141954
843167816 843167833
843193415 843193432
843195752 843195769
843196224 843196241
843196344 843196361
843196439 843196456
843196458 843196475
843215231 843215248
843217691 843217708
843219579 843219596
843220784 843220801
843222090 843222107
843222458 843222476
843222523 843222541
843222699 843222716
843223640 843223657
843223681 843223698
843224060 843224077
843224456 843224473
843224754 843224771
843231368 843231385
843251361 843251378
843254239 843254257
843304280 843304297
843304284 843304302
843372298 843372315
843379275 843379292
843379306 843379323
843390199 843390216
843412867 843412884
843412885 843412903
843412944 843412962
843413972 843413989
843419181 843419199
843419229 843419249
843419256 843419273
843423220 843423238
843476664 843476682
843476688 843476706
843476743 843476760
843476764 843476781
843480409 843480426
843482381 843482398
843487681 843487698
843487718 843487735
843487730 843487748
843487755 843487773
843487760 843487777
843488668 843488687
843488693 843488710
843488737 843488755
843499142 843499159
843501053 843501070
843501068 843501086
843562506 843562523
843562517 843562534
843562540 843562558
843562546 843562564
843562586 843562603
843566926 843566943
843569837 843569857
843570119 843570136
843570913 843570930
843579850 843579867
843579908 843579926
843579916 843579933
843579928 843579946
843579991 843580008
843580488 843580505
843580570 843580587
843580574 843580591
843580596 843580613
843583450 843583468
843583470 843583488
843583490 843583507
843583500 843583517
843583523 843583540
843583542 843583561
843583563 843583580
843594086 843594103
843594218 843594235
843594560 843594577
843597506 843597523
843617878 843617895
843617889 843617906
843627775 843627792
843631839 843631859
843659657 843659674
843659838 843659855
843660021 843660038
843758797 843758814
843817461 843817478
843825432 843825449
843825682 843825699
843825857 843825875
843831260 843831279
843832114 843832131
843843002 843843019
843855600 843855617
843855663 843855680
843856852 843856869
843857560 843857577
843857587 843857604
843981504 843981521
843995178 843995195
843995199 843995216
843995257 843995277
843998781 843998798
844006387 844006404
844006417 844006436
844009178 844009195
844009201 844009218
844011676 844011693
844011726 844011743
844011740 844011757
844012953 844012970
844017817 844017834
844017866 844017883
844017881 844017899
844027874 844027891
844031965 844031982
844031990 844032007
844032013 844032031
844032063 844032081
844065986 844066003
844066013 844066030
844081730 844081748
844081748 844081765
844084719 844084737
844085991 844086008
844086054 844086071
844087442 844087459
844087533 844087551
844100355 844100372
844103567 844103585
844103590 844103612
844103668 844103685
844106757 844106774
844123738 844123755
844167896 844167914
844175530 844175548
844175581 844175598
844183654 844183671
844183689 844183706
844191376 844191393
844191390 844191407
844196885 844196903
844196905 844196922
844196929 844196946
844196943 844196961
844200681 844200698
844203089 844203106
844203106 844203123
844204945 844204962
844268503 844268520
844274246 844274263
844274357 844274375
844274365 844274383
844274387 844274404
844276967 844276985
844276977 844276994
844285011 844285028
844349240 844349258
844352584 844352602
844372179 844372197
844372219 844372238
844393632 844393649
844425765 844425782
844425778 844425795
844444220 844444237
844444710 844444727
844444745 844444762
844444762 844444779
844444816 844444833
844446877 844446894
844461632 844461649
844461691 844461709
844462634 844462653
844509427 844509444
844516170 844516189
844518400 844518417
844518458 844518476
844518830 844518848
844519571 844519588
844519646 844519663
844519915 844519932
844519956 844519974
844576024 844576041
844599631 844599648
844603676 844603693
844620220 844620237
844690083 844690100
844691849 844691866
844693462 844693479
844695660 844695677
844695681 844695699
844695734 844695755
844696101 844696118
844776762 844776779
844777279 844777296
844777707 844777724
844777814 844777831
844780051 844780068
844780217 844780234
844780436 844780453
844812140 844812157
844887590 844887607
844897575 844897592
844931831 844931848
845007762 845007779
845306000 845306018
845306052 845306069
845376588 845376606
845392762 845392779
845401893 845401910
845402596 845402613
845402663 845402683
845403140 845403157
845403229 845403246
845475355 845475372
845498811 845498828
845571494 845571511
845571506 845571524
845583103 845583121
845583178 845583197
845642560 845642577
845645576 845645593
845654182 845654199
845654264 845654281
845654292 845654309
845655828 845655845
845655976 845655994
845664792 845664809
845727721 845727738
845728983 845729000
845730278 845730295
845730296 845730314
845730347 845730366
845730375 845730392
845730393 845730410
845730434 845730451
845814473 845814490
845815932 845815949
846095971 846095988
846095985 846096002
846191166 846191184
846248252 846248269
846249010 846249027
846249090 846249109
846249939 846249956
846277622 846277639
846278117 846278134
846279293 846279310
846279301 846279319
846279476 846279493
846279605 846279625
846279614 846279631
846279806 846279826
846279838 846279857
846330987 846331007
846331049 846331070
846336821 846336838
846422748 846422766
846422796 846422814
846423714 846423731
846426632 846426652
846428504 846428522
846428557 846428574
846428896 846428913
846438144 846438161
846438227 846438244
846447069 846447086
846448493 846448510
846496456 846496473
846509222 846509239
846509246 846509263
846510328 846510345
846582243 846582261
846582316 846582333
846582321 846582338
846582835 846582852
846594675 846594693
846594720 846594737
846594726 846594744
846594743 846594761
846594754 846594771
846595105 846595122
846595129 846595146
846595182 846595200
846606236 846606253
846714501 846714518
846785996 846786013
846786005 846786022
846786020 846786037
846786051 846786068
846793350 846793367
846842165 846842182
846853626 846853645
846860482 846860499
846860537 846860554
846860647 846860664
846860862 846860879
846860920 846860938
846860931 846860948
846861698 846861715
846865575 846865593
846865603 846865621
846865623 846865640
846865632 846865649
846865644 846865662
846875898 846875915
846877431 846877448
846878966 846878983
846878973 846878990
846943333 846943351
847032906 847032924
847032954 847032973
847032995 847033012
847033685 847033702
847111558 847111575
847113218 847113235
847113441 847113458
847135460 847135478
847188174 847188191
847188178 847188196
847197355 847197372
847207286 847207303
847209294 847209311
847209332 847209350
847209359 847209376
847209364 847209381
847209417 847209435
847209422 847209439
847216961 847216979
847218822 847218839
847218845 847218862
847231969 847231990
847232264 847232281
847232315 847232333
847232331 847232349
847285823 847285841
847286677 847286694
847286758 847286775
847303789 847303806
847303984 847304002
847304059 847304076
847305912 847305929
847309422 847309440
847317504 847317521
847382211 847382228
847393227 847393244
847457816 847457833
847458366 847458384
847458442 847458459
847458466 847458483
847459668 847459685
847459682 847459699
847465143 847465161
847482173 847482190
847482225 847482242
847543804 847543823
847543833 847543850
847543841 847543858
847544462 847544480
847544537 847544554
862145185 862145202
862145245 862145262
862150676 862150693
862151241 862151259
862151270 862151289
862151280 862151297
862151395 862151412
862151413 862151430
862151420 862151438
862151493 862151510
862155049 862155068
862155076 862155093
862155122 862155140
862155128 862155145
862157998 862158016
862158011 862158029
862162187 862162204
862162251 862162268
862163768 862163785
862163787 862163804
862163882 862163899
862174738 862174755
862174767 862174784
862178824 862178842
862179809 862179826
862180939 862180956
862229411 862229428
862231118 862231135
862234720 862234737
862235050 862235068
862237409 862237426
862237422 862237439
862237433 862237451
862237483 862237500
862247017 862247034
862247368 862247385
862251009 862251026
862256287 862256304
862256337 862256355
862256354 862256371
862257479 862257496
862262020 862262037
862262520 862262537
862265122 862265144
862273510 862273527
862277550 862277567
862277629 862277646
862305387 862305405
862309483 862309500
862309499 862309516
862324322 862324342
862361795 862361812
862408091 862408108
862412908 862412925
862418291 862418308
862419515 862419532
862514699 862514716
862564280 862564298
862582889 862582906
862583035 862583052
862583766 862583784
862583810 862583828
862584881 862584898
862584928 862584946
862584954 862584972
862585226 862585244
862585287 862585305
862585310 862585327
862591079 862591096
862591395 862591413
862602494 862602511
862605030 862605047
862619977 862619994
862636601 862636618
862663378 862663395
862667993 862668010
862668050 862668067
862668076 862668093
862669042 862669060
862669060 862669077
862669164 862669181
862669185 862669202
862669243 862669260
862669289 862669306
862669714 862669732
862670148 862670165
862671074 862671094
862696421 862696439
862696474 862696491
862696490 862696507
862697837 862697854
862698920 862698937
862698985 862699002
862745526 862745543
862768316 862768333
862769816 862769833
862769877 862769897
862769926 862769943
862769938 862769958
862769948 862769966
862769971 862769988
862770154 862770171
862775058 862775075
862775121 862775138
862775802 862775819
862811129 862811146
862824132 862824149
862831598 862831615
862834233 862834251
862834291 862834310
862835473 862835490
862835542 862835559
862835783 862835800
862835836 862835853
862836710 862836727
862836729 862836746
862836790 862836808
862846133 862846150
862846227 862846244
862846252 862846269
862846260 862846277
862846364 862846381
862846870 862846887
862846881 862846899
862846978 862846995
862848305 862848322
862848419 862848437
862849333 862849350
862849346 862849363
862849369 862849386
862849391 862849408
862849402 862849419
862849433 862849450
862849449 862849466
862849467 862849484
862850457 862850474
862850500 862850517
862851110 862851127
862851119 862851136
862851137 862851154
862853610 862853627
862853660 862853678
862853684 862853702
862853694 862853711
862853706 862853724
862853726 862853744
862853742 862853759
862853760 862853778
862855131 862855149
862855214 862855232
862856540 862856557
862857058 862857076
862857713 862857730
862857877 862857894
862857893 862857913
862857923 862857941
862861296 862861314
862861364 862861383
862861383 862861400
862863040 862863057
862863047 862863064
862863079 862863097
862863131 862863149
862863173 862863190
862863189 862863206
862863207 862863226
862865189 862865206
862865597 862865614
862868816 862868833
862874188 862874205
862884328 862884345
862888724 862888741
862890036 862890053
862895885 862895902
862903477 862903494
862911849 862911866
862913921 862913938
862916656 862916673
862918177 862918194
862920214 862920231
862920847 862920865
862922334 862922351
862932254 862932271
862932291 862932308
862932876 862932894
862933146 862933163
862934711 862934729
862934757 862934774
862934763 862934781
862934792 862934809
862935353 862935370
862937949 862937967
862937960 862937977
862938007 862938024
862938011 862938028
862938107 862938125
862938154 862938171
862938276 862938293
862938777 862938794
862939410 862939427
862940246 862940263
862940599 862940617
862998473 862998490
863039261 863039279
863039328 863039346
863042748 863042765
863042792 863042810
863042942 863042959
863042964 863042981
863119624 863119641
863175669 863175686
863208045 863208064
863208199 863208216
863208441 863208458
863208779 863208796
863210504 863210523
863210511 863210529
863210784 863210801
863271095 863271112
863271143 863271160
863271190 863271207
863271200 863271217
863272066 863272083
863295419 863295436
863295468 863295485
863295487 863295504
863295515 863295532
863297420 863297440
863297502 863297522
863298077 863298094
863360921 863360938
863360960 863360977
863360987 863361005
863361006 863361023
863361012 863361029
863361027 863361045
863361065 863361082
863363599 863363616
863364286 863364303
863364310 863364328
863375760 863375777
863375812 863375829
863388479 863388501
863388519 863388537
863442264 863442281
863444020 863444038
863444066 863444085
863444082 863444100
863446990 863447007
863447003 863447021
863447158 863447175
863447201 863447220
863451621 863451638
863454783 863454800
863454841 863454858
863457039 863457056
863457049 863457067
863457073 863457090
863457120 863457138
863459282 863459299
863459307 863459324
863459678 863459696
863459696 863459714
863459714 863459732
863459765 863459784
863459805 863459823
863466219 863466236
863483382 863483399
863532133 863532150
863532195 863532213
863534425 863534442
863534474 863534491
863534488 863534507
863537464 863537481
863539744 863539761
863541493 863541510
863541500 863541518
863541524 863541542
863541576 863541595
863542628 863542645
863542684 863542702
863544741 863544759
863544768 863544786
863544804 863544823
863545582 863545600
863545590 863545607
863546432 863546449
863546439 863546456
863546520 863546537
863588508 863588525
863613823 863613840
863641764 863641781
863641849 863641866
863644879 863644897
863644886 863644903
863644899 863644916
863644916 863644933
863646012 863646029
863730728 863730746
863778558 863778575
863785204 863785222
863789859 863789876
863790418 863790436
863794283 863794300
863794420 863794437
863794515 863794532
863794594 863794612
863794763 863794780
863795149 863795166
863795296 863795314
863795303 863795320
863795322 863795339
863796070 863796087
863796178 863796195
863796207 863796224
863796216 863796233
863796238 863796256
863796250 863796268
863796281 863796298
863796386 863796405
863796412 863796430
863796423 863796440
863796454 863796471
863798005 863798022
863798208 863798228
863798243 863798260
863800347 863800364
863801620 863801637
863801624 863801641
863801652 863801669
863801813 863801830
863801848 863801865
863801979 863801996
863802043 863802060
863802058 863802075
863804437 863804454
863805712 863805729
863806748 863806765
863808189 863808206
863808274 863808291
863810558 863810578
863810585 863810602
863810658 863810676
863810665 863810682
863810686 863810703
863810803 863810820
863811620 863811637
863815676 863815693
863815717 863815735
863815769 863815786
863815812 863815829
863815817 863815834
863815844 863815861
863815848 863815865
863816101 863816118
863816318 863816335
863816376 863816393
863816399 863816416
863816413 863816430
863816443 863816461
863816593 863816610
863816927 863816944
863870762 863870779
863870836 863870854
863873073 863873090
863873092 863873110
863873132 863873149
863873144 863873162
863873169 863873187
863955182 863955200
863958578 863958595
863961375 863961392
863961406 863961423
863961430 863961447
863962821 863962838
863963227 863963245
863963232 863963249
863967987 863968004
863968062 863968079
863972875 863972892
863972919 863972937
863972942 863972960
863972959 863972979
863973030 863973050
863973059 863973076
863973207 863973224
863973223 863973241
863973940 863973958
863974006 863974026
863975685 863975702
863975698 863975716
863976627 863976644
863976632 863976649
863981422 863981439
863982114 863982131
863982171 863982192
864047197 864047214
864051215 864051232
864051228 864051246
864051246 864051263
864051278 864051295
864051294 864051312
864051306 864051326
864053066 864053083
864053541 864053558
864053770 864053787
864053942 864053959
864053957 864053974
864063283 864063300
864064605 864064622
864064635 864064652
864064646 864064664
864064652 864064669
864072901 864072918
864072960 864072978
864073008 864073026
864073901 864073918
864073923 864073940
864073958 864073975
864074000 864074018
864074020 864074037
864143752 864143769
864143756 864143773
864151835 864151853
864151857 864151874
864151867 864151885
864151892 864151911
864154511 864154528
864154536 864154553
864154561 864154578
864154591 864154608
864154600 864154617
864157801 864157818
864160740 864160757
864160787 864160804
864160989 864161006
864216673 864216690
864216782 864216800
864242528 864242545
864246667 864246684
864246729 864246746
864480544 864480561
864503183 864503200
864503199 864503217
864504140 864504157
864504145 864504162
864504242 864504259
864504258 864504275
864504325 864504346
864504334 864504351
864505662 864505679
864505678 864505695
864505706 864505725
864505712 864505729
864505727 864505744
864505762 864505780
864506320 864506337
864506332 864506349
864506620 864506638
864506699 864506716
864507315 864507333
864508744 864508764
864512718 864512735
864512915 864512932
864512925 864512942
864563049 864563066
864563096 864563113
864563110 864563128
864654400 864654418
864676019 864676036
864679994 864680012
864680012 864680029
864682210 864682227
864742042 864742059
864742066 864742083
864748489 864748506
864749513 864749531
864749798 864749815
864749823 864749840
864749908 864749925
864749914 864749932
864749939 864749956
864749989 864750006
864750005 864750022
864750016 864750035
864750045 864750062
864755890 864755907
864755954 864755971
864756599 864756616
864760973 864760990
864761944 864761961
864763099 864763116
864763725 864763744
864763778 864763795
864765567 864765584
864766428 864766445
864778095 864778112
864782235 864782252
864831727 864831744
864839333 864839350
864932666 864932684
864932727 864932744
864990795 864990813
864998293 864998310
864998305 864998322
864998471 864998488
865001054 865001071
865001177 865001195
865001297 865001315
865001363 865001380
865001417 865001435
865001447 865001464
865001464 865001481
865002371 865002388
865003632 865003649
865004838 865004855
865005318 865005335
865005420 865005437
865006739 865006756
865006762 865006779
865006784 865006801
865006803 865006820
865006969 865006986
865007018 865007035
865007081 865007098
865007314 865007331
865007595 865007612
865007624 865007641
865009305 865009322
865009591 865009608
865010504 865010521
865010635 865010652
865010662 865010679
865010838 865010855
865020340 865020357
865022380 865022397
865022443 865022460
865022461 865022479
865022690 865022708
865022705 865022722
865022770 865022789
865022786 865022803
865025769 865025786
865025833 865025850
865038540 865038557
865080668 865080685
865084548 865084566
865085531 865085548
865085907 865085924
865086650 865086667
865101809 865101827
865101850 865101867
865101875 865101893
865101902 865101921
865160747 865160764
865178760 865178778
865182531 865182548
865182555 865182573
865182583 865182600
865182621 865182639
865182628 865182645
865182649 865182666
865182724 865182741
865182801 865182819
865182885 865182902
865185722 865185739
865185745 865185764
865186056 865186073
865189345 865189364
865189803 865189820
865189841 865189860
865191056 865191073
865192001 865192019
865192862 865192879
865192897 865192915
865192916 865192933
865193173 865193190
865193433 865193450
865193727 865193744
865193735 865193752
865193751 865193769
865194460 865194478
865249989 865250006
865253269 865253286
865254719 865254736
865261421 865261438
865261488 865261505
865261516 865261533
865264371 865264388
865264937 865264954
865264970 865264987
865265018 865265035
865271894 865271912
865274627 865274644
865276295 865276312
865278064 865278081
865278406 865278423
865278434 865278455
865278496 865278513
865278502 865278520
865278886 865278903
865279050 865279067
865279537 865279554
865279606 865279623
865279637 865279655
865280133 865280153
865280671 865280689
865281692 865281709
865281713 865281730
865281777 865281794
865343096 865343113
865344046 865344063
865344091 865344108
865344764 865344781
865358340 865358357
865358752 865358770
865360201 865360218
865360256 865360273
865363041 865363059
865363808 865363826
865364006 865364023
865364480 865364499
865382925 865382942
865428372 865428391
865446389 865446407
865446454 865446471
865453751 865453769
865466401 865466418
865505222 865505239
865523428 865523446
865602120 865602137
865602167 865602184
865605278 865605295
865608086 865608104
865608304 865608321
865614838 865614857
865614924 865614941
865616181 865616198
865616186 865616203
865616259 865616276
865616263 865616283
865619325 865619342
865619378 865619395
865620553 865620570
865620610 865620628
865620622 865620639
865621202 865621219
865623727 865623745
865623848 865623865
865625809 865625826
865626007 865626024
865684367 865684386
865684373 865684390
865684388 865684405
865684439 865684457
865684460 865684477
865684465 865684483
865765525 865765542
865773394 865773411
865773645 865773662
865774704 865774721
865774757 865774774
865776909 865776926
865777344 865777361
865777697 865777714
865778419 865778436
865778564 865778582
865778619 865778636
865781177 865781194
865781230 865781248
865781242 865781260
865781256 865781273
865781270 865781287
865781329 865781346
865781603 865781620
865781877 865781894
865781939 865781956
865782014 865782031
865782023 865782040
865782363 865782380
865782385 865782402
865783437 865783454
865783748 865783766
865783936 865783954
865784006 865784023
865784282 865784299
865784466 865784483
865785636 865785653
865787470 865787487
865787502 865787519
865788041 865788058
865789627 865789644
865795784 865795801
865854288 865854306
865857325 865857342
865857568 865857586
865862881 865862899
865862936 865862953
865862977 865862996
865863000 865863017
865863045 865863063
865863062 865863079
865863761 865863778
865863967 865863984
865864000 865864017
865864047 865864064
865865161 865865178
865865261 865865278
865865866 865865883
865865908 865865926
865866636 865866653
865868870 865868889
865869386 865869403
865869628 865869645
865869656 865869675
865871305 865871323
865871414 865871431
865871467 865871484
865871474 865871491
865871484 865871501
865872259 865872276
865872787 865872804
865872832 865872849
865873468 865873485
865873649 865873666
865875071 865875088
865879412 865879430
865879480 865879498
865879498 865879515
865879542 865879559
865880324 865880341
865884578 865884595
865886728 865886746
865888511 865888528
865888581 865888598
865888589 865888607
865889927 865889944
865889955 865889972
865889999 865890016
865890033 865890050
865893694 865893711
865929079 865929097
865941096 865941115
865941138 865941155
865955493 865955510
865961292 865961309
865961346 865961363
866203640 866203657
866210598 866210616
866210651 866210668
866210684 866210701
866217241 866217259
866217304 866217323
866220776 866220794
866221159 866221176
866295783 866295801
866324901 866324918
866325055 866325072
866325416 866325433
866325459 866325476
866326062 866326079
866331844 866331861
866337083 866337102
866337386 866337405
866363472 866363489
866376471 866376488
866377320 866377338
866381453 866381470
866381511 866381528
866382634 866382651
866387452 866387470
866387472 866387489
866387479 866387496
866387528 866387545
866388053 866388070
866388122 866388139
866388143 866388160
866389933 866389950
866410243 866410260
866468347 866468364
866468819 866468836
866468838 866468855
866471801 866471818
866471811 866471828
866471816 866471833
866471820 866471837
866471866 866471885
866475126 866475143
866482550 866482567
866482565 866482583
866482574 866482592
866485732 866485749
866485736 866485753
866486022 866486042
866487183 866487200
866487201 866487219
866487258 866487277
866487271 866487289
866487301 866487318
866487316 866487333
866488310 866488327
866488374 866488392
866488447 866488464
866542378 866542395
866543160 866543177
866569943 866569960
866571643 866571660
866573111 866573129
866573187 866573204
866574288 866574305
866574420 866574437
866574438 866574455
866574667 866574684
866574855 866574873
866574967 866574986
866574980 866574997
866575052 866575069
866575061 866575078
866575073 866575090
866575188 866575205
866575195 866575212
866575326 866575343
866575392 866575409
866575406 866575423
866575416 866575433
866575536 866575553
866575547 866575564
866575602 866575619
866575611 866575628
866575628 866575645
866575641 866575658
866575700 866575717
866575917 866575934
866576036 866576053
866576104 866576121
866576188 866576205
866576192 866576209
866576236 866576253
866576249 866576266
866576319 866576336
866576475 866576492
866576522 866576539
866576544 866576561
866576706 866576723
866576895 866576912
866577040 866577058
866636432 866636449
866636437 866636454
866654901 866654918
866809222 866809240
866809235 866809252
866809294 866809311
866809421 866809441
866809450 866809472
866809511 866809528
866809913 866809931
866821979 866821996
866822117 866822134
866822174 866822191
866822442 866822459
866822469 866822486
866822746 866822763
866823112 866823129
866823355 866823374
866823706 866823723
866823753 866823770
866823839 866823856
866823852 866823869
866823860 866823877
866823871 866823888
866823944 866823961
866824006 866824025
866824179 866824196
866827640 866827657
866827644 866827663
866830783 866830800
866830793 866830810
866831326 866831343
866831340 866831357
866831363 866831380
866831390 866831407
866831411 866831428
866831451 866831471
866831472 866831489
866831488 866831505
866831703 866831720
866832006 866832023
866832555 866832572
866833070 866833088
866833136 866833153
866833197 866833214
866833201 866833218
866833252 866833269
866833359 866833377
866833374 866833391
866833388 866833405
866833420 866833437
866833490 866833509
866833500 866833517
866833520 866833537
866833625 866833642
866833705 866833722
866833756 866833774
866840321 866840338
866840565 866840582
866840590 866840607
866840635 866840652
866840852 866840871
866894391 866894411
866897538 866897555
866897865 866897882
866898893 866898910
866898945 866898962
866898958 866898975
866899012 866899029
866899454 866899471
866899916 866899933
866900324 866900341
866900341 866900358
866900699 866900716
866900739 866900757
866900748 866900765
866968469 866968487
866968509 866968527
866975686 866975703
866984512 866984529
866984825 866984842
866995945 866995962
866995992 866996009
866996007 866996024
866996035 866996053
866996049 866996066
866996130 866996147
866996198 866996215
866996269 866996286
866996318 866996335
866996380 866996397
866996547 866996564
866996650 866996667
866996710 866996727
866996784 866996801
866996800 866996817
866996879 866996896
866997082 866997100
866997115 866997132
866997129 866997146
866997155 866997172
866997162 866997180
866998435 866998452
866998452 866998469
866998606 866998623
866998702 866998719
866998985 866999003
867001571 867001588
867001660 867001678
867001672 867001689
867001676 867001693
867003422 867003439
867003490 867003507
867003496 867003513
867003517 867003534
867003536 867003553
867003544 867003561
867003910 867003927
867003995 867004012
867004100 867004117
867004389 867004406
867004705 867004724
867004766 867004783
867004776 867004793
867004790 867004807
867004826 867004843
867004835 867004852
867005017 867005034
867005320 867005337
867005354 867005371
867005512 867005529
867005784 867005801
867006109 867006126
867006257 867006274
867006294 867006311
867006315 867006332
867006400 867006418
867006429 867006446
867006462 867006479
867006490 867006507
867006531 867006548
867006579 867006596
867006607 867006624
867006677 867006694
867086777 867086794
867086788 867086805
867086830 867086847
867087442 867087459
867088732 867088753
867155042 867155059
867155099 867155116
867162768 867162785
867162774 867162791
867162923 867162940
867163146 867163163
867163265 867163282
867163384 867163401
867163455 867163472
867164506 867164523
867165011 867165028
867165018 867165035
867165099 867165116
867165607 867165624
867166363 867166380
867166372 867166389
867166388 867166405
867166580 867166597
867166679 867166696
867167300 867167317
867167457 867167474
867167665 867167682
867167831 867167848
867167836 867167853
867167881 867167898
867167976 867167993
867168223 867168240
867168473 867168490
867168494 867168511
867169027 867169044
867169161 867169178
867169822 867169839
867170214 867170231
867170485 867170502
867170580 867170597
867170659 867170676
867170873 867170890
867171271 867171288
867171344 867171361
867171369 867171386
867171952 867171970
867171967 867171984
867171976 867171993
867175524 867175541
867175998 867176015
867176039 867176056
867176073 867176090
867176367 867176384
867176546 867176563
867176569 867176586
867176897 867176914
867177078 867177095
867177572 867177589
867177625 867177642
867177875 867177892
867178186 867178203
867178485 867178502
867178775 867178792
867179708 867179725
867179776 867179793
867179842 867179859
867179863 867179880
867181211 867181228
867181415 867181432
867181655 867181672
867182838 867182855
867184009 867184027
867186103 867186121
867192478 867192495
867197629 867197647
867197678 867197695
867249316 867249333
867275575 867275592
867276074 867276091
867281258 867281276
867412693 867412710
867420235 867420252
867420690 867420707
867420747 867420764
867420858 867420875
867420862 867420879
867421004 867421021
867421024 867421041
867421166 867421183
867421319 867421336
867422015 867422032
867422183 867422200
867422559 867422576
867422712 867422729
867422940 867422957
867423141 867423158
867423301 867423318
867423501 867423519
867423670 867423687
867423956 867423973
867423974 867423993
867425709 867425726
867425761 867425778
867425778 867425795
867426045 867426062
867426142 867426159
867426216 867426233
867426226 867426243
867426243 867426260
867426285 867426302
867426297 867426314
867430522 867430539
867434527 867434544
867436816 867436833
867437168 867437185
867437219 867437236
867437244 867437261
867437258 867437275
867437371 867437388
867437437 867437454
867437616 867437633
867438191 867438208
867438480 867438497
867438522 867438539
867438530 867438548
867438574 867438592
867438646 867438663
867438800 867438817
867439389 867439406
867440676 867440695
867441638 867441655
867441821 867441838
867442116 867442133
867442167 867442184
867442240 867442257
867455240 867455257
867455697 867455714
867461836 867461853
867478016 867478033
867478023 867478040
867500464 867500482
867500620 867500637
867500633 867500650
867500683 867500701
867500689 867500706
867500949 867500966
867501461 867501478
867502560 867502577
867502601 867502618
867502637 867502654
867502651 867502668
867502689 867502706
867502743 867502760
867502781 867502798
867502806 867502823
867502874 867502891
867503190 867503207
867503215 867503234
867503242 867503259
867680081 867680098
867680632 867680649
867680741 867680758
867680784 867680801
867680837 867680854
867681110 867681127
867681523 867681540
867681597 867681614
867681610 867681627
867681859 867681876
867682130 867682147
867682954 867682971
867683233 867683253
867683494 867683511
867684568 867684585
867685172 867685189
867686048 867686065
867686311 867686328
867689966 867689983
867941014 867941032
868018929 868018946
868018957 868018975
868019032 868019050
868019049 868019067
868031010 868031029
868031072 868031089
868033127 868033145
868039149 868039168
868044159 868044176
868044176 868044193
868044990 868045009
868045067 868045084
868047000 868047017
868047134 868047153
868212802 868212819
868212860 868212879
868218277 868218294
868218825 868218842
868222726 868222743
868223668 868223686
868286201 868286218
868286205 868286222
868309262 868309279
868309282 868309299
868309341 868309358
868363036 868363056
868363119 868363136
868376163 868376180
868376168 868376185
868377735 868377753
868390526 868390543
868392645 868392662
868392667 868392684
868453298 868453315
868453354 868453372
868456968 868456985
868456992 868457009
868457016 868457033
868460366 868460383
868583723 868583740
868584978 868584995
868650144 868650161
868651151 868651168
868651231 868651248
868651312 868651329
868803403 868803420
868805658 868805675
868805684 868805703
868805746 868805763
868811195 868811212
868880515 868880533
868880576 868880593
868881145 868881162
868881201 868881218
868893430 868893447
868893454 868893471
868893522 868893540
868893581 868893598
868893902 868893919
868893908 868893926
868893948 868893966
868899407 868899424
868900949 868900966
868900989 868901006
868901103 868901120
868901234 868901251
868901279 868901296
868901355 868901372
868901360 868901377
868901649 868901666
868901984 868902001
868913443 868913460
868913497 868913515
868968228 868968245
868968281 868968298
868968293 868968311
868985368 868985385
868985422 868985439
868985435 868985452
868989497 868989515
868990445 868990464
869141739 869141756
869149457 869149475
869157589 869157606
869157665 869157682
869226802 869226819
869226861 869226878
869227686 869227703
869227695 869227712
869239010 869239027
869240779 869240796
869241103 869241120
869258135 869258152
869312649 869312667
869316392 869316409
869316466 869316484
869321859 869321876
869323093 869323110
869399485 869399502
869401551 869401569
869406942 869406959
869418482 869418499
869427995 869428012
869429894 869429911
869429898 869429915
869429947 869429965
869436159 869436176
869436184 869436201
869436242 869436259
869436246 869436264
869512025 869512042
869512082 869512099
869515586 869515603
869578096 869578113
869581571 869581588
869675427 869675444
869685972 869685989
869764218 869764235
869832828 869832845
869838451 869838468
869844707 869844724
869844728 869844745
869845586 869845603
869885587 869885604
869913859 869913878
869913947 869913964
870001623 870001640
870004883 870004901
870004912 870004930
870004971 870004989
870008772 870008789
870022770 870022787
870022808 870022825
870022830 870022847
870040804 870040821
870091712 870091729
870091770 870091787
870091774 870091791
870099868 870099885
870099931 870099948
870099943 870099960
870099950 870099967
870104328 870104345
870107030 870107049
870107082 870107099
870107096 870107113
870108085 870108102
870108839 870108858
870108884 870108901
870108889 870108906
870112347 870112365
870112392 870112409
870112396 870112413
870112419 870112436
870112430 870112447
870123376 870123393
870123428 870123445
870123441 870123458
870125854 870125871
870125916 870125933
870125943 870125960
870362791 870362810
870374873 870374890
870458921 870458939
870465629 870465651
870465658 870465675
870465857 870465875
870465896 870465913
870465903 870465920
870465908 870465925
870465946 870465963
870467136 870467153
870473650 870473667
870547160 870547179
870547190 870547211
870547254 870547274
870551630 870551647
870551699 870551717
870551725 870551743
870551773 870551790
870558305 870558322
870558375 870558392
870611953 870611971
870612007 870612024
870612012 870612029
870612023 870612040
870702663 870702680
870732648 870732665
870732662 870732679
870732715 870732732
870784955 870784972
870786272 870786289
870792999 870793016
870793018 870793035
870793051 870793068
870803752 870803769
870803798 870803815
870803803 870803821
870803821 870803838
870806663 870806680
870806738 870806755
870806758 870806779
870824921 870824938
870827049 870827066
870827063 870827080
870827085 870827102
870827090 870827107
870892294 870892313
870892366 870892385
870937699 870937716
871052658 871052675
871055462 871055479
871055553 871055570
871065678 871065695
871071552 871071571
871071567 871071584
871071577 871071594
871071603 871071620
871071628 871071645
871071640 871071657
871073243 871073260
871125410 871125427
871125464 871125481
871136226 871136243
871136275 871136292
871136295 871136312
871210822 871210839
871211100 871211117
871211175 871211192
871212041 871212059
871218015 871218032
871218089 871218108
871218711 871218729
871218795 871218813
871218810 871218827
871218959 871218976
871225091 871225108
871225117 871225134
871225170 871225187
871225184 871225202
871225902 871225920
871227834 871227852
871227856 871227874
871227871 871227888
871232069 871232086
871235923 871235942
871236274 871236291
871236346 871236363
871236352 871236370
871236365 871236383
871236410 871236428
871318917 871318937
871318996 871319013
871325178 871325195
871325183 871325200
871326409 871326426
871326477 871326494
871326494 871326511
871389708 871389725
871389733 871389750
871389784 871389802
871389805 871389822
871413332 871413349
871413404 871413421
871472284 871472302
871483967 871483984
871488875 871488892
871489895 871489912
871489903 871489920
871489907 871489924
871586778 871586796
871641079 871641096
871650006 871650024
871650050 871650067
871650054 871650075
871651330 871651347
871652711 871652728
871663727 871663744
871663792 871663809
871668567 871668584
871668621 871668639
871674883 871674902
871674960 871674977
871723928 871723945
871738959 871738978
871738992 871739009
871739001 871739019
871821543 871821560
871821547 871821564
871822739 871822756
871843368 871843385
871843497 871843518
871843536 871843553
871844214 871844231
871844238 871844255
871844279 871844296
871908662 871908679
871908709 871908726
871908732 871908749
871908772 871908789
871932626 871932644
871932633 871932651
871934630 871934648
871934681 871934699
871934705 871934724
871934727 871934744
871934746 871934764
871939945 871939963
871939957 871939976
871990631 871990648
871992847 871992865
871992911 871992928
871992917 871992934
871994844 871994862
871996074 871996092
872004829 872004846
872004863 872004880
872004888 872004905
872009653 872009670
872009678 872009696
872009737 872009754
872009761 872009779
872009781 872009799
872011980 872012000
872016251 872016268
872016262 872016279
872016957 872016974
872016974 872016991
872031983 872032000
872032131 872032148
872032614 872032631
872093036 872093053
872095234 872095251
872095841 872095859
872095861 872095878
872109391 872109408
872109742 872109760
872113568 872113585
872189080 872189097
872198676 872198695
872198684 872198701
872200124 872200141
872256775 872256792
872256809 872256826
872256832 872256850
872273478 872273495
872279396 872279414
872285737 872285754
872286692 872286709
872287258 872287275
872337952 872337970
872373409 872373426
872373431 872373452
872373511 872373530
872374225 872374243
872376116 872376133
872423347 872423364
872423450 872423467
872423517 872423534
872425041 872425058
872425082 872425099
872425458 872425475
872425859 872425876
872425950 872425967
872426001 872426018
872426067 872426087
872426083 872426100
872426276 872426293
872426284 872426301
872426615 872426632
872426647 872426665
872426773 872426790
872427215 872427232
872427237 872427254
872427276 872427293
872427357 872427374
872427490 872427507
872427529 872427546
872427767 872427784
872427897 872427917
872428001 872428018
872428096 872428113
872428179 872428196
872428200 872428217
872428300 872428317
872428388 872428405
872428394 872428411
872428409 872428426
872428419 872428436
872428477 872428494
872428571 872428588
872428684 872428701
872428790 872428807
872428931 872428948
872428936 872428953
872429000 872429017
872429048 872429065
872429200 872429217
872429397 872429415
872429423 872429440
872429670 872429687
872429798 872429815
872429828 872429845
872429835 872429853
872429845 872429864
872429859 872429879
872429892 872429909
872429908 872429927
872429914 872429931
872429934 872429952
872429954 872429971
872429959 872429976
872429996 872430013
872430019 872430036
872430114 872430131
872430183 872430200
872430354 872430371
872430463 872430480
872430556 872430573
872430583 872430600
872430680 872430697
872430753 872430770
872430880 872430897
872430910 872430927
872430969 872430986
872431042 872431059
872431047 872431064
872431082 872431099
872431097 872431114
872431123 872431140
872431130 872431147
872431154 872431174
872431168 872431186
872431209 872431227
872431289 872431306
872431316 872431333
872431397 872431414
872431407 872431424
872431424 872431441
872431459 872431476
872431553 872431573
872431668 872431686
872431677 872431694
872431695 872431713
872431703 872431720
872431707 872431724
872431756 872431773
872431827 872431844
872431836 872431853
872432133 872432150
872432166 872432183
872432280 872432297
872432454 872432471
872432594 872432612
872432602 872432622
872432706 872432724
872432711 872432728
872433176 872433193
872433206 872433223
872433386 872433403
872433390 872433407
872433407 872433427
872433418 872433435
872433439 872433456
872433455 872433472
872433637 872433654
872433708 872433725
872433733 872433751
872437308 872437325
872437837 872437854
872437869 872437886
872437957 872437975
872438014 872438031
872438304 872438321
872438888 872438905
872439013 872439030
872439444 872439461
872439651 872439668
872439698 872439716
872439757 872439774
872439785 872439802
872439801 872439818
872439832 872439849
872440051 872440068
872440063 872440080
872441062 872441079
872441217 872441234
872441441 872441458
872441588 872441605
872442589 872442606
872442895 872442914
872442999 872443016
872443028 872443045
872443188 872443205
872443439 872443456
872443541 872443558
872444239 872444256
872444333 872444350
872444574 872444591
872444640 872444657
872444704 872444722
872444751 872444768
872444882 872444899
872448690 872448707
872448804 872448821
872449190 872449207
872449204 872449221
872450436 872450453
872450525 872450542
872450835 872450852
872450858 872450875
872450954 872450973
872450960 872450978
872450965 872450982
872450983 872451000
872451005 872451022
872451077 872451094
872451705 872451723
872451711 872451728
872451771 872451788
872451776 872451793
872451901 872451918
872452139 872452156
872452361 872452378
872452619 872452636
872455561 872455578
872455658 872455675
872455680 872455697
872455935 872455952
872455977 872455994
872456147 872456164
872456629 872456646
872457288 872457306
872457379 872457397
872457439 872457456
872457512 872457530
872522305 872522322
872522338 872522357
872522362 872522379
872522436 872522453
872522469 872522486
872522488 872522505
872522517 872522534
872522540 872522559
872522650 872522667
872523691 872523708
872523712 872523729
872523717 872523734
872523729 872523748
872523763 872523780
872523796 872523815
872523833 872523850
872524026 872524043
872524040 872524057
872524092 872524109
872524118 872524135
872524362 872524379
872549919 872549936
872594080 872594097
872596396 872596413
872596423 872596440
872596448 872596467
872596473 872596490
872596483 872596501
872596623 872596640
872596657 872596674
872596683 872596700
872596810 872596827
872596920 872596937
872596983 872597000
872597134 872597153
872597149 872597166
872597172 872597190
872597432 872597449
872597656 872597673
872597729 872597746
872597748 872597766
872597762 872597779
872597957 872597974
872597974 872597991
872598059 872598076
872598555 872598572
872598589 872598606
872598610 872598627
872598645 872598662
872598708 872598725
872598898 872598915
872598915 872598934
872598957 872598974
872598997 872599014
872599053 872599070
872599092 872599109
872599134 872599151
872599314 872599331
872599398 872599415
872599412 872599429
872599461 872599478
872599466 872599483
872599755 872599772
872604699 872604716
872604932 872604949
872605785 872605802
872606578 872606595
872687805 872687822
872687826 872687843
872690276 872690293
872708325 872708342
872708661 872708678
872709301 872709318
872718759 872718776
872855552 872855569
872855944 872855961
872855963 872855980
872893766 872893783
872941444 872941462
872941516 872941535
872973042 872973059
872973047 872973064
872973080 872973097
872973092 872973110
872973765 872973782
872973771 872973788
872974352 872974369
872974408 872974425
872974739 872974756
872974752 872974769
872974801 872974818
872974823 872974840
872974856 872974873
872979635 872979652
873027949 873027969
873027995 873028012
873028001 873028018
873028917 873028934
873029574 873029591
873029665 873029682
873029997 873030014
873031024 873031041
873031160 873031177
873032201 873032218
873032218 873032235
873032282 873032301
873032762 873032781
873032797 873032814
873033095 873033113
873033105 873033122
873033120 873033137
873033146 873033163
873036723 873036740
873037202 873037220
873037324 873037341
873037539 873037556
873037543 873037560
873037939 873037959
873037950 873037967
873038642 873038659
873039105 873039122
873039689 873039706
873039734 873039751
873039807 873039824
873039866 873039883
873039898 873039915
873040133 873040150
873040163 873040180
873040178 873040195
873040367 873040384
873040727 873040744
873041022 873041039
873041042 873041059
873041396 873041414
873041529 873041547
873041826 873041843
873042517 873042534
873043040 873043057
873044645 873044662
873048856 873048873
873052584 873052602
873057965 873057982
873061575 873061594
873062277 873062294
873062282 873062299
873062336 873062353
873069900 873069917
873117723 873117741
873117729 873117747
873117809 873117826
873117829 873117846
873117843 873117860
873200435 873200452
873205096 873205113
873206533 873206550
873211637 873211654
873212037 873212054
873212728 873212745
873222110 873222127
873223061 873223079
873223129 873223147
873225022 873225039
873225465 873225482
873225645 873225662
873225673 873225692
873225729 873225746
873232452 873232469
873232765 873232782
873283295 873283312
873283318 873283336
873283374 873283391
873292693 873292710
873292703 873292721
873292735 873292752
873295940 873295957
873295963 873295980
873295983 873296000
873298092 873298109
873301700 873301717
873301715 873301732
873301766 873301783
873301963 873301980
873304959 873304976
873305020 873305037
873305024 873305041
873305895 873305912
873306284 873306301
873306652 873306670
873306668 873306686
873306674 873306691
873307710 873307727
873310555 873310572
873310594 873310611
873310609 873310626
873310613 873310631
873310632 873310649
873310660 873310679
873321182 873321199
873406709 873406726
873406721 873406738
873446578 873446595
873475239 873475257
873476433 873476450
873478250 873478267
873481184 873481201
873481392 873481409
873482043 873482060
873482158 873482175
873483095 873483112
873486371 873486388
873486851 873486868
873489892 873489909
873490053 873490070
873490340 873490359
873492800 873492818
873493585 873493602
873501677 873501694
873527373 873527390
873547121 873547138
873547159 873547176
873554066 873554083
873554697 873554714
873554701 873554718
873556721 873556738
873575831 873575848
873576131 873576149
873576164 873576181
873576492 873576509
873576606 873576623
873577096 873577113
873578778 873578795
873579873 873579890
873579994 873580011
873581052 873581069
873663635 873663652
873663677 873663694
873663750 873663769
873665903 873665923
873665918 873665936
873665933 873665950
873665953 873665971
873670257 873670274
873737898 873737915
873737963 873737980
873747529 873747546
873810318 873810337
873810348 873810365
873810380 873810398
873816944 873816961
873819441 873819458
873819459 873819479
873819537 873819554
873821416 873821433
873828635 873828655
873831807 873831824
873832250 873832267
873841191 873841208
873908933 873908951
873909015 873909033
873909605 873909622
873986039 873986056
873986043 873986061
874011679 874011696
874018397 874018414
874078142 874078159
874079914 874079931
874079971 874079988
874080956 874080973
874081020 874081038
874082409 874082426
874083205 874083222
874083241 874083258
874087506 874087523
874087532 874087549
874087573 874087590
874095168 874095185
874096281 874096298
874096516 874096533
874097413 874097430
874097453 874097470
874097478 874097496
874097524 874097542
874154813 874154831
874155073 874155090
874155099 874155116
874161379 874161396
874162976 874162993
874163197 874163214
874189112 874189129
874189184 874189201
874243800 874243817
874243824 874243841
874243879 874243897
874243893 874243912
874244499 874244518
874244506 874244523
874244537 874244554
874244549 874244567
874244570 874244587
874253498 874253516
874253526 874253545
874253544 874253561
874253824 874253841
874257062 874257080
874257113 874257132
874257147 874257164
874258746 874258765
874260127 874260144
874260186 874260205
874261265 874261282
874261275 874261293
874261293 874261312
874261954 874261971
874262245 874262262
874268954 874268971
874268979 874268997
874269031 874269050
874269055 874269074
874269093 874269110
874272321 874272338
874275256 874275273
874275327 874275344
874275344 874275361
874333930 874333947
874333940 874333957
874333971 874333991
874333998 874334016
874335596 874335613
874335643 874335661
874335665 874335684
874335686 874335703
874337956 874337973
874337986 874338003
874338033 874338050
874338064 874338081
874339778 874339795
874357313 874357332
874359233 874359250
874359238 874359255
874367616 874367633
874367888 874367905
874412038 874412058
874414469 874414486
874416850 874416867
874416898 874416916
874416916 874416933
874416971 874416989
874438356 874438373
874438601 874438618
874438685 874438702
874442251 874442268
874442641 874442658
874443002 874443019
874503221 874503238
874505701 874505718
874505773 874505790
874505813 874505830
874528404 874528424
874536361 874536378
874674726 874674743
874674775 874674792
874674811 874674829
874676823 874676841
874676871 874676889
874676881 874676898
874676897 874676914
874691430 874691447
874698954 874698971
874699111 874699129
874699117 874699134
874699136 874699154
874699160 874699178
874699290 874699308
874699339 874699356
874699365 874699383
874875706 874875723
874907342 874907359
874907350 874907367
874945196 874945213
874945230 874945248
874945262 874945280
874945277 874945294
874945282 874945300
874945289 874945306
874945318 874945337
874946168 874946185
874958199 874958216
874958235 874958252
874958531 874958549
874958568 874958585
874958849 874958866
875045422 875045439
875099562 875099579
875100283 875100300
875108805 875108822
875108842 875108860
875126734 875126751
875126765 875126782
875129868 875129886
875222133 875222150
875222138 875222155
