815370559 815370578
815378726 815378744
822920414 822920433
824807139 824807237
825428798 825428920
826553571 826554068
826580409 826580427
827945825 827945844
830661015 830661034
830661025 830661045
830661030 830662010
830698798 830698817
830698821 830698841
830698826 830698845
830698848 830698868
830698854 830698876
830698862 830702302
832698912 832698930
833020521 833020540
834518376 834518395
836459677 836459696
837163243 837163270
837163260 837163285
837163277 837163301
837163294 837163316
837163311 837163334
839869618 839869636
840049266 840049285
840488405 840488424
840995753 840995772
841242265 841242296
841792448 841792467
841827855 841827874
842922615 842922634
843251636 843251655
843496258 843496289
843721519 843721538
844035229 844035248
845360331 845360349
845478672 845478691
845665846 845665865
846188969 846188988
846623379 846623399
846689895 846689914
846924970 846924989
846941874 846941893
849147669 849147716
849719488 849719509
850187425 850187444
850780657 850780676
851338622 851338641
851395806 851395825
853272970 853272989
855220539 855220557
856218065 856218084
856233090 856233111
856233099 856233120
856323570 856323589
856323577 856323598
856323584 856323605
856323591 856323612
856323600 856323621
856323607 856323628
856323616 856323635
856323623 856323642
856323631 856323650
856323638 856323657
856323645 856323664
856323654 856323673
856323659 856323680
856323669 856323688
856323676 856323697
856323683 856323704
856323692 856323711
856396269 856396288
856466324 856466343
856703014 856703033
856718562 856718581
856718571 856718590
856718579 856718598
856718586 856718605
856718602 856718621
856718609 856718628
856718616 856718637
856718632 856718651
856718641 856718660
856718646 856718667
856718655 856718674
856748588 856748607
856748595 856748616
856748604 856748623
856748611 856748630
856748634 856748653
856748643 856748662
856748650 856748669
856748655 856748676
857514123 857514143
857514130 857514152
857514146 857514168
857514153 857514175
857514169 857514189
857514192 857514212
857514201 857514221
857514208 857514228
857514214 857514236
857514230 857514251
857514268 857514288
857514277 857514297
857514282 857514304
857514298 857514318
857514314 857514334
857514321 857514343
857514330 857514350
857544363 857544382
857680362 857680381
857680378 857680397
858617698 858617716
858693363 858693382
860342989 860343008
860921067 860921086
861625591 861625610
861886157 861886176
865853739 865853757
865909094 865909113
870261835 870261854
870578143 870578162
870905941 870905960
874867617 874867635
