817081332 817081333
817081345 817084937
828104566 828104567
828190581 828204978
828276692 828291084
828365914 828365915
828365922 828380320
828536209 828536210
828536213 828561406
828709161 828737957
828795280 828809673
830334463 830337515
835664353 835664354
840200634 840200635
840200652 840215034
840546320 840546321
847119785 847134183
852415850 852423044
852633905 852634801
853863407 853892204
854013997 854013998
854014123 854028519
854620830 854649622
854651061 854673811
855161335 855162056
856191539 856223913
856278152 856306494
856367795 856375274
856460480 856466547
856656581 856681829
856684503 856713300
856850389 856864785
856915867 856930264
856942776 856957173
857424356 857453153
864506136 864513334
864514341 864517938
864518218 864521814
865114947 865124670
865358539 865358540
865360314 865363632
865538243 865543819
865685337 865699732
865712783 865712784
865712787 865720234
865720237 865721994
865794894 865795490
865802966 865803565
866846969 866856350
867075005 867082203
867111669 867112251
869946065 869946066
869946073 869952417
871076878 871076879
871076891 871078690
871331714 871333282
871348723 871352321
872917977 872946775
873012260 873041057
