H1:LSC-PRCL_IN1_DQ 16384
H1:LSC-PRCL_OUT_DQ 16384
H1:IMC-F_OUT_DQ 16384
H1:IMC-L_OUT_DQ 16384
H1:HPI-HAM2_SENSCOR_X_FIR_IN1_DQ 512
H1:HPI-HAM2_SENSCOR_Y_FIR_IN1_DQ 512
H1:HPI-HAM2_SENSCOR_Z_FIR_IN1_DQ 512
H1:HPI-HAM2_BLND_L4C_X_IN1_DQ 1024
H1:HPI-HAM2_BLND_L4C_Y_IN1_DQ 1024
H1:HPI-HAM2_BLND_L4C_Z_IN1_DQ 1024
H1:HPI-HAM2_BLND_L4C_RX_IN1_DQ 1024
H1:HPI-HAM2_BLND_L4C_RY_IN1_DQ 1024
H1:HPI-HAM2_BLND_L4C_RZ_IN1_DQ 1024
H1:ISI-HAM2_BLND_GS13X_IN1_DQ 2048
H1:ISI-HAM2_BLND_GS13Y_IN1_DQ 2048
H1:ISI-HAM2_BLND_GS13Z_IN1_DQ 2048
H1:ISI-HAM2_BLND_GS13RX_IN1_DQ 2048 
H1:ISI-HAM2_BLND_GS13RY_IN1_DQ 2048
H1:ISI-HAM2_BLND_GS13RZ_IN1_DQ 2048
H1:HPI-HAM3_BLND_L4C_X_IN1_DQ 1024
H1:HPI-HAM3_BLND_L4C_Y_IN1_DQ 1024
H1:HPI-HAM3_BLND_L4C_Z_IN1_DQ 1024
H1:HPI-HAM3_BLND_L4C_RX_IN1_DQ 1024
H1:HPI-HAM3_BLND_L4C_RY_IN1_DQ 1024
H1:HPI-HAM3_BLND_L4C_RZ_IN1_DQ 1024
H1:ISI-HAM3_BLND_GS13X_IN1_DQ 2048
H1:ISI-HAM3_BLND_GS13Y_IN1_DQ 2048
H1:ISI-HAM3_BLND_GS13Z_IN1_DQ 2048
H1:ISI-HAM3_BLND_GS13RX_IN1_DQ 2048
H1:ISI-HAM3_BLND_GS13RY_IN1_DQ 2048
H1:ISI-HAM3_BLND_GS13RZ_IN1_DQ 2048
H1:SUS-MC1_M1_DAMP_L_IN1_DQ 256
H1:SUS-MC1_M1_DAMP_T_IN1_DQ 256
H1:SUS-MC1_M1_DAMP_V_IN1_DQ 256
H1:SUS-MC1_M1_DAMP_R_IN1_DQ 256
H1:SUS-MC1_M1_DAMP_P_IN1_DQ 256
H1:SUS-MC1_M1_DAMP_Y_IN1_DQ 256
H1:SUS-MC2_M1_DAMP_L_IN1_DQ 256
H1:SUS-MC2_M1_DAMP_T_IN1_DQ 256
H1:SUS-MC2_M1_DAMP_V_IN1_DQ 256
H1:SUS-MC2_M1_DAMP_R_IN1_DQ 256
H1:SUS-MC2_M1_DAMP_P_IN1_DQ 256
H1:SUS-MC2_M1_DAMP_Y_IN1_DQ 256
H1:SUS-MC3_M1_DAMP_L_IN1_DQ 256
H1:SUS-MC3_M1_DAMP_T_IN1_DQ 256
H1:SUS-MC3_M1_DAMP_V_IN1_DQ 256
H1:SUS-MC3_M1_DAMP_R_IN1_DQ 256 
H1:SUS-MC3_M1_DAMP_P_IN1_DQ 256
H1:SUS-MC3_M1_DAMP_Y_IN1_DQ 256
H1:SUS-MC1_M3_WIT_L_DQ 256
H1:SUS-MC1_M3_WIT_P_DQ 256
H1:SUS-MC1_M3_WIT_Y_DQ 256
H1:SUS-MC2_M3_WIT_L_DQ 256
H1:SUS-MC2_M3_WIT_P_DQ 256
H1:SUS-MC2_M3_WIT_Y_DQ 256
H1:SUS-MC3_M3_WIT_L_DQ 256
H1:SUS-MC3_M3_WIT_P_DQ 256
H1:SUS-MC3_M3_WIT_Y_DQ 256
