816363411 816363428
816651500 816651517
816651591 816651608
816664198 816664215
816738406 816738423
816995041 816995058
817007040 817007057
817007480 817007497
817199116 817199133
817206930 817206947
817265311 817265328
817292684 817292701
817306150 817306167
817306233 817306250
817354671 817354688
817355470 817355487
817356594 817356611
817367649 817367666
817423918 817423935
817431720 817431737
817437289 817437307
817439929 817439946
817443624 817443641
817443668 817443685
817444386 817444403
817444708 817444725
817444872 817444889
817444996 817445013
817445101 817445118
817447352 817447369
817451356 817451373
817451773 817451790
817464411 817464428
817515090 817515107
817523476 817523493
817530826 817530843
817542104 817542121
817607449 817607466
817626663 817626680
817628791 817628808
817629055 817629072
817629363 817629380
817629539 817629556
817629558 817629575
817638028 817638045
817638050 817638067
817648025 817648042
817654567 817654584
817694573 817694590
817696207 817696224
817696217 817696234
817696459 817696476
817698464 817698481
817705512 817705529
817714186 817714203
817714238 817714255
817715869 817715886
817723133 817723150
817723172 817723191
817723238 817723255
817724867 817724884
817725323 817725340
817725834 817725851
817726620 817726637
817726669 817726686
817727646 817727663
817727719 817727736
817736877 817736894
817737215 817737232
817737223 817737240
817737251 817737268
817738646 817738663
817742293 817742310
817743160 817743177
817743705 817743722
817745844 817745861
817745985 817746002
817746049 817746066
817746324 817746341
817748014 817748031
817756760 817756777
817756791 817756808
817758927 817758944
817758933 817758950
817766498 817766515
817766982 817766999
817774953 817774970
817775028 817775045
817775382 817775399
817775634 817775651
817775656 817775673
817780203 817780220
817780885 817780903
817781714 817781731
817784093 817784110
817784418 817784435
817784440 817784457
817796386 817796403
817797342 817797359
817799369 817799386
817801815 817801832
817801825 817801842
817802555 817802572
817808646 817808663
817810012 817810029
817869755 817869772
817869857 817869874
817870457 817870474
817870577 817870594
817870600 817870617
817870994 817871011
817871007 817871024
817871013 817871030
817871162 817871179
817871248 817871265
817871570 817871587
817871593 817871610
817871758 817871775
817872195 817872212
817877484 817877501
817878020 817878037
817878709 817878726
817878816 817878833
817882402 817882419
817882671 817882688
817884504 817884521
817884516 817884533
817889886 817889903
817896833 817896850
817897184 817897201
817906084 817906101
817906154 817906171
817906460 817906477
817907439 817907456
818213673 818213690
818222623 818222640
818244343 818244360
818270526 818270543
818369807 818369824
818379603 818379620
818379813 818379830
818379874 818379891
818380653 818380670
818382593 818382610
818383619 818383636
818416756 818416773
818417363 818417380
818417381 818417398
818418102 818418119
818418110 818418127
818418635 818418652
818418814 818418831
818419553 818419570
818560378 818560395
818620457 818620474
818774717 818774734
818898395 818898412
819015167 819015184
819017202 819017219
819020857 819020874
819033957 819033974
819033970 819033987
819069950 819069967
819072706 819072723
819074386 819074403
819111090 819111107
819369190 819369207
819489795 819489812
819627504 819627521
820192423 820192440
820268756 820268773
820272295 820272312
820358585 820358602
820359010 820359027
820543961 820543978
820625813 820625830
820644018 820644035
820678006 820678023
820682514 820682531
820687753 820687770
820690937 820690954
820695691 820695708
820696834 820696851
820747380 820747397
820768630 820768647
820803737 820803754
820912376 820912393
820972056 820972073
821004089 821004106
821018857 821018874
821093580 821093597
821142048 821142065
821151394 821151411
821246762 821246779
821293241 821293258
821304035 821304052
821361852 821361869
821373580 821373597
821388057 821388074
821389639 821389656
821516875 821516892
821917460 821917477
821924406 821924423
821942763 821942780
821949512 821949529
822120086 822120103
822125537 822125554
822134875 822134892
822181273 822181290
822186873 822186890
822195922 822195939
822205034 822205051
822213253 822213270
822216969 822216986
822221963 822221980
822222351 822222368
822223081 822223098
822225867 822225884
822227513 822227530
822238037 822238054
822266193 822266210
822312723 822312740
822371130 822371147
822374854 822374871
822455982 822455999
822470416 822470433
822482200 822482217
822552143 822552160
822559518 822559535
822633914 822633931
822906409 822906426
822911664 822911681
822973876 822973893
822987741 822987758
823005608 823005625
823061072 823061089
823062058 823062075
823064485 823064502
823076393 823076410
823076920 823076937
823079576 823079593
823089106 823089123
823092096 823092113
823152559 823152576
823241144 823241161
823249740 823249757
823290118 823290135
823399800 823399817
823423736 823423753
823503138 823503155
823526079 823526096
823623834 823623851
823748442 823748459
823754276 823754293
823782994 823783011
823827823 823827840
823838107 823838124
823864138 823864155
823927951 823927968
823929448 823929465
823930624 823930641
823949925 823949942
824009706 824009723
824054541 824054558
824147423 824147440
824179170 824179187
824262985 824263002
824280239 824280256
824283068 824283085
824325855 824325872
824332899 824332916
824333044 824333061
824334518 824334535
824346741 824346758
824371454 824371471
824376534 824376551
824376628 824376645
824393109 824393126
824394649 824394666
824395389 824395406
824509410 824509427
824510044 824510061
824517424 824517441
824520135 824520152
824522977 824522994
824525746 824525763
824535399 824535416
824535773 824535790
824539693 824539710
824540580 824540597
824550125 824550142
824558330 824558347
824612865 824612882
824746694 824746711
824747767 824747784
824763036 824763053
824896286 824896303
824934045 824934062
824993865 824993882
825001402 825001419
825033699 825033716
825036097 825036114
825081915 825081932
825111360 825111377
825240436 825240453
825399935 825399952
825532565 825532582
825581781 825581798
825597458 825597475
825647643 825647660
825703097 825703114
825704058 825704075
825767341 825767358
825875571 825875588
825896335 825896352
826068887 826068904
826115920 826115937
826151646 826151663
826211835 826211852
826302590 826302607
826309079 826309096
826331627 826331644
826353587 826353604
826596465 826596482
826690322 826690339
826697262 826697279
826830305 826830322
826961127 826961144
827083006 827083023
827106430 827106447
827134182 827134199
827256603 827256620
827277201 827277218
827281086 827281103
827281174 827281191
827290682 827290699
827300143 827300160
827321554 827321571
827323024 827323041
827328964 827328981
827337086 827337103
827403277 827403294
827469389 827469406
827469686 827469703
827582997 827583014
827773143 827773160
827946227 827946244
827953576 827953593
827961134 827961151
827967738 827967755
827972063 827972080
828039050 828039067
828042049 828042066
828049140 828049157
828052126 828052143
828095343 828095360
828341879 828341896
828434455 828434472
828960463 828960480
828962695 828962712
829036414 829036431
829037316 829037333
829055989 829056006
829056103 829056120
829057276 829057293
829141582 829141599
829205585 829205602
829221765 829221782
829283563 829283580
829283647 829283664
829283746 829283763
829288694 829288711
829316768 829316785
829389063 829389080
829415830 829415847
829416187 829416204
829416354 829416371
829417052 829417069
829418085 829418102
829419044 829419061
829433250 829433267
829439720 829439737
829442099 829442116
829444262 829444279
829475697 829475714
829500434 829500451
829501534 829501551
829501669 829501686
829502621 829502638
829502750 829502767
829553020 829553037
829553043 829553060
829645272 829645289
829695856 829695873
829703592 829703609
829714638 829714655
829763326 829763343
829771904 829771921
829772173 829772190
829777445 829777462
829780997 829781014
829782148 829782165
829782963 829782980
829785909 829785926
829785930 829785948
829787358 829787375
829791505 829791522
829807525 829807542
829875621 829875638
829884507 829884524
829925363 829925380
829963852 829963869
829992801 829992818
830038825 830038842
830040016 830040033
830044739 830044756
830052419 830052436
830053955 830053972
830071796 830071813
830080676 830080693
830127470 830127487
830138999 830139016
830157243 830157260
830221028 830221045
830222859 830222876
830223183 830223200
830226334 830226351
830240578 830240595
830484157 830484174
830484471 830484488
831187181 831187198
