817736342 817736344
817824113 817824115
817911867 817911869
818073843 818073844
818159113 818159114
818426005 818426007
818507471 818507472
818511506 818511508
818515502 818515504
818684261 818684262
819002197 819002199
819036727 819036728
819160195 819160197
819211051 819211053
819257185 819257187
819384811 819384813
819386152 819386153
819673745 819673746
820394438 820394440
820595204 820595205
821270677 821270679
821459495 821459496
823009423 823009425
823355072 823355074
825082555 825082557
825170441 825170443
826119809 826119811
827089512 827089514
827506075 827506077
827592238 827592240
828112266 828112267
828319858 828319859
828324708 828324710
828405522 828405523
828888936 828888938
830129194 830129196
830533000 830533001
832034865 832034866
832035864 832035866
832037114 832037115
832037645 832037647
832115575 832115576
832116401 832116403
832116653 832116655
832117069 832117071
832161381 832161383
832460269 832460271
832882826 832882827
832884946 832884948
832885930 832885932
832886354 832886356
832886566 832886567
832887253 832887255
832888154 832888156
832888218 832888219
832889590 832889591
833582205 833582207
833992276 833992277
834009842 834009843
834191525 834191527
834197292 834197294
834199251 834199253
834230648 834230649
834243808 834243810
834439593 834439594
834786770 834786772
835029478 835029480
835045267 835045269
835481497 835481498
835823795 835823796
835920200 835920202
835968995 835968996
836033503 836033504
836035655 836035657
836116362 836116364
836116787 836116788
836117252 836117254
836118285 836118286
836120174 836120176
836169641 836169643
836213613 836213615
836215619 836215620
836880503 836880505
836968247 836968249
837182824 837182826
837242345 837242347
837401054 837401056
837442517 837442519
837626834 837626835
837792988 837792989
838052101 838052102
838966565 838966567
839008016 839008018
839045264 839045266
839046371 839046372
839047101 839047103
839050426 839050427
839106960 839106962
839189065 839189066
839626469 839626470
839714944 839714946
839768816 839768818
839920089 839920090
840407193 840407195
840824171 840824172
841093963 841093965
841491261 841491262
841580203 841580205
841681492 841681493
841762913 841762915
842911053 842911055
844605291 844605292
846403513 846403515
846683961 846683963
847116537 847116538
847807496 847807498
848241496 848241498
848668121 848668122
849251521 849251523
849361802 849361804
849368135 849368136
849536097 849536098
849705475 849705476
850195576 850195577
850420715 850420716
851782397 851782398
852304339 852304341
852907094 852907095
853589810 853589811
853767480 853767481
854115809 854115811
854811668 854811669
854913456 854913458
855233689 855233691
855241053 855241055
855608425 855608427
856130955 856130957
856269807 856269809
856618095 856618097
856791990 856791991
857309962 857309964
857395954 857395955
857486444 857486446
857996653 857996655
858514641 858514643
858898252 858898254
859126200 859126202
859200862 859200864
859291993 859291995
859422409 859422411
859422621 859422623
859898001 859898003
859930082 859930084
859930525 859930527
860252021 860252023
861279977 861279979
861713029 861713030
861972053 861972055
862060118 862060119
862168781 862168782
862350527 862350529
862355180 862355182
862571338 862571340
862620873 862620875
863586084 863586085
864608387 864608389
865044562 865044563
865044716 865044718
865045190 865045192
865045793 865045794
865046302 865046304
865047987 865047989
865048087 865048089
865055474 865055476
865056516 865056518
865057466 865057468
865361366 865361367
865370615 865370616
867079634 867079636
867678332 867678334
867855082 867855084
867946269 867946271
868366802 868366804
868383727 868383728
868386137 868386138
868386266 868386267
868386858 868386860
868387804 868387806
868388141 868388143
868388483 868388485
868388748 868388751
868389062 868389064
868389865 868389868
868390380 868390381
868392892 868392893
868549943 868549944
868643711 868643712
868751229 868751230
868793878 868793880
868874234 868874236
869073924 869073926
869177044 869177046
869344883 869344885
869522667 869522668
869605514 869605515
870119657 870119658
870300143 870300145
870455146 870455147
871110356 871110357
871243107 871243108
871330641 871330643
871349424 871349425
871931442 871931444
872281668 872281669
872462055 872462057
872535440 872535441
872568518 872568519
872568823 872568825
872569204 872569206
872569933 872569934
872600852 872600854
872612746 872612748
872804715 872804717
873217542 873217544
