831360070 831360087
832015088 832015105
832679675 832679692
833056326 833056343
833749751 833749768
833896605 833896622
833973647 833973664
834356410 834356427
835641132 835641149
835718691 835718708
836765893 836765910
836836513 836836530
836841672 836841689
836841974 836841991
836843831 836843848
836871483 836871500
836967202 836967219
837449518 837449535
837451444 837451461
837539718 837539737
837539955 837539972
837550507 837550524
837791295 837791312
838365343 838365360
838654577 838654594
838657240 838657257
838754181 838754198
839106114 839106131
839608870 839608887
839609304 839609321
839772868 839772885
841540248 841540265
842318800 842318817
842372393 842372410
842811035 842811052
842897638 842897655
843315581 843315598
843451876 843451893
843452092 843452109
843586227 843586244
843597694 843597711
843862177 843862194
844122495 844122512
844180398 844180415
844446484 844446501
844468743 844468760
844471682 844471699
845318092 845318109
845567590 845567607
845671881 845671898
846081046 846081063
846313258 846313275
846517607 846517624
846545036 846545053
846582071 846582088
847109256 847109273
847119839 847119856
847123459 847123476
847124827 847124844
847291389 847291406
