L1:ISI-HAM6_BLND_GS13RX_IN1_DQ 2048
L1:ISI-HAM6_BLND_GS13RY_IN1_DQ 2048
L1:ISI-HAM6_BLND_GS13RZ_IN1_DQ 2048
L1:ISI-HAM6_BLND_GS13X_IN1_DQ 2048
L1:ISI-HAM6_BLND_GS13Y_IN1_DQ 2048
L1:ISI-HAM6_BLND_GS13Z_IN1_DQ 2048
L1:ISI-HAM2_BLND_GS13RX_IN1_DQ 2048
L1:ISI-HAM2_BLND_GS13RY_IN1_DQ 2048
L1:ISI-HAM2_BLND_GS13RZ_IN1_DQ 2048
L1:ISI-HAM2_BLND_GS13X_IN1_DQ 2048
L1:ISI-HAM2_BLND_GS13Y_IN1_DQ 2048
L1:ISI-HAM2_BLND_GS13Z_IN1_DQ 2048
L1:ISI-HAM3_BLND_GS13RX_IN1_DQ 2048
L1:ISI-HAM3_BLND_GS13RY_IN1_DQ 2048
L1:ISI-HAM3_BLND_GS13RZ_IN1_DQ 2048
L1:ISI-HAM3_BLND_GS13X_IN1_DQ 2048
L1:ISI-HAM3_BLND_GS13Y_IN1_DQ 2048
L1:ISI-HAM3_BLND_GS13Z_IN1_DQ 2048
L1:ISI-HAM4_BLND_GS13RX_IN1_DQ 2048
L1:ISI-HAM4_BLND_GS13RY_IN1_DQ 2048
L1:ISI-HAM4_BLND_GS13RZ_IN1_DQ 2048
L1:ISI-HAM4_BLND_GS13X_IN1_DQ 2048
L1:ISI-HAM4_BLND_GS13Y_IN1_DQ 2048
L1:ISI-HAM4_BLND_GS13Z_IN1_DQ 2048
L1:ISI-HAM5_BLND_GS13RX_IN1_DQ 2048
L1:ISI-HAM5_BLND_GS13RY_IN1_DQ 2048
L1:ISI-HAM5_BLND_GS13RZ_IN1_DQ 2048
L1:ISI-HAM5_BLND_GS13X_IN1_DQ 2048
L1:ISI-HAM5_BLND_GS13Y_IN1_DQ 2048
L1:ISI-HAM5_BLND_GS13Z_IN1_DQ 2048
L1:ISI-BS_ST2_BLND_RX_GS13_CUR_IN1_DQ 2048
L1:ISI-BS_ST2_BLND_RY_GS13_CUR_IN1_DQ 2048
L1:ISI-BS_ST2_BLND_RZ_GS13_CUR_IN1_DQ 2048
L1:ISI-BS_ST2_BLND_X_GS13_CUR_IN1_DQ 2048
L1:ISI-BS_ST2_BLND_Y_GS13_CUR_IN1_DQ 2048
L1:ISI-BS_ST2_BLND_Z_GS13_CUR_IN1_DQ 2048
L1:ISI-ITMX_ST2_BLND_RX_GS13_CUR_IN1_DQ 2048
L1:ISI-ITMX_ST2_BLND_RY_GS13_CUR_IN1_DQ 2048
L1:ISI-ITMX_ST2_BLND_RZ_GS13_CUR_IN1_DQ 2048
L1:ISI-ITMX_ST2_BLND_X_GS13_CUR_IN1_DQ 2048
L1:ISI-ITMX_ST2_BLND_Y_GS13_CUR_IN1_DQ 2048
L1:ISI-ITMX_ST2_BLND_Z_GS13_CUR_IN1_DQ 2048
L1:ISI-ITMY_ST2_BLND_RX_GS13_CUR_IN1_DQ 2048
L1:ISI-ITMY_ST2_BLND_RY_GS13_CUR_IN1_DQ 2048
L1:ISI-ITMY_ST2_BLND_RZ_GS13_CUR_IN1_DQ 2048
L1:ISI-ITMY_ST2_BLND_X_GS13_CUR_IN1_DQ 2048
L1:ISI-ITMY_ST2_BLND_Y_GS13_CUR_IN1_DQ 2048
L1:ISI-ITMY_ST2_BLND_Z_GS13_CUR_IN1_DQ 2048
L1:ISI-ETMX_ST2_BLND_RX_GS13_CUR_IN1_DQ 2048
L1:ISI-ETMX_ST2_BLND_RY_GS13_CUR_IN1_DQ 2048
L1:ISI-ETMX_ST2_BLND_RZ_GS13_CUR_IN1_DQ 2048
L1:ISI-ETMX_ST2_BLND_X_GS13_CUR_IN1_DQ 2048
L1:ISI-ETMX_ST2_BLND_Y_GS13_CUR_IN1_DQ 2048
L1:ISI-ETMX_ST2_BLND_Z_GS13_CUR_IN1_DQ 2048
L1:ISI-ETMY_ST2_BLND_RX_GS13_CUR_IN1_DQ 2048
L1:ISI-ETMY_ST2_BLND_RY_GS13_CUR_IN1_DQ 2048
L1:ISI-ETMY_ST2_BLND_RZ_GS13_CUR_IN1_DQ 2048
L1:ISI-ETMY_ST2_BLND_X_GS13_CUR_IN1_DQ 2048
L1:ISI-ETMY_ST2_BLND_Y_GS13_CUR_IN1_DQ 2048
L1:ISI-ETMY_ST2_BLND_Z_GS13_CUR_IN1_DQ 2048
