862130481 862130482
862139824 862139825
862158453 862158454
862177047 862177049
862179451 862179453
862258344 862258346
862262555 862262556
862350558 862350559
862356143 862356144
862381092 862381093
862384746 862384747
862444498 862444499
862462646 862462648
862521815 862521816
862524774 862524776
862533398 862533400
862599906 862599907
862668096 862668098
862695176 862695178
862697392 862697394
862698698 862698699
862701308 862701310
862701612 862701613
862704874 862704875
862713435 862713436
862768808 862768809
862770032 862770033
862773102 862773104
862870019 862870021
862870602 862870604
862880089 862880090
862897022 862897024
862934378 862934380
862944122 862944124
862947250 862947252
862948744 862948745
862954148 862954149
862957993 862957995
863027540 863027541
863051979 863051981
863053000 863053002
863053275 863053278
863185138 863185139
863197909 863197911
863202529 863202531
863216963 863216965
863301807 863301809
863311366 863311368
863316563 863316564
863344411 863344413
863367904 863367906
863377907 863377908
863398038 863398040
863457776 863457777
863476568 863476569
863528912 863528914
863532182 863532184
863534881 863534882
863539889 863539890
863547547 863547549
863636508 863636510
863637351 863637352
863669775 863669777
863683959 863683960
863743559 863743560
863760367 863760368
863770803 863770804
863831481 863831482
863931136 863931137
863982954 863982955
863984377 863984378
864058997 864058999
864062667 864062669
864149886 864149888
864151204 864151206
864158806 864158807
864253445 864253446
864314470 864314471
864325517 864325518
864328185 864328186
864339266 864339267
864340127 864340128
864340466 864340467
864341375 864341376
864341874 864341875
864353231 864353233
864418222 864418224
864434097 864434099
864464152 864464153
864507622 864507624
864577330 864577331
864592284 864592285
864594250 864594252
864606934 864606935
864608706 864608708
864612162 864612163
864671221 864671222
864673456 864673458
864746563 864746565
864751180 864751181
864777348 864777349
864778547 864778549
864859061 864859063
864921844 864921846
864963831 864963832
865015551 865015552
865019924 865019925
865029068 865029069
865030610 865030612
865034994 865034995
865057163 865057165
865079311 865079312
865130286 865130288
865172572 865172574
865184984 865184986
865185448 865185450
865190332 865190333
865198642 865198644
865201425 865201426
865202108 865202110
865345196 865345199
865361885 865361886
865465071 865465072
865474650 865474652
865490998 865491001
865542478 865542480
865557035 865557036
865645724 865645725
865668380 865668382
865684221 865684222
865695504 865695505
865743331 865743333
865785155 865785156
865793143 865793144
865793208 865793212
865795326 865795327
865798655 865798657
865807161 865807163
865808674 865808676
865824199 865824200
865827610 865827611
865829036 865829037
865864247 865864248
865876536 865876538
865885248 865885250
865887816 865887817
865893522 865893523
865949835 865949837
865957875 865957877
866032224 866032225
866134919 866134921
866160823 866160825
866164917 866164919
866166135 866166137
866166509 866166510
866168707 866168709
866169994 866169996
866172795 866172797
866190186 866190188
866193131 866193133
866223872 866223874
866231955 866231957
866240128 866240129
866257174 866257176
866325523 866325524
866333497 866333498
866382203 866382204
866386592 866386593
866389699 866389700
866413923 866413926
866447399 866447401
866468992 866468993
866475453 866475454
866497431 866497433
866583669 866583671
866605037 866605038
866605187 866605811
866726651 866726653
866736423 866736425
866774070 866774071
866958188 866958190
867035156 867035157
867036681 867036683
867056207 867056208
867120614 867120615
867121309 867121311
867170846 867170847
867191170 867191172
867298982 867298983
867353147 867353148
867364311 867364313
867440836 867440837
867450224 867450226
867511055 867511057
867627047 867627048
867689605 867689607
867766563 867766565
867771707 867771709
867775239 867775241
867782792 867782795
867795637 867795638
867836866 867836867
868028135 868028136
868054800 868054802
868059611 868059612
868114697 868114698
868162679 868162680
868216396 868216398
868223100 868223102
868223700 868223702
868232624 868232626
868247690 868247692
868253687 868253688
868262645 868262647
868388534 868388535
868389191 868389192
868399209 868399210
868472302 868472304
868527655 868527656
868540494 868540496
868584301 868584302
868603781 868603783
868631330 868631331
868651857 868651858
868654759 868654761
868662760 868662762
868701178 868701180
868745036 868745037
868748345 868748347
868753271 868753273
868864980 868864981
868903670 868903671
868916426 868916428
868919375 868919376
869005207 869005208
869051382 869051383
869060244 869060246
869068029 869068030
869234026 869234028
869413836 869413838
869442650 869442651
869466234 869466236
869473214 869473216
869505249 869505251
869513668 869513670
869524306 869524308
869535609 869535611
869544038 869544040
869604906 869604908
869616312 869616314
869617377 869617378
869720585 869720586
869773260 869773261
869831494 869831496
870007512 870007514
870011549 870011550
870024127 870024128
870030785 870030786
870031314 870031315
870031409 870031410
870031574 870031576
870038700 870038702
870046092 870046093
870052047 870052049
870059882 870059883
870103428 870103429
870110613 870110614
870132728 870132729
870177900 870177901
870214718 870214719
870273275 870273276
870274343 870274345
870290019 870290020
870342132 870342134
870403873 870403874
870467420 870467422
870521525 870521527
870560014 870560016
870568242 870568243
870578163 870578164
870629025 870629026
870657402 870657404
870743032 870743033
870758591 870758592
870815200 870815201
870873064 870873065
870900509 870900511
870905951 870905952
870939917 870939919
870960081 870960082
870991923 870991924
871016645 871016646
871032523 871032524
871057169 871057170
871061228 871061230
871070463 871070464
871075843 871075845
871105598 871105599
871165895 871165897
871228551 871228552
871243438 871243440
871272694 871272696
871277332 871277334
871289597 871289599
871291520 871291521
871300049 871300051
871300442 871300443
871307935 871307936
871329515 871329516
871351444 871351446
871392601 871392603
871393987 871393989
871409405 871409406
871414326 871414328
871441455 871441457
871597099 871597101
871619303 871619304
871672023 871672024
871679619 871679620
871681972 871681974
871685683 871685685
871765350 871765352
871818821 871818823
871851523 871851524
871920988 871920990
872014954 872014955
872019968 872019970
872049096 872049098
872104001 872104003
872129881 872129882
872167790 872167792
872171048 872171050
872201842 872201844
872242604 872242605
872263028 872263030
872348461 872348463
872367581 872367582
872373274 872373275
872515649 872515650
872530462 872530464
872545307 872545309
872564699 872564700
872635370 872635371
872643802 872643804
872645368 872645370
872645694 872645696
872706971 872706973
872709124 872709126
872731159 872731160
872731826 872731828
872871903 872871905
872885772 872885774
872953141 872953142
872979807 872979808
873039706 873039708
873055937 873055938
873060203 873060205
873081668 873081670
873103495 873103496
873119803 873119805
873137079 873137080
873141122 873141124
873145508 873145509
873147576 873147578
873154650 873154651
873179450 873179451
873222863 873222864
873227462 873227464
873235506 873235508
873236136 873236138
873236317 873236319
873424756 873424758
873482083 873482086
873583458 873583459
873586081 873586082
873591203 873591204
873631800 873631802
873645313 873645314
873648749 873648750
873665978 873665980
873670119 873670120
873677305 873677306
873690899 873690901
873745623 873745625
873749335 873749337
873759400 873759401
873959137 873959139
873994944 873994945
874098316 874098318
874132567 874132569
874162756 874162758
874181606 874181608
874227036 874227038
874272889 874272890
874275438 874275440
874313464 874313466
874316938 874316940
874342400 874342402
874347701 874347703
874349484 874349486
874352760 874352761
874354144 874354145
874360687 874360688
874436901 874436903
874514095 874514097
874622925 874622927
874650124 874650126
874695985 874695986
874706781 874706783
874787743 874787744
874802187 874802189
874817619 874817621
874846235 874846236
874848009 874848011
874878344 874878345
874885171 874885173
874935190 874935192
874979375 874979376
874984892 874984893
875022653 875022655
875041724 875041726
875056064 875056066
875103206 875103207
875104060 875104062
875154095 875154096
875167232 875167234
875182180 875182182
875184833 875184836
