815388541 815388544
815639411 815639414
815640372 815640375
815640834 815640837
815693400 815693403
815904684 815904687
816390881 816390884
816578879 816578882
816622884 816622887
816971086 816971089
816986177 816986180
817144764 817144767
817163709 817163712
817229695 817229698
817231775 817231778
817231834 817231837
817231962 817231965
817692161 817692164
817876587 817876590
817949884 817949887
817968967 817968970
818111474 818111477
818284380 818284383
818284487 818284490
818284560 818284563
818284723 818284726
818285840 818285843
818285902 818285906
818286009 818286012
818286084 818286087
818286190 818286193
818286256 818286259
818286350 818286353
818286409 818286412
818286690 818286693
818286754 818286757
818286930 818286933
818287066 818287069
818287152 818287155
818287235 818287238
818287341 818287344
818287389 818287392
818288030 818288034
818288170 818288173
818288199 818288202
818288697 818288700
818288750 818288754
818289005 818289008
818289072 818289075
818289567 818289570
818289844 818289847
818289894 818289897
818289974 818289977
818290052 818290055
818290361 818290364
818290409 818290412
818290528 818290531
818290591 818290594
818290863 818290866
818290916 818290919
818291093 818291096
818291269 818291272
818291367 818291370
818291422 818291425
818291583 818291586
818291727 818291730
818292323 818292326
818292355 818292358
818293023 818293026
818293150 818293154
818293192 818293195
818294012 818294015
818294079 818294082
818294176 818294179
818294245 818294248
818294409 818294412
818294659 818294662
818294714 818294717
818295412 818295415
818295664 818295667
818295716 818295719
818295886 818295889
818349014 818349017
818365658 818365661
818367690 818367693
818384806 818384809
818386771 818386774
818387019 818387022
818413535 818413538
818414127 818414130
818415852 818415855
818415914 818415917
818416329 818416332
818418310 818418313
818419844 818419847
818449952 818449955
818449989 818449992
818450271 818450274
818450344 818450347
818450431 818450434
818450511 818450514
818464128 818464131
818464159 818464162
818464270 818464273
818464350 818464353
818464420 818464423
818464508 818464511
818517461 818517464
818860072 818860075
819344811 819344814
819346429 819346432
819347593 819347596
819347696 819347699
819352639 819352642
819626532 819626535
819677451 819677454
819679868 819679871
819780330 819780333
819802626 819802629
819859133 819859136
820175560 820175563
820181270 820181273
820190891 820190894
820207929 820207933
820218536 820218539
820333569 820333572
820394437 820394440
820476462 820476465
820476519 820476522
820476965 820476968
820477030 820477033
820477542 820477545
820477665 820477668
820672060 820672063
821036239 821036242
821347229 821347232
821474406 821474409
821498026 821498029
821514611 821514614
821568212 821568215
821796984 821796987
822280895 822280898
822299448 822299451
822299629 822299632
822597070 822597073
822742349 822742352
823080437 823080440
823701877 823701881
823701966 823701969
823702040 823702043
823702141 823702144
823702313 823702316
823702410 823702413
823702699 823702702
823702734 823702737
823702893 823702896
823702933 823702937
823703057 823703060
823703103 823703106
823703218 823703221
823703261 823703264
823703353 823703356
823703493 823703496
823703856 823703859
823703943 823703946
823704018 823704021
823704107 823704110
823704378 823704381
823704437 823704441
823704608 823704611
823704774 823704777
823704928 823704931
823705085 823705088
823705187 823705190
823705268 823705271
823705405 823705408
823705472 823705475
823705574 823705577
823705631 823705634
823708057 823708060
823708100 823708103
824374771 824374774
824381494 824381497
824381589 824381592
824387859 824387862
824465590 824465593
830855342 830855345
834196794 834196797
835654977 835654980
835965744 835965747
840862074 840862078
850191064 850191067
851233479 851233482
851233925 851233928
851234793 851234796
851234897 851234900
851235492 851235495
851235512 851235515
851235684 851235687
851235802 851235805
851235819 851235823
851235978 851235981
851236088 851236091
851236152 851236155
851236588 851236591
851236669 851236672
851236686 851236689
851236862 851236865
862356136 862356139
864125983 864125986
864973352 864973355
866859137 866859140
867645833 867645836
867728146 867728149
867728475 867728478
867728560 867728563
867741896 867741899
867743112 867743115
867744429 867744432
868386112 868386115
868386136 868386139
868411927 868411930
869258977 869258980
869259025 869259028
874199626 874199629
874199835 874199838
874203210 874203213
874203275 874203278
874204362 874204365
874610463 874610466
874613662 874613665
874615726 874615729
