H1:ALS-X_ARM_IN1_DQ    16384
H1:ALS-X_REFL_CTRL_OUT_DQ    16384
H1:ALS-X_FIBR_CTRL_OUT_DQ    16384
H1:ALS-X_FIBR_A_LF_OUT_DQ    2048
H1:ALS-X_FIBR_REJECTED_LF_OUT_DQ    2048
H1:ALS-X_FIBR_TRANS_LF_OUT_DQ    2048
H1:ALS-X_LASER_GR_LF_OUT_DQ    2048
H1:ALS-X_LASER_IR_LF_OUT_DQ    2048
H1:ALS-X_REFL_B_LF_OUT_DQ    2048
H1:ALS-X_SPARE_B_LF_OUT_DQ    2048
H1:ASC-X_TR_A_NSUM_OUT_DQ    2048
H1:LSC-CARM_IN1_DQ    16384
H1:LSC-YARM_IN1_DQ    2048
H1:LSC-REFL_SERVO_ERR_OUT_DQ    16384
H1:ISI-HAM3_BLND_GS13RX_IN1_DQ    2048
H1:ISI-HAM3_BLND_GS13RY_IN1_DQ    2048
H1:ISI-HAM3_BLND_GS13RZ_IN1_DQ    2048
H1:ISI-HAM3_BLND_GS13X_IN1_DQ    2048
H1:ISI-HAM3_BLND_GS13Y_IN1_DQ    2048
H1:ISI-HAM3_BLND_GS13Z_IN1_DQ    2048
H1:ISI-HAM3_MASTER_H1_DRIVE_DQ    2048
H1:ISI-HAM3_MASTER_H2_DRIVE_DQ    2048
H1:ISI-HAM3_MASTER_H3_DRIVE_DQ    2048
H1:ISI-HAM3_MASTER_V1_DRIVE_DQ    2048
H1:ISI-HAM3_MASTER_V2_DRIVE_DQ    2048
H1:ISI-HAM3_MASTER_V3_DRIVE_DQ    2048
H1:ISI-ITMX_ST1_BLND_RX_L4C_CUR_IN1_DQ    2048
H1:ISI-ITMX_ST1_BLND_RY_L4C_CUR_IN1_DQ    2048
H1:ISI-ITMX_ST1_BLND_RZ_L4C_CUR_IN1_DQ    2048
H1:ISI-ITMX_ST1_BLND_X_L4C_CUR_IN1_DQ    2048
H1:ISI-ITMX_ST1_BLND_Y_L4C_CUR_IN1_DQ    2048
H1:ISI-ITMX_ST1_BLND_Z_L4C_CUR_IN1_DQ    2048
H1:ISI-ITMX_ST2_BLND_RX_GS13_CUR_IN1_DQ    2048
H1:ISI-ITMX_ST2_BLND_RY_GS13_CUR_IN1_DQ    2048
H1:ISI-ITMX_ST2_BLND_RZ_GS13_CUR_IN1_DQ    2048
H1:ISI-ITMX_ST2_BLND_X_GS13_CUR_IN1_DQ    2048
H1:ISI-ITMX_ST2_BLND_Y_GS13_CUR_IN1_DQ    2048
H1:ISI-ITMX_ST2_BLND_Z_GS13_CUR_IN1_DQ    2048
H1:ISI-ITMX_ST1_MASTER_H1_DRIVE_DQ    512
H1:ISI-ITMX_ST1_MASTER_H2_DRIVE_DQ    512
H1:ISI-ITMX_ST1_MASTER_H3_DRIVE_DQ    512
H1:ISI-ITMX_ST1_MASTER_V1_DRIVE_DQ    512
H1:ISI-ITMX_ST1_MASTER_V2_DRIVE_DQ    512
H1:ISI-ITMX_ST1_MASTER_V3_DRIVE_DQ    512
H1:ISI-ITMX_ST2_MASTER_H1_DRIVE_DQ    512
H1:ISI-ITMX_ST2_MASTER_H2_DRIVE_DQ    512
H1:ISI-ITMX_ST2_MASTER_H3_DRIVE_DQ    512
H1:ISI-ITMX_ST2_MASTER_V1_DRIVE_DQ    512
H1:ISI-ITMX_ST2_MASTER_V2_DRIVE_DQ    512
H1:ISI-ITMX_ST2_MASTER_V3_DRIVE_DQ    512
H1:ISI-ETMX_ST1_BLND_RX_L4C_CUR_IN1_DQ    2048
H1:ISI-ETMX_ST1_BLND_RY_L4C_CUR_IN1_DQ    2048
H1:ISI-ETMX_ST1_BLND_RZ_L4C_CUR_IN1_DQ    2048
H1:ISI-ETMX_ST1_BLND_X_L4C_CUR_IN1_DQ    2048
H1:ISI-ETMX_ST1_BLND_Y_L4C_CUR_IN1_DQ    2048
H1:ISI-ETMX_ST1_BLND_Z_L4C_CUR_IN1_DQ    2048
H1:ISI-ETMX_ST2_BLND_RX_GS13_CUR_IN1_DQ    2048
H1:ISI-ETMX_ST2_BLND_RY_GS13_CUR_IN1_DQ    2048
H1:ISI-ETMX_ST2_BLND_RZ_GS13_CUR_IN1_DQ    2048
H1:ISI-ETMX_ST2_BLND_X_GS13_CUR_IN1_DQ    2048
H1:ISI-ETMX_ST2_BLND_Y_GS13_CUR_IN1_DQ    2048
H1:ISI-ETMX_ST2_BLND_Z_GS13_CUR_IN1_DQ    2048
H1:ISI-ETMX_ST1_MASTER_H1_DRIVE_DQ    512
H1:ISI-ETMX_ST1_MASTER_H2_DRIVE_DQ    512
H1:ISI-ETMX_ST1_MASTER_H3_DRIVE_DQ    512
H1:ISI-ETMX_ST1_MASTER_V1_DRIVE_DQ    512
H1:ISI-ETMX_ST1_MASTER_V2_DRIVE_DQ    512
H1:ISI-ETMX_ST1_MASTER_V3_DRIVE_DQ    512
H1:ISI-ETMX_ST2_MASTER_H1_DRIVE_DQ    512
H1:ISI-ETMX_ST2_MASTER_H2_DRIVE_DQ    512
H1:ISI-ETMX_ST2_MASTER_H3_DRIVE_DQ    512
H1:ISI-ETMX_ST2_MASTER_V1_DRIVE_DQ    512
H1:ISI-ETMX_ST2_MASTER_V2_DRIVE_DQ    512
H1:ISI-ETMX_ST2_MASTER_V3_DRIVE_DQ    512
H1:SUS-MC2_M3_LOCK_L_IN1_DQ    2048
H1:SUS-MC2_M2_MASTER_OUT_LL_DQ    1024
H1:SUS-MC2_M2_MASTER_OUT_LR_DQ    1024
H1:SUS-MC2_M2_MASTER_OUT_UL_DQ    1024
H1:SUS-MC2_M2_MASTER_OUT_UR_DQ    1024
H1:SUS-MC2_M2_OSEMINF_LL_IN1_DQ    256
H1:SUS-MC2_M2_OSEMINF_LR_IN1_DQ    256
H1:SUS-MC2_M2_OSEMINF_UL_IN1_DQ    256
H1:SUS-MC2_M2_OSEMINF_UR_IN1_DQ    256
H1:SUS-MC2_M3_MASTER_OUT_LL_DQ    2048
H1:SUS-MC2_M3_MASTER_OUT_LR_DQ    2048
H1:SUS-MC2_M3_MASTER_OUT_UL_DQ    2048
H1:SUS-MC2_M3_MASTER_OUT_UR_DQ    2048
H1:SUS-MC2_M3_OSEMINF_LL_IN1_DQ    256
H1:SUS-MC2_M3_OSEMINF_LR_IN1_DQ    256
H1:SUS-MC2_M3_OSEMINF_UL_IN1_DQ    256
H1:SUS-MC2_M3_OSEMINF_UR_IN1_DQ    256
H1:SUS-ITMX_L1_OSEMINF_UL_IN1_DQ    256
H1:SUS-ITMX_L1_OSEMINF_LL_IN1_DQ    256
H1:SUS-ITMX_L1_OSEMINF_UR_IN1_DQ    256
H1:SUS-ITMX_L1_OSEMINF_LR_IN1_DQ    256
H1:SUS-ITMX_L1_MASTER_OUT_UL_DQ    1024
H1:SUS-ITMX_L1_MASTER_OUT_LL_DQ    1024
H1:SUS-ITMX_L1_MASTER_OUT_UR_DQ    1024
H1:SUS-ITMX_L1_MASTER_OUT_LR_DQ    1024
H1:SUS-ITMX_L2_OSEMINF_UL_IN1_DQ    256
H1:SUS-ITMX_L2_OSEMINF_LL_IN1_DQ    256
H1:SUS-ITMX_L2_OSEMINF_UR_IN1_DQ    256
H1:SUS-ITMX_L2_OSEMINF_LR_IN1_DQ    256
H1:SUS-ITMX_L2_MASTER_OUT_UL_DQ    2048
H1:SUS-ITMX_L2_MASTER_OUT_LL_DQ    2048
H1:SUS-ITMX_L2_MASTER_OUT_UR_DQ    2048
H1:SUS-ITMX_L2_MASTER_OUT_LR_DQ    2048
H1:SUS-ITMX_L3_OPLEV_PIT_OUT_DQ    256
H1:SUS-ITMX_L3_OPLEV_YAW_OUT_DQ    256
H1:SUS-ITMX_L3_OPLEV_SUM_OUT_DQ    256
H1:SUS-ITMX_L3_MASTER_OUT_UL_DQ    2048
H1:SUS-ITMX_L3_MASTER_OUT_LL_DQ    2048
H1:SUS-ITMX_L3_MASTER_OUT_UR_DQ    2048
H1:SUS-ITMX_L3_MASTER_OUT_LR_DQ    2048
H1:SUS-ITMX_L3_MASTER_OUT_DC_DQ    256
H1:SUS-ETMX_M0_NOISEMON_F1_DQ    1024
H1:SUS-ETMX_M0_NOISEMON_F2_DQ    1024
H1:SUS-ETMX_M0_NOISEMON_F3_DQ    1024
H1:SUS-ETMX_M0_NOISEMON_LF_DQ    1024
H1:SUS-ETMX_M0_NOISEMON_RT_DQ    1024
H1:SUS-ETMX_M0_NOISEMON_SD_DQ    1024
H1:SUS-ETMX_L1_NOISEMON_LL_DQ    1024
H1:SUS-ETMX_L1_NOISEMON_LR_DQ    1024
H1:SUS-ETMX_L1_NOISEMON_UL_DQ    1024
H1:SUS-ETMX_L1_NOISEMON_UR_DQ    1024
H1:SUS-ETMX_L2_NOISEMON_LL_DQ    1024
H1:SUS-ETMX_L2_NOISEMON_LR_DQ    1024
H1:SUS-ETMX_L2_NOISEMON_UL_DQ    1024
H1:SUS-ETMX_L2_NOISEMON_UR_DQ    1024
H1:SUS-ETMX_L1_OSEMINF_UL_IN1_DQ    256
H1:SUS-ETMX_L1_OSEMINF_LL_IN1_DQ    256
H1:SUS-ETMX_L1_OSEMINF_UR_IN1_DQ    256
H1:SUS-ETMX_L1_OSEMINF_LR_IN1_DQ    256
H1:SUS-ETMX_L1_MASTER_OUT_UL_DQ    1024
H1:SUS-ETMX_L1_MASTER_OUT_LL_DQ    1024
H1:SUS-ETMX_L1_MASTER_OUT_UR_DQ    1024
H1:SUS-ETMX_L1_MASTER_OUT_LR_DQ    1024
H1:SUS-ETMX_L2_OSEMINF_UL_IN1_DQ    256
H1:SUS-ETMX_L2_OSEMINF_LL_IN1_DQ    256
H1:SUS-ETMX_L2_OSEMINF_UR_IN1_DQ    256
H1:SUS-ETMX_L2_OSEMINF_LR_IN1_DQ    256
H1:SUS-ETMX_L2_MASTER_OUT_UL_DQ    2048
H1:SUS-ETMX_L2_MASTER_OUT_LL_DQ    2048
H1:SUS-ETMX_L2_MASTER_OUT_UR_DQ    2048
H1:SUS-ETMX_L2_MASTER_OUT_LR_DQ    2048
H1:SUS-ETMX_L3_OPLEV_PIT_OUT_DQ    256
H1:SUS-ETMX_L3_OPLEV_YAW_OUT_DQ    256
H1:SUS-ETMX_L3_OPLEV_SUM_OUT_DQ    256
H1:SUS-ETMX_L3_MASTER_OUT_UL_DQ    2048
H1:SUS-ETMX_L3_MASTER_OUT_LL_DQ    2048
H1:SUS-ETMX_L3_MASTER_OUT_UR_DQ    2048
H1:SUS-ETMX_L3_MASTER_OUT_LR_DQ    2048
H1:SUS-ETMX_L3_MASTER_OUT_DC_DQ    256
H1:IMC-F_OUT_DQ    16384
H1:IMC-I_OUT_DQ    16384
H1:IMC-L_OUT_DQ    2048
H1:IMC-X_DQ    16384
H1:IMC-REFL_DC_OUT_DQ    2048
H1:IMC-TRANS_OUT_DQ    16384
H1:IMC-MC2_TRANS_PIT_OUT_DQ    2048
H1:IMC-MC2_TRANS_SUM_IN1_DQ    2048
H1:IMC-MC2_TRANS_SUM_OUT_DQ    2048
H1:IMC-MC2_TRANS_YAW_OUT_DQ    2048
H1:IMC-MC2_PIT_OUT_DQ    2048
H1:IMC-MC2_YAW_OUT_DQ    2048
H1:PEM-CS_ACC_BEAMTUBE_XMAN_Y_DQ    8192
H1:PEM-CS_ACC_BEAMTUBE_YMAN_X_DQ    8192
H1:PEM-CS_ACC_BSC3_ITMX_X_DQ    8192
H1:PEM-CS_ACC_BSC3_ITMX_Y_DQ    8192
H1:PEM-CS_ACC_BSC2_BS_Y_DQ    8192
H1:PEM-CS_ACC_EBAY_FLOOR_Z_DQ    8192
H1:PEM-CS_ACC_FLOOR_XCRYO_Z_DQ    8192
H1:PEM-CS_ACC_FLOOR_YCRYO_Z_DQ    8192
H1:PEM-CS_ACC_HAM2_PR1_Y_DQ    8192
H1:PEM-CS_ACC_HAM2_PR1_Z_DQ    8192
H1:PEM-CS_ACC_HAM3_PR2_Y_DQ    8192
H1:PEM-CS_ACC_HAM4_SR2_X_DQ    8192
H1:PEM-CS_ACC_HAM5_SR1_X_DQ    8192
H1:PEM-CS_ACC_HAM6_OMC_X_DQ    8192
H1:PEM-CS_ACC_HAM6_OMC_Z_DQ    8192
H1:PEM-CS_ACC_IOT1_MC_X_DQ    8192
H1:PEM-CS_ACC_IOT1_MC_Y_DQ    8192
H1:PEM-CS_ACC_IOT1_MC_Z_DQ    8192
H1:PEM-CS_ACC_IOT2_INPUTOPTICS_Y_DQ    8192
H1:PEM-CS_ACC_ISCT1_REFL_Y_DQ    8192
H1:PEM-CS_ACC_ISCT6_OMC_X_DQ    8192
H1:PEM-CS_ACC_LVEA_FLOORBS_X_DQ    8192
H1:PEM-CS_ACC_LVEA_FLOORBS_Y_DQ    8192
H1:PEM-CS_ACC_LVEA_FLOORBS_Z_DQ    8192
H1:PEM-CS_ACC_LVEA_FLOORHAM1_Z_DQ    8192
H1:PEM-CS_ACC_MCTUBE_INPUTOPTICS_Y_DQ    8192
H1:PEM-CS_ACC_OPLEV_ITMX_Y_DQ    8192
H1:PEM-CS_ACC_OPLEV_ITMY_X_DQ    8192
H1:PEM-CS_ACC_PSL_PERISCOPE_X_DQ    8192
H1:PEM-CS_ACC_PSL_TABLE1_X_DQ    8192
H1:PEM-CS_ACC_PSL_TABLE1_Y_DQ    8192
H1:PEM-CS_ACC_PSL_TABLE1_Z_DQ    8192
H1:PEM-CS_ACC_PSL_TABLE2_Z_DQ    8192
H1:PEM-CS_ACC_PSL_TABLE3_Z_DQ    8192
H1:PEM-CS_MAG_EBAY_LSCRACK_QUAD_SUM_DQ    8192
H1:PEM-CS_MAG_EBAY_LSCRACK_X_DQ    8192
H1:PEM-CS_MAG_EBAY_LSCRACK_Y_DQ    8192
H1:PEM-CS_MAG_EBAY_LSCRACK_Z_DQ    8192
H1:PEM-CS_MAG_EBAY_SUSRACK_QUAD_SUM_DQ    4096
H1:PEM-CS_MAG_EBAY_SUSRACK_X_DQ    4096
H1:PEM-CS_MAG_EBAY_SUSRACK_Y_DQ    4096
H1:PEM-CS_MAG_EBAY_SUSRACK_Z_DQ    4096
H1:PEM-CS_MAG_LVEA_VERTEX_QUAD_SUM_DQ    4096
H1:PEM-CS_MAG_LVEA_VERTEX_X_DQ    4096
H1:PEM-CS_MAG_LVEA_VERTEX_Y_DQ    4096
H1:PEM-CS_MAG_LVEA_VERTEX_Z_DQ    4096
H1:PEM-CS_MIC_EBAY_RACKS_DQ    16384
H1:PEM-CS_MIC_LVEA_VERTEX_DQ    16384
H1:PEM-CS_MIC_YMAN_SPOOL_DQ    16384
H1:PEM-CS_SEIS_LVEA_VERTEX_QUAD_SUM_DQ    256
H1:PEM-CS_SEIS_LVEA_VERTEX_X_DQ    256
H1:PEM-CS_SEIS_LVEA_VERTEX_Y_DQ    256
H1:PEM-CS_SEIS_LVEA_VERTEX_Z_DQ    256
H1:PEM-CS_TILT_LVEA_VERTEX_T_DQ    256
H1:PEM-CS_TILT_LVEA_VERTEX_X_DQ    256
H1:PEM-CS_TILT_LVEA_VERTEX_Y_DQ    256
H1:PEM-EX_ACC_EBAY_FLOOR_Z_DQ    8192
H1:PEM-EX_ACC_ISCTEX_TRANS_X_DQ    8192
H1:PEM-EX_ACC_OPLEV_ETMX_X_DQ    8192
H1:PEM-EX_MAG_EBAY_SEIRACK_QUAD_SUM_DQ    4096
H1:PEM-EX_MAG_EBAY_SEIRACK_X_DQ    4096
H1:PEM-EX_MAG_EBAY_SEIRACK_Y_DQ    4096
H1:PEM-EX_MAG_EBAY_SEIRACK_Z_DQ    4096
H1:PEM-EX_MAG_EBAY_SUSRACK_QUAD_SUM_DQ    4096
H1:PEM-EX_MAG_EBAY_SUSRACK_X_DQ    4096
H1:PEM-EX_MAG_EBAY_SUSRACK_Y_DQ    4096
H1:PEM-EX_MAG_EBAY_SUSRACK_Z_DQ    4096
H1:PEM-EX_MAG_VEA_FLOOR_QUAD_SUM_DQ    4096
H1:PEM-EX_MAG_VEA_FLOOR_X_DQ    4096
H1:PEM-EX_MAG_VEA_FLOOR_Y_DQ    4096
H1:PEM-EX_MAG_VEA_FLOOR_Z_DQ    4096
H1:PEM-EX_MIC_EBAY_RACKS_DQ    16384
H1:PEM-EX_SEIS_VEA_FLOOR_QUAD_SUM_DQ    256
H1:PEM-EX_SEIS_VEA_FLOOR_X_DQ    256
H1:PEM-EX_SEIS_VEA_FLOOR_Y_DQ    256
H1:PEM-EX_SEIS_VEA_FLOOR_Z_DQ    256
H1:PEM-EX_TILT_VEA_FLOOR_T_DQ    256
H1:PEM-EX_TILT_VEA_FLOOR_X_DQ    256
H1:PEM-EX_TILT_VEA_FLOOR_Y_DQ    256
