815731808 815731840
815733472 815733504
815805696 815805728
815882688 815882720
815903072 815903104
815912960 815912992
815970464 815970496
815974784 815974816
815980128 815980160
815995776 815995808
816086528 816086560
816091200 816091232
816256128 816256160
816262464 816262496
816280128 816280160
816389248 816389280
816419744 816419776
816489312 816489344
816492640 816492672
816503872 816503904
816539552 816540032
816540832 816540898
816548128 816548608
816553621 816554065
816554089 816561785
816561849 816563182
816564940 816572184
816573266 816579650
816579706 816597730
816597785 816609952
816634759 816635008
816708380 816708384
817374784 817374816
817397856 817397888
817408832 817408864
817418368 817418400
817418496 817418528
817419968 817420000
817428416 817428448
817429312 817429344
817430656 817431104
817439904 817440480
817448352 817448864
817457056 817457472
817462496 817462528
817476288 817476320
817509536 817509568
817511904 817511936
817517408 817517440
817520544 817520576
817524992 817525024
817526272 817526304
817531936 817531968
817532544 817532576
817537536 817537568
817562976 817563008
817578976 817579008
817582080 817582112
817582816 817582848
817609888 817611808
817611840 817612512
817612544 817618144
817633929 817645650
817645706 817657601
817657665 817662200
817664610 817681152
817760992 817761024
817795680 817795712
817796352 817796384
817805952 817805984
817820032 817820064
817823616 817823648
817831232 817831264
817833536 817833568
817884736 817884768
817904160 817904192
817908160 817908192
818012224 818012256
818493216 818493728
818779680 818780256
818830624 818830656
818850528 818850560
818896704 818896736
818909696 818909728
818910208 818910240
818937824 818937856
818951552 818951584
818957248 818957280
818962144 818962176
818975904 818975936
818979008 818979040
819018784 819018816
819021024 819021056
819024864 819024896
819034880 819034912
819036832 819036864
819053152 819053184
819056480 819056512
819056704 819056736
819059616 819059648
819064000 819064032
819079488 819079520
819081344 819081376
819083456 819083488
819088416 819088448
819102112 819102144
819121472 819121504
819125248 819125280
819127648 819127680
819166656 819166688
819183232 819183264
819183328 819183360
819194304 819194336
819198752 819198784
819206912 819206944
819241920 819241952
819281248 819281280
819337984 819338016
819346368 819346400
819359520 819359552
819361824 819361856
819424992 819425024
819425440 819425472
819437184 819437216
819458624 819458656
819464576 819464608
819466272 819466304
819470752 819470784
819492000 819492032
819493920 819493952
819505248 819505280
819527232 819527264
819538528 819538560
819550656 819550688
819554816 819554848
819561312 819561344
819616608 819616640
819625696 819625728
819659520 819659552
819660992 819661024
819666176 819666208
819686944 819687488
819807072 819807104
819811200 819811232
819828488 819828928
819829664 819829987
819949344 819949376
819964160 819964192
820044768 820044800
820096352 820096384
820096448 820096480
820298816 820298848
820310816 820310848
820314528 820315104
820315136 820315808
820315840 820316392
820316628 820317184
820317216 820317888
820317920 820318560
820318592 820319264
820319296 820319968
820320000 820320640
820320672 820321196
820321810 820321920
820321952 820322270
820322418 820322656
820322688 820323968
820324000 820324704
820324736 820325984
820326016 820326656
820326688 820327241
820327808 820328032
820328064 820328736
820328768 820330016
820330048 820330688
820330720 820331424
820331456 820332096
820332128 820333376
820333408 820334016
820334048 820334720
820334752 820335424
820335456 820336160
820336192 820337472
820337504 820338086
820338288 820339488
820339520 820340160
820340192 820340207
820359180 820359381
820359678 820364673
820365762 820370993
820373426 820380200
820381418 820382003
820382080 820384288
820387584 820387616
820416288 820416320
820424096 820424128
820436160 820436192
820439360 820439392
820450016 820450048
820452992 820453024
820472224 820472256
820479040 820479072
820493600 820493632
820497120 820497152
820500704 820500736
820507552 820507584
820510432 820510464
820516192 820516224
820547872 820547904
820573760 820573792
820576096 820576128
820603520 820603552
820652800 820652832
820654944 820654976
820655936 820655968
820658176 820658208
820660928 820660960
820663936 820663968
820694496 820694528
820701664 820701696
820711712 820711744
820718528 820718560
820719136 820719168
820742976 820743008
820763072 820763104
820819616 820819648
820832832 820832864
820843904 820843936
820847200 820847232
820868160 820868192
820906080 820906112
820913120 820913152
820936992 820937024
820978944 820978976
820982528 820983072
820991232 820991808
820998216 820998417
821066464 821066944
821335392 821335424
821358944 821358976
821362208 821362752
821433504 821433536
821435712 821435744
821447488 821447936
821713088 821713568
821713600 821718679
821720082 821720817
821722673 821723068
821723117 821725824
821728718 821729224
821729303 821734884
821734947 821738178
821739681 821741500
821741556 821742814
821744967 821746988
821747711 821754826
821754963 821756512
821756736 821757024
821763680 821764192
821772064 821772544
821786112 821786560
821919968 821920000
821957952 821957984
821960608 821960640
821980352 821980384
821981920 821981952
822040640 822040672
822050752 822050784
822050912 822050944
822052000 822052032
822064064 822064096
822074208 822074240
822080640 822080672
822121792 822121824
822130144 822130176
822134336 822134368
822268672 822268786
822487776 822487808
822533024 822533056
822536832 822536864
822538912 822538944
822541728 822541760
822546112 822546144
822562304 822562336
822566336 822566368
822571424 822571456
822572352 822572384
822639616 822639648
822641920 822641952
822643904 822643936
822647904 822647936
822666560 822666592
822704000 822704032
822728672 822728704
822747040 822747072
822755520 822755552
822773760 822773792
822826880 822826912
822867456 822867488
822901376 822901408
822912236 822912256
822949536 822949568
822968768 822968800
822982400 822982432
822997120 822997152
823000512 823000544
823026496 823026528
823032416 823032437
823037216 823037248
823043072 823043104
823058688 823058720
823060832 823060864
823604192 823604224
823609024 823609056
823614432 823614464
823775424 823775456
823870816 823870848
823875296 823875328
823880864 823880896
823947264 823947296
824038496 824038528
824048096 824048128
824049184 824049216
824131072 824131104
824131424 824131456
824205536 824205568
824208896 824208928
824712896 824712928
824901280 824901312
824904608 824904640
824911328 824911360
824911872 824911904
824915168 824915200
824917312 824917344
824944864 824944896
824959104 824959136
824965728 824965760
824977984 824978016
824979136 824979168
824979744 824979776
824981696 824981728
825009024 825009056
825013856 825013888
825021696 825021728
825032160 825032192
825037216 825037248
825047296 825047328
825051104 825051136
825052672 825052704
825069600 825069632
825070016 825070048
825084128 825084160
825090912 825090944
825094624 825094656
825098336 825098368
825098400 825098432
825138176 825138208
825150080 825150112
825155456 825155488
825159296 825159328
825177536 825177568
825228448 825228480
825229504 825229536
825409632 825409664
825415200 825415232
825419872 825419904
825424928 825424960
825432992 825433024
825434208 825434240
825443136 825443168
825443936 825443968
825445280 825445312
825449632 825449664
825450944 825450976
825456096 825456128
825468608 825468640
825478976 825479008
825480416 825480448
825485664 825485728
825487456 825487488
825491200 825491232
825491456 825491488
825491616 825491648
825500064 825500096
825516000 825516032
825524032 825524064
825535104 825535136
825542816 825542848
825573056 825573088
825601248 825601280
825609920 825609952
825636192 825636224
825674336 825674368
825681120 825681152
825706496 825706528
825721824 825721856
825730592 825730624
825738656 825738688
825753792 825753824
825761440 825761472
825762816 825762848
825830912 825830944
825835968 825836000
825866240 825866272
825869824 825869856
825900352 825900384
825915008 825915040
825948896 825948928
825980736 825980768
825988576 825988608
825993248 825993280
825996192 825996224
825996256 825996288
825996352 825996384
826004160 826004192
826010432 826010464
826012288 826012320
826015616 826015648
826016096 826016128
826018016 826018048
826039008 826039040
826045984 826046016
826057984 826058016
826085216 826085248
826086752 826086784
826101056 826101088
826109216 826109248
826113088 826113120
826123264 826123296
826125248 826125280
826145280 826145312
826158848 826158880
826159424 826159456
826160288 826160320
826168448 826168480
826195808 826195840
826196864 826196896
826207808 826207840
826210976 826211008
826211168 826211200
826212384 826212416
826219520 826219552
826221888 826221920
826264736 826264768
826265216 826265248
826267808 826267840
826286016 826286048
826307648 826307680
826311776 826311808
826336416 826336448
826342880 826342912
826342944 826342976
826343904 826343936
826347200 826347232
826354816 826354848
826370272 826370304
826371392 826371424
826372288 826372320
826377728 826377760
826379424 826379456
826597632 826597664
826614144 826614176
826620320 826620352
826626208 826626240
826626656 826626688
826633376 826633408
826634336 826634368
826634816 826634848
826648192 826648224
826651648 826651680
826654912 826654944
826681120 826681152
826695200 826695232
826702496 826702528
826722208 826722240
826724896 826724928
826727488 826727520
826740928 826740960
826747136 826747168
826758688 826758720
826759648 826759680
826763552 826763584
826789344 826789376
826797056 826797088
826800512 826800544
826807712 826807744
826820096 826820128
826835936 826835968
826837376 826837408
826845184 826845216
826867136 826867168
826876704 826876736
826884608 826884640
826884896 826884928
826889536 826889568
826889696 826889728
826896896 826896928
826899232 826899264
826956096 826956128
826965248 826965280
826972928 826972960
826975776 826975808
826983968 826984000
827136416 827136448
827156576 827156608
827169344 827169376
827174048 827174080
827183104 827183136
827184288 827184320
827187584 827187616
827193056 827193088
827208160 827208192
827214112 827214144
827219648 827219680
827240448 827240480
827245248 827245280
827247904 827247936
827249472 827249504
827250048 827250080
827251808 827251840
827257248 827257280
827264896 827264928
827271648 827271680
827274176 827274208
827290976 827291008
827295776 827295808
827303552 827303584
827306912 827306944
827309312 827309344
827310176 827310208
827313024 827313088
827320256 827320288
827320736 827320768
827330080 827330112
827332352 827332384
827343296 827343328
827346048 827346080
827350976 827351008
827351232 827351264
827362112 827362144
827365856 827365888
827368480 827368512
827385728 827385760
827387936 827387968
827395136 827395168
827401600 827401632
827401952 827401984
827403872 827403904
827407040 827407072
827411776 827411808
827412032 827412064
827424032 827424064
827426528 827426560
827440960 827440992
827441280 827441312
827449504 827449536
827461600 827461632
827466656 827466688
827467520 827467552
827473856 827473888
827473952 827473984
827481600 827481632
827489216 827489248
827503616 827503648
827511744 827511776
827536256 827536288
827563712 827563744
827567936 827567968
827580160 827580192
827588544 827588576
827596128 827596160
827614656 827614688
827630080 827630112
827630976 827631008
827638016 827638048
827650976 827651008
827659136 827659168
827660576 827660608
827662528 827662560
827671136 827671168
827680448 827680480
827695328 827695360
827699456 827699488
827702848 827702880
827707616 827707648
827736864 827736896
827741696 827741728
827742176 827742208
827744096 827744128
827747424 827747456
827747936 827747968
827752832 827752864
827755520 827755552
827758176 827758208
827758496 827758528
827761472 827761504
827764288 827764320
827764736 827764768
827769536 827769568
827772384 827772416
827777728 827777760
827779360 827779392
827780960 827780992
827786336 827786368
827786784 827786816
827790080 827790112
827797184 827797216
827798400 827798432
827799136 827799168
827802656 827802688
827811840 827811904
827812320 827812352
827812384 827812416
827812736 827812832
827812992 827813024
827813280 827813344
827813376 827813408
827813728 827814176
827814336 827817750
827820324 827825888
827828544 827828576
827832000 827832032
827840448 827840480
827864832 827864864
827867296 827867328
827867456 827867488
827872640 827872672
827876576 827876608
827877536 827877568
827903456 827903488
827913728 827913760
827919392 827919424
827936128 827936576
827940416 827940448
827941376 827941408
827950208 827950240
827966816 827966848
827969024 827969056
827973056 827973088
827982048 827982080
827983872 827983904
827986272 827986304
827997216 827997248
828007520 828007552
828023552 828023584
828028288 828028320
828031392 828031424
828035424 828035456
828035936 828035968
828044800 828044832
828048128 828048160
828050816 828050848
828056096 828056128
828061568 828061600
828070496 828070528
828075776 828075808
828077632 828077664
828085856 828085888
828086144 828086176
828092992 828093024
828095904 828095936
828102336 828102368
828109024 828109056
828140224 828140256
828152320 828152352
828167648 828168096
828178816 828178848
828187200 828187232
828234272 828234304
828257696 828257728
828259744 828259776
828261248 828261280
828261536 828261568
828267456 828267488
828267968 828268000
828269120 828269152
828271232 828271264
828272608 828272640
828347968 828348000
828354208 828354240
828367488 828367520
828450848 828450880
828451616 828451648
828459008 828459040
828762816 828762848
828765312 828765344
828765760 828765792
828778112 828778144
828778592 828778624
828783648 828783680
828785056 828785088
828786112 828786144
828787776 828787808
828788288 828788320
828788608 828788640
828842115 828842592
828878720 828879200
828910144 828910592
828932896 828933376
829052128 829053920
