847614877 847614894
847614943 847614960
847615127 847615144
847615571 847615588
847616127 847616144
847619950 847619967
847620208 847620225
847622054 847622071
847622658 847622675
847622944 847622961
847623047 847623064
847623099 847623116
847623324 847623341
847623380 847623397
847623608 847623625
847623639 847623656
847623686 847623703
847623729 847623746
847623758 847623775
847623859 847623876
847623909 847623926
847623923 847623940
847623963 847623980
847624081 847624098
847624147 847624164
847624446 847624463
847624920 847624937
847625141 847625158
847728752 847728769
847728820 847728837
847763901 847763918
847768199 847768216
847770342 847770359
847772534 847772551
847774666 847774683
847776800 847776817
847778915 847778932
847781067 847781084
847783171 847783188
847787428 847787445
847789570 847789587
847793876 847793893
847796000 847796017
847798123 847798140
847800237 847800254
847802380 847802397
847804484 847804501
847854648 847854665
847861276 847861293
847870005 847870022
847889581 847889598
847896119 847896136
847915202 847915219
847915221 847915238
847920297 847920316
848126958 848126975
848131353 848131370
848216413 848216430
848216631 848216648
848263882 848263899
848268068 848268085
848270132 848270149
848270982 848270999
848272139 848272156
848282805 848282822
848298281 848298298
848305049 848305066
848309582 848309599
848314203 848314220
848336457 848336474
848340752 848340769
848342827 848342844
848344264 848344281
848347422 848347439
848349196 848349213
848350038 848350055
848350742 848350759
848351252 848351269
848354459 848354476
848355508 848355525
848357554 848357571
848359637 848359654
848370234 848370251
848385703 848385720
848387935 848387952
848405475 848405492
848422929 848422946
848441918 848441935
848452549 848452566
848467889 848467906
848470160 848470177
848478979 848478996
848503700 848503717
848511703 848511720
848518916 848518933
848526819 848526836
848533177 848533194
848556326 848556343
848564997 848565014
848570509 848570526
848587796 848587813
848592170 848592187
848595897 848595914
848602403 848602420
848631982 848631999
848638619 848638636
848660823 848660840
848677873 848677890
848678425 848678442
848681646 848681663
848689319 848689336
848695687 848695704
848716499 848716516
848729297 848729314
848734682 848734699
848823215 848823232
848823600 848823617
848827916 848827933
848832232 848832249
848836548 848836565
848840156 848840173
848840874 848840891
848881856 848881873
848885442 848885459
848905699 848905716
848909778 848909795
848913768 848913785
848921788 848921805
848941719 848941736
848945709 848945726
848949719 848949736
848953457 848953474
848953709 848953726
849125466 849125483
849134612 849134629
849334354 849334371
849391429 849391446
849392366 849392383
849465721 849465738
849473909 849473926
849506896 849506913
849511657 849511674
849516526 849516543
849521277 849521294
849729673 849729690
849731359 849731376
849736130 849736147
849740992 849741009
849887201 849887218
849888029 849888046
849892851 849892868
849923053 849923070
849924078 849924095
849927361 849927378
849930234 849930251
849935982 849935999
849937122 849937139
849953307 849953324
849963074 849963091
849966493 849966510
850016115 850016132
850024948 850024965
850072824 850072841
850078718 850078735
850120253 850120270
850129694 850129711
850139346 850139363
850146611 850146628
850151810 850151827
850159567 850159584
850160253 850160270
850167186 850167203
850172847 850172864
850181627 850181644
850189118 850189135
850204382 850204399
850208935 850208952
850209759 850209776
850225757 850225774
850251640 850251657
850253837 850253854
850256055 850256072
850258162 850258179
850265993 850266010
850267111 850267128
850271626 850271643
850276305 850276322
850280977 850280994
850297624 850297641
850304791 850304808
850320925 850320942
850323685 850323702
850332605 850332622
850333020 850333037
850354235 850354252
850358640 850358657
850390966 850390983
850413724 850413741
850417902 850417919
850439007 850439024
850474731 850474748
850545274 850545291
850629477 850629494
850636644 850636661
850645407 850645424
850649879 850649896
850652353 850652370
850663025 850663042
850665486 850665503
850676023 850676040
850676544 850676561
850680172 850680189
850684291 850684308
850688479 850688496
850697823 850697840
850700824 850700841
850708894 850708911
850710250 850710267
850712873 850712890
850716963 850716980
850729982 850729999
850733074 850733091
850745292 850745309
850746142 850746159
850751784 850751801
850765478 850765495
850771859 850771876
850777568 850777585
850779109 850779126
850781559 850781576
850784832 850784849
850785658 850785675
850789172 850789189
850789508 850789525
850789674 850789691
850790449 850790466
850790586 850790603
850797383 850797400
850798092 850798109
850798251 850798268
850799422 850799439
850802360 850802377
850819050 850819067
850827437 850827454
850849629 850849646
850853028 850853045
850875022 850875039
850877056 850877073
850879141 850879158
850881235 850881252
850883338 850883355
850889767 850889784
850892009 850892026
850898587 850898604
850900779 850900796
850902993 850903010
850905184 850905201
850907366 850907383
850909631 850909648
850911841 850911858
850916275 850916292
850918450 850918467
850920692 850920709
850925155 850925172
850932518 850932535
850933747 850933764
850935881 850935898
850938006 850938023
850940129 850940146
850942233 850942250
850944287 850944304
850945248 850945265
850946342 850946359
850952785 850952802
850954898 850954915
850957022 850957039
850959116 850959133
850961249 850961266
850963373 850963390
850965505 850965522
850967661 850967678
850971977 850971994
850974159 850974176
850976350 850976367
850980717 850980734
850982871 850982888
850985053 850985070
850987224 850987241
850991619 850991636
850994344 850994361
850996007 850996024
850998227 850998244
851000379 851000396
851002553 851002570
851006969 851006986
851009151 851009168
851011313 851011330
851013497 851013514
851015669 851015686
851017851 851017868
851020046 851020063
851022189 851022206
851024401 851024418
851026603 851026620
851026963 851026980
851028815 851028832
851031017 851031034
851033182 851033199
851035364 851035381
851037547 851037564
851039709 851039726
851041881 851041898
851042558 851042575
851044075 851044092
851046247 851046264
851048450 851048467
851054988 851055005
851055392 851055409
851057161 851057178
851059306 851059323
851061437 851061454
851135957 851135974
851138189 851138206
851138281 851138298
851143241 851143258
851145541 851145558
851147921 851147938
851157394 851157411
851164406 851164423
851199323 851199340
851203707 851203724
851205879 851205896
851208101 851208118
851219510 851219527
851221849 851221866
851224161 851224178
851231271 851231288
851231500 851231517
851233829 851233846
851236190 851236207
851241248 851241265
851246019 851246036
851253051 851253068
851257772 851257789
851260181 851260198
851312114 851312131
851319620 851319637
851327770 851327787
851330180 851330197
851332837 851332854
851348068 851348085
851356771 851356788
851357766 851357783
851364259 851364276
851365549 851365566
851370229 851370246
851382532 851382549
851383732 851383749
851408661 851408678
851417067 851417084
851417466 851417483
851419594 851419611
851424604 851424621
851425650 851425667
851428207 851428224
851431481 851431498
851444683 851444700
851448972 851448989
851569266 851569283
851591202 851591219
851599568 851599585
851605107 851605124
851611980 851611997
851631858 851631875
851665691 851665708
851691540 851691557
851693781 851693798
851701966 851701983
851702927 851702944
851705210 851705227
851707432 851707449
851709674 851709691
851720540 851720557
851736519 851736536
851743324 851743341
851745656 851745673
851747898 851747915
851750227 851750244
851752441 851752458
851754744 851754761
851757015 851757032
851804295 851804312
851806338 851806355
851808542 851808559
851815050 851815067
851839979 851839996
851844433 851844450
851919716 851919733
851928723 851928740
851931016 851931033
851935382 851935399
851937543 851937560
851940181 851940198
851944131 851944148
851946216 851946233
851960009 851960026
851961761 851961778
851964684 851964701
851966138 851966155
851978503 851978520
851984480 851984497
851986289 851986306
851995639 851995656
851998794 851998811
852006939 852006956
852007268 852007285
852007619 852007636
852007809 852007826
852007987 852008004
852009853 852009870
852013271 852013288
852017359 852017376
852022535 852022552
852042023 852042040
852045014 852045031
852047406 852047423
852082198 852082215
852100359 852100376
852107999 852108016
852114926 852114943
852122381 852122398
852135585 852135602
852140156 852140173
852144370 852144387
852185321 852185338
852187884 852187901
852203002 852203019
852208025 852208042
852212755 852212772
852249357 852249374
852261670 852261687
852270686 852270703
852275545 852275562
852279548 852279565
852280138 852280155
852282252 852282269
852287111 852287128
852289531 852289548
852292020 852292037
852323586 852323603
852329949 852329966
852332726 852332743
852336673 852336690
852345673 852345690
852350274 852350291
852354858 852354875
852357188 852357205
852359429 852359446
852361732 852361749
852366255 852366272
852368507 852368524
852370741 852370758
852373011 852373028
852419900 852419917
852421925 852421942
852428011 852428028
852430152 852430169
852432246 852432263
852434399 852434416
852436541 852436558
852438705 852438722
852440879 852440896
852442973 852442990
852445038 852445055
852447180 852447197
852449293 852449310
852451407 852451424
852453510 852453527
852455574 852455591
852457648 852457665
852459743 852459760
852461817 852461834
852463872 852463889
852465984 852466001
852468049 852468066
852470182 852470199
852472236 852472253
852478419 852478436
852488720 852488737
852489306 852489323
852502587 852502604
852504514 852504531
852506468 852506485
852512673 852512690
852514727 852514744
852516880 852516897
852518993 852519010
852521077 852521094
852523151 852523168
852525234 852525251
852529441 852529458
852531535 852531552
852533681 852533698
852535772 852535789
852537856 852537873
852539972 852539989
852542017 852542034
852544081 852544098
852546144 852546161
852548209 852548226
852550283 852550300
852552406 852552423
852554538 852554555
852556603 852556620
852558826 852558843
852560861 852560878
852562965 852562982
852567014 852567031
852571062 852571079
852573086 852573103
852575121 852575138
852577156 852577173
852581285 852581302
852583319 852583336
852591496 852591513
852593561 852593578
852595586 852595603
852597581 852597598
852599526 852599543
852601552 852601569
852603537 852603554
852607506 852607523
852609523 852609540
852613521 852613538
852615546 852615563
852616429 852616446
852617571 852617588
852619607 852619624
852621632 852621649
852623637 852623654
852625403 852625420
852625701 852625718
852631705 852631722
852633739 852633756
852635715 852635732
852637817 852637834
852639774 852639791
852641946 852641963
852646213 852646230
852648329 852648346
852648520 852648537
852650756 852650773
852655795 852655812
852658421 852658438
852666249 852666266
852666935 852666952
852680309 852680326
852681591 852681608
852684149 852684166
852686609 852686626
852689009 852689026
852691479 852691496
852691760 852691777
852693838 852693855
852696270 852696287
852727577 852727594
852729760 852729777
852731944 852731961
852734107 852734124
852734830 852734847
852736604 852736621
852739543 852739560
852741888 852741905
852743245 852743262
852744773 852744790
852752171 852752188
852753753 852753770
852757642 852757659
852761455 852761472
852767332 852767349
852769829 852769846
852772536 852772553
852774975 852774992
852777327 852777344
852779530 852779547
852781731 852781748
852783874 852783891
852786037 852786054
852788211 852788228
852789560 852789577
852790393 852790410
852792783 852792800
852794997 852795014
852795529 852795546
852797207 852797224
852801386 852801403
852802096 852802113
852804299 852804316
852806778 852806795
852809001 852809018
852811440 852811457
852813920 852813937
852816370 852816387
852818591 852818608
852821061 852821078
852823568 852823585
852826067 852826084
852828872 852828889
852831726 852831743
852832000 852832017
852835154 852835171
852839008 852839025
852840615 852840632
852844428 852844445
852848746 852848763
852850872 852850889
852852388 852852405
852854967 852854984
852857426 852857443
852859934 852859951
852862404 852862421
852864884 852864901
852865837 852865854
852867342 852867359
852869781 852869798
852871223 852871240
852872201 852872218
852876884 852876901
852879105 852879122
852881278 852881295
852885633 852885650
852887667 852887684
852889793 852889810
852891984 852892001
852898523 852898540
852902888 852902905
852903133 852903150
852905830 852905847
852907303 852907320
852908320 852908337
852909801 852909818
852912340 852912357
852920558 852920575
852920787 852920804
852923028 852923045
852925159 852925176
852935117 852935134
852935699 852935716
852937801 852937818
852939906 852939923
852941991 852942008
852944182 852944199
852946305 852946322
852948449 852948466
852950611 852950628
852952766 852952783
852954947 852954964
852957112 852957129
852959333 852959350
852961409 852961426
852966011 852966028
852968251 852968268
852970445 852970462
852972648 852972665
852974889 852974906
852977180 852977197
852979384 852979401
852981486 852981503
852983698 852983715
852985821 852985838
852989980 852989997
852992083 852992100
852994187 852994204
852996332 852996349
853021932 853021949
853024056 853024073
853026129 853026146
853028193 853028210
853030217 853030234
853032293 853032310
853034417 853034434
853036548 853036565
853038672 853038689
853040786 853040803
853042869 853042886
853044884 853044901
853046908 853046925
853048993 853049010
853051097 853051114
853053182 853053199
853055265 853055282
853059423 853059440
853061458 853061475
853063503 853063520
853065527 853065544
853067572 853067589
853069617 853069634
853071731 853071748
853073833 853073850
853079937 853079954
853081951 853081968
853084005 853084022
853086101 853086118
853088182 853088199
853090278 853090295
853092411 853092428
853094495 853094512
853100619 853100636
853106761 853106778
853108856 853108873
853110929 853110946
853113033 853113050
853115117 853115134
853119285 853119302
853121349 853121366
853123432 853123449
853125516 853125533
853127571 853127588
853131731 853131748
853133783 853133800
853135907 853135924
853140055 853140072
853142070 853142087
853148233 853148250
853150318 853150335
853152381 853152398
853154455 853154472
853156510 853156527
853158584 853158601
853160648 853160665
853162653 853162670
853164716 853164733
853166743 853166760
853168806 853168823
853175083 853175100
853177208 853177225
853179301 853179318
853179467 853179484
853189651 853189668
853191775 853191792
853193867 853193884
853195971 853195988
853198076 853198093
853204417 853204434
853206473 853206490
853208556 853208573
853210649 853210666
853212773 853212790
853214856 853214873
853216920 853216937
853218974 853218991
853221059 853221076
853223152 853223169
853227291 853227308
853229375 853229392
853231507 853231524
853233633 853233650
853235736 853235753
853238018 853238035
853242293 853242310
853244466 853244483
853248694 853248711
853250808 853250825
853257158 853257175
853259251 853259268
853261365 853261382
853263488 853263505
853265592 853265609
853267708 853267725
853269811 853269828
853273999 853274016
853276082 853276099
853280269 853280286
853282392 853282409
853284466 853284483
853286571 853286588
853290734 853290751
853292846 853292863
853294921 853294938
853296975 853296992
853299068 853299085
853301143 853301160
853303287 853303304
853305421 853305438
853307535 853307552
853309667 853309684
853320335 853320352
853322457 853322474
853324620 853324637
853326694 853326711
853328788 853328805
853330962 853330979
853333026 853333043
853335159 853335176
853337233 853337250
853339326 853339343
853341390 853341407
853342174 853342191
853343465 853343482
853345560 853345577
853347612 853347629
853349706 853349723
853351721 853351738
853352288 853352305
853353706 853353723
853355703 853355720
853357686 853357703
853359672 853359689
853361667 853361684
853363579 853363596
853363673 853363690
853365747 853365764
853367860 853367877
853369915 853369932
853371959 853371976
853374052 853374069
853376157 853376174
853378259 853378276
853378670 853378687
853380334 853380351
853382410 853382427
853384524 853384541
853386617 853386634
853388601 853388618
853390615 853390632
853391585 853391602
853392640 853392657
853394655 853394672
853396671 853396688
853398686 853398703
853402704 853402721
853404719 853404736
853406744 853406761
853410813 853410830
853412810 853412827
853414874 853414891
853444660 853444677
853446884 853446901
853453164 853453181
853455269 853455286
853457402 853457419
853459507 853459524
853461589 853461606
853463683 853463700
853465779 853465796
853467862 853467879
853469974 853469991
853472049 853472066
853474122 853474139
853476228 853476245
853478301 853478318
853487324 853487341
853488779 853488796
853490845 853490862
853492948 853492965
853495327 853495344
853497413 853497430
853499545 853499562
853501897 853501914
854334693 854334710
854334849 854334866
854348555 854348572
854355351 854355368
854357563 854357580
854428302 854428319
854466965 854466982
854469057 854469074
854469501 854469518
854491354 854491371
854493458 854493475
854545459 854545476
854586265 854586282
854599039 854599056
854625064 854625081
854627118 854627135
854633075 854633092
854635170 854635187
854644904 854644921
854647131 854647148
854704393 854704410
854779625 854779642
854800928 854800945
854803052 854803069
854962097 854962114
855005550 855005567
855214607 855214624
855234683 855234700
855253515 855253532
855263514 855263531
855344837 855344854
855355636 855355653
855384573 855384590
855385630 855385647
855385778 855385795
855393142 855393159
855394163 855394180
855394376 855394393
855394669 855394686
855394801 855394818
855395015 855395032
855395335 855395352
855395367 855395384
855395485 855395502
855395547 855395564
855395569 855395586
855395611 855395628
855395636 855395653
855395661 855395678
855395677 855395694
855395692 855395709
855395703 855395720
855395720 855395737
855395742 855395760
855395762 855395779
855395776 855395793
855395794 855395811
855395817 855395834
855395829 855395846
855395902 855395919
855395960 855395977
855395986 855396003
855396035 855396052
855396058 855396075
855396142 855396159
855396174 855396191
855396232 855396249
855396254 855396271
855396337 855396354
855396362 855396379
855396470 855396487
855396494 855396511
855396604 855396621
855399495 855399512
855412499 855412516
855412647 855412664
855412796 855412813
855413005 855413022
855417912 855417929
855454385 855454402
855456608 855456625
855458662 855458679
855462830 855462847
855464993 855465010
855467118 855467135
855468174 855468191
855469280 855469297
855471512 855471529
855473674 855473691
855478050 855478067
855480242 855480259
855482418 855482435
855484620 855484637
855486802 855486819
855772167 855772184
855791408 855791425
855944435 855944452
855969838 855969855
856006761 856006778
856072841 856072858
856075582 856075599
856110044 856110061
856121262 856121279
856124917 856124934
856234456 856234473
856260542 856260559
856378252 856378269
856415861 856415878
856422506 856422523
856423139 856423156
856423186 856423203
856423367 856423384
856423544 856423561
856444445 856444462
856554686 856554703
856558306 856558323
856585128 856585145
856626283 856626300
856626354 856626371
856626511 856626528
856651588 856651605
856655942 856655959
856657967 856657984
856659962 856659979
856661968 856661985
856663963 856663980
856665950 856665967
856667945 856667962
856669980 856669997
856672112 856672129
856674246 856674263
856676387 856676404
856678501 856678518
856680644 856680661
856682788 856682805
856687114 856687131
856689306 856689323
856691471 856691488
856693594 856693611
856695766 856695783
856697888 856697905
856699983 856700000
856704142 856704159
856708329 856708346
856710393 856710410
856714532 856714549
856714830 856714847
856722936 856722953
856725070 856725087
856727242 856727259
856729378 856729395
856737268 856737285
856739805 856739822
856742404 856742421
856749831 856749848
856756982 856756999
856759205 856759222
856761643 856761660
856764073 856764090
856766224 856766241
856766502 856766519
856769030 856769047
856771530 856771547
856771584 856771601
856776588 856776605
856779402 856779419
856782196 856782213
856785060 856785077
856785613 856785630
856787618 856787635
856790414 856790431
856793023 856793040
856796449 856796466
856805644 856805661
856834345 856834362
856836470 856836487
856838524 856838541
856840616 856840633
856840687 856840704
856842731 856842748
856844855 856844872
856846858 856846875
856848814 856848831
856850908 856850925
856853061 856853078
856855224 856855241
856857347 856857364
856861693 856861710
856868282 856868299
856870424 856870441
856872596 856872613
856876974 856876991
856879096 856879113
856880814 856880831
856881220 856881237
856883383 856883400
856886542 856886559
856887550 856887567
856891649 856891666
856893684 856893701
856894992 856895009
856895738 856895755
856897814 856897831
856898805 856898822
856899868 856899885
856901951 856901968
856906099 856906116
856908163 856908180
856910327 856910344
856912390 856912407
856914434 856914451
856916429 856916446
856918474 856918491
856920519 856920536
856922573 856922590
856924686 856924703
856926850 856926867
856929063 856929080
856931215 856931232
856933358 856933375
856937753 856937770
856939955 856939972
856957952 856957969
857062899 857062916
857147072 857147089
857151744 857151761
857152489 857152506
857360941 857360958
857371993 857372010
857429554 857429571
857435656 857435673
857437152 857437169
857449973 857449990
857463216 857463233
857469914 857469931
857492204 857492221
857496897 857496914
857507020 857507037
857509341 857509358
857563960 857563977
857574197 857574214
857577839 857577856
857587868 857587885
857665799 857665816
857722504 857722521
857771727 857771744
857810475 857810492
857878596 857878613
857881074 857881091
857883296 857883313
857885479 857885496
857887888 857887905
857890071 857890088
857892274 857892291
857897243 857897260
857902231 857902248
857904787 857904804
857907287 857907304
857909766 857909783
857911882 857911899
857912392 857912409
857914961 857914978
857920964 857920981
857922130 857922147
857924353 857924370
857927218 857927235
857930111 857930128
857933825 857933842
857935078 857935095
857949964 857949981
857952728 857952745
857952847 857952864
857955426 857955443
857957934 857957951
857960671 857960688
857963129 857963146
857965361 857965378
857965752 857965769
857967861 857967878
857970281 857970298
857972174 857972191
857972462 857972479
857973534 857973551
857973664 857973681
857974368 857974385
857974644 857974661
857974789 857974806
857975043 857975060
857980455 857980472
857980768 857980785
857981518 857981535
857982739 857982756
857983753 857983770
857988165 857988182
857990378 857990395
857994753 857994770
857996917 857996934
857999100 857999117
858003525 858003542
858005746 858005763
858010764 858010781
858010945 858010962
858013242 858013259
858015841 858015858
858038201 858038218
858041133 858041150
858045795 858045812
858047949 858047966
858050101 858050118
858051892 858051909
858052364 858052381
858054459 858054476
858056603 858056620
858058695 858058712
858060788 858060805
858063228 858063245
858065727 858065744
858070270 858070287
858072385 858072402
858073834 858073851
858076602 858076619
858078755 858078772
858080927 858080944
858085254 858085271
858087447 858087464
858089895 858089912
858094320 858094337
858096888 858096905
858099396 858099413
858101955 858101972
858103119 858103136
858104582 858104599
858108426 858108443
858111376 858111393
858132809 858132826
858134894 858134911
858136987 858137004
858139111 858139128
858143525 858143542
858145748 858145765
858147979 858147996
858150221 858150238
858152444 858152461
858154628 858154645
858156838 858156855
858159022 858159039
858161235 858161252
858163436 858163453
858165621 858165638
858167842 858167859
858170024 858170041
858172228 858172245
858174399 858174416
858176601 858176618
858178805 858178822
858180958 858180975
858183071 858183088
858185135 858185152
858187210 858187227
858188158 858188175
858189286 858189303
858191369 858191386
858193432 858193449
858195506 858195523
858197572 858197589
858199723 858199740
858201957 858201974
858204088 858204105
858206331 858206348
858210745 858210762
858212810 858212827
858214846 858214863
858219081 858219098
858225621 858225638
858227833 858227850
858230036 858230053
858236673 858236690
858238875 858238892
858241108 858241125
858243329 858243346
858245522 858245539
858247340 858247357
858247734 858247751
858249956 858249973
858252178 858252195
858254371 858254388
858258755 858258772
858260950 858260967
858263073 858263090
858267318 858267335
858269404 858269421
858271517 858271534
858273671 858273688
858277936 858277953
858280190 858280207
858282510 858282527
858284781 858284798
858287053 858287070
858289344 858289361
858291597 858291614
858293917 858293934
858296120 858296137
858298233 858298250
858300298 858300315
858302391 858302408
858306519 858306536
858308595 858308612
858310629 858310646
858312714 858312731
858314787 858314804
858316959 858316976
858323546 858323563
858325730 858325747
858327942 858327959
858330144 858330161
858332329 858332346
858334529 858334546
858336724 858336741
858343290 858343307
858345464 858345481
858347656 858347673
858349739 858349756
858351855 858351872
858354016 858354033
858358343 858358360
858360604 858360621
858362737 858362754
858367389 858367406
858369750 858369767
858372072 858372089
858374432 858374449
858379044 858379061
858381404 858381421
858383685 858383702
858388467 858388484
858391677 858391694
858394047 858394064
858396201 858396218
858398570 858398587
858400712 858400729
858402838 858402855
858404989 858405006
858407105 858407122
858409454 858409471
858411570 858411587
858415914 858415931
858417909 858417926
858420031 858420048
858422226 858422243
858426874 858426891
858427163 858427180
858429722 858429739
858432082 858432099
858489615 858489632
858525190 858525207
858533182 858533199
858593656 858593673
858666292 858666309
858779124 858779141
858784450 858784467
858802917 858802934
858862156 858862173
858933363 858933380
858946099 858946116
858967553 858967570
859006500 859006517
859111378 859111395
859118573 859118590
859131977 859131994
859184066 859184083
859187302 859187319
859234871 859234888
859266631 859266648
859373769 859373786
859408394 859408411
859408698 859408715
859408958 859408975
859409011 859409028
859409049 859409066
859409098 859409115
859409378 859409395
859438502 859438519
859446294 859446311
859454129 859454146
859461490 859461507
859536100 859536117
859586899 859586916
859587279 859587296
859587361 859587378
859587524 859587541
859587694 859587711
859587984 859588001
859588057 859588074
859588095 859588112
859589098 859589115
859589524 859589541
859589551 859589568
859589617 859589634
859589711 859589728
859589825 859589842
859589893 859589910
859589936 859589953
859589973 859589990
859590019 859590036
859591572 859591589
859624464 859624481
859639209 859639226
859689306 859689323
859738969 859738986
859756589 859756606
859767893 859767910
859776841 859776858
859788018 859788035
859829235 859829252
860092071 860092088
860098309 860098326
860119776 860119793
860193965 860193982
860212463 860212480
860216219 860216236
860222966 860222983
860228080 860228097
860274872 860274889
860276783 860276800
860278515 860278532
860284868 860284885
860289912 860289929
860292490 860292507
860294972 860294989
860297500 860297517
860300137 860300154
860302665 860302682
860305577 860305594
860308115 860308132
860310705 860310722
860313233 860313250
860315721 860315738
860321135 860321152
860324560 860324577
860327651 860327668
860331098 860331115
860335782 860335799
860355717 860355734
860375159 860375176
860378081 860378098
860380207 860380224
860382407 860382424
860382644 860382661
860384819 860384836
860387543 860387560
860390331 860390348
860392917 860392934
860395228 860395245
860397301 860397318
860399466 860399483
860403920 860403937
860406102 860406119
860408336 860408353
860410556 860410573
860412779 860412796
860415001 860415018
860417195 860417212
860419415 860419432
860425944 860425961
860428107 860428124
860430241 860430258
860437007 860437024
860437245 860437262
860439317 860439334
860451319 860451336
860456218 860456235
860458537 860458554
860460562 860460579
860462617 860462634
860464653 860464670
860466726 860466743
860468820 860468837
860471021 860471038
860475407 860475424
860477560 860477577
860484187 860484204
860493006 860493023
860499653 860499670
860501876 860501893
860502957 860502974
860504068 860504085
860506251 860506268
860514874 860514891
860517078 860517095
860519437 860519454
860524129 860524146
860550815 860550832
860554578 860554595
860558844 860558861
860562316 860562333
860563180 860563197
860567693 860567710
860576405 860576422
860580168 860580185
860583161 860583178
860586066 860586083
860589293 860589310
860589360 860589377
860589974 860589991
860590012 860590029
860591499 860591516
860591679 860591696
860591821 860591838
860592870 860592887
860593237 860593254
860594501 860594518
860596302 860596319
860598729 860598746
860599419 860599436
860602395 860602412
860661583 860661600
860663783 860663800
860670372 860670389
860672574 860672591
860674768 860674785
860676940 860676957
860681344 860681361
860683559 860683576
860684241 860684258
860685799 860685816
860687943 860687960
860702699 860702716
860704289 860704306
860704772 860704789
860706856 860706873
860708959 860708976
860711043 860711060
860713108 860713125
860715203 860715220
860717265 860717282
860719301 860719318
860721424 860721441
860723606 860723623
860725770 860725787
860727982 860727999
860730195 860730212
860732408 860732425
860734629 860734646
860739074 860739091
860741297 860741314
860743518 860743535
860745732 860745749
860747953 860747970
860750145 860750162
860752338 860752355
860754550 860754567
860758876 860758893
860761048 860761065
860765464 860765481
860767677 860767694
860776101 860776118
860778185 860778202
860780281 860780298
860784507 860784524
860786779 860786796
860789109 860789126
860795755 860795772
860798078 860798095
860800378 860800395
860802619 860802636
860804674 860804691
860806740 860806757
860808735 860808752
860810788 860810805
860812990 860813007
860815153 860815170
860817316 860817333
860819480 860819497
860821682 860821699
860823893 860823910
860828299 860828316
860830492 860830509
860832704 860832721
860834906 860834923
860837141 860837158
860839351 860839368
860843765 860843782
860851015 860851032
860853248 860853265
860855371 860855388
860894081 860894098
861026564 861026581
861035747 861035764
861080304 861080321
861087684 861087701
861095643 861095660
861110840 861110857
861162108 861162125
861176926 861176943
861187335 861187352
861286263 861286280
861290253 861290270
861320260 861320277
861392120 861392137
861423271 861423288
861434986 861435003
861455501 861455518
861502377 861502394
861504030 861504047
861505200 861505217
861507709 861507726
861510900 861510917
861513486 861513503
861515995 861516012
861516369 861516386
861518435 861518452
861520945 861520962
861525685 861525702
861527916 861527933
861532284 861532301
861534524 861534541
861536706 861536723
861545151 861545168
861575982 861575999
861579270 861579287
861581566 861581583
861581833 861581850
861582407 861582424
861582556 861582573
861582751 861582768
861583300 861583317
861585677 861585694
861588484 861588501
861588679 861588696
861589103 861589120
861589153 861589170
861589647 861589664
861590719 861590736
861591611 861591628
861592085 861592102
861592501 861592518
861592598 861592615
861592917 861592934
861593154 861593171
861593428 861593445
861595820 861595837
861596104 861596121
861596452 861596469
861596866 861596883
861596936 861596953
861597414 861597431
861597923 861597940
861598125 861598142
861598493 861598510
861598836 861598854
861601824 861601841
861601882 861601899
861601988 861602005
861602146 861602163
861602263 861602280
861602393 861602410
861602883 861602900
861603030 861603047
861603141 861603158
861604067 861604084
861604352 861604369
861606831 861606848
861608575 861608592
861609408 861609425
861611909 861611926
861614476 861614493
861617044 861617061
861622053 861622070
861624450 861624467
861626930 861626947
861629508 861629525
861632399 861632416
861632461 861632478
861641488 861641505
861670436 861670453
861672866 861672883
861675069 861675086
861677459 861677476
861679642 861679659
861681794 861681811
861683930 861683947
861686327 861686344
861688521 861688538
861690903 861690920
861695375 861695392
861697607 861697624
861700128 861700145
861702250 861702267
861704383 861704400
861706517 861706534
861708699 861708716
861710922 861710939
861713152 861713169
861715298 861715315
861717449 861717466
861728274 861728291
861729184 861729201
861732996 861733013
861735336 861735353
861737933 861737950
861740600 861740617
861755644 861755661
861758536 861758553
861760928 861760945
861763437 861763454
861765619 861765636
861765955 861765972
861767801 861767818
861769973 861769990
861772048 861772065
861774162 861774179
861782882 861782899
861784857 861784874
861787041 861787058
861789431 861789448
861789695 861789712
861791781 861791798
861794212 861794229
861796512 861796529
861798695 861798712
861800700 861800717
861802921 861802938
861809604 861809621
861811406 861811423
861835145 861835162
861846292 861846309
861849363 861849380
861851783 861851800
861854280 861854297
861856454 861856471
861858568 861858585
861860759 861860776
861862913 861862930
861869580 861869597
861871969 861871986
861874162 861874179
861879012 861879029
861881184 861881201
861883248 861883265
861885422 861885439
861892730 861892747
861893026 861893043
861901447 861901464
861904187 861904204
861926041 861926058
861935211 861935228
861938500 861938517
861940998 861941015
861942611 861942628
861943536 861943553
861945928 861945945
861948434 861948451
861950608 861950625
861966192 861966209
861968318 861968335
861969072 861969089
861977671 861977688
862040673 862040690
862042836 862042853
862042858 862042875
862045059 862045076
862047252 862047269
862049403 862049420
862051625 862051642
862053770 862053787
862055883 862055900
862058115 862058132
862060308 862060325
862060765 862060782
862062807 862062824
