1164601376.000000 1164601440.000000
1164601656.000000 1164601688.000000
1164601920.000000 1164601944.000000
1164602184.000000 1164602200.000000
1164602448.000000 1164602452.000000
1164606592.000000 1164606656.000000
1164606876.000000 1164606884.000000
1164607140.000000 1164607144.000000
1164608472.000000 1164608488.000000
1164608728.000000 1164608760.000000
1164608996.000000 1164609004.000000
1164609636.000000 1164609644.000000
1164609760.000000 1164609784.000000
1164609961.000000 1164610011.125000
1164610024.000000 1164610032.000000
1164610071.000000 1164610090
1164611600.000000 1164611624.000000
1164614119.000000 1164614124.500000
1164614164.000000 1164614176.000000
1164614251.925781 1164614252.125000
1164614672.000000 1164614676.000000
1164614731.500000 1164614733.000000
1164615830.750000 1164615831.125000
1164615888.000000 1164615900.000000
1164616064.000000 1164616076.000000
1164630646.000000 1164630656.000000
1164631328.000000 1164631332.000000
1164631588.000000 1164631592.000000
1164632303.500000 1164632304.875000
1164633182.000000 1164633190.000000
1164633694.000000 1164633704.000000
1164634125.500000 1164634125.625000
1164634125.750000 1164634126.000000
1164634308.000000 1164634312.000000
1164634687.000000 1164634691.000000
1164635053.875000 1164635057.500000
1164635483.000000 1164635485.000000
1164635870.000000 1164635884.750000
1164660181.750000 1164660182.875000
1164660706.000000 1164660707
1164660992.000000 1164660995.000000
1164662084.000000 1164662096.000000
1164662136.000000 1164662144.000000
1164662347.750000 1164662348.250000
1164662363.500000 1164662366.125000
1164662580.000000 1164662592.000000
1164662722.000000 1164662732.000000
1164662868.000000 1164662880.000000
1164662911.000000 1164662920.000000
1164663116.000000 1164663132.000000
1164663312.000000 1164663340.000000
1164663496.000000 1164663524.000000
1164663668.000000 1164663696.000000
1164663890.000000 1164663896.000000
1164664736.000000 1164664752.000000
1164664900.000000 1164664916.000000
1164665088.000000 1164665104.000000
1164665124.000000 1164665136.000000
1164665153.000000 1164665154.000000
1164665181.687500 1164665182.250000
1164665256.000000 1164665264.000000
1164665794.000000 1164665808.375000
1164667429.500000 1164667431.000000
1164667752.000000 1164667754.000000
1164684502.000000 1164684503.000000
1164684592.000000 1164684616.000000
1164684784.250000 1164684785.000000
1164684848.000000 1164684872.000000
1164685422.812500 1164685426.000000
1164685884.000000 1164685892.000000
1164686013.500000 1164686018.000000
1164686113.375000 1164686122.000000
1164687736.000000 1164687744.000000
1164687839.000000 1164687843.875000
1164688752.000000 1164688776.000000
1164689012.000000 1164689024.000000
1164689344.375000 1164689344.750000
1164689538.000000 1164689558.000000
1164689628.000000 1164689632.000000
1164689888.000000 1164689896.000000
1164690093.000000 1164690105.000000
1164690148.000000 1164690152.000000
1164690724.000000 1164690732.000000
1164690831.000000 1164690840.000000
1164690984.000000 1164690996.000000
1164691209.000000 1164691222.000000
1164691324.000000 1164691338.500000
1164691402.000000 1164691417.000000
1164691504.000000 1164691536.000000
1164691784.000000 1164691796.000000
1164692264.000000 1164692280.000000
1164692372.000000 1164692377.125000
1164692524.000000 1164692536.000000
1164692676.000000 1164692680.000000
1164692996.000000 1164693004.000000
1164693320.000000 1164693344.000000
1164693584.000000 1164693600.000000
1164694739.000000 1164694754.000000
1164695332.000000 1164695352.000000
1164695664.000000 1164695676.000000
1164695930.000000 1164695934.000000
1164696048.000000 1164696080.000000
1164696408.000000 1164696412.000000
1164696816.000000 1164696824.000000
1164698007.312500 1164698011.000000
1164698584.000000 1164698608.875000
1164699024.000000 1164699036.000000
1164699280.000000 1164699304.000000
1164699806.000000 1164699812.000000
1164700868.000000 1164700892.062500
1164701976.000000 1164701984.000000
1164702392.000000 1164702408.000000
1164702540.000000 1164702552.000000
1164702672.000000 1164702696.000000
1164703232.000000 1164703256.000000
1164703420.000000 1164703424.000000
1164704020.000000 1164704025.000000
1164704076.000000 1164704084.000000
1164704336.000000 1164704344.000000
1164704664.000000 1164704676.000000
1164705770.000000 1164705770.500000
1164706520.000000 1164706524.000000
1164706541.500000 1164706543.500000
1164707256.125000 1164707256.750000
1164707392.000000 1164707408.000000
1164707792.000000 1164707816.000000
1164708336.000000 1164708340.000000
1164708430.375000 1164708432.125000
1164709154.625000 1164709173.250000
1164709176.000000 1164709183.250000
1164709440.000000 1164709448.000000
1164709712.000000 1164709724.000000
1164709734.500000 1164709735.250000
1164709808.000000 1164709832.000000
1164710374.250000 1164710374.375000
1164711480.500000 1164711482.000000
1164711556.000000 1164711560.000000
1164711908.000000 1164711912.000000
1164712168.000000 1164712172.000000
1164713136.000000 1164713152.000000
1164713624.000000 1164713638.625000
1164714552.000000 1164714576.000000
1164715564.000000 1164715576.000000
1164715713.000000 1164715725.750000
1164716684.000000 1164716688.000000
1164716816.000000 1164716820.000000
1164717624.000000 1164717648.000000
1164717804.000000 1164717828.000000
1164717964.000000 1164718004.250000
1164718096.000000 1164718104.000000
1164718127.875000 1164718129.000000
1164718183.000000 1164718186.000000
1164718316.000000 1164718328.000000
1164718340.000000 1164718344.000000
1164718370.250000 1164718370.375000
1164718385.000000 1164718388.000000
1164718420.000000 1164718436.000000
1164718572.000000 1164718575.000000
1164718712.000000 1164718736.000000
1164719156.000000 1164719172.000000
1164719440.000000 1164719464.000000
1164719996.000000 1164720004.000000
1164720148.000000 1164720164.000000
1164720256.000000 1164720264.000000
1164720306.000000 1164720316.000000
1164720444.000000 1164720464.062500
1164720653.218750 1164720654.000000
1164738878.000000 1164738879.500000
1164739025.937500 1164739027.000000
1164739186.000000 1164739189.000000
1164739305.750000 1164739308.250000
1164739323.968750 1164739336.000000
1164753654 1164753664.000000
1164754479.000000 1164754481.625000
1164754974.000000 1164754978.000000
1164755471.661132 1164755472.250000
1164757123.750000 1164757125.375000
1164757292.000000 1164757292.750000
1164759968.625000 1164759971.500000
1164761789.000000 1164761789.250000
1164761938.750000 1164761940.000000
1164762763.000000 1164762764.625000
1164764159.125000 1164764159.375000
1164765441.500000 1164765450.250000
1164766296.000000 1164766304.000000
1164767084.000000 1164767092.000000
1164767363.500000 1164767365.875000
1164769706.000000 1164769707.000000
1164770793.406250 1164770798.000000
1164771558.000000 1164771562.000000
1164773979.375000 1164773981.500000
1164778284.000000 1164778296.000000
1164779557.125000 1164779561.250000
1164781203.000000 1164781206.000000
1164781639.000000 1164781648.000000
1164786345.750000 1164786346.000000
1164786468.000000 1164786472.000000
1164787406.000000 1164787412.000000
1164787758.000000 1164787764.000000
1164788195.875000 1164788196.125000
1164788685.000000 1164788694.875000
1164788695.250000 1164788699.125000
1164789767.000000 1164789779.500000
1164792168.000000 1164792172.000000
1164792787.500000 1164792788.000000
1164792811.500000 1164792812.000000
1164802007.000000 1164802011.000000
1164802066.000000 1164802072.000000
1164802228.000000 1164802231.000000
1164802311.000000 1164802314.000000
1164803226.000000 1164803230.000000
1164804196.000000 1164804208.000000
1164804972.000000 1164804984.000000
1164805143.000000 1164805150.125000
1164805162.875000 1164805165.500000
1164805192.000000 1164805200.000000
1164806492.000000 1164806492.750000
1164807090.500000 1164807104.000000
1164808318.500000 1164808318.750000
1164808364.000000 1164808376.000000
1164808538.000000 1164808548.000000
1164808900.000000 1164808928.000000
1164809028.875000 1164809029.000000
1164809076.000000 1164809084.000000
1164809539.500000 1164809542.000000
1164809957.000000 1164809957.500000
1164810688.000000 1164810716.000000
1164810726.000000 1164810730.000000
1164811288.000000 1164811296.000000
1164815678 1164815688.000000
1164815857.000000 1164815859.000000
1164817019 1164817036.000000
1164817658.000000 1164817663.000000
1164820118.375000 1164820120.375000
1164821674.000000 1164821682.000000
1164821838.000000 1164821848.000000
1164822083.500000 1164822084.500000
1164822547.000000 1164822550.000000
1164822882.750000 1164822885.875000
1164823374.000000 1164823384.000000
1164823654.000000 1164823660.125000
1164823663.000000 1164823669.125000
1164823916.000000 1164823946.000000
1164825534.500000 1164825536.437500
1164826292.000000 1164826294.000000
1164829833.125000 1164829839.000000
1164830929.000000 1164830932.000000
1164831342.000000 1164831344.000000
1164831930.000000 1164831936.000000
1165041146.000000 1165041154.000000
1165041326.000000 1165041332.000000
1165041831.000000 1165041831.500000
1165066915.000000 1165066920.000000
1165067020.875000 1165067022.750000
1165067188.375000 1165067195.125000
1165067212.250000 1165067213.500000
1165067603.187500 1165067604.500000
1165067932.000000 1165067956.000000
1165067985.750000 1165067994.000000
1165068145.375000 1165068145.500000
1165068145.875000 1165068152.000000
1165068704.000000 1165068720.000000
1165069115.375000 1165069118.875000
1165069142.000000 1165069145.375000
1165069469.750000 1165069472.250000
1165070167.750000 1165070168.750000
1165070322.000000 1165070344.000000
1165070775.750000 1165070778.250000
1165070907.250000 1165070908.000000
1165070914.375000 1165070916.875000
1165071103.937500 1165071108.000000
1165071173.000000 1165071179.000000
1165071348.000000 1165071360.000000
1165116690.000000 1165116696.000000
1165116752.000000 1165116776.000000
1165116778.000000 1165116784.000000
1165116806.000000 1165116812.000000
1165116832.000000 1165116832.125000
1165117210.375000 1165117213.625000
1165117230.250000 1165117233.125000
1165117330.500000 1165117331.000000
1165117991.500000 1165118001.000000
1165118129.750000 1165118138.000000
1165118176.000000 1165118184.125000
1165118222.000000 1165118232.000000
1165118238.000000 1165118246.000000
1165118411.000000 1165118414.000000
1165118715.875000 1165118734.000000
1165119386.000000 1165119396.000000
1165119492.687500 1165119498.000000
1165119548.000000 1165119556.000000
1165119574.000000 1165119580.000000
1165119586.000000 1165119594.000000
1165119640.500000 1165119646.000000
1165119652.000000 1165119660.000000
1165119958.500000 1165119959.625000
1165119981.500000 1165119986.500000
1165120102.500000 1165120117.500000
1165120118.250000 1165120130.750000
1165120298.000000 1165120318.250000
1165120528.250000 1165120537.750000
1165120608.750000 1165120615.250000
1165120660.125000 1165120666.750000
1165120667.125000 1165120678.125000
1165120764.000000 1165120772.000000
1165120839.500000 1165120851.250000
1165120900.000000 1165120908.000000
1165120926.000000 1165120932.000000
1165121040.500000 1165121051.000000
1165121060.750000 1165121069.500000
1165121077.250000 1165121085.750000
1165121093.500000 1165121100.750000
1165121253.000000 1165121257.500000
1165121630.000000 1165121637.000000
1165121679.250000 1165121684.000000
1165121694.500000 1165121700.750000
1165121791.000000 1165121797.500000
1165122032.000000 1165122042.000000
1165122500.000000 1165122516.000000
1165123689.062500 1165123689.187500
1165123690.281250 1165123690.437500
1165123956.000000 1165123976.000000
1165123983.984375 1165123984.015625
1165124193.750000 1165124197.375000
1165124283.500000 1165124283.750000
1165124284.375000 1165124284.812500
1165124481.000000 1165124484.000000
1165124676.125000 1165124682.375000
1165124764.875000 1165124771.625000
1165125302.500000 1165125303.500000
1165125705.000000 1165125716.375000
1165125716.750000 1165125722.375000
1165125725.625000 1165125732.750000
1165125733.000000 1165125741.000000
1165125741.250000 1165125765.875000
1165127064.875000 1165127076.750000
1165127076.875000 1165127093.625000
1165127616.000000 1165127620.125000
1165127688.000000 1165127696.000000
1165127740.000000 1165127768.000000
1165128722.000000 1165128726.000000
1165128836.000000 1165128840.000000
1165128962.625000 1165128972.250000
1165129020.000000 1165129028.000000
1165130263.953125 1165130274.000000
1165130435.000000 1165130442.375000
1165130519.000000 1165130526.000000
1165130541.664062 1165130552.000000
1165131120.750000 1165131125.000000
1165131352.000000 1165131355.000000
1165131574.875000 1165131575.000000
1165131801.812500 1165131808.156250
1165131839.750000 1165131848.000000
1165132137.375000 1165132137.625000
1165133131.312500 1165133135.000000
1165133312.000000 1165133324.000000
1165134187.625000 1165134219.250000
1165134580.687500 1165134580.875000
1165135505.750000 1165135506.250000
1165135999.000000 1165136003.000000
1165136058.000000 1165136066.000000
1165142901.000000 1165142908.000000
1165143337.625000 1165143345.375000
1165143783.625000 1165143786.625000
1165143848.625000 1165143850.750000
1165143855.125000 1165143867.125000
1165143869.125000 1165143878.375000
1165144089.000000 1165144096.000000
1165144216.250000 1165144221.000000
1165144249.000000 1165144256.000000
1165144632.000000 1165144642.000000
1165144814.000000 1165144816.000000
1165145462.000000 1165145470.125000
1165145536.625000 1165145538.875000
1165145578.875000 1165145579.250000
1165146217.000000 1165146221.000000
1165146402.000000 1165146409.000000
1165146709.875000 1165146710.500000
1165146814.187500 1165146814.312500
1165146814.812500 1165146819.000000
1165146819.312500 1165146819.500000
1165146898.000000 1165146902.000000
1165147653.125000 1165147654.500000
1165147702.500000 1165147704.875000
1165148388.000000 1165148398.000000
1165148418.000000 1165148428.187500
1165148472.125000 1165148481.375000
1165148485.000000 1165148488.000000
1165149304.000000 1165149344.000000
1165149426.125000 1165149426.375000
1165149511.437500 1165149511.625000
1165149512.250000 1165149516.500000
1165149596.500000 1165149602.000000
1165150190.000000 1165150219.125000
1165150420.000000 1165150436.000000
1165150449.250000 1165150480.125000
1165150576.000000 1165150584.000000
1165151166.000000 1165151176.000000
1165151255.000000 1165151258.000000
1165151996.000000 1165152012.000000
1165152027.750000 1165152028.250000
1165152276.000000 1165152280.000000
1165152405.000000 1165152411.000000
1165152666.500000 1165152668.000000
1165152988.000000 1165153016.000000
1165153324.000000 1165153344.000000
1165153720.000000 1165153744.000000
1165153837.000000 1165153844.000000
1165153855.000000 1165153858.437500
1165153897.906250 1165153904.000000
1165154551.500000 1165154568.000000
1165155157.000000 1165155164.000000
1165155178.000000 1165155196.000000
1165155234.000000 1165155238.000000
1165156036.000000 1165156048.000000
1165156274.000000 1165156286.000000
1165156685.000000 1165156694.000000
1165156826.125000 1165156826.625000
1165157887.500000 1165157892.000000
1165157998.875000 1165158018.000000
1165158119.812500 1165158132.000000
1165158267.125000 1165158268.750000
1165158511.875000 1165158512.250000
1165158773.375000 1165158774.000000
1165158855.000000 1165158855.375000
1165159019.320312 1165159048.000000
1165159296.000000 1165159302.000000
1165159374.000000 1165159392.000000
1165159405.625000 1165159416.000000
1165159489.562500 1165159489.625000
1165160036.000000 1165160048.000000
1165160322.000000 1165160324.000000
1165160410.000000 1165160424.000000
1165160896.000000 1165160908.000000
1165160936.000000 1165160976.000000
1165161622.000000 1165161637.000000
1165161667.500000 1165161673.000000
1165161686.202148 1165161688.000000
1165161746.500000 1165161747.000000
1165161869.000000 1165161871.267578
1165162129.500000 1165162133.507813
1165162212.000000 1165162216.500000
1165162293.000000 1165162295.000000
1165162369.750000 1165162375.531250
1165162535.750000 1165162537.500000
1165162818.500000 1165162825.000000
1165162932.000000 1165162936.000000
1165163016.500000 1165163024.000000
1165163161.500000 1165163163.500000
1165163191.500000 1165163200.500000
1165163254.500000 1165163258.889649
1165163293.000000 1165163297.529297
1165163426.500000 1165163431.365235
1165163938.000000 1165163939.500000
1165164154.000000 1165164156.006836
1165164237.500000 1165164243.000000
1165164407.250000 1165164414.000000
1165164660.250000 1165164669.500000
1165164725.239257 1165164731.500000
1165164776.543457 1165164782.265625
1165164796.000000 1165164801.000000
1165165118.229980 1165165123.000000
1165165124.154297 1165165127.856446
1165165144.908447 1165165147.000000
1165165267.500000 1165165270.985352
1165165429.737304 1165165437.335938
1165165515.547363 1165165521.516602
1165165578.889404 1165165585.692383
1165165624.000000 1165165628.000000
1165165731.000000 1165165740.569825
1165165865.741699 1165165869.083008
1165165879.500000 1165165882.500000
1165166062.750000 1165166071.529297
1165166116.984375 1165166123.284058
1165166148.500000 1165166153.856690
1165166379.485351 1165166382.500000
1165166426.000000 1165166432.000000
1165166553.967773 1165166558.278321
1165166567.906494 1165166571.000000
1165166794.500000 1165166803.728516
1165167129.000000 1165167131.500000
1165167214.500000 1165167221.035157
1165167896.968750 1165167901.000000
1165168177.000000 1165168182.319825
1165168502.500000 1165168509.227662
1165168583.000000 1165168587.680664
1165168883.280151 1165168887.175782
1165168890.000000 1165168895.500000
1165169085.500000 1165169093.500000
1165169225.426269 1165169226.000000
1165169238.856445 1165169249.031250
1165169288.500000 1165169291.713379
1165169410.500000 1165169412.500000
1165170129.500000 1165170139.500000
1165170227.000000 1165170233.570313
1165170375.500000 1165170377.076172
1165170628.000000 1165170635.500000
1165170649.000000 1165170650.500000
1165170726.576172 1165170730.013672
1165170961.000000 1165170963.000000
1165171057.500000 1165171064.000000
1165171333.250000 1165171342.019043
1165171620.000000 1165171623.000000
1165171744.500000 1165171748.000000
1165172313.500000 1165172317.500000
1165172324.437500 1165172324.562500
1165172329.000000 1165172331.000000
1165172331.687500 1165172331.812500
1165172549.812500 1165172549.937500
1165172668.912109 1165172672.500000
1165172770.000000 1165172771.500000
1165172857.000000 1165172860.796875
1165173182.467773 1165173184.500000
1165173191.500000 1165173194.000000
1165173681.878906 1165173687.000000
1165173763.500000 1165173768.500000
1165174149.000000 1165174153.464844
1165174203.250000 1165174204.083008
1165174582.666015 1165174586.188965
1165174962.000000 1165174963.500000
1165175031.000000 1165175031.500000
1165175722.994873 1165175729.000000
1165176357.000000 1165176359.017578
1165176487.500000 1165176489.538575
1165176838.595703 1165176844.500000
1165177566.928711 1165177567.250000
1165177776.000000 1165177779.000000
1165177786.000000 1165177786.250000
1165177980.954101 1165177983.807618
1165178177.794922 1165178182.000000
1165178797.500000 1165178801.000000
1165179236.000000 1165179241.000000
1165179424.937500 1165179424.968750
1165179762.035156 1165179764.455078
1165179963.000000 1165179970.500000
1165180016.802246 1165180018.000000
1165180140.437500 1165180143.000000
1165180461.187500 1165180461.500000
1165180461.750000 1165180462.000000
1165180492.500000 1165180497.000000
1165181149.500000 1165181155.000000
1165181629.375488 1165181632.500000
1165182181.000000 1165182193.000000
1165182296.625000 1165182302.476563
1165183377.750000 1165183378.500000
1165184214.500000 1165184216.500000
1165184598.000000 1165184603.611939
1165184916.468750 1165184916.531250
1165187328.815918 1165187337.201172
1165187734.250000 1165187734.375000
1165189611.947265 1165189621.000000
1165189776.937500 1165189777.125000
1165190633.718750 1165190633.812500
1165190643.125000 1165190643.375000
1165191522.101562 1165191528.314453
1165196174.250000 1165196174.625000
1165196416.500000 1165196424.000000
1165196478.500000 1165196478.687500
1165197245.500000 1165197246.000000
1165224946.377929 1165224953.292969
1165224954.000000 1165224961.606446
1165227333.500000 1165227335.000000
1165231916.250000 1165231916.312500
1165233244.000000 1165233245.651368
1165233648.687500 1165233648.837647
1165234425.998535 1165234426.500000
1165234932.000000 1165234933.000000
1165237526.500000 1165237526.562500
1165237538.750000 1165237539.500000
1165237982.500000 1165237984.500000
1165238420.500000 1165238423.000000
1165238493.000000 1165238495.500000
1165239819.913818 1165239823.000000
1165297967.750000 1165297968.000000
1165298389.000000 1165298393.625000
1165299604.500000 1165299611.155762
1165299924.000000 1165299924.500000
1165300644.500000 1165300651.000000
1165301051.500000 1165301054.500000
1165301801.000000 1165301809.300782
1165309536.500000 1165309539.500000
1165341470.000000 1165341471.500000
1165341503.500000 1165341506.750000
1165341864.937500 1165341865.500000
1165342166.500000 1165342169.000000
1165342189.500000 1165342193.000000
1165342253.750000 1165342260.943848
1165342687.500000 1165342691.823243
1165342704.000000 1165342707.000000
1165373550.281250 1165373550.312500
1165373710.000000 1165373716.123047
1165374219.000000 1165374226.044922
1165375720.000000 1165375720.500000
1165375926.750000 1165375927.000000
1165387408.250000 1165387409.000000
1165389492.000000 1165389502.000000
1165389729.000000 1165389740.339844
1165392563.140747 1165392567.500000
1165392766.307617 1165392777.500000
1165393289.687500 1165393290.500000
1165394826.500000 1165394833.937500
1165395911.907226 1165395918.498047
1165396607.860839 1165396618.865235
1165398503.500000 1165398507.500000
1165398569.000000 1165398578.000000
1165398823.500000 1165398837.767578
1165399667.000000 1165399672.000000
1165400502.000000 1165400505.500000
1165402145.000000 1165402145.250000
1165402259.187500 1165402261.000000
1165402269.000000 1165402270.500000
1165403540.500000 1165403542.500000
1165404163.687500 1165404163.750000
1165404253.000000 1165404257.000000
1165404488.000000 1165404494.500000
1165404560.500000 1165404562.098633
1165404612.000000 1165404619.000000
1165404620.000000 1165404620.500000
1165404853.500000 1165404863.000000
1165405596.000000 1165405609.000000
1165405743.000000 1165405744.500000
1165406083.500000 1165406086.500000
1165406501.000000 1165406506.000000
1165406733.500000 1165406740.556153
1165406820.000000 1165406827.500000
1165407134.541015 1165407143.000000
1165407344.000000 1165407347.298828
1165407422.427734 1165407424.000000
1165407441.500000 1165407447.000000
1165407891.000000 1165407895.500000
1165407904.500000 1165407907.500000
1165408096.500000 1165408099.500000
1165408147.000000 1165408157.000000
1165408159.000000 1165408164.594727
1165408321.304199 1165408325.000000
1165408561.712524 1165408565.000000
1165408603.000000 1165408609.690430
1165408835.500000 1165408836.000000
1165408894.000000 1165408905.504883
1165409567.000000 1165409570.000000
1165409714.500000 1165409716.500000
1165409722.812500 1165409722.875000
1165409751.656250 1165409758.000000
1165410024.000000 1165410030.960694
1165410221.062500 1165410221.125000
1165410277.500000 1165410288.764649
1165410344.000000 1165410351.524414
1165410437.799804 1165410450.252930
1165410539.500000 1165410541.500000
1165410719.688476 1165410723.416016
1165410734.000000 1165410736.119629
1165410785.000000 1165410788.394532
1165410813.862548 1165410820.970093
1165411029.500000 1165411031.000000
1165411209.500000 1165411212.500000
1165411421.862304 1165411423.500000
1165411748.999023 1165411751.000000
1165411755.500000 1165411760.022950
1165411842.000000 1165411844.500000
1165411846.500000 1165411860.500000
1165411933.500000 1165411936.500000
1165412142.795654 1165412147.000000
1165412664.811523 1165412668.148438
1165412808.500000 1165412834.348633
1165412978.500000 1165412988.592774
1165413012.000000 1165413014.000000
1165413055.000000 1165413059.000000
1165413096.500000 1165413102.000000
1165413224.500000 1165413225.500000
1165413355.500000 1165413360.061524
1165413599.000000 1165413607.500000
1165413639.000000 1165413647.380860
1165413671.000000 1165413675.500000
1165413730.500000 1165413736.500000
1165413856.362304 1165413873.625000
1165414189.206054 1165414194.000000
1165414347.000000 1165414351.000000
1165414950.459961 1165414958.808594
1165415367.000000 1165415371.805664
1165415489.000000 1165415497.747559
1165415712.000000 1165415716.866211
1165416445.000000 1165416446.515625
1165442754.000000 1165442764.000000
1165442797.000000 1165442797.750000
1165443387.500000 1165443394.000000
1165443447.912109 1165443451.000000
1165443533.500000 1165443539.500000
1165443543.000000 1165443548.500000
1165444110.952148 1165444119.000000
1165444121.304687 1165444125.500000
1165444143.000000 1165444154.549805
1165444161.500000 1165444174.523438
1165444236.976562 1165444240.500000
1165444480.000000 1165444486.000000
1165447872.500000 1165447876.500000
1165448509.026367 1165448524.000000
1165448746.018066 1165448753.000000
1165454307.288818 1165454313.500000
1165454627.000000 1165454633.000000
1165455246.500000 1165455252.134766
1165455575.500000 1165455583.000000
1165455626.500000 1165455635.500000
1165455805.836914 1165455813.000000
1165455836.566162 1165455846.000000
1165455879.500000 1165455894.500000
1165456119.821533 1165456126.509766
1165456302.432129 1165456308
1165459326.000000 1165459329.000000
1165459693.984375 1165459706.000000
1165459821.500000 1165459825.000000
1165459993.500000 1165459999.059571
1165460137.385742 1165460143.500000
1165460208.867187 1165460215.000000
1165460215.681640 1165460223.242188
1165460224.000000 1165460230.500000
1165460252.500000 1165460259.000000
1165460259.500000 1165460268.000000
1165461330.985351 1165461337.000000
1165461380.155517 1165461398.000000
1165461559.000000 1165461565.500000
1165461678.000000 1165461684.000000
1165461865.000000 1165461877.000000
1165461993.589843 1165462001.000000
1165464549.593261 1165464556.000000
1165464793.500000 1165464796.500000
1165464798.500000 1165464804.500000
1165464835.500000 1165464839.500000
1165472167.125000 1165472168.000000
1165472317.000000 1165472317.125000
1165472550.875000 1165472552.000000
1165473018.000000 1165473019.000000
1165473145.000000 1165473148.000000
1165473217.520507 1165473222.203125
1165482094.562500 1165482094.750000
1165482644.154297 1165482650.772461
1165482772.410644 1165482773.500000
1165482819.500000 1165482825.500000
1165482976.000000 1165482988.500000
1165483169.000000 1165483176.500000
1165483437.437500 1165483437.500000
1165484021.000000 1165484024.500000
1165484255.500000 1165484262.500000
1165484355.439453 1165484380.500000
1165484575.500000 1165484589.218750
1165485255.500000 1165485263.895508
1165485700.000000 1165485706.700196
1165485989.500000 1165485996.000000
1165486008.778808 1165486013.000000
1165486159.500000 1165486175.000000
1165486403.500000 1165486409.500000
1165486437.000000 1165486445.500000
1165496169.468261 1165496174.000000
1165496322.963867 1165496329.750000
1165496585.970703 1165496591.000000
1165496909.000000 1165496916.000000
1165497346.000000 1165497352.500000
1165497407.000000 1165497416.500000
1165502908.500000 1165502913.000977
1165532173.172851 1165532181.756470
1165532524.500000 1165532531.000000
1165532724.500000 1165532725.000000
1165532737.408203 1165532741.000000
1165536863.500000 1165536866.500000
1165536933.000000 1165536935.000000
1165536999.000000 1165537005.000000
1165537067.939453 1165537070.000000
1165537471.000000 1165537477.000000
1165560678.041992 1165560684.740235
1165560997.500000 1165561002.609375
1165561789.000000 1165561793.500000
1165562614.362304 1165562624.000000
1165562776.357422 1165562788.000000
1165563121.500000 1165563126.408203
1165563503.937500 1165563517.000000
1165563595.500000 1165563602.423828
1165563624.666992 1165563630.000000
1165563979.000000 1165563988.500000
1165565013.000000 1165565018.274414
1165565593.812500 1165565593.937500
1165565683.500000 1165565689.610352
1165565690.500000 1165565693.500000
1165565965.045898 1165565976.398438
1165578414.000000 1165578417.000000
1165578521.000000 1165578530.000000
1165578557.846557 1165578568.000000
1165578677.446289 1165578679.500000
1165578753.000000 1165578762.783203
1165579295.839843 1165579301.000000
1165580416.000000 1165580419.547852
1165580861.520507 1165580869.617188
1165581064.500000 1165581067.563965
1165581104.000000 1165581111.115235
1165581237.858886 1165581250.000000
1165581859.781250 1165581859.843750
1165581938.500000 1165581940.787110
1165582065.000000 1165582067.000000
1165582665.437500 1165582666.007813
1165582703.000000 1165582704.000000
1165582844.000000 1165582852.500000
1165583021.500000 1165583025.763672
1165583088.500000 1165583095.000000
1165583228.500000 1165583235.692383
1165583498.500000 1165583500.607422
1165583527.916992 1165583545.007813
1165583578.500000 1165583582.658081
1165583685.000000 1165583691.796875
1165583904.500000 1165583910.000000
1165584194.500000 1165584199.188477
1165584387.488281 1165584389.000000
1165584400.000000 1165584408.148438
1165584786.679687 1165584793.011719
1165584966.500000 1165584969.000000
1165584980.880371 1165584983.000000
1165585087.500000 1165585091.628907
1165585451.804687 1165585455.063477
1165585651.482422 1165585657.428711
1165585910.410156 1165585914.103516
1165586012.086181 1165586019.500000
1165586277.687500 1165586278.000000
1165586365.500000 1165586368.262696
1165586457.500000 1165586463.500000
1165586524.440429 1165586530.175782
1165586569.000000 1165586569.062500
1165586640.500000 1165586644.000000
1165586760.936035 1165586762.500000
1165586939.250000 1165586940.500000
1165586958.730468 1165586963.500000
1165587425.500000 1165587428.000000
1165587564.000000 1165587568.598633
1165587607.047851 1165587614.036133
1165587620.586547 1165587624.500000
1165588093.500000 1165588093.625000
1165588260.292968 1165588264.500000
1165588753.500000 1165588756.918213
1165588776.000000 1165588782.280274
1165588858.187500 1165588858.500000
1165589118.500000 1165589121.172364
1165589285.647461 1165589289.500000
1165589341.496093 1165589345.500000
1165589377.761718 1165589381.269043
1165589420.079101 1165589423.000000
1165589707.902343 1165589710.164795
1165589884.442138 1165589889.500000
1165589890.000000 1165589899.709961
1165590262.390625 1165590264.000000
1165590295.990966 1165590299.000000
1165590516.430664 1165590521.000000
1165590572.500000 1165590574.348633
1165597504.000000 1165597507.000000
1165603279.500000 1165603282.500000
1165603639.000000 1165603640.500000
1165607217.375000 1165607217.406250
1165607841.625000 1165607841.687500
1165608350.125000 1165608350.500000
1165608411.500000 1165608414.000000
1165608661.000000 1165608662.500000
1165608720.500000 1165608725.000000
1165608835.500000 1165608842.000000
1165608849.000000 1165608851.000000
1165609170.500000 1165609173.685547
1165609434.922851 1165609439.326172
1165609588.625000 1165609588.750000
1165609937.500000 1165609940.000000
1165619177.500000 1165619177.625000
1165620751.437500 1165620751.562500
1165621006.687500 1165621006.718750
1165621802.687500 1165621802.812500
1165624490.312500 1165624490.375000
1165627025.500000 1165627025.750000
1165630384.430664 1165630386.537110
1165630467.875000 1165630467.937500
1165638313.500000 1165638314.125000
1165639717.959961 1165639718.500000
1165639734.125000 1165639734.375000
1165640192.843750 1165640192.906250
1165641225.312500 1165641225.500000
1165642587.000000 1165642587.500000
1165643667.812500 1165643667.843750
1165659081.875000 1165659082.500000
1165664261.000000 1165664261.187500
1165665401.375000 1165665401.562500
1165667009.562500 1165667009.875000
1165668744.500000 1165668747.500000
1165670093.062500 1165670093.125000
1165671068.906250 1165671068.968750
1165702397.718750 1165702397.812500
1165703520.750000 1165703521.000000
1165703808.000000 1165703810.500000
1165704053.000000 1165704055.000000
1165704243.000000 1165704243.125000
1165706169.937500 1165706170.062500
1165706171.562500 1165706171.656250
1165706196.562500 1165706196.625000
1165707196.531250 1165707196.687500
1165707435.750000 1165707436.500000
1165708099.500000 1165708100.000000
1165708326.937500 1165708327.250000
1165708329.500000 1165708330.750000
1165708432.781250 1165708432.875000
1165708800.000000 1165708800.250000
1165709212.843750 1165709212.875000
1165712294.062500 1165712294.187500
1165716382.257812 1165716382.875000
1165716507.687500 1165716507.812500
1165716731.312500 1165716731.375000
1165717028.375000 1165717029.041016
1165731269.187500 1165731269.330811
1165740719.093750 1165740719.156250
1165741641.531250 1165741641.562500
1165748646.000000 1165748646.500000
1165752010.000000 1165752010.062500
1165754189.000000 1165754189.500000
1165754458.750000 1165754459.250000
1165759845.835937 1165759847.791016
1165760838.500000 1165760840.500000
1165760915.875000 1165760916.500000
1165766414.250000 1165766414.523926
1168650989.000000 1168651002.000000
1168651087.000000 1168651092.000000
1168654297.250000 1168654297.750000
1168658474.000000 1168658481.000000
1168659860.500000 1168659861.500000
1168662571.500000 1168662572.250000
1168662911.500000 1168662913.500000
1168665151.500000 1168665155.000000
1168666025.000000 1168666026.000000
1168668693.250000 1168668695.000000
1168671993.375000 1168671993.625000
1168676511.500000 1168676514.000000
1168677690.000000 1168677696.000000
1168677716.000000 1168677722.000000
1168694975.000000 1168694983.000000
1168695576.000000 1168695594.000000
1168695624.000000 1168695644.000000
1168695667.000000 1168695672.000000
1168698837.000000 1168698838.500000
1168699141.750000 1168699150.000000
1168723703.000000 1168723704.000000
1168724153.000000 1168724170.000000
1168724242.250000 1168724243.000000
1168724272.000000 1168724278.000000
1168724681.000000 1168724684.000000
1168726867.000000 1168726869.000000
1168728201.000000 1168728256.000000
1168728287.000000 1168728297.187500
1168728638.000000 1168728644.000000
1168730016.000000 1168730023.000000
1168730224.000000 1168730232.000000
1168735160.000000 1168735169.000000
1168735662.500000 1168735667.000000
1168736143.000000 1168736151.000000
1168741472.000000 1168741478.000000
1168743501.500000 1168743502.500000
1168763118.000000 1168763126.000000
1168763433.500000 1168763435.500000
1168763536.000000 1168763546.000000
1168764739.000000 1168764747.000000
1168765774.000000 1168765779.125000
1168766870.000000 1168766872.000000
1168783249.000000 1168783256.000000
1168783433.000000 1168783435.000000
1168792538.000000 1168792544.000000
1168794454.000000 1168794466.000000
1168795254.000000 1168795264.000000
1168795858.750000 1168795860.500000
1168803390.000000 1168803398.000000
1168804668.000000 1168804672.000000
1168805057.000000 1168805058.000000
1168805574.250000 1168805574.750000
1168808144.000000 1168808151.000000
1168811476.000000 1168811480.000000
1168812342.500000 1168812344.000000
1168812518.500000 1168812520.000000
1168812874.000000 1168812882.000000
1168813209.500000 1168813211.500000
1168813223.500000 1168813224.500000
1168814141.000000 1168814151.000000
1168814223.000000 1168814235.000000
1168815633.500000 1168815635.000000
1168816626.000000 1168816634.000000
1168816656.000000 1168816665.000000
1168817138.000000 1168817156.000000
1168817208.000000 1168817223.000000
1168817402.000000 1168817414.000000
1168819208.000000 1168819214.000000
1168822480.187500 1168822481.000000
1168826678.000000 1168826694.000000
1168828058.000000 1168828064.000000
1168831472.687500 1168831473.250000
1168836229.500000 1168836231.000000
1168836310.000000 1168836314.000000
1168838346.000000 1168838352.000000
1168838440.000000 1168838446.000000
1168850660.000000 1168850677.000000
1168851517.000000 1168851521.000000
1168851708.000000 1168851728.000000
1168852163.000000 1168852207.000000
1168856013.000000 1168856015.000000
1168859938.000000 1168859944.000000
1168859962.000000 1168859973.000000
1168860849.500000 1168860853.000000
1168861876.000000 1168861880.000000
1168862168.500000 1168862170.000000
1168862218.000000 1168862227.000000
1168862287.000000 1168862292.000000
1168864141.000000 1168864150.000000
1168864631.000000 1168864653.000000
1168865219.000000 1168865226.000000
1168865260.500000 1168865269.000000
1168866458.000000 1168866459.000000
1168867196.500000 1168867198.500000
1168867317.500000 1168867319.500000
1168867371.000000 1168867381.000000
1168867952.500000 1168867954.500000
1168869747.250000 1168869748.000000
1168870689.000000 1168870695.000000
1168872268.000000 1168872274.000000
1168873072.000000 1168873088.000000
1168875068.000000 1168875071.000000
1168875077.000000 1168875079.000000
1168875998.250000 1168875999.500000
1168879403.000000 1168879411.000000
1168879642.625000 1168879651.000000
1168879991.937500 1168880002.000000
1168880598.250000 1168880600.000000
1168880709.000000 1168880715.000000
1168880897.500000 1168880898.500000
1168881516.250000 1168881516.437500
1168881588.375000 1168881591.500000
1168881606.000000 1168881613.000000
1168882890.000000 1168882907.000000
1168883017.000000 1168883024.000000
1168884383.500000 1168884385.500000
1168884468.000000 1168884475.000000
1168884578.000000 1168884584.000000
1168886242.500000 1168886243.000000
1168887722.000000 1168887725.000000
1168888374.500000 1168888384.000000
1168888796.718750 1168888797.000000
1168889865.500000 1168889867.000000
1168890219.000000 1168890227.000000
1168891148.000000 1168891148.750000
1168891456.000000 1168891467.000000
1168892577.000000 1168892579.000000
1168893368.000000 1168893374.000000
1168893550.125000 1168893550.375000
1168893763.500000 1168893772.000000
1168895605.250000 1168895606.750000
1168898083.000000 1168898087.000000
1168898627.000000 1168898637.000000
1168899744.250000 1168899745.000000
1168900254.000000 1168900262.000000
1168900288.000000 1168900301.000000
1168901196.000000 1168901201.000000
1168901647.750000 1168901648.500000
1168921536.000000 1168921544.000000
1168922326.000000 1168922332.000000
1168922980.562500 1168922982.000000
1168927078.000000 1168927086.000000
1168928412.000000 1168928418.000000
1168929790.000000 1168929800.000000
1168932992.000000 1168933002.000000
1168934599.812500 1168934599.906250
1168937258.000000 1168937262.000000
1168939164.000000 1168939182.000000
1168951904.000000 1168951916.000000
1168952377.062500 1168952377.750000
1168953445.000000 1168953450.000000
1168953522.000000 1168953530.000000
1168953668.000000 1168953689.000000
1168955390.000000 1168955405.000000
1168955570.000000 1168955579.000000
1168957844.250000 1168957845.000000
1168962397.500000 1168962399.500000
1168962516.000000 1168962524.000000
1168965993.500000 1168965995.000000
1168970849.437500 1168970850.500000
1168973081.062500 1168973083.062500
1168973358.687500 1168973359.281250
1168975560.000000 1168975564.000000
1168975949.000000 1168975950.000000
1168976706.000000 1168976722.000000
1168976729.000000 1168976740.000000
1168977102.000000 1168977105.000000
1168977683.000000 1168977691.000000
1168980924.000000 1168980929.000000
1168980955.500000 1168980961.000000
1168981622.000000 1168981628.000000
1168983072.000000 1168983072.750000
1168983518.000000 1168983530.000000
1168983570.000000 1168983580.000000
1168983589.000000 1168983603.000000
1168983606.500000 1168983631.000000
1168985130.500000 1168985132.500000
1168985474.500000 1168985477.500000
1168986839.000000 1168986844.000000
1168991786.000000 1168991794.000000
1168991867.000000 1168991880.000000
1168992947.000000 1168992955.000000
1168994448.000000 1168994454.000000
1168994879.000000 1168994885.156250
1168997333.000000 1168997339.000000
1168999078.000000 1168999080.000000
1169000155.000000 1169000172.000000
1169000177.000000 1169000183.000000
1169000495.000000 1169000516.000000
1169012716.000000 1169012728.000000
1169015320.375000 1169015322.000000
1169018807.687500 1169018808.000000
1169019348.000000 1169019350.000000
1169020271.000000 1169020281.000000
1169020693.000000 1169020706.000000
1169022730.875000 1169022731.500000
1169023711.375000 1169023722.000000
1169035465.000000 1169035469.000000
1169035722.000000 1169035730.000000
1169036137.875000 1169036146.000000
1169036427.000000 1169036434.000000
1169037655.000000 1169037657.000000
1169039894.250000 1169039895.500000
1169040922.000000 1169040927.000000
1169041273.000000 1169041279.000000
1169042297.000000 1169042303.000000
1169043071.500000 1169043074.000000
1169043993.500000 1169043995.500000
1169044506.250000 1169044508.000000
1169058811.000000 1169058814.000000
1169061708.500000 1169061711.500000
1169062235.250000 1169062236.000000
1169066212.000000 1169066213.000000
1169066310.000000 1169066311.750000
1169066733.500000 1169066739.500000
1169067289.500000 1169067292.500000
1169067296.500000 1169067299.000000
1169067771.250000 1169067772.000000
1169068838.500000 1169068841.000000
1169069431.750000 1169069433.000000
1169069955.000000 1169069955.500000
1169070025.625000 1169070027.000000
1169070687.000000 1169070689.500000
1169070945.500000 1169070946.250000
1169072152.000000 1169072160.000000
1169075678.937500 1169075680.000000
1169076293.500000 1169076300.000000
1169077482.000000 1169077487.000000
1169078100.000000 1169078109.000000
1169078568.750000 1169078576.000000
1169078977.500000 1169078980.500000
1169081212.500000 1169081218.500000
1169082143.500000 1169082151.000000
1169082347.000000 1169082352.000000
1169085136.000000 1169085146.000000
1169085152.000000 1169085178.000000
1169093333.500000 1169093339.500000
1169208184.500000 1169208189.000000
1169208595.000000 1169208596.000000
1169208652.000000 1169208657.500000
1169209002.000000 1169209007.500000
1169209015.000000 1169209019.500000
1169209102.250000 1169209102.750000
1169209702.500000 1169209707.000000
1169209796.500000 1169209801.500000
1169209950.000000 1169209954.500000
1169210254.000000 1169210258.500000
1169210337.000000 1169210338.500000
1169210863.500000 1169210869.500000
1169211144.000000 1169211145.000000
1169211293.000000 1169211298.000000
1169211359.000000 1169211361.000000
1169211724.000000 1169211728.000000
1169212024.500000 1169212031.000000
1169212102.000000 1169212102.500000
1169212691.500000 1169212694.500000
1169212783.500000 1169212786.000000
1169213112.000000 1169213119.000000
1169213321.500000 1169213325.500000
1169213500.500000 1169213503.500000
1169213924.000000 1169213928.500000
1169213999.000000 1169214001.000000
1169215547.500000 1169215554.000000
1169215893.500000 1169215896.500000
1169216231.000000 1169216233.500000
1169216449.000000 1169216451.000000
1169216506.000000 1169216509.000000
1169237232.500000 1169237234.000000
1169237385.000000 1169237385.750000
1169237692.500000 1169237694.500000
1169237830.000000 1169237832.000000
1169239495.750000 1169239496.000000
1169239548.000000 1169239549.500000
1169239818.000000 1169239820.000000
1169240734.500000 1169240739.000000
1169240765.000000 1169240767.000000
1169241011.500000 1169241014
1169241215.000000 1169241221.000000
1169241256.500000 1169241260.500000
1169241306.937500 1169241311.000000
1169242120.937500 1169242121.250000
1169242351.250000 1169242352.500000
1169242383.750000 1169242386.500000
1169242642.500000 1169242644.500000
1169242767.500000 1169242774.500000
1169243861.000000 1169243863.000000
1169243970.500000 1169243972.250000
1169244303.500000 1169244305.000000
1169244306.000000 1169244308.000000
1169244368.875000 1169244370.000000
1169244659.500000 1169244661.000000
1169244780.000000 1169244782.500000
1169245226.000000 1169245232.500000
1169246284.500000 1169246291.500000
1169246308.500000 1169246313.500000
1169246802.000000 1169246807.000000
1169246927.000000 1169246932.000000
1169247045.000000 1169247047.500000
1169247297.000000 1169247302.500000
1169247572.750000 1169247574.000000
1169248365.500000 1169248370.000000
1169248462.750000 1169248463.250000
1169248516.000000 1169248521.000000
1169249056.500000 1169249061.000000
1169249072.000000 1169249079.000000
1176253211 1176253214
1176253217 1176253236
1176253241 1176253242
1176253245 1176253250
1176316438 1176316439
1176486968 1176486969
1176488109 1176488110
1176488112 1176488114
1176488118 1176488121
1176488399 1176488401
1176488567 1176488571
1176488704 1176488706
1176488728 1176488731
1176488738 1176488739
1176488742 1176488743
1176488758 1176488759
1176488760 1176488762
1176488763 1176488765
1176488828 1176488830
1176488839 1176488840
1176489189 1176489198
1176489199 1176489203
1176489319 1176489320
1176756407 1176756408
1176756409 1176756411
1176756414 1176756415
1176756418 1176756420
1176756421 1176756422
1176946433 1176946434
1176946845 1176946846
1176946984 1176946985
1176947040 1176947041
1176947229 1176947230
1176947314 1176947316
1176947332 1176947335
1176947454 1176947457
1176947459 1176947460
1176947463 1176947467
1176947529 1176947531
1176947539 1176947540
1176947541 1176947542
1176947625 1176947632
1176947636 1176947641
1176947688 1176947704
1176947705 1176947722
1176947724 1176947726
1176947727 1176947728
1176947770 1176947792
1176947931 1176947933
1176947942 1176947948
1176947949 1176947951
1176948010 1176948014
1176948016 1176948021
1176948049 1176948064
1176948065 1176948069
1176948070 1176948071
1176948100 1176948105
1176948106 1176948108
1176948112 1176948115
1176948176 1176948178
1176948197 1176948205
1176948206 1176948207
1176948271 1176948274
1176948275 1176948277
1176948336 1176948337
1176948338 1176948339
1176948353 1176948354
1176948361 1176948362
1176948364 1176948366
1176948367 1176948368
1176948373 1176948374
1176948390 1176948391
1176948398 1176948399
1176948401 1176948403
1176948404 1176948405
1176948409 1176948410
1176948438 1176948439
1176948505 1176948509
1176948543 1176948547
1176948549 1176948550
1176948639 1176948642
1176948645 1176948650
1176948655 1176948657
1176948658 1176948659
1176948702 1176948703
1176948708 1176948711
1176948714 1176948715
1176948720 1176948721
1176948789 1176948790
1176948796 1176948797
1176948799 1176948802
1176948826 1176948827
1176948839 1176948842
1176948843 1176948846
1176948918 1176948919
1176948926 1176948927
1176949087 1176949088
1176949091 1176949092
1176949102 1176949103
1176949386 1176949387
1176949488 1176949490
1176949495 1176949496
1176949614 1176949616
1176949653 1176949654
1176949676 1176949677
1176949813 1176949814
1176949816 1176949817
1177012012 1177012013
1177429047 1177429048
1177429064 1177429069
1177429098 1177429100
1177438255 1177438258
1177857485 1177857492
1177857496 1177857497
1177857498 1177857499
1177857500 1177857503
1177858873 1177858875
1177859392 1177859394
1177878756 1177878759
1177879344 1177879350
1177880316 1177880318
1177880351 1177880352
1177880471 1177880474
1177880732 1177880733
1177880744 1177880747
1177893764 1177893765
1177893955 1177893963
1177893969 1177893970
1179846990 1179846992
1179847056 1179847057
1179847232 1179847233
1180084288 1180084290
1180092146 1180092147
1180092149 1180092151
1180092154 1180092156
1180092157 1180092158
1180092159 1180092162
1180092206 1180092208
1180180300 1180180301
1180181282 1180181283
1180184947 1180184948
1180185775 1180185776
1180187553 1180187555
1180187557 1180187558
1180187613 1180187614
1180387804 1180387805
1180387811 1180387813
1180387815 1180387816
1180387866 1180387869
1180387873 1180387877
1180387920 1180387923
1180387936 1180387937
1180387946 1180387948
1180387974 1180387977
1180387984 1180387985
1180388046 1180388047
1180388059 1180388060
1180388068 1180388069
1180388109 1180388110
1180388115 1180388118
1180388149 1180388151
1180388152 1180388153
1180388200 1180388202
1180388223 1180388224
1180388225 1180388228
1180388232 1180388237
1180388257 1180388258
1180388352 1180388354
1180388363 1180388367
1180388373 1180388375
1180388409 1180388410
1180388412 1180388413
1180388416 1180388418
1180388420 1180388422
1180388519 1180388521
1180388524 1180388525
1180388526 1180388527
1180388528 1180388531
1180388534 1180388537
1180388576 1180388578
1180388584 1180388585
1180388586 1180388587
1180388592 1180388597
1180388635 1180388636
1180388637 1180388638
1180388641 1180388643
1180388644 1180388646
1180388648 1180388649
1180388651 1180388654
1180388673 1180388675
1180388683 1180388684
1180388734 1180388736
1180388737 1180388738
1180388744 1180388746
1180388747 1180388748
1180388754 1180388755
1180388764 1180388765
1180388808 1180388809
1180388813 1180388819
1180388822 1180388826
1180388842 1180388844
1180388847 1180388848
1180388851 1180388860
1180388861 1180388869
1180388910 1180388911
1180388933 1180388934
1180388935 1180388945
1180388946 1180388955
1180389004 1180389005
1180389009 1180389016
1180389021 1180389022
1180389034 1180389035
1180389047 1180389050
1180389057 1180389059
1180389203 1180389204
1180389209 1180389214
1180389246 1180389247
1180389249 1180389252
1180389254 1180389255
1180389257 1180389260
1180389508 1180389526
1180389527 1180389528
1180389665 1180389666
1180547173 1180547174
1180547468 1180547469
1180547577 1180547579
1180547592 1180547594
1180547905 1180547906
1180547910 1180547911
1180548007 1180548008
1180548220 1180548221
1180548667 1180548670
1180548678 1180548679
1180548683 1180548684
1180548797 1180548798
1180548802 1180548805
1180548823 1180548824
1180548985 1180548986
1180549080 1180549081
1180549303 1180549305
1180549315 1180549316
1180549436 1180549437
1180549447 1180549448
1180549450 1180549451
1180550713 1180550714
1180646160 1180646161
1180820617 1180820619
1180820620 1180820622
1180820691 1180820694
1180820966 1180820970
1180823157 1180823158
1180823159 1180823160
1180823336 1180823337
1180823823 1180823825
1180824264 1180824265
1180824266 1180824267
1180824277 1180824278
1180824757 1180824758
1180982781 1180982782
1181239304 1181239309
1181239311 1181239314
1181239516 1181239517
1181239518 1181239519
1181239521 1181239522
1181240561 1181240562
1181241736 1181241739
1181244330 1181244331
1181244552 1181244553
1181244671 1181244673
1181244681 1181244683
1181244709 1181244710
1181245282 1181245283
1181245494 1181245496
1181245498 1181245501
1181245502 1181245503
1181245697 1181245700
1181246107 1181246108
1181246115 1181246116
1181246117 1181246118
1181246353 1181246354
1181246362 1181246363
1181247331 1181247333
1181247337 1181247339
1181248986 1181248987
1181249216 1181249217
1181249533 1181249534
1181249540 1181249542
1181249560 1181249561
1181249568 1181249569
1181249603 1181249604
1181249606 1181249607
1181249616 1181249618
1181249624 1181249626
1181249667 1181249669
1181249675 1181249676
1181249721 1181249727
1181249769 1181249770
1181249779 1181249780
1181249812 1181249814
1181249821 1181249822
1181249843 1181249845
1181249848 1181249849
1181249862 1181249865
1181249871 1181249872
1181249912 1181249913
1181249964 1181249967
1181249968 1181249970
1181249974 1181249976
1181249977 1181249979
1181250083 1181250086
1181250093 1181250094
1181250100 1181250101
1181250197 1181250198
1181250203 1181250205
1181250207 1181250208
1181250253 1181250254
1181250256 1181250257
1181250297 1181250299
1181250307 1181250308
1181250340 1181250345
1181250346 1181250348
1181250349 1181250350
1181250352 1181250355
1181250434 1181250436
1181250544 1181250546
1181250547 1181250563
1181250564 1181250565
1181250808 1181250810
1181251046 1181251047
1181251055 1181251056
1181251057 1181251058
1181251066 1181251067
1181251068 1181251070
1181251231 1181251232
1181251366 1181251370
1181326472 1181326473
1181326474 1181326475
1181326477 1181326478
1181326516 1181326517
1181326520 1181326522
1181326645 1181326646
1181326647 1181326648
1181326852 1181326853
1181326871 1181326873
1181326896 1181326897
1181326945 1181326946
1181327068 1181327069
1181327077 1181327078
1181327197 1181327199
1181327207 1181327209
1181327334 1181327336
1181327407 1181327409
1181327415 1181327416
1181327444 1181327445
1181327468 1181327469
1181327521 1181327522
1181327572 1181327573
1181327576 1181327578
1181327580 1181327581
1181327582 1181327586
1181327592 1181327594
1181327623 1181327628
1181327718 1181327723
1181327726 1181327729
1181327763 1181327780
1181327782 1181327784
1181327785 1181327789
1181327831 1181327832
1181327836 1181327840
1181327845 1181327847
1181327857 1181327858
1181327885 1181327887
1181327899 1181327900
1181327956 1181327958
1181328022 1181328030
1181328111 1181328114
1181328120 1181328121
1181328224 1181328225
1181328226 1181328227
1181328316 1181328317
1181328386 1181328387
1181328389 1181328391
1181328394 1181328398
1181328444 1181328449
1181328516 1181328527
1181328529 1181328530
1181328585 1181328587
1181328590 1181328591
1181328594 1181328597
1181328599 1181328603
1181328604 1181328605
1181328656 1181328669
1181328892 1181328894
1181328897 1181328899
1181329007 1181329009
1181329010 1181329015
1181329867 1181329868
1181330710 1181330721
1181330724 1181330725
1181330837 1181330840
1181330846 1181330847
1181330848 1181330850
1181330851 1181330852
1181330853 1181330856
1181331050 1181331053
1181331061 1181331062
1181499778 1181499779
1181767939 1181767940
1181767985 1181767987
1181769082 1181769084
1181850697 1181850698
1181850700 1181850702
1181850710 1181850711
1181850712 1181850713
1181850716 1181850719
1181850742 1181850748
1181850750 1181850751
1181850752 1181850756
1181850758 1181850760
1181850783 1181850785
1181850792 1181850796
1181850816 1181850821
1181850822 1181850823
1181850824 1181850826
1181850827 1181850828
1181850829 1181850832
1181850873 1181850878
1181850881 1181850888
1181850889 1181850890
1181851108 1181851109
1181851119 1181851120
1181851132 1181851134
1181851139 1181851140
1181851178 1181851179
1181851269 1181851271
1181851384 1181851385
1181851424 1181851426
1181851458 1181851460
1181851586 1181851587
1181851590 1181851593
1181851595 1181851597
1181851604 1181851608
1181851610 1181851611
1181851676 1181851677
1181851700 1181851701
1181851703 1181851706
1181851726 1181851728
1181851734 1181851738
1181851739 1181851740
1181851750 1181851753
1181851802 1181851803
1181851831 1181851834
1181851851 1181851853
1181958053 1181958055
1181958056 1181958057
1182266825 1182266827
1182266829 1182266830
1182266833 1182266835
1182275714 1182275716
1182275768 1182275769
1182275780 1182275781
1182276049 1182276052
1182276282 1182276284
1182331170 1182331174
1182331316 1182331318
1182332865 1182332867
1182332959 1182332960
1182333559 1182333562
1182368726 1182368727
1182368775 1182368777
1182368785 1182368786
1182369044 1182369045
1182369376 1182369377
1182369577 1182369581
1182369659 1182369662
1182369668 1182369670
1182369970 1182369972
1182369979 1182369980
1182370030 1182370032
1182370098 1182370099
1182370157 1182370159
1182370196 1182370197
1182370222 1182370223
1182370313 1182370314
1182370336 1182370338
1182370411 1182370412
1182370415 1182370416
1182370424 1182370425
1182370434 1182370435
1182370516 1182370518
1182370520 1182370522
1182370552 1182370558
1182370669 1182370670
1182370674 1182370675
1182370726 1182370728
1182370768 1182370769
1182370848 1182370849
1182370937 1182370939
1182371202 1182371206
1182371214 1182371215
1182371219 1182371220
1182371221 1182371223
1182371265 1182371267
1182371277 1182371279
1182371286 1182371288
1182371374 1182371375
1182371402 1182371404
1182371411 1182371413
1182371414 1182371416
1182371422 1182371423
1182371481 1182371482
1182371547 1182371548
1182371553 1182371559
1182371564 1182371568
1182371620 1182371627
1182371632 1182371633
1182371635 1182371637
1182371674 1182371677
1182371686 1182371687
1182371716 1182371717
1182371718 1182371720
1182371748 1182371749
1182371784 1182371785
1182371846 1182371848
1182371850 1182371852
1182371856 1182371857
1182371861 1182371862
1182371877 1182371881
1182371885 1182371886
1182371906 1182371911
1182372018 1182372019
1182372041 1182372043
1182372126 1182372127
1182372157 1182372160
1182372163 1182372165
1182372224 1182372230
1182372232 1182372233
1182372234 1182372237
1182372240 1182372243
1182372303 1182372304
1182372472 1182372474
1182372609 1182372611
1182372810 1182372812
1182372935 1182372936
1182373269 1182373271
1182373274 1182373275
1182378353 1182378354
1182378531 1182378532
1182378533 1182378534
1182378537 1182378538
1182461780 1182461781
1182461785 1182461786
1182464580 1182464582
1182464583 1182464601
1182528481 1182528484
1183207377 1183207379
1183246787 1183246788
1183246828 1183246830
1183246857 1183246860
1183246897 1183246902
1183246981 1183246984
1183247073 1183247077
1183247078 1183247079
1183414083 1183414086
1183554705 1183554706
1183554913 1183554914
1183555115 1183555116
1183555357 1183555358
1183555637 1183555639
1183590442 1183590445
1183590451 1183590452
1183590974 1183590981
1183591032 1183591033
1183591097 1183591098
1183591268 1183591271
1183591277 1183591278
1183591305 1183591307
1183591311 1183591312
1183591480 1183591482
1183591510 1183591512
1183591544 1183591547
1183591563 1183591566
1183591732 1183591733
1183591737 1183591738
1183591977 1183591980
1183592026 1183592028
1183592029 1183592030
1183592064 1183592065
1183592066 1183592067
1183592159 1183592161
1183592191 1183592194
1183592197 1183592199
1183592200 1183592201
1183592481 1183592483
1183592510 1183592512
1183592513 1183592515
1183592518 1183592519
1183592556 1183592557
1183592623 1183592628
1183592641 1183592646
1183668757 1183668758
1183669955 1183669957
1183670150 1183670151
1183670378 1183670379
1183670557 1183670559
1183670572 1183670576
1183670709 1183670714
1183670717 1183670718
1183670720 1183670721
1183670750 1183670751
1183670787 1183670790
1183670800 1183670803
1183670804 1183670805
1183670807 1183670810
1183670833 1183670837
1183670838 1183670840
1183670857 1183670858
1183670889 1183670893
1183670928 1183670929
1183670952 1183670953
1183670959 1183670960
1183671393 1183671395
1183671427 1183671428
1183671618 1183671619
1183671660 1183671663
1183671718 1183671720
1183671804 1183671805
1183671869 1183671871
1183671913 1183671914
1183671918 1183671922
1183671944 1183671945
1183671985 1183671986
1183671994 1183671996
1183672038 1183672039
1183672060 1183672062
1183672068 1183672070
1183672083 1183672085
1183672116 1183672119
1183672129 1183672132
1183672227 1183672228
1183672268 1183672270
1183672277 1183672279
1183672304 1183672306
1183672343 1183672347
1183672351 1183672352
1183672362 1183672363
1183672386 1183672387
1183672394 1183672395
1183672416 1183672417
1183672419 1183672420
1183672499 1183672500
1183672522 1183672523
1183672604 1183672605
1183672606 1183672607
1183672614 1183672618
1183672619 1183672622
1183672623 1183672624
1183672730 1183672731
1183672733 1183672736
1183672808 1183672812
1183672815 1183672818
1183672987 1183672989
1183673021 1183673022
1183673052 1183673053
1183673056 1183673057
1183673099 1183673100
1183673102 1183673104
1183673151 1183673152
1183673171 1183673173
1183673205 1183673206
1183673245 1183673246
1183673351 1183673353
1183673525 1183673526
1183673630 1183673631
1183674524 1183674526
1183674801 1183674802
1183674813 1183674814
1183675058 1183675061
1183675496 1183675498
1183675500 1183675501
1183675661 1183675662
1183675663 1183675664
1183675668 1183675673
1183675950 1183675951
1183676218 1183676219
1183676225 1183676227
1183677148 1183677149
1183677200 1183677208
1184095681 1184095683
1184095733 1184095734
1184095756 1184095757
1184095785 1184095787
1184095795 1184095796
1184095903 1184095904
1184095955 1184095956
1184096017 1184096019
1184096025 1184096026
1184096058 1184096059
1184096129 1184096130
1184096248 1184096250
1184096309 1184096310
1184096314 1184096315
1184096339 1184096340
1184096348 1184096349
1184096399 1184096400
1184096426 1184096427
1184096484 1184096485
1184096619 1184096624
1184096627 1184096628
1184096708 1184096713
1184096714 1184096717
1184096723 1184096724
1184096777 1184096779
1184096849 1184096851
1184096952 1184096954
1184096997 1184096998
1184097165 1184097168
1184097334 1184097337
1184097340 1184097341
1184097385 1184097388
1184097393 1184097394
1184097395 1184097396
1184097437 1184097440
1184097511 1184097512
1184097585 1184097588
1184097628 1184097631
1184097725 1184097726
1184097733 1184097734
1184097737 1184097738
1184097774 1184097776
1184097893 1184097894
1184098379 1184098380
1184106256 1184106257
1184106644 1184106645
1184183809 1184183811
1184184520 1184184521
1184184749 1184184750
1184184754 1184184755
1184185078 1184185079
1184185084 1184185085
1184185151 1184185152
1184247981 1184247994
1184247997 1184248000
1184248001 1184248003
1184459568 1184459570
1184459803 1184459806
1184459807 1184459808
1184461105 1184461106
1184461159 1184461160
1184461161 1184461162
1184461612 1184461616
1184461697 1184461698
1184462150 1184462155
1184462221 1184462229
1184462232 1184462233
1184462420 1184462425
1184462432 1184462433
1184462434 1184462435
1184462438 1184462439
1184462590 1184462593
1184462594 1184462595
1184462598 1184462600
1184462758 1184462759
1184462760 1184462762
1184462925 1184462927
1184462928 1184462929
1184462930 1184462931
1184463481 1184463482
1184463492 1184463493
1184508856 1184508858
1184783631 1184783632
1184783779 1184783780
1184783886 1184783887
1184783901 1184783902
1184783905 1184783906
1184783918 1184783920
1184783931 1184783935
1184783943 1184783944
1184783958 1184783963
1184783967 1184783971
1184783976 1184783977
1184783978 1184783979
1184784006 1184784009
1184784013 1184784014
1184784022 1184784024
1184784029 1184784031
1184784037 1184784040
1184784043 1184784044
1184784045 1184784046
1184784047 1184784050
1184784068 1184784069
1184784070 1184784075
1184784076 1184784077
1184784078 1184784080
1184784082 1184784083
1184784117 1184784118
1184784131 1184784135
1184784141 1184784142
1184784167 1184784168
1184784212 1184784213
1184784239 1184784246
1184784253 1184784256
1184784259 1184784260
1184784261 1184784264
1184784268 1184784269
1184784279 1184784281
1184784286 1184784288
1184784303 1184784307
1184784309 1184784313
1184784315 1184784317
1184784318 1184784320
1184784324 1184784325
1184784335 1184784337
1184784342 1184784344
1184784347 1184784349
1184784357 1184784358
1184784371 1184784373
1184784379 1184784381
1184784402 1184784404
1184784405 1184784408
1184784410 1184784412
1184784413 1184784416
1184784443 1184784447
1184784448 1184784456
1184784509 1184784512
1184784514 1184784519
1184784520 1184784524
1184784525 1184784526
1184784528 1184784529
1184784535 1184784537
1184950527 1184950528
1184950668 1184950672
1184950835 1184950836
1184950840 1184950842
1184950843 1184950844
1184950860 1184950861
1184950866 1184950867
1184950868 1184950869
1184950877 1184950878
1184950926 1184950927
1184950953 1184950955
1184950958 1184950959
1184950990 1184950992
1184950993 1184950996
1184951106 1184951107
1184951134 1184951138
1184951139 1184951144
1184951161 1184951162
1184951179 1184951183
1184951185 1184951192
1184951193 1184951197
1184951445 1184951446
1184951579 1184951583
1184951585 1184951595
1184951739 1184951740
1184951750 1184951751
1184951926 1184951927
1184951933 1184951934
1184951935 1184951936
1184952029 1184952031
1184952264 1184952265
1184952266 1184952267
1184953737 1184953738
1184954041 1184954043
1185722495 1185722497
1185865410 1185865412
1185865512 1185865513
1185865515 1185865517
1185865523 1185865524
1185865598 1185865599
1185865602 1185865603
1185865609 1185865610
1185865666 1185865668
1185865677 1185865678
1185865956 1185865957
1185866130 1185866134
1185866140 1185866143
1185866145 1185866147
1185866150 1185866151
1185866162 1185866163
1185866279 1185866281
1185866288 1185866290
1185866293 1185866297
1185866302 1185866303
1185866304 1185866305
1185866306 1185866307
1185866552 1185866553
1185866560 1185866561
1186155866 1186155867
1186163410 1186163411
1186163605 1186163606
1186163649 1186163651
1186163657 1186163660
1186163841 1186163842
1186163992 1186163993
1186164067 1186164068
1186164245 1186164248
1186165270 1186165271
1186165462 1186165465
1186165466 1186165468
1186165847 1186165848
1186165850 1186165852
1186166066 1186166068
1186166352 1186166353
1186166361 1186166362
1186166885 1186166886
1186174568 1186174569
1186176016 1186176017
1186176294 1186176295
1186176424 1186176425
1186176528 1186176529
1186176594 1186176595
1186176644 1186176645
1186177216 1186177218
1186177221 1186177222
1186177348 1186177349
1186177559 1186177562
1186177829 1186177831
1186177959 1186177960
1186178239 1186178241
1186178552 1186178553
1186180535 1186180536
1186180697 1186180698
1186180702 1186180704
1186180780 1186180781
1186415107 1186415109
1186435161 1186435169
1186435194 1186435201
1186596698 1186596707
1186775149 1186775150
1186775321 1186775322
1186775334 1186775335
1186775467 1186775468
1186775470 1186775471
1186775478 1186775479
1186775583 1186775587
1186775590 1186775591
1186775599 1186775600
1186775676 1186775679
1186775680 1186775681
1186775688 1186775689
1186775763 1186775766
1186775770 1186775771
1186775774 1186775776
1186775874 1186775875
1186776065 1186776067
1186953289 1186953290
1186953292 1186953294
1186953367 1186953368
1186962648 1186962649
1186962655 1186962656
1187014414 1187014416
1187014422 1187014423
1187212571 1187212572
1187213087 1187213088
1187213249 1187213253
1187213255 1187213256
1187213262 1187213263
1187214833 1187214834
1187220283 1187220286
1187220295 1187220297
1187220299 1187220301
1187293386 1187293387
1187293396 1187293397
1187374880 1187374923
1187374925 1187374926
1187374931 1187374932
1187386207 1187386209
1187386254 1187386255
1187386299 1187386300
1187386363 1187386364
1187386482 1187386483
1187386662 1187386663
1187386673 1187386674
1187386846 1187386847
1187386957 1187386959
1187386966 1187386969
1187387195 1187387196
1187387199 1187387200
1187387238 1187387241
1187387250 1187387251
1187387379 1187387380
1187387382 1187387383
1187387840 1187387841
1187387842 1187387843
1187387844 1187387845
1187389000 1187389001
1187389138 1187389139
1187389149 1187389151
1187389599 1187389600
1187390302 1187390304
1187390742 1187390743
1187390744 1187390745
1187390746 1187390747
1187391062 1187391063
1187391352 1187391353
1187391968 1187391969
1187544789 1187544798
1187544799 1187544800
1187645357 1187645358
1187645615 1187645617
1187645736 1187645738
1187645797 1187645798
1187645848 1187645852
1187645853 1187645855
1187645859 1187645862
1187645869 1187645870
1187645873 1187645874
1187645950 1187645951
1187646069 1187646070
1187646071 1187646072
1187646076 1187646077
1187646078 1187646083
1187646089 1187646090
1187646261 1187646262
1187646284 1187646285
1187646289 1187646291
1187646325 1187646326
1187646336 1187646337
1187646353 1187646355
1187646359 1187646360
1187646419 1187646420
1187646438 1187646439
1187646450 1187646451
1187646488 1187646489
1187646499 1187646500
1187646511 1187646513
1187646517 1187646520
1187646521 1187646522
1187646531 1187646532
1187646564 1187646566
1187646568 1187646571
1187646575 1187646577
1187646579 1187646581
1187646596 1187646597
1187646598 1187646599
1187646602 1187646603
1187646607 1187646609
1187646612 1187646613
1187646616 1187646617
1187646618 1187646619
1187646628 1187646630
1187646631 1187646634
1187646640 1187646642
1187646643 1187646644
1187646646 1187646647
1187646651 1187646653
1187646662 1187646663
1187646673 1187646675
1187646720 1187646723
1187646726 1187646728
1187646731 1187646734
1187646736 1187646739
1187647007 1187647009
1187647287 1187647292
1187647299 1187647302
1187647424 1187647425
1187647427 1187647428
1187647435 1187647436
1187647438 1187647439
