831422553 831422570
831471795 831471812
831475951 831475969
831476796 831476813
831484832 831484849
831485327 831485344
831485497 831485514
831485747 831485764
831485830 831485847
831485882 831485899
831488050 831488067
831488503 831488520
831492040 831492057
831492216 831492233
831539910 831539927
831554491 831554508
831571739 831571756
831578014 831578031
831578433 831578450
831578441 831578458
831578457 831578474
831583622 831583639
831583714 831583731
831583838 831583855
831584012 831584029
831584029 831584046
831584083 831584102
831584167 831584184
831584353 831584374
831584515 831584534
831584541 831584558
831584549 831584566
831585172 831585190
831585335 831585352
831586081 831586098
831586189 831586206
831586330 831586347
831586341 831586360
831586373 831586390
831586528 831586545
831587015 831587032
831587036 831587053
831587073 831587090
831587091 831587108
831587111 831587128
831587152 831587169
831587178 831587196
831587895 831587912
831588347 831588364
831588385 831588402
831589448 831589465
831589469 831589486
831589555 831589574
831589609 831589626
831589673 831589691
831590436 831590453
831590617 831590634
831649857 831649874
831649907 831649924
831649930 831649947
831670438 831670455
831671027 831671045
831671993 831672010
831672115 831672132
831672146 831672163
831672185 831672202
831672219 831672236
831672283 831672300
831672521 831672538
831672715 831672732
831672774 831672791
831673783 831673801
831673820 831673837
831673953 831673970
831673975 831673993
831674074 831674092
831674317 831674334
831674638 831674655
831674687 831674704
831674696 831674713
831674714 831674731
831674952 831674969
831725918 831725935
831756533 831756550
831756671 831756689
831756687 831756704
831756712 831756729
831756742 831756759
831756776 831756793
831756840 831756857
831756853 831756872
831756957 831756974
831757083 831757100
831757162 831757179
831757419 831757436
831757483 831757501
831757589 831757606
831757610 831757627
831757631 831757648
831757752 831757769
831757825 831757842
831757914 831757933
831757980 831757997
831758137 831758154
831758188 831758205
831758208 831758225
831758274 831758291
831758324 831758341
831758466 831758484
831758492 831758509
831758558 831758575
831758790 831758807
831758880 831758897
831759639 831759656
831810274 831810294
831933582 831933599
831933705 831933722
831933737 831933754
831933781 831933799
831984830 831984847
831984893 831984910
832071630 832071647
832158455 832158473
832247376 832247393
832418234 832418251
832418247 832418264
832448855 832448872
832448876 832448893
832448905 832448922
832479926 832479943
832480173 832480190
832500511 832500528
832531909 832531926
832534276 832534293
832536589 832536606
832536632 832536649
832539614 832539631
832678892 832678910
832678939 832678957
832678944 832678961
832714830 832714847
832729404 832729421
832836467 832836484
832859835 832859852
832936226 832936243
832962090 832962108
832962150 832962169
832962160 832962177
833021579 833021597
833021647 833021664
833108462 833108479
833145259 833145277
833145320 833145337
833145330 833145347
833162694 833162711
833215060 833215077
833285224 833285242
833285495 833285512
833285546 833285563
833285560 833285577
833287121 833287138
833287195 833287212
833288206 833288223
833288265 833288282
833288301 833288318
833303318 833303335
833303365 833303382
833303404 833303422
833305759 833305776
833306841 833306858
833311148 833311165
833311152 833311169
833311235 833311253
833312869 833312886
833312904 833312921
833317264 833317282
833317325 833317342
833317356 833317373
833320513 833320530
833368278 833368296
833368329 833368346
833379694 833379711
833386114 833386131
833386167 833386184
833541450 833541467
833542967 833542984
833561388 833561405
833561392 833561409
833561407 833561424
833561453 833561470
833561473 833561490
833562862 833562879
833564605 833564622
833564610 833564627
833566157 833566175
833566203 833566221
833570225 833570242
833571376 833571393
833596499 833596516
833627722 833627739
833627772 833627789
833634183 833634200
833634205 833634222
833634216 833634233
833634326 833634343
833636609 833636626
833636992 833637009
833637014 833637031
833637511 833637528
833637515 833637533
833637577 833637594
833673089 833673106
833714645 833714662
833714734 833714751
833800628 833800645
833800677 833800695
833804778 833804795
833804867 833804884
833806817 833806836
833806837 833806854
833806881 833806898
833806885 833806902
833807181 833807198
833884842 833884859
833884847 833884864
833886846 833886864
833886904 833886921
833886929 833886946
833908536 833908553
833909175 833909192
833911149 833911166
833920227 833920244
833920287 833920307
833920332 833920349
833926150 833926167
833932466 833932483
833964668 833964685
833964674 833964691
833972861 833972879
833993046 833993065
834072879 834072896
834137542 834137559
834140557 834140574
834167136 834167153
834169860 834169877
834175703 834175720
834177524 834177541
834179997 834180014
834180004 834180021
834181950 834181967
834182951 834182968
834193455 834193472
834269952 834269969
834275870 834275888
834318368 834318385
834318392 834318410
834326282 834326299
834337135 834337152
834338737 834338754
834340059 834340076
834343353 834343370
834355068 834355085
834355151 834355168
834404906 834404924
834404954 834404972
834408593 834408610
834408636 834408654
834413240 834413257
834428439 834428456
834441145 834441162
834441149 834441166
834441204 834441221
834442390 834442407
834494824 834494841
834494926 834494945
834494946 834494963
834498943 834498960
834499503 834499520
834499569 834499586
834500176 834500193
834506712 834506729
834510893 834510910
834511477 834511494
834530167 834530184
834619348 834619365
834702507 834702524
834752663 834752680
834760257 834760274
834762683 834762700
834765151 834765168
834767344 834767361
834786840 834786857
834817109 834817126
834846970 834846987
834847527 834847544
834848586 834848604
834848593 834848610
834848612 834848629
834849223 834849240
834849317 834849334
834870879 834870896
834870883 834870900
834870932 834870949
834911183 834911200
834923799 834923816
834925679 834925697
834925699 834925719
834926977 834926994
834928082 834928099
834928707 834928724
834945977 834945994
834948638 834948655
834950380 834950397
834950400 834950417
834950477 834950495
834950499 834950518
834950517 834950534
834951762 834951779
834953282 834953299
834955599 834955616
834955632 834955649
834955738 834955755
834955973 834955991
834956031 834956049
834956054 834956071
834957851 834957868
834959825 834959842
835035641 835035658
835045834 835045851
835046314 835046331
835046319 835046336
835046347 835046364
835046482 835046499
835076483 835076500
835093448 835093465
835093547 835093564
835096027 835096044
835097009 835097026
835099839 835099856
835101881 835101898
835102710 835102727
835112240 835112257
835112866 835112885
835112914 835112934
835122393 835122410
835125097 835125114
835125362 835125379
835126036 835126053
835126041 835126058
835126061 835126079
835126088 835126105
835128060 835128077
835128139 835128156
835135975 835135992
835136035 835136052
835184922 835184939
835184927 835184944
835193616 835193633
835201152 835201169
835277727 835277744
835356143 835356160
835357516 835357533
835359345 835359362
835360427 835360444
835360496 835360514
835361480 835361497
835362323 835362340
835362991 835363008
835364219 835364236
835366648 835366665
835366695 835366714
835366820 835366837
835370615 835370634
835370662 835370679
835373346 835373363
835373830 835373847
835374222 835374239
835374795 835374812
835377613 835377630
835381761 835381778
835381978 835381996
835383247 835383264
835383271 835383288
835383677 835383694
835384582 835384599
835385748 835385765
835392716 835392733
835392740 835392757
835392789 835392806
835393359 835393376
835539534 835539551
835540738 835540755
835540787 835540804
835546109 835546127
835546171 835546188
835547565 835547582
835557272 835557289
835559662 835559679
835560286 835560304
835572746 835572763
835614633 835614650
835614748 835614765
835614767 835614784
835614809 835614826
835614871 835614888
835614926 835614943
835614986 835615003
835615027 835615044
835623008 835623025
835626932 835626949
835629711 835629728
835632665 835632682
835638929 835638946
835639230 835639247
835639976 835639993
835641405 835641424
835644762 835644780
835709844 835709863
835710897 835710914
835711265 835711282
835712154 835712171
835712180 835712197
835722444 835722461
835722497 835722516
835731627 835731644
835733816 835733833
835735515 835735532
835743642 835743660
835743755 835743772
835796725 835796742
835798587 835798604
835802886 835802903
835812782 835812800
835816815 835816832
835817233 835817250
835817258 835817275
835825424 835825441
835828359 835828376
835868984 835869001
835875470 835875487
835881599 835881616
835893283 835893300
835966244 835966261
835966249 835966266
835966264 835966281
835968650 835968667
836073968 836073987
836073988 836074005
836138885 836138902
836138960 836138977
836140740 836140757
836148206 836148223
836154044 836154061
836158733 836158750
836163933 836163950
836167709 836167726
836168051 836168068
836169033 836169050
836177310 836177327
836206969 836206986
836219815 836219832
836219860 836219877
836219867 836219884
836225473 836225491
836227311 836227328
836229957 836229977
836230006 836230023
836230147 836230164
836230221 836230238
836230237 836230254
836241630 836241647
836242378 836242396
836245833 836245851
836245879 836245896
836245886 836245903
836247361 836247378
836247386 836247403
836249901 836249919
836249952 836249969
836253111 836253128
836253210 836253227
836253379 836253396
836253465 836253482
836253489 836253506
836306489 836306506
836306562 836306582
836306614 836306631
836314229 836314246
836317605 836317622
836322711 836322730
836323470 836323487
836323494 836323511
836323517 836323534
836323544 836323561
836323561 836323578
836330623 836330640
836341847 836341865
836341927 836341945
836344247 836344264
836410230 836410249
836410256 836410273
836410305 836410322
836515196 836515213
836515295 836515312
836515300 836515317
836536543 836536560
836565898 836565915
836565902 836565919
836565956 836565974
836565963 836565980
836565980 836565997
836596647 836596664
836601408 836601425
836601412 836601429
836652207 836652224
836652260 836652277
836652270 836652287
836664382 836664399
836748514 836748532
836748558 836748575
836750619 836750636
836752278 836752295
836754990 836755007
836755166 836755183
836759056 836759073
836759137 836759154
836770251 836770269
836770293 836770310
836832882 836832899
836833647 836833664
836833791 836833808
836840397 836840415
836840450 836840467
836842721 836842738
836863880 836863898
836911930 836911947
836911953 836911970
836920289 836920306
836920303 836920320
836920352 836920369
836920453 836920470
836925440 836925457
836925515 836925532
836926236 836926254
836927714 836927731
837001825 837001842
837002906 837002923
837010373 837010390
837014520 837014537
837014573 837014591
837014596 837014613
837086339 837086356
837198686 837198703
837206359 837206376
837241395 837241412
837256702 837256719
837256763 837256781
837263791 837263808
837266391 837266408
837266889 837266906
837364482 837364499
837364988 837365005
837365015 837365032
837365073 837365090
837378665 837378682
837378737 837378755
837395600 837395617
837399931 837399948
837410718 837410735
837448602 837448619
837448652 837448669
837457117 837457134
837457436 837457455
837457511 837457528
837457527 837457544
837458509 837458526
837458513 837458530
837459748 837459765
837460553 837460573
837460572 837460589
837460602 837460621
837464054 837464071
837464104 837464124
837464154 837464171
837465504 837465521
837465573 837465590
837465594 837465611
837466025 837466042
837518361 837518378
837522388 837522408
837522450 837522467
837522470 837522488
837522869 837522886
837527012 837527029
837527073 837527090
837529846 837529864
837531264 837531281
837532781 837532798
837532861 837532878
837533594 837533611
837533641 837533658
837533719 837533737
837533767 837533784
837535824 837535841
837535879 837535896
837535901 837535919
837537222 837537239
837539127 837539145
837539149 837539166
837539174 837539193
837539216 837539233
837544880 837544897
837544927 837544944
837544950 837544967
837546396 837546414
837548100 837548117
837550679 837550696
837550720 837550737
837550727 837550744
837550749 837550766
837606786 837606803
837606854 837606871
837613782 837613799
837617072 837617089
837617114 837617131
837620250 837620267
837620329 837620346
837620498 837620515
837620546 837620563
837620568 837620586
837620585 837620602
837620605 837620622
837620664 837620681
837626303 837626321
837626378 837626395
837626400 837626417
837627077 837627094
837629423 837629441
837629470 837629489
837629493 837629510
837631598 837631617
837632532 837632549
837632575 837632595
837633248 837633265
837635943 837635960
837636020 837636037
837773950 837773967
837788627 837788644
837790070 837790087
837792294 837792311
837829048 837829065
837867827 837867844
837945268 837945285
837948977 837948994
837954917 837954934
837962793 837962810
837984837 837984854
838044161 838044178
838063903 838063920
838066269 838066286
838124642 838124659
838212932 838212949
838236724 838236741
838247001 838247018
838332473 838332490
838387114 838387131
838391232 838391250
838391303 838391320
838391550 838391567
838395428 838395445
838396096 838396113
838396650 838396667
838396725 838396742
838404349 838404367
838414343 838414360
838415045 838415062
838415107 838415124
838502154 838502171
838502177 838502194
838502181 838502198
838502228 838502247
838502456 838502473
838502499 838502516
838502597 838502614
838506374 838506391
838552480 838552497
838557895 838557912
838599165 838599182
838646868 838646889
838694153 838694170
838725459 838725477
838725509 838725526
838725539 838725556
838731015 838731034
838733969 838733986
838735981 838735998
838736122 838736139
838737197 838737214
838746392 838746409
838753142 838753160
838754757 838754776
838761574 838761591
838763075 838763092
838812750 838812767
838813919 838813936
838825791 838825808
838981558 838981575
838984830 838984847
838984892 838984910
838984897 838984914
838984912 838984929
838986899 838986916
838987000 838987017
838988199 838988216
838990743 838990760
838995298 838995315
838995790 838995807
838998590 838998608
838998704 838998721
839000462 839000480
839001655 839001673
839011434 839011451
839011461 839011478
839014683 839014700
839015061 839015078
839015083 839015100
839015130 839015147
839015137 839015154
839016347 839016364
839016750 839016767
839017201 839017218
839019559 839019576
839019618 839019635
839019641 839019660
839021187 839021204
839022920 839022937
839023761 839023778
839023810 839023827
839070943 839070960
839078749 839078768
839099572 839099589
839100314 839100331
839105288 839105305
839106464 839106481
839106480 839106497
839106738 839106758
839106788 839106805
839106821 839106838
839106947 839106966
839158208 839158225
839158232 839158252
839158279 839158296
839158289 839158307
839161032 839161049
839162345 839162363
839163418 839163435
839165805 839165822
839168066 839168083
839178941 839178958
839178968 839178985
839178996 839179013
839190222 839190240
839191931 839191948
839192667 839192684
839229054 839229071
839252538 839252555
839252606 839252623
839252640 839252657
839258212 839258229
839258364 839258381
839259221 839259239
839259259 839259276
839268587 839268604
839268658 839268676
839268694 839268711
839278046 839278064
839279497 839279514
839279548 839279565
839287178 839287195
839287280 839287297
839329836 839329853
839329843 839329860
839340669 839340686
839340880 839340897
839341730 839341747
839358334 839358351
839366193 839366210
839385115 839385132
839426929 839426946
839433142 839433159
839434599 839434619
839436603 839436620
839437174 839437191
839438349 839438366
839442556 839442573
839442858 839442875
839510896 839510913
839532104 839532121
839595024 839595041
839595050 839595067
839595094 839595111
839595099 839595116
839595140 839595157
839606001 839606019
839606039 839606056
839608326 839608343
839613164 839613181
839613215 839613232
839613240 839613257
839615651 839615668
839617745 839617762
839624974 839624991
839681775 839681792
839681803 839681820
839681869 839681886
839681890 839681907
839681910 839681927
839730535 839730552
839783931 839783948
839783956 839783975
839785669 839785688
839785701 839785720
839785727 839785744
839789351 839789368
839873447 839873464
839876912 839876929
839877066 839877083
839884402 839884419
839887082 839887099
839939222 839939239
839942795 839942812
839942864 839942881
839942891 839942908
839943166 839943184
839943550 839943568
839943571 839943588
839943596 839943613
839946575 839946592
839947757 839947776
839948031 839948048
840029225 840029242
840200124 840200141
840214528 840214545
840220168 840220185
840221946 840221963
840222214 840222231
840222326 840222343
840320397 840320414
840320484 840320501
840371288 840371305
840372233 840372251
840372323 840372340
840452691 840452708
840452718 840452735
840452785 840452802
840459565 840459582
840460284 840460301
840471541 840471558
840471667 840471684
840471691 840471709
840471728 840471745
840471765 840471782
840471782 840471799
840471802 840471819
840539832 840539849
840539856 840539874
840539904 840539922
840539909 840539926
840539931 840539948
840567601 840567618
840568947 840568964
840568990 840569007
840569214 840569231
840569279 840569296
840570818 840570837
840570850 840570868
840570915 840570932
840575891 840575908
840643496 840643513
840643552 840643569
840648300 840648317
840648315 840648332
840648398 840648415
840798570 840798587
840798608 840798625
840798636 840798653
840933556 840933573
841049384 841049401
841057717 841057734
841057893 841057910
841057907 841057924
841104190 841104207
841104327 841104344
841111957 841111974
841112969 841112986
841113434 841113451
841113668 841113685
841114828 841114845
841114881 841114898
841115742 841115759
841128639 841128656
841129723 841129742
841132697 841132714
841132835 841132852
841135094 841135111
841138912 841138929
841180421 841180438
841181774 841181791
841181866 841181883
841181948 841181965
841182247 841182264
841182459 841182476
841182654 841182671
841182983 841183000
841186033 841186050
841186213 841186230
841186490 841186507
841186743 841186760
841186788 841186805
841187972 841187989
841188133 841188150
841188239 841188256
841188264 841188281
841190626 841190643
841190704 841190721
841191063 841191080
841191317 841191334
841191526 841191543
841191894 841191911
841192052 841192069
841192087 841192104
841192499 841192516
841193554 841193571
841194260 841194277
841194512 841194529
841194532 841194549
841195063 841195080
841196000 841196017
841196726 841196743
841200195 841200212
841200900 841200917
841201181 841201198
841201632 841201649
841202281 841202298
841203275 841203292
841205289 841205306
841206915 841206932
841206954 841206971
841207158 841207175
841208547 841208564
841209059 841209076
841212263 841212280
841214583 841214600
841215239 841215256
841215471 841215488
841224243 841224260
841224698 841224715
841224917 841224934
841230643 841230660
841230770 841230787
841279706 841279723
841280060 841280077
841280137 841280154
841280237 841280254
841280946 841280963
841283112 841283129
841284222 841284239
841284226 841284243
841286638 841286655
841287516 841287533
841289080 841289097
841289364 841289381
841289852 841289869
841411144 841411161
841421875 841421893
841432612 841432629
841672309 841672326
841681916 841681933
841682624 841682641
841697981 841697998
841698086 841698105
841698170 841698187
841698644 841698661
841706044 841706061
841758623 841758640
841758652 841758669
841761815 841761832
841766693 841766710
841767432 841767449
841779160 841779177
841784891 841784908
841786581 841786598
841839009 841839026
841839019 841839036
841839448 841839465
841863698 841863715
841910335 841910352
841910341 841910358
842020036 842020053
842020109 842020126
842020778 842020796
842025761 842025778
842028182 842028201
842031986 842032003
842035437 842035456
842035877 842035894
842051522 842051539
842052276 842052293
842057422 842057440
842062336 842062353
842065680 842065697
842066576 842066593
842068980 842068997
842069306 842069323
842070952 842070969
842071003 842071020
842096339 842096356
842096412 842096429
842100438 842100455
842102486 842102503
842102587 842102604
842181296 842181313
842188065 842188082
842188365 842188382
842188687 842188704
842188699 842188716
842207740 842207760
842217254 842217271
842217268 842217285
842217829 842217846
842224063 842224080
842252061 842252078
842259876 842259893
842260233 842260250
842267117 842267134
842278409 842278426
842283867 842283884
842287656 842287673
842304728 842304745
842304746 842304763
842304809 842304826
842328876 842328893
842329056 842329073
842331155 842331172
842338256 842338273
842338276 842338293
842338590 842338607
842340771 842340788
842353813 842353830
842353838 842353855
842353888 842353905
842353901 842353918
842353917 842353934
842353942 842353959
842364285 842364302
842371340 842371357
842372019 842372036
842375386 842375403
842386179 842386197
842445872 842445889
842447791 842447808
842447884 842447901
842521498 842521515
842521512 842521529
842521542 842521559
842521566 842521583
842537537 842537554
842553768 842553785
842560905 842560923
842613815 842613832
842618089 842618106
842618204 842618221
842619300 842619317
842620374 842620391
842630828 842630845
842630919 842630936
842630944 842630961
842631000 842631017
842638573 842638590
842650151 842650169
842653671 842653688
842671936 842671953
842683861 842683878
842694843 842694860
842701608 842701625
842701678 842701695
842710070 842710087
842712039 842712056
842756450 842756467
842756928 842756945
842771332 842771349
842772437 842772454
842772457 842772474
842772511 842772528
842776428 842776445
842777841 842777858
842780777 842780794
842780983 842781000
842781037 842781054
842781058 842781075
842781104 842781121
842781217 842781234
842781228 842781245
842781246 842781263
842783471 842783488
842789886 842789903
842790291 842790308
842790838 842790855
842791628 842791645
842791901 842791918
842793198 842793215
842794101 842794118
842794210 842794227
842795182 842795199
842795244 842795261
842796058 842796075
842796423 842796440
842796899 842796916
842800537 842800554
842801002 842801019
842801348 842801365
842801533 842801550
842803703 842803720
842804374 842804391
842804485 842804502
842805452 842805469
842805508 842805525
842805580 842805599
842805767 842805784
842812901 842812918
842818911 842818928
842819696 842819713
842819722 842819739
842819782 842819799
842820389 842820406
842820847 842820864
842821306 842821323
842824247 842824264
842824406 842824423
842853218 842853235
842853238 842853255
842856952 842856969
842856957 842856974
842856978 842856995
842872921 842872938
842873013 842873030
842876428 842876445
842879580 842879597
842881533 842881550
842881733 842881750
842881775 842881792
842888810 842888827
842889230 842889247
842889718 842889735
842890179 842890196
842890451 842890468
842890567 842890584
842890582 842890599
842896162 842896179
842896363 842896380
842897543 842897560
842898650 842898667
842899275 842899292
842900082 842900099
842901139 842901156
842901437 842901454
842901636 842901653
842902300 842902317
842903852 842903869
842904388 842904405
842905005 842905022
842905241 842905258
842906570 842906587
842908727 842908745
842908735 842908752
842912226 842912243
842914117 842914134
842932646 842932663
842932756 842932773
842934171 842934188
842936662 842936679
842945634 842945651
842946165 842946182
842952792 842952809
842956134 842956151
842958488 842958505
842958929 842958946
842959295 842959312
842960079 842960096
842960557 842960574
842961123 842961140
842961967 842961984
842962987 842963004
842963407 842963424
842963637 842963654
842964063 842964080
842964141 842964158
842964779 842964796
842965030 842965047
842965152 842965169
842965548 842965565
842966203 842966220
842966253 842966270
842966848 842966865
842967261 842967278
842967634 842967651
842968238 842968255
842968509 842968526
842968777 842968794
842972204 842972221
842972347 842972365
842972500 842972517
842972871 842972888
842973583 842973600
842973652 842973669
842973911 842973928
842974890 842974907
842975249 842975266
842975415 842975432
842975820 842975837
843005538 843005555
843008019 843008036
843008194 843008211
843018901 843018919
843040546 843040564
843040597 843040614
843041949 843041966
843050875 843050892
843053130 843053147
843056029 843056046
843060439 843060456
843060582 843060599
843068805 843068822
843070570 843070587
843120486 843120503
843121385 843121402
843121410 843121427
843121422 843121439
843141777 843141794
843193415 843193432
843193485 843193502
843194530 843194547
843195023 843195040
843195653 843195670
843195752 843195769
843195935 843195952
843196113 843196130
843196224 843196241
843196298 843196315
843196313 843196330
843196344 843196361
843196439 843196459
843196458 843196475
843196480 843196500
843196623 843196640
843213276 843213293
843213369 843213386
843213508 843213525
843213548 843213565
843213839 843213856
843213945 843213962
843214005 843214025
843214088 843214105
843214331 843214348
843214576 843214593
843214790 843214807
843214951 843214971
843215231 843215248
843215414 843215431
843215454 843215471
843215593 843215610
843215614 843215631
843215641 843215658
843215892 843215909
843216335 843216352
843216350 843216367
843216552 843216569
843216847 843216864
843217101 843217118
843217153 843217170
843217316 843217333
843217590 843217607
843217681 843217699
843217693 843217710
843218070 843218087
843218265 843218282
843218492 843218509
843218680 843218697
843218887 843218904
843219312 843219329
843219576 843219596
843219749 843219766
843219938 843219955
843220068 843220085
843220127 843220144
843220784 843220801
843220916 843220933
843221656 843221673
843221685 843221702
843222090 843222107
843222389 843222406
843222699 843222716
843222895 843222912
843222926 843222943
843223292 843223309
843223365 843223382
843223685 843223702
843223893 843223910
843224060 843224077
843224082 843224099
843224456 843224473
843224657 843224674
843224754 843224771
843224842 843224859
843224868 843224885
843224949 843224966
843225050 843225067
843225662 843225679
843225963 843225980
843226003 843226020
843227647 843227664
843227746 843227763
843228001 843228018
843228070 843228087
843231154 843231171
843231368 843231385
843246226 843246243
843254239 843254256
843254296 843254313
843302412 843302429
843304223 843304240
843304284 843304301
843372298 843372315
843372374 843372391
843372402 843372419
843379140 843379157
843379193 843379210
843379275 843379292
843379295 843379312
843379306 843379323
843390179 843390196
843390199 843390217
843394736 843394753
843412885 843412902
843412944 843412962
843419181 843419199
843419231 843419248
843420458 843420475
843421119 843421136
843423221 843423238
843456763 843456780
843476664 843476682
843476689 843476706
843476745 843476762
843479720 843479737
843480409 843480426
843481119 843481136
843481894 843481911
843483033 843483050
843487537 843487554
843487656 843487673
843487681 843487698
843487729 843487746
843488341 843488358
843488668 843488685
843488672 843488689
843499142 843499159
843501053 843501070
843501069 843501086
843562518 843562535
843562547 843562564
843566926 843566943
843569837 843569857
843570119 843570136
843570913 843570930
843579107 843579124
843579929 843579946
843580200 843580217
843580596 843580613
843582296 843582313
843583450 843583467
843583471 843583488
843583523 843583540
843583543 843583561
843583563 843583580
843586911 843586928
843587176 843587193
843594432 843594449
843596171 843596188
843597506 843597523
843617889 843617906
843627775 843627792
843631839 843631859
843635392 843635409
843656696 843656713
843659657 843659674
843659838 843659855
843660021 843660038
843660063 843660080
843660585 843660602
843661247 843661264
843666601 843666618
843674938 843674955
843749595 843749612
843758797 843758814
843783872 843783889
843825432 843825449
843825857 843825874
843829825 843829842
843829950 843829967
843831261 843831279
843831479 843831496
843831539 843831556
843855663 843855680
843856852 843856869
843856862 843856879
843857337 843857354
843861346 843861363
843871424 843871441
843995179 843995196
843995199 843995216
843995257 843995274
844006346 844006363
844006366 844006383
844006387 844006404
844006417 844006436
844009203 844009220
844009554 844009571
844009617 844009634
844011740 844011757
844012167 844012184
844017882 844017899
844027675 844027692
844027833 844027850
844031965 844031982
844032014 844032031
844065986 844066003
844066013 844066030
844081730 844081748
844083828 844083845
844084725 844084742
844087226 844087243
844087534 844087552
844100161 844100178
844100284 844100301
844100354 844100371
844103568 844103585
844103591 844103609
844103668 844103685
844123738 844123755
844175531 844175548
844179648 844179665
844181021 844181038
844183689 844183706
844196885 844196902
844196929 844196946
844196943 844196960
844204107 844204124
844204945 844204963
844261966 844261983
844268503 844268520
844273666 844273683
844274246 844274263
844274357 844274374
844274365 844274382
844274387 844274404
844274574 844274591
844276967 844276984
844276977 844276994
844285011 844285028
844349241 844349258
844352584 844352602
844352651 844352668
844372179 844372196
844372221 844372238
844393632 844393649
844425765 844425782
844425778 844425796
844444220 844444237
844444710 844444727
844461408 844461425
844461691 844461710
844461948 844461965
844462634 844462653
844463386 844463403
844463548 844463565
844509420 844509437
844509427 844509444
844516172 844516189
844518458 844518476
844518807 844518824
844518830 844518847
844519211 844519228
844519571 844519588
844519575 844519592
844519646 844519663
844519915 844519932
844519956 844519973
844599632 844599649
844599851 844599868
844599878 844599895
844603676 844603695
844646552 844646569
844674746 844674763
844688224 844688241
844691849 844691866
844691893 844691910
844692187 844692204
844693488 844693505
844694836 844694853
844695655 844695672
844695660 844695677
844695681 844695698
844695696 844695713
844695735 844695754
844696101 844696118
844776762 844776779
844777751 844777768
844780436 844780453
844781724 844781741
844782257 844782274
844866533 844866550
844868080 844868097
844887590 844887607
844897575 844897592
844931831 844931848
844956712 844956729
844956954 844956971
845030426 845030443
845392761 845392778
845401893 845401910
845403229 845403246
845421849 845421866
845475354 845475371
845481092 845481109
845571506 845571523
845583103 845583121
845583178 845583197
845643206 845643223
845644661 845644678
845645103 845645120
845654182 845654199
845654292 845654310
845655828 845655845
845655977 845655994
845728303 845728320
845730297 845730314
845730348 845730366
845730435 845730452
845813692 845813709
845814938 845814955
845815932 845815949
845855797 845855814
846089477 846089494
846089492 846089509
846090919 846090936
846092320 846092337
846092998 846093015
846095971 846095988
846095985 846096002
846096500 846096517
846191166 846191186
846249010 846249027
846249090 846249109
846279095 846279112
846279194 846279211
846279301 846279319
846279408 846279425
846279476 846279493
846279493 846279510
846279532 846279549
846279632 846279649
846279806 846279825
846279840 846279857
846279847 846279864
846330987 846331007
846331052 846331069
846422748 846422765
846422797 846422814
846426632 846426652
846428504 846428522
846428552 846428569
846428557 846428574
846438145 846438162
846438169 846438186
846438227 846438244
846456737 846456754
846496457 846496474
846509221 846509238
846509246 846509264
846510328 846510345
846538971 846538988
846582244 846582261
846582274 846582291
846582315 846582333
846582321 846582338
846582835 846582852
846594676 846594693
846594720 846594737
846594726 846594744
846594743 846594760
846595105 846595122
846606236 846606253
846780311 846780328
846786020 846786037
846793351 846793368
846802585 846802602
846853595 846853612
846853628 846853645
846860647 846860664
846860931 846860948
846861399 846861416
846861642 846861659
846865575 846865593
846865604 846865621
846865623 846865640
846865632 846865650
846869734 846869753
846875779 846875796
846877431 846877448
846878969 846878986
846879002 846879019
846943333 846943351
847032906 847032924
847032954 847032971
847032995 847033012
847033685 847033702
847113441 847113458
847135461 847135478
847188174 847188191
847197354 847197371
847208781 847208798
847209294 847209311
847209332 847209350
847209418 847209435
847211216 847211233
847211368 847211385
847216961 847216979
847231969 847231989
847232052 847232069
847232263 847232281
847232332 847232349
847285823 847285840
847303984 847304001
847304059 847304076
847305912 847305929
847309422 847309439
847356069 847356086
847356513 847356530
847382211 847382228
847393227 847393244
847402991 847403008
847405700 847405717
847414794 847414811
847429489 847429506
847457816 847457833
847458367 847458384
847458443 847458460
847459682 847459699
847482173 847482190
847482225 847482242
847511558 847511575
847541179 847541196
847543804 847543822
847543833 847543850
847543894 847543911
847544463 847544480
847544537 847544555
