848820837 848820854
849936189 849936206
850356781 850356798
850358031 850358048
850377572 850377589
850382787 850382804
850385892 850385909
850751914 850751931
851144394 851144412
851230495 851230512
851243867 851243884
851245897 851245914
851245977 851245994
851247124 851247141
852779551 852779568
855023641 855023658
855038500 855038517
856160097 856160114
856245856 856245873
856328515 856328532
856330617 856330634
856354649 856354666
856355309 856355326
856373586 856373603
856483844 856483861
856499399 856499416
856571057 856571074
856575717 856575734
856576937 856576954
856577332 856577349
856578353 856578370
856579893 856579910
856581756 856581773
856596649 856596666
856604551 856604568
856650640 856650657
856690025 856690042
856692517 856692534
856795671 856795688
856806007 856806024
856808531 856808548
856808605 856808622
