831360070 831360087
832541233 832541250
832544962 832544979
832545088 832545106
832957282 832957299
833056326 833056343
833749751 833749768
835641132 835641149
836539918 836539935
836765893 836765910
836841254 836841271
836841672 836841689
836843831 836843848
836967202 836967219
837448179 837448196
837449518 837449535
837451444 837451461
837451613 837451630
837451648 837451665
837451916 837451933
837535937 837535954
837539718 837539735
837539955 837539972
837550507 837550524
837791295 837791312
838074825 838074842
838573109 838573126
838573947 838573964
838574739 838574757
838656332 838656349
838657240 838657257
839106114 839106131
839119053 839119070
839608588 839608605
839609286 839609303
839609304 839609321
839609338 839609355
839609523 839609540
839609560 839609577
839612847 839612864
839772868 839772885
839952286 839952303
840205925 840205942
840749138 840749155
842811038 842811055
842811130 842811147
842980064 842980081
843586227 843586244
843595945 843595962
843597694 843597711
843850514 843850531
843862177 843862194
844122495 844122512
844468743 844468760
844827489 844827506
845671881 845671898
846089797 846089814
846313258 846313275
846317297 846317314
846517607 846517624
846548744 846548761
847119839 847119856
847123459 847123476
