815607778 815607781
815609744 815609747
815656032 815656035
815657911 815657913
815662655 815662658
815671163 815671166
815685155 815685157
815696384 815696387
815708288 815708291
815712257 815712260
815717555 815717558
815725948 815725951
815726169 815726172
815752009 815752012
815752675 815752677
815762619 815762621
815782499 815782502
815785267 815785269
815787139 815787141
815804373 815804376
815805959 815805962
815807688 815807691
815838188 815838191
815838631 815838633
815839517 815839520
815844163 815844166
815846819 815846821
815848808 815848811
815852124 815852127
815855439 815855441
815858749 815858752
815867838 815867841
815868495 815868497
815870680 815870686
815873371 815873373
815891899 815891902
815905168 815905171
815906495 815906497
815912457 815912460
815922399 815922402
815926220 815926223
815929695 815929698
815943820 815943823
815945597 815945600
815946920 815946923
815965885 815965888
815974257 815974260
815991982 815991985
815997949 815997952
816005653 816005656
816007893 816007896
816011873 816011876
816067078 816067081
816073632 816073635
816084933 816084936
816087593 816087596
816103555 816103558
816104387 816104389
816105945 816105948
816163939 816163942
816174547 816174549
816179849 816179852
816194783 816194785
816246468 816246471
816250080 816250083
816253397 816253400
816265989 816265992
816271959 816271961
816281031 816281033
816283899 816283902
816303768 816303771
816304428 816304431
816317565 816317568
816319578 816319581
816325651 816325653
816327659 816327661
816336928 816336931
816350867 816350869
816350963 816350966
816356382 816356385
816356433 816356436
816361299 816361301
816363453 816363456
816366791 816366793
816407211 816407213
816435883 816435885
816438398 816438401
816463640 816463643
816468903 816468905
816470953 816470956
816474878 816474881
816476027 816476029
816484833 816484836
816498097 816498100
816539873 816539876
816545843 816545845
816575015 816575017
816575975 816575977
816594237 816594240
816611487 816611489
816612149 816612152
816613233 816613236
816634688 816634691
816645295 816645298
816648617 816648620
816651273 816651276
816677791 816677793
816706313 816706316
816706977 816706980
816785273 816785276
816793229 816793232
816797031 816797033
816813792 816813795
816817108 816817111
816817222 816817225
816818371 816818373
816835018 816835021
816847619 816847622
816852260 816852263
816871492 816871495
816881843 816881845
816888069 816888072
816913263 816913265
816916019 816916021
816916580 816916583
816927844 816927847
816939773 816939776
816951700 816951703
816982800 816982803
816998657 816998660
817014552 817014555
817043299 817043302
817048443 817048445
817063557 817063560
817067528 817067531
817075465 817075468
817084075 817084078
817090703 817090705
817097992 817097995
817099317 817099320
817101969 817101972
817103298 817103301
817105287 817105289
817125843 817125846
817136467 817136469
817139483 817139486
817166331 817166333
817174279 817174281
817180251 817180253
817184235 817184238
817196849 817196852
817202163 817202165
817208143 817208146
817214788 817214791
817218778 817218781
817219442 817219445
817231407 817231409
817242035 817242037
817281063 817281065
817290331 817290333
827591077 827591080
