931402337 931402338
931422093 931422094
931459233 931459234
931592584 931592585
931603886 931603887
931672176 931672178
931685312 931685313
931776494 931776496
931889672 931889673
931974338 931974339
931974993 931974995
931974996 931974997
931974999 931975000
931975232 931975233
931975248 931975249
931975295 931975296
931975343 931975344
931975346 931975347
931975373 931975374
931975440 931975441
931975444 931975445
932059946 932059947
932059957 932059958
932067085 932067086
932067127 932067128
932067285 932067286
932067395 932067396
932067490 932067491
932067497 932067498
932067499 932067500
932067597 932067598
932067629 932067630
932067694 932067695
932067727 932067728
932067802 932067803
932067805 932067806
932067848 932067849
932067870 932067871
932067933 932067934
932067938 932067939
932082813 932082814
932086484 932086486
932086878 932086879
932087660 932087661
932087673 932087674
932087676 932087677
932087758 932087759
932139663 932139664
932158991 932158992
932204320 932204321
932245172 932245173
932260601 932260602
932292854 932292855
932313875 932313876
932345110 932345111
932502204 932502205
932519986 932519987
932586907 932586908
932586984 932586985
932587005 932587006
932587029 932587030
932587032 932587033
932587054 932587055
932618701 932618702
932633477 932633478
932654005 932654006
932658722 932658723
932750853 932750854
932771853 932771854
932785418 932785419
932858735 932858741
932858742 932858750
932858756 932858758
932889178 932889179
932959916 932959917
933044782 933044783
933207039 933207040
933316416 933316417
933496770 933496771
933675394 933675395
933754701 933754702
933788121 933788122
933800635 933800636
933806726 933806727
933807730 933807731
933811197 933811198
933811718 933811719
933896133 933896134
933911816 933911817
933966685 933966686
933967459 933967460
934002035 934002036
934004628 934004629
934009276 934009277
934077274 934077275
934110928 934110929
934182275 934182276
934233092 934233093
934252669 934252670
934253043 934253044
934256598 934256614
934263395 934263396
934264130 934264131
934274993 934274994
934278112 934278113
934311586 934311587
934315845 934315846
934321663 934321664
934321690 934321691
934440454 934440455
934463187 934463204
934491608 934491609
934496449 934496450
934498627 934498645
934534260 934534261
934541357 934541358
934541414 934541415
934541454 934541456
934541552 934541553
934601143 934601144
934605044 934605045
934622848 934622849
934674470 934674471
934696063 934696064
934711478 934711479
934881921 934881922
934946161 934946162
934952422 934952423
935014059 935014060
935085569 935085586
935092558 935092559
935109456 935109457
935116927 935116928
935123732 935123733
935133164 935133165
935140109 935140110
935143952 935143953
938004843 938004844
938073994 938073995
938107299 938107300
938127313 938127314
938164032 938164033
938589171 938589172
938657410 938657411
938682944 938682945
938756251 938756252
938773300 938773301
939290689 939290690
939292289 939292290
939292294 939292296
939292297 939292305
939292800 939292816
939309210 939309211
939356212 939356213
939995110 939995111
940000720 940000721
940008819 940008820
940047597 940047598
940053956 940053957
940110177 940110178
940144293 940144294
940418576 940418577
940420645 940420649
940420650 940420651
940420652 940420656
940420657 940420661
940470366 940470367
940533641 940533642
941062178 941062181
941086580 941086584
941086648 941086651
941086738 941086741
941086925 941086928
941095294 941095297
941095301 941095304
941095306 941095309
941095352 941095356
941095372 941095375
941095408 941095411
941095427 941095430
941095491 941095494
941095617 941095620
941095786 941095789
941095817 941095820
941095932 941095935
941096039 941096042
941097441 941097444
941097464 941097468
941097499 941097502
941097518 941097522
941097564 941097567
941098077 941098080
941098124 941098127
941098202 941098205
941098281 941098284
941100133 941100136
941100323 941100326
941100357 941100360
941100435 941100438
941101714 941101718
941101720 941101723
941101766 941101769
941101798 941101801
941101823 941101826
941101978 941101981
941102095 941102099
941102123 941102126
941102167 941102170
941103598 941103601
941103747 941103751
941103981 941103984
941103999 941104002
941107641 941107644
941107669 941107672
941107681 941107684
941107757 941107760
941107784 941107788
941107831 941107834
941107859 941107862
941107873 941107876
941107966 941107969
941107986 941107989
941108202 941108205
941108436 941108439
941113384 941113387
941113477 941113480
941113587 941113590
941113606 941113609
941124787 941124789
941124867 941124870
941124917 941124920
941125085 941125089
941125091 941125094
941125096 941125099
941125214 941125217
941125265 941125268
941125468 941125471
941125540 941125543
941125574 941125577
941125606 941125609
941125700 941125703
941125788 941125791
941125799 941125802
941125867 941125870
941126001 941126004
941126851 941126854
941126897 941126900
941126918 941126921
941127010 941127013
941127164 941127167
941128087 941128090
941128119 941128122
941129098 941129101
941129142 941129145
941129171 941129174
941129326 941129330
941129336 941129339
941129481 941129484
941129532 941129536
941129768 941129771
941130399 941130402
941130543 941130546
941131990 941131993
941131996 941131999
941132006 941132009
941132061 941132064
941132089 941132093
941132103 941132106
941132192 941132196
941132348 941132351
941132371 941132374
941132447 941132450
941132649 941132652
941132709 941132712
941132849 941132852
941133148 941133151
941137092 941137095
941137133 941137136
941137379 941137382
941137440 941137443
941151703 941151706
941151835 941151838
941151894 941151897
941151995 941151998
941152043 941152046
941152304 941152307
941152315 941152318
941152351 941152354
941152437 941152440
941152849 941152852
941153064 941153065
941153552 941153553
941153987 941153990
941154181 941154182
941161520 941161523
941161533 941161536
941168526 941168529
941170907 941170910
941170939 941170942
941170944 941170947
941170975 941170979
941171064 941171067
941171068 941171071
941171137 941171141
941171153 941171156
941171198 941171201
941171268 941171271
941171388 941171391
941171420 941171423
941174943 941174946
941175090 941175093
941175147 941175150
941175290 941175293
941175483 941175486
941176251 941176254
941176411 941176414
941176422 941176425
941176518 941176521
941178047 941178050
941178539 941178542
941181399 941181402
941181445 941181448
941181636 941181640
941181689 941181692
941182098 941182101
941194394 941194397
941194399 941194402
941194412 941194415
941194476 941194479
941194522 941194525
941194589 941194592
941194642 941194645
941194770 941194773
941194941 941194944
941195307 941195310
941195321 941195324
941208916 941208919
941209006 941209009
941209039 941209042
941209076 941209079
941209144 941209147
941228919 941228922
941228928 941228931
941234954 941234957
941236907 941236910
941238856 941238859
941238927 941238930
941239107 941239110
941240838 941240841
941289644 941289647
941314771 941314773
941320547 941320550
941321515 941321518
941321529 941321532
941322672 941322675
941325214 941325217
941334911 941334914
941336745 941336746
941369047 941369048
941381368 941381369
941417763 941417764
941419693 941419696
941426395 941426398
941426400 941426403
941503679 941503682
941513831 941513834
941533317 941533318
941533482 941533485
941681114 941681117
941698853 941698854
941699671 941699672
941699977 941699978
941704075 941704078
941711820 941711823
941711883 941711886
941713146 941713149
942203558 942203559
942203741 942203742
942208323 942208324
942215902 942215903
942220176 942220177
942278676 942278677
942279315 942279316
942293647 942293648
942312454 942312455
942314225 942314226
942350490 942350491
942358823 942358824
942360894 942360895
942365721 942365722
942371214 942371215
942393673 942393674
942397096 942397103
942397104 942397113
942973223 942973224
942983323 942983325
943027107 943027108
943027624 943027625
943029879 943029880
943048703 943048704
943056304 943056305
943061145 943061146
943071303 943071304
943083244 943083247
943084579 943084582
943090528 943090545
943127489 943127491
943133572 943133574
943324705 943324706
943331978 943331979
943336122 943336125
943344385 943344386
943395279 943395281
943397664 943397665
943398530 943398531
943398631 943398632
943412606 943412607
943419251 943419254
943419256 943419259
943439502 943439504
943439617 943439618
943443779 943443780
943466923 943466926
943466963 943466966
943474590 943474591
943475217 943475218
943479790 943479793
943488698 943488701
943504927 943504928
943505401 943505404
943510180 943510181
943517409 943517410
943582352 943582355
943583212 943583213
943584307 943584308
943584883 943584884
943613528 943613529
943617511 943617512
944075149 944075151
944162074 944162075
944169801 944169803
944193522 944193523
944200946 944200947
944201428 944201429
944231368 944231369
944257337 944257338
944268543 944268544
944698370 944698371
944704522 944704523
944710682 944710683
944724923 944724924
944737657 944737658
944767161 944767162
944770202 944770203
944791330 944791331
944793046 944793047
944796835 944796836
944824277 944824278
944825594 944825608
944839362 944839363
944856540 944856541
944858818 944858819
944863393 944863394
944868300 944868301
944879904 944879905
944889666 944889667
944890474 944890475
944895730 944895731
944898072 944898073
944972101 944972102
944973033 944973034
944982727 944982728
944984056 944984057
945035913 945035914
945038514 945038515
945043889 945043890
945044566 945044567
945045900 945045901
945061237 945061238
945063482 945063483
945097282 945097283
945115095 945115096
945115304 945115305
945225063 945225064
945236467 945236468
945237864 945237865
945239431 945239432
945241796 945241797
945248322 945248323
945255136 945255137
945256053 945256054
945259685 945259686
945276211 945276212
945281603 945281604
945282019 945282036
945283634 945283635
945311769 945311770
945322858 945322859
945339954 945339955
945353698 945353700
945356185 945356186
945359418 945359419
945359951 945359957
945359958 945359959
945359960 945359967
945361131 945361138
945361139 945361148
945361659 945361660
945363558 945363559
945366053 945366060
945366061 945366071
945366911 945366912
945382680 945382681
945394082 945394083
945402239 945402245
945402246 945402247
945402248 945402255
945412199 945412200
945417431 945417438
945417439 945417448
945435533 945435534
945438571 945438572
945444875 945444882
945444883 945444893
945450911 945450918
945450919 945450929
945453064 945453065
945453066 945453070
945455646 945455648
945456254 945456255
945456775 945456778
945462016 945462017
945462019 945462020
945462021 945462024
945468759 945468760
945476713 945476714
945480408 945480409
945480422 945480423
945480539 945480540
945507866 945507867
945517609 945517610
945517983 945517984
945518843 945518844
945519560 945519561
945521895 945521912
945522357 945522358
945550348 945550349
945550755 945550756
945564635 945564636
945564940 945564941
945570124 945570125
945571184 945571185
945571645 945571646
945610634 945610635
945612144 945612151
945612152 945612161
945612485 945612486
945621176 945621177
945624793 945624794
945626227 945626228
945636584 945636600
945636720 945636721
945641668 945641669
945641679 945641680
945649398 945649399
945661824 945661825
945662452 945662453
945666612 945666613
945667784 945667786
945667787 945667800
945670462 945670463
945676483 945676484
945841496 945841497
945846338 945846339
945862924 945862925
945883413 945883430
945884077 945884078
945889942 945889943
945896002 945896003
945902611 945902612
945910190 945910191
945924820 945924821
945927435 945927436
945928977 945928978
945932514 945932515
945936113 945936114
945944573 945944574
945945118 945945119
945956841 945956842
945960655 945960656
945961378 945961379
945965558 945965559
945966314 945966315
945970663 945970664
945972720 945972723
945981772 945981773
946002181 946002182
946008392 946008393
946012559 946012576
946015146 946015147
946016274 946016275
946019344 946019345
946025121 946025122
946041996 946041997
946049403 946049404
946049405 946049406
946049407 946049408
946049416 946049417
946053518 946053520
946056267 946056268
946058931 946058938
946058939 946058940
946058941 946058948
946062871 946062872
946074210 946074211
946075722 946075723
946076708 946076709
946077408 946077409
946085376 946085382
946085384 946085393
946087186 946087187
946087251 946087258
946087259 946087268
946091270 946091271
946094898 946094899
946104812 946104813
946106513 946106514
946108943 946108944
946119270 946119271
946125954 946125955
946138871 946138873
946146625 946146626
946147558 946147559
946147562 946147571
946147572 946147574
946148787 946148788
946150787 946150788
946151173 946151174
946157003 946157004
946181321 946181322
946182679 946182680
946342589 946342590
946343526 946343543
946345749 946345750
946347698 946347699
946360071 946360072
946363186 946363187
946365119 946365120
946379347 946379348
946398633 946398634
946399760 946399761
946427176 946427191
946434890 946434891
946441287 946441288
946446751 946446752
946469159 946469160
946470800 946470801
946482525 946482526
946482661 946482662
946485919 946485920
946497057 946497058
946498010 946498011
946505680 946505681
946507919 946507920
946517017 946517018
946527079 946527080
946528538 946528539
946528908 946528909
946538759 946538760
946548107 946548108
946549375 946549376
946557042 946557043
946562910 946562911
946562912 946562913
946565996 946565997
946567077 946567078
946567350 946567351
946575098 946575099
946579616 946579617
946580758 946580759
946615725 946615726
946628764 946628765
946636783 946636784
946639819 946639820
946641674 946641675
946648331 946648332
946664059 946664060
946681235 946681236
946684307 946684308
946720204 946720205
946755369 946755370
946755542 946755545
946755547 946755548
946755550 946755554
946755555 946755557
946755558 946755560
946758206 946758213
946758214 946758223
946758945 946758946
946768824 946768830
946768831 946768840
946784685 946784686
946785960 946785961
946792559 946792560
946794589 946794596
946794597 946794606
946805256 946805260
946805261 946805265
946805266 946805268
946817060 946817061
946823969 946823970
946842664 946842665
946858007 946858008
946859729 946859730
946861999 946862000
946868834 946868835
946868836 946868837
946889822 946889823
946895324 946895325
946910515 946910516
946977097 946977098
946978151 946978152
946983001 946983002
946993074 946993075
947040613 947040614
947062833 947062834
947066554 947066555
947070562 947070563
947080778 947080779
947081853 947081854
947089869 947089870
947090943 947090944
947092290 947092291
947093133 947093139
947093140 947093150
947101067 947101068
947106354 947106355
947111840 947111841
947116804 947116805
947117766 947117767
947146413 947146414
947149590 947149591
947152458 947152459
947157374 947157375
947171204 947171205
947174805 947174808
947181211 947181212
947183762 947183779
947191287 947191288
947191894 947191895
947197642 947197643
947197911 947197912
947204625 947204670
947209996 947209997
947214695 947214696
947224823 947224824
947228583 947228628
947228868 947228928
947233246 947233247
947233443 947233488
947238423 947238468
947247695 947247696
947253957 947254002
947254182 947254227
947303499 947303544
947311224 947311299
947699560 947699605
947701678 947701723
949348207 949348237
949393986 949394016
949421207 949421252
949492175 949492205
949492678 949492686
949550610 949550700
949611862 949611892
949644713 949644714
949669169 949669171
949703852 949703897
949864048 949864078
949870678 949870708
949875763 949875808
949875838 949875883
949930627 949930657
949949089 949949134
950006483 950006484
950086414 950086489
950087344 950087374
950113824 950113854
950152253 950152298
950159285 950159286
950179566 950179567
950184857 950184883
950227238 950227239
950234138 950234139
950242937 950243012
950243162 950243207
950244354 950244355
950244887 950244947
950246057 950246087
950253308 950253353
950276954 950276955
950281419 950281464
950290284 950290329
950290659 950290689
950295017 950295062
950296127 950296157
950299292 950299337
950299427 950299472
950300252 950300297
950302263 950302308
950302533 950302623
950317960 950317990
950339353 950339354
950363172 950363191
950366357 950366431
950389733 950389763
950451944 950451989
950610962 950610963
950611982 950612007
950775467 950775468
950782442 950782443
950786176 950786177
950788504 950788505
950801801 950801831
950808520 950808522
950808997 950808998
950809334 950809379
950809726 950809727
950811477 950811478
950811919 950811922
950812034 950812079
950817665 950817668
950820898 950820899
950821132 950821134
950929491 950929536
950947251 950947296
950949471 950949516
950950212 950950214
950951730 950951731
950955769 950955771
950956971 950957016
950957654 950957655
951025991 951026036
951026906 951026966
951027476 951027521
951027536 951027581
951035366 951035396
951035966 951036011
951038351 951038396
951039176 951039221
951039622 951039623
951039686 951039731
951040976 951041006
951043691 951043693
951043916 951043961
951044516 951044561
951044968 951044969
951045019 951045020
951045056 951045101
951045716 951045761
951046758 951046759
951046811 951046871
951048236 951048296
951048483 951048484
951050966 951051011
951051221 951051266
951053711 951053756
951055031 951055061
951055601 951055617
951075249 951075266
951084218 951084221
951084488 951084491
951085331 951085335
951085642 951085645
951085789 951085792
951086143 951086146
951086209 951086212
951086442 951086445
951086827 951086830
951087285 951087288
951087322 951087325
951087389 951087392
951087848 951087851
951087910 951087913
951088572 951088575
951088701 951088706
951088975 951088978
951089125 951089128
951089371 951089374
951089391 951089394
951089640 951089643
951120533 951120578
951120977 951120978
951132561 951132562
951132848 951132893
951157115 951157160
951166568 951166571
951172312 951172313
951177768 951177769
951180873 951180918
951183858 951183903
951200382 951200427
951202557 951202602
951213801 951213802
951218262 951218263
951233730 951233731
951236325 951236370
951242089 951242091
951286423 951286424
951339212 951339242
951339602 951339647
951350865 951350925
951351870 951351930
951357429 951357430
951360003 951360004
951366555 951366600
951368520 951368550
951369915 951369975
951377973 951378033
951387873 951387918
951402426 951402471
951412545 951412558
951425136 951425137
951437895 951437940
951446318 951446320
951453844 951453845
951463284 951463285
951465323 951465324
951492426 951492471
951494391 951494451
951624439 951624440
951641973 951641974
951654765 951654766
951733440 951733441
951737886 951737931
951782222 951782252
951788813 951788814
951802928 951802929
951810208 951810209
951865554 951865614
951866223 951866224
951902918 951902919
951971456 951971457
951987471 951987472
951988915 951988960
952029611 952029656
952060818 952060834
952070847 952070848
952078745 952078805
952079876 952079877
952140337 952140338
952172535 952172580
952257530 952257531
952311660 952311690
952327938 952327965
952346846 952346869
952352975 952352976
952394099 952394128
952394633 952394677
952404206 952404207
952408019 952408064
952416339 952416340
952443335 952443380
952452248 952452338
952467111 952467171
952482116 952482117
952521950 952521951
952546741 952546786
952563373 952563374
952565160 952565205
952592070 952592091
952607303 952607326
952628241 952628271
952628735 952628736
952650960 952650961
952711192 952711222
952736611 952736612
952808738 952808740
952808743 952808745
952812132 952812177
952825545 952825590
952835257 952835302
952837720 952837721
952838171 952838172
952842787 952842832
952851806 952851807
952852780 952852781
952854890 952854891
952854917 952854918
952856040 952856041
952856249 952856250
952856257 952856302
952896445 952896477
952920045 952920120
952926090 952926120
952930891 952930892
952933091 952933092
952933785 952933786
952939701 952939702
952941872 952941873
952951617 952951618
952969881 952969926
952972254 952972255
952992765 952992810
952993154 952993155
953044735 953044744
953051226 953051271
953075453 953075483
953076263 953076308
953077673 953077718
953080065 953080095
953081355 953081385
953093107 953093137
953097147 953097148
953101346 953101347
953109346 953109347
953116747 953116792
953121037 953121067
953153098 953153143
953157553 953157580
953181090 953181120
953189701 953189746
953191096 953191141
953254380 953254425
953255670 953255700
953271164 953271165
953283900 953283945
953284978 953284979
953290155 953290200
953311649 953311694
953314409 953314454
953314469 953314495
953320329 953320359
953321484 953321529
953341005 953341035
953342935 953342936
953344005 953344035
953348565 953348610
953425695 953425696
953430992 953430993
953433555 953433600
953459146 953459147
953465232 953465277
953469477 953469494
953477854 953477855
953498462 953498507
953514078 953514079
953517812 953517813
953529784 953529785
953529840 953529885
953532961 953532962
953572603 953572633
953574823 953574913
953578161 953578191
953578536 953578596
953578731 953578776
953580381 953580426
953586523 953586568
953587363 953587408
953610423 953610453
953611923 953611968
953626818 953626819
953629001 953629046
953630056 953630057
953641573 953641581
953688495 953688525
953695166 953695167
953702205 953702235
953707245 953707246
953710845 953710846
953720677 953720678
953725231 953725232
953733825 953733870
953747532 953747577
953751207 953751252
953751585 953751588
953754737 953754740
953754767 953754768
953763680 953763681
953765994 953765995
953777454 953777455
953781366 953781367
953782871 953782916
953788000 953788001
953791016 953791046
953812934 953812937
953820136 953820137
953821496 953821516
953828323 953828368
953838589 953838590
953859600 953859660
953867130 953867160
953877150 953877195
953935536 953935539
953959515 953959545
953963645 953963646
953966776 953966777
953969370 953969400
953970480 953970525
953977307 953977308
953985581 953985654
954025730 954025743
954064455 954064500
954102235 954102238
954114486 954114487
954143156 954143159
954144240 954144270
954150270 954150300
954180734 954180737
954186479 954186480
954192564 954192609
954198233 954198234
954204750 954204780
954205455 954205456
954219030 954219075
954246714 954246744
954252624 954252669
954261204 954261249
954261264 954261287
954265256 954265316
954268142 954268143
954271076 954271121
954272621 954272696
954272711 954272756
954292290 954292368
954308290 954308320
954324130 954324160
954326066 954326071
954329392 954329395
954334563 954334564
954338069 954338070
954353577 954353578
954353719 954353720
954355702 954355732
954359310 954359311
954363877 954363907
954367357 954367387
954369344 954369347
954387295 954387296
954421676 954421721
954422810 954422811
954423347 954423348
954427849 954427850
954442869 954442899
954448439 954448442
954455707 954455767
954510444 954510489
954521737 954521740
954546486 954546531
954552210 954552240
954557475 954557520
954562267 954562268
954562407 954562408
954565110 954565111
954566262 954566263
954567930 954567960
954570555 954570600
954576984 954577014
954624348 954624393
954654116 954654161
954654379 954654382
954655896 954655903
954660576 954660577
954665239 954665284
954668029 954668074
954674897 954674898
954675117 954675118
954677272 954677273
954679234 954679279
954680885 954680888
954690456 954690459
954691336 954691339
954707850 954707853
954725340 954725353
954749585 954749663
954759754 954759757
954765557 954765617
954768332 954768407
954768460 954768463
954771621 954771624
954773792 954773837
954775439 954775442
954830960 954831005
954834261 954834262
954844400 954844445
954857662 954857665
954873547 954873607
954874297 954874342
954874575 954874576
954879322 954879323
954914796 954914799
954917588 954917591
954918166 954918196
954923543 954923546
954923771 954923774
954930267 954930270
954931916 954931919
954933874 954933877
954939897 954939900
954940259 954940262
954940420 954940423
954942363 954942408
954947787 954947790
954948331 954948334
954953747 954953748
954955527 954955530
954957050 954957053
954965046 954965049
954965501 954965546
954965813 954965816
954966592 954966595
954974257 954974260
954975922 954975925
954977050 954977053
955014911 955014914
955015168 955015171
955015359 955015362
955034366 955034369
955034448 955034451
955034488 955034491
955046816 955046861
955053561 955053564
955081537 955081582
955084223 955084226
955085625 955085628
955085958 955085975
955095016 955095019
955096002 955096005
955096966 955096967
955098534 955098537
955099269 955099272
955099405 955099408
955100305 955100308
955103680 955103681
955104553 955104556
955107350 955107353
955111145 955111190
955111200 955111203
955112090 955112093
955112915 955112960
955113315 955113318
955113408 955113411
955115338 955115341
955115893 955115896
955118967 955118970
955118972 955118975
955119149 955119152
955119271 955119274
955119551 955119554
955121819 955121822
955122963 955122966
955123714 955123717
955124624 955124627
955124911 955124914
955124928 955124931
955127232 955127235
955127582 955127585
955127744 955127747
955129285 955129290
955131465 955131468
955131809 955131812
955132269 955132272
955133622 955133625
955133733 955133736
955134402 955134405
955135498 955135543
955136078 955136081
955136847 955136850
955136851 955136854
955137449 955137452
955138511 955138514
955138602 955138605
955138829 955138832
955139368 955139371
955139542 955139545
955141979 955141982
955141995 955141998
955142964 955142967
955143293 955143297
955184129 955184132
955184546 955184549
955187360 955187361
955187969 955187972
955190283 955190284
955190420 955190423
955190932 955190935
955190965 955190968
955191452 955191455
955194152 955194155
955194225 955194228
955195995 955195998
955196929 955196932
955197545 955197548
955198817 955198821
955198932 955198935
955199295 955199297
955332442 955332487
955333189 955333192
955335373 955335376
955336378 955336438
955341651 955341654
955342437 955342441
955344972 955344975
955345378 955345423
955346206 955346209
955353975 955353978
955354223 955354226
955354464 955354494
955358565 955358568
955358679 955358682
955358866 955358869
955359284 955359287
955360370 955360373
955361028 955361031
955362971 955362974
955365580 955365583
955366524 955366527
955366559 955366562
955368446 955368449
955368455 955368458
955368523 955368527
955368618 955368621
955368682 955368685
955368868 955368871
955368914 955368917
955368973 955368976
955369022 955369024
955374829 955374832
955374907 955374910
955375001 955375004
955375262 955375267
955375401 955375403
955376009 955376012
955376073 955376076
955382244 955382247
955382572 955382575
955382856 955382859
955383270 955383273
955384864 955384867
955385315 955385318
955385587 955385591
955385649 955385652
955386064 955386067
955386166 955386169
955391832 955391835
955392237 955392240
955392959 955392962
955394637 955394640
955422802 955422805
955422894 955422897
955423998 955424058
955424351 955424354
955425868 955425871
955428105 955428106
955432345 955432348
955432428 955432473
955435149 955435150
955437633 955437678
955438330 955438333
955438758 955438803
955439103 955439106
955441699 955441702
955442030 955442033
955442650 955442651
955442652 955442655
955443117 955443120
955443648 955443651
955445602 955445605
955449103 955449106
955449534 955449537
955449607 955449610
955452081 955452084
955453206 955453209
955457238 955457241
955458574 955458577
955458737 955458740
955460701 955460704
955469979 955469982
955470196 955470205
955470907 955470910
955471050 955471054
955471463 955471466
955471817 955471820
955471901 955471904
955472411 955472412
955472585 955472588
955472648 955472651
955473909 955473912
955476460 955476463
955476543 955476546
955477916 955477919
955479412 955479415
955480281 955480284
955482014 955482017
955484105 955484108
955486136 955486181
955488726 955488729
955489328 955489358
955489811 955489814
955490422 955490425
955490439 955490442
955490959 955490963
955500844 955500845
955503320 955503321
955518269 955518314
955649724 955649769
955654029 955654059
955657596 955657597
955660449 955660494
955664279 955664280
955672020 955672050
955674090 955674120
955676959 955676960
955687575 955687635
955700688 955700704
955704198 955704228
955716724 955716725
955735472 955735517
955740167 955740176
955743875 955743920
955744954 955744955
955746011 955746012
955746950 955746995
955750952 955750953
955756015 955756016
955759515 955759545
955760835 955760880
955784305 955784350
955786135 955786180
955787995 955788040
955794925 955794970
955827073 955827118
955838562 955838569
955847520 955847550
955851870 955851915
955858095 955858125
955865715 955865760
955867648 955867649
955868505 955868550
955874340 955874341
955878795 955878840
955881009 955881010
955892002 955892003
955894121 955894151
955902316 955902317
955905371 955905401
955921099 955921174
955923229 955923259
955928348 955928349
955931850 955931895
955932735 955932780
955935510 955935540
955937400 955937445
955942065 955942110
955944570 955944615
955947990 955948035
955951200 955951245
955953630 955953675
955954605 955954635
955954900 955954901
955961355 955961400
955970464 955970509
955971649 955971709
955978357 955978358
955985174 955985204
955992073 955992133
955994563 955994623
956011682 956011727
956022557 956022558
956023924 956023925
956025364 956025365
956027503 956027504
956040180 956040210
956077727 956077772
956091898 956091899
956092126 956092127
956099313 956099358
956099688 956099733
956104190 956104193
956106210 956106285
956106542 956106545
956106624 956106627
956110076 956110079
956116574 956116575
956117861 956117864
956118717 956118720
956118808 956118811
956119016 956119019
956119073 956119076
956119351 956119354
956121984 956121987
956123189 956123192
956126134 956126179
956130269 956130272
956131654 956131699
956133041 956133044
956133916 956133919
956136279 956136282
956137121 956137124
956137609 956137612
956138295 956138296
956139153 956139156
956139212 956139215
956140862 956140863
956141130 956141133
956145576 956145579
956145630 956145633
956146060 956146063
956146701 956146704
956147447 956147450
956147612 956147615
956194452 956194455
956194834 956194837
956196320 956196326
956196681 956196684
956197894 956197897
956201099 956201102
956201263 956201266
956203047 956203048
956205660 956205690
956206775 956206776
956207368 956207371
956210396 956210399
956213301 956213304
956214843 956214846
956216054 956216057
956216984 956216987
956217541 956217544
956217947 956217948
956218263 956218266
956219709 956219712
956220696 956220699
956220799 956220802
956220832 956220835
956221241 956221247
956221415 956221419
956223625 956223628
956231772 956231775
956232991 956232992
956236148 956236223
956242061 956242121
956250085 956250088
956253859 956253862
956254957 956254960
956256144 956256147
956266088 956266089
956266718 956266793
956269877 956269878
956270531 956270534
956270789 956270792
956273422 956273423
956279265 956279295
956285625 956285670
956287743 956287746
956297292 956297295
956297357 956297360
956297506 956297509
956301720 956301723
956302052 956302097
956302163 956302166
956302866 956302869
956307497 956307542
956311094 956311097
956311603 956311606
956312719 956312722
956312795 956312798
956312927 956312930
956312958 956312961
956312971 956312974
956313298 956313301
956313554 956313557
956313583 956313586
956313594 956313597
956313852 956313855
956313915 956313918
956314052 956314055
956314305 956314308
956314368 956314371
956314401 956314404
956314430 956314433
956317250 956317253
956317574 956317577
956329424 956329454
956345706 956345707
956368820 956368823
956369553 956369556
956369894 956369897
956370058 956370061
956370766 956370767
956373557 956373602
956379722 956379752
956382677 956382752
956385367 956385370
956387522 956387525
956393770 956393773
956393960 956393963
956394104 956394107
956394134 956394137
956396386 956396389
956396453 956396456
956397301 956397304
956397775 956397778
956400115 956400118
956400714 956400717
956400937 956400940
956403694 956403697
956404447 956404450
956404830 956404833
956404981 956404982
956406295 956406298
956407985 956407988
956408027 956408030
956409152 956409155
956431752 956431812
956432109 956432112
956438188 956438191
956438336 956438339
956438466 956438469
956438603 956438606
956439544 956439547
956439843 956439873
956463288 956463291
956464851 956464881
956472111 956472114
956473357 956473358
956491552 956491555
956492314 956492317
956492777 956492780
956492999 956493002
956493291 956493294
956493849 956493852
956494871 956494872
956499693 956499696
956500715 956500718
956514834 956514837
956514922 956514925
956515679 956515682
956516043 956516046
956516209 956516212
956518055 956518058
956520741 956520771
956522976 956523006
956531886 956531889
956534412 956534415
956534775 956534805
956555603 956555648
956556729 956556732
956556962 956556965
956562264 956562267
956563198 956563201
956564222 956564225
956565882 956565885
956572373 956572418
956575076 956575079
956575756 956575759
956580423 956580426
956580482 956580485
956581681 956581684
956581835 956581838
956583927 956583972
956588905 956588908
956590019 956590022
956593216 956593219
956594042 956594045
956594473 956594518
956595728 956595731
956597000 956597003
956597122 956597125
956597855 956597944
956598771 956598774
956600055 956600058
956600957 956600987
956603106 956603109
956603456 956603459
956607444 956607447
956608409 956608412
956608868 956608871
956608885 956608888
956609029 956609032
956615887 956615890
956621048 956621051
956621084 956621087
956621314 956621317
956621436 956621439
956621761 956621764
956621832 956621835
956622109 956622112
956622305 956622308
956622930 956622975
956623198 956623201
956643367 956643427
956644042 956644102
956644338 956644341
956646670 956646673
956647716 956647719
956654610 956654613
956666617 956666620
956666677 956666707
956670179 956670182
956671841 956671844
956672065 956672068
956675368 956675371
956677422 956677425
956677999 956678002
956682592 956682595
956683338 956683341
956684773 956684776
956687054 956687129
956692023 956692026
956693589 956693592
956695354 956695357
956695703 956695706
956696948 956696952
956698964 956699024
956701140 956701143
956701949 956701994
956718564 956718567
956721746 956721776
956725226 956725256
956736626 956736656
956748118 956748119
956756422 956756452
956757262 956757292
956757789 956757790
956762752 956762797
956767493 956767496
956769049 956769052
956769547 956769592
956771045 956771048
956772048 956772051
956772815 956772816
956775010 956775013
956781727 956781757
956784595 956784598
956788867 956788912
956792002 956792032
956801085 956801115
956801224 956801227
956808660 956808705
956811885 956811915
956822682 956822684
956823645 956823690
956823735 956823765
956826276 956826279
956831611 956831613
956834349 956834352
956841666 956841667
956842676 956842679
956847487 956847532
956857882 956857927
956859172 956859178
956860502 956860513
956862207 956862210
956868063 956868075
956872646 956872647
956881422 956881425
956883765 956883810
956891219 956891222
956892035 956892038
956894096 956894099
956897858 956897918
956908012 956908015
956909371 956909416
956909701 956909746
956910631 956910661
956911186 956911204
956914364 956914409
956916284 956916344
956921072 956921075
956986583 956986628
956986752 956986755
956991338 956991368
957005025 957005028
957005509 957005510
957006005 957006008
957006248 957006251
957045877 957045880
957045980 957046055
957046671 957046674
957046910 957046955
957049025 957049055
957056535 957056580
957056647 957056650
957057305 957057308
957063336 957063339
957064829 957064832
957067200 957067245
957068130 957068175
957069060 957069090
957072540 957072585
957080593 957080623
957080803 957080833
957082130 957082133
957082573 957082633
957084067 957084070
957093661 957093664
957107570 957107573
957110583 957110586
957127639 957127642
957133811 957133814
957161620 957161623
957164457 957164487
957173461 957173462
957175876 957175879
957179172 957179217
957184224 957184227
957186476 957186479
957186599 957186600
957188495 957188498
957191299 957191300
957193720 957193723
957198323 957198326
957203974 957203977
957209177 957209180
957247561 957247562
957250716 957250746
957254901 957254946
957256304 957256307
957260724 957260727
957261513 957261516
957263211 957263241
957267173 957267174
957268177 957268180
957273017 957273018
957273820 957273823
957282908 957282938
957284946 957284949
957286253 957286298
957299060 957299063
957337108 957337153
957337798 957337843
957337858 957337888
957342493 957342516
957346217 957346220
957355902 957355947
957356767 957356770
957365133 957365136
957366135 957366180
957367755 957367815
957380012 957380013
957385079 957385124
957416952 957416982
957418540 957418543
957435693 957435724
957437059 957437089
957439429 957439459
957447791 957447794
957448148 957448151
957448777 957448778
957449089 957449134
957457142 957457145
957462413 957462414
957462996 957462999
957465464 957465465
957467788 957467818
957471133 957471142
957472810 957472813
957473382 957473385
957474283 957474286
957477333 957477334
957479851 957479881
957481221 957481224
957482766 957482767
957488280 957488310
957492097 957492098
957495573 957495576
957496696 957496697
957501225 957501255
957501257 957501258
957505359 957505362
957512776 957512779
957517436 957517437
957519863 957519866
957521529 957521531
957522839 957522865
957525390 957525405
957532354 957532355
957533037 957533097
957533342 957533345
957534566 957534569
957535257 957535287
957544952 957544997
957547240 957547243
957550295 957550298
957554747 957554792
957576927 957576930
957585204 957585249
957590753 957590754
957594871 957594916
957594927 957594929
957599082 957599083
957601053 957601056
957601295 957601325
957605392 957605393
957615998 957616001
957670700 957670703
957675839 957675842
957676818 957676819
957677632 957677633
957682707 957682710
957696478 957696481
957711790 957711791
957712490 957712520
957722137 957722182
957723262 957723292
957724263 957724264
957726431 957726448
957727942 957727958
957730326 957730371
957765357 957765360
957768121 957768151
957768181 957768226
957771301 957771331
957772456 957772501
957778625 957778628
957778994 957778997
957780101 957780146
957781354 957781357
957785713 957785788
957786277 957786278
957786418 957786463
957786585 957786586
957798250 957798253
957799307 957799310
957800184 957800197
957806293 957806338
957806382 957806385
957809853 957809856
957813595 957813640
957814553 957814556
957823757 957823760
957824533 957824578
957830643 957830662
957839044 957839089
957841879 957841909
957842595 957842598
957843298 957843299
957846139 957846184
957860227 957860272
957865419 957865420
957865447 957865450
957872638 957872641
957872789 957872819
957885856 957885859
957900584 957900587
957905609 957905612
957906601 957906646
957917445 957917448
957920581 957920584
957921539 957921809
957921854 957922019
957922034 957922079
957922109 957922154
957922169 957922229
957922304 957922349
957922694 957922739
957923024 957923054
957924164 957924167
957946277 957946278
957947350 957947353
957948080 957948083
957955079 957955082
957956927 957956930
957957468 957957471
957958226 957958227
957958396 957958399
957962497 957962502
957963238 957963241
957967298 957967301
957971660 957971690
957973235 957973265
957973504 957973507
957975229 957975232
957976430 957976460
957989660 957989705
957990140 957990214
957993364 957993367
957994570 957994573
958010984 958010987
958011022 958011025
958011208 958011211
958014967 958014970
958022759 958022762
958026702 958026705
958028483 958028528
958028872 958028875
958033829 958033832
958037473 958037476
958037888 958037918
958038605 958038608
958040278 958040281
958041242 958041245
958044552 958044555
958049120 958049123
958049891 958049894
958052243 958052246
958052340 958052343
958052352 958052355
958052358 958052359
958056574 958056577
958058000 958058003
958059236 958059239
958061065 958061095
958064224 958064225
958065392 958065395
958080945 958080948
958088430 958088433
958089870 958089915
958091535 958091565
958097588 958097591
958099185 958099188
958100369 958100372
958102412 958102415
958103551 958103554
958104909 958104912
958106302 958106303
958107883 958107886
958108034 958108035
958110142 958110145
958112457 958112490
958112862 958112865
958121604 958121607
958122998 958123000
958124181 958124184
958124580 958124625
958127580 958127610
958133022 958133025
958133465 958133468
958137829 958137832
958139986 958139989
958140237 958140241
958141180 958141183
958141405 958141408
958143385 958143388
958144088 958144091
958145536 958145539
958149228 958149231
958153866 958153869
958154125 958154155
958158070 958158115
958158406 958158409
958162645 958162690
958164936 958164939
958171152 958171182
958171185 958171188
958171424 958171427
958173622 958173625
958175716 958175719
958176135 958176180
958177805 958177808
958178158 958178159
958185032 958185035
958190015 958190018
958191863 958191866
958194558 958194603
958194945 958194949
958197675 958197678
958199212 958199215
958199330 958199333
958201819 958201822
958201936 958201939
958202449 958202452
958203018 958203063
958204555 958204558
958205214 958205217
958206216 958206219
958206330 958206333
958206357 958206360
958206417 958206420
958206738 958206765
958208808 958208838
958212538 958212541
958212916 958212919
958215231 958215235
958215728 958215731
958218648 958218651
958219259 958219262
958220327 958220330
958220695 958220698
958221335 958221338
958288034 958288037
958288513 958288516
958288988 958288991
958290171 958290174
958290240 958290243
958290387 958290390
958291661 958291664
958291681 958291726
958292253 958292256
958293148 958293151
958293789 958293795
958293796 958293826
958295586 958295589
958295710 958295713
958296139 958296142
958296596 958296599
958298108 958298111
958298141 958298144
958298458 958298461
958298865 958298868
958298933 958298936
958299818 958299821
958300955 958300958
958302022 958302025
958302251 958302254
958303925 958303928
958304011 958304014
958304171 958304174
958304302 958304305
958304554 958304558
958304651 958304654
958304723 958304726
958305363 958305366
958305705 958305708
958306425 958306428
958306981 958307006
958312423 958312426
958313313 958313316
958315133 958315136
958315138 958315141
958315805 958315808
958315886 958315889
958317520 958317523
958319304 958319307
958321216 958321276
958332361 958332364
958332587 958332632
958334848 958334851
958337066 958337069
958337294 958337297
958337350 958337353
958337555 958337558
958337690 958337693
958338174 958338177
958338743 958338746
958378376 958378421
958383578 958383579
958390816 958390819
958395357 958395360
958397952 958397955
958398573 958398576
958398791 958398794
958399104 958399107
958399484 958399487
958399587 958399590
958400699 958400702
958400836 958400839
958401468 958401471
958401498 958401501
958401887 958401890
958401972 958401975
958403369 958403372
958403835 958403838
958403944 958403947
958403974 958403977
958404051 958404054
958404729 958404732
958405809 958405812
958405892 958405895
958405986 958405989
958406316 958406319
958406674 958406677
958406777 958406786
958412927 958412930
958413371 958413431
958420936 958420939
958420960 958420963
958421547 958421550
958422103 958422106
958423239 958423242
958444895 958444898
958445389 958445419
958454529 958454532
958455555 958455558
958460544 958460574
958461639 958461669
958463588 958463591
958466913 958466916
958469110 958469113
958469199 958469229
958472025 958472028
958473889 958473892
958475378 958475381
958476092 958476095
958476763 958476766
958477256 958477259
958478073 958478076
958485434 958485437
958488003 958488007
958488552 958488555
958491285 958491288
958491289 958491292
958492822 958492825
958493698 958493701
958494327 958494330
958500037 958500040
958500790 958500793
958502242 958502245
958503754 958503757
958508141 958508144
958509038 958509041
958509601 958509604
958509757 958509760
958510702 958510705
958510808 958510853
958511233 958511236
958513942 958513945
958514007 958514010
958515823 958515826
958515828 958515829
958517188 958517191
958542808 958542853
958543501 958543504
958546138 958546183
958557645 958557648
958557723 958557768
958559760 958559763
958576497 958576500
958578613 958578658
958591433 958591463
958594658 958594665
958597062 958597063
958600083 958600128
958601688 958601733
958604448 958604477
958606625 958606626
958608048 958608049
958615072 958615075
958617361 958617362
958618319 958618320
958619304 958619305
958621693 958621696
958621860 958621890
958624620 958624665
958625090 958625093
958625745 958625775
958638707 958638710
958639582 958639585
958640339 958640342
958640485 958640488
958677317 958677318
958682653 958682698
958707305 958707350
958712000 958712045
958713870 958713873
958714550 958714580
958720389 958720434
958727615 958727618
958729103 958729106
958733262 958733265
958736889 958736903
958741511 958741556
958815213 958815216
958815325 958815355
958817035 958817080
958933902 958933903
958936536 958936539
958973931 958974006
958980889 958980892
958990100 958990101
958998064 958998109
958998366 958998369
959013732 959013735
959028512 959028515
959046165 959046195
959049949 959049950
959054367 959054370
959054685 959054686
959055614 959055659
959056651 959056654
959060887 959060917
959075833 959075836
959082865 959082884
959092815 959092845
959093265 959093310
959097312 959097315
959108409 959108439
959133149 959133224
959135736 959135739
959136734 959136779
959140802 959140847
959142772 959142775
959147492 959147537
959158787 959158832
959158982 959158985
959173943 959173988
959174108 959174138
959177221 959177224
959179319 959179322
959180650 959180680
959183500 959183575
959184945 959184967
959189264 959189294
959193347 959193348
959198319 959198320
959200119 959200122
959200679 959200709
959202824 959202899
959203897 959203898
959203899 959203900
959205694 959205697
959206904 959206918
959209439 959209442
959209871 959209874
959210160 959210171
959220111 959220112
959221789 959221790
959223553 959223583
959224963 959225008
959236260 959236305
959238959 959238962
959243595 959243640
959244924 959244927
959248155 959248158
959249110 959249113
959251094 959251097
959251125 959251155
959260085 959260112
959261036 959261037
959263198 959263199
959264121 959264151
959271713 959271743
959276764 959276809
959281098 959281099
959282031 959282034
959283785 959283788
959285929 959285959
959286499 959286544
959289033 959289036
959290204 959290234
959290819 959290849
959296923 959296968
959297733 959297793
959298885 959298888
959304518 959304521
959308318 959308378
959308798 959308843
959314723 959314768
959316977 959316980
959317717 959317720
959319088 959319089
959319097 959319100
959326294 959326295
959335258 959335333
959352342 959352345
959352912 959352915
959354159 959354162
959356240 959356285
959361600 959361601
959365101 959365104
959366391 959366412
959372881 959372911
959375902 959375905
959391463 959391466
959396683 959396713
959410079 959410124
959419922 959419954
959423785 959423786
959424992 959425037
959438507 959438510
959449541 959449544
959451196 959451241
959454445 959454448
959460136 959460181
959462435 959462438
959462927 959462928
959463250 959463253
959492112 959492131
959503092 959503137
959503305 959503306
959505173 959505174
959509023 959509068
959517835 959517836
959531604 959531607
959535096 959535099
959536119 959536194
959539676 959539721
959541242 959541245
959589272 959589275
959589427 959589430
959603635 959603680
959614190 959614220
959626487 959626490
959659885 959659888
959667645 959667690
959678865 959678895
959682874 959682875
959686407 959686410
959687428 959687461
959691522 959691525
959696764 959696809
959697064 959697109
959697254 959697257
959701057 959701060
959733705 959733735
959734920 959734950
959736480 959736510
959738580 959738625
959740104 959740134
959743895 959743898
959754996 959754997
959758054 959758099
959761122 959761167
959769571 959769616
959770156 959770186
959778720 959778727
959846367 959846397
959846412 959846433
959856997 959857000
959857561 959857586
959899506 959899509
959902396 959902399
959905605 959905650
959905710 959905740
959909475 959909520
959910772 959910775
959915295 959915325
959920852 959920853
959921490 959921565
959924670 959924715
959925225 959925270
959935005 959935037
959938576 959938579
959940570 959940571
959979778 959979853
959983459 959983489
959983594 959983624
959984554 959984584
959984719 959984764
959984794 959984824
959984856 959984859
959989664 959989667
960004236 960004239
960007704 960007705
960008762 960008765
960009473 960009474
960014794 960014839
960016522 960016525
960018124 960018184
960021589 960021634
960022444 960022474
960024994 960025024
960026674 960026719
960027409 960027439
960028384 960028429
960030641 960030644
960072513 960072516
960076005 960076008
960077792 960077795
960102754 960102784
960103759 960103804
960104249 960104252
960104314 960104374
960106200 960106203
960109493 960109494
960110571 960110601
960114600 960114601
960125728 960125731
960186399 960186402
960186779 960186780
960193121 960193151
960194561 960194606
960209545 960209548
960210240 960210241
960212714 960212717
960220868 960220871
960226042 960226072
960233707 960233752
960236437 960236512
960237307 960237352
960239347 960239377
960241036 960241039
960244072 960244117
960267226 960267229
960268635 960268680
960272745 960272790
960283834 960283837
960285007 960285052
960286122 960286125
960286405 960286408
960289155 960289158
960299582 960299585
960305235 960305310
960310515 960310519
960331110 960331113
960331310 960331340
960346260 960346305
960347012 960347015
960350483 960350486
960422106 960422109
960422608 960422611
960426704 960426707
960427839 960427842
960427997 960428057
960428895 960428898
960429561 960429564
960429722 960429752
960430240 960430241
960430607 960430652
960520833 960520836
960521238 960521241
960521322 960521325
960521649 960521652
960522945 960522990
960524720 960524723
960528885 960528915
960541896 960541941
960543012 960543015
960548495 960548498
960550540 960550543
960709129 960709159
960714404 960714449
960718679 960718709
960722160 960722161
960732481 960732482
960806869 960806944
960815938 960815939
960817390 960817435
960837015 960837016
960851330 960851360
960851855 960851900
960881920 960881927
960891776 960891777
960942237 960942240
960942380 960942383
960953020 960953023
960961064 960961067
960967949 960967952
960968862 960968892
960982258 960982261
960985455 960985458
960995190 960995220
960998523 960998526
960998761 960998791
960998971 960999016
960999286 960999316
961001371 961001374
961006318 961006363
961015020 961015023
961017469 961017472
961046875 961046905
961047101 961047104
961065351 961065381
961065981 961066056
961069792 961069795
961070211 961070212
961074751 961074796
961080740 961080743
961090248 961090677
961316451 961316481
961316976 961317021
961317036 961317063
961324835 961324838
961325798 961325801
961330140 961330143
961331961 961331964
961332098 961332101
961341948 961341951
961355171 961355174
961405856 961405859
961405874 961405877
961406672 961406675
961409326 961409329
961416316 961416348
961418528 961418531
961423117 961423147
961425837 961425840
961432240 961432243
961441102 961441132
961441237 961441267
961442352 961442355
961480437 961480440
961484787 961484817
961485523 961485526
961486737 961486782
961494792 961494803
961496978 961497023
961497124 961497127
961497173 961497203
961503735 961503765
961504374 961504377
961514410 961514440
961515803 961515806
961522075 961522120
961523449 961523452
961525780 961525810
961529678 961529681
961534401 961534404
961538737 961538782
961538797 961538823
961539827 961539857
961539932 961539962
961541087 961541162
961545870 961545915
961546477 961546494
961559013 961559030
961559437 961559440
961566728 961566731
961566895 961566912
961576498 961576543
961586950 961586980
961587077 961587080
961598291 961598308
961598357 961598360
961600409 961600412
961601007 961601037
961601578 961601595
961603137 961603182
961614162 961614207
961614234 961614237
961614242 961614245
961614289 961614292
961614499 961614502
961616514 961616517
961617691 961617694
961619292 961619367
961620081 961620084
961621334 961621337
961621660 961621663
961622309 961622312
961623767 961623770
961624454 961624457
961627939 961627942
961628022 961628067
961630170 961630173
961662699 961662716
961665149 961665152
961668158 961668188
961668968 961669028
961669853 961669856
961670776 961670793
961686343 961686346
961686921 961686924
961688849 961688879
961689811 961689814
961689992 961690009
961703984 961703987
961704004 961704007
961741573 961741576
961745375 961745378
961747903 961747906
961749748 961749765
961753467 961753484
961756536 961756553
961757592 961757670
961759334 961759408
961765748 961765751
961811308 961811383
961814816 961814819
961820943 961820946
961821534 961821538
961825616 961825619
961827928 961827931
961827943 961827947
961829799 961829844
961832094 961832124
961896686 961896689
961904303 961904306
961912672 961912689
961915248 961915278
961917918 961917999
961930915 961930918
961932945 961933005
961934353 961934370
961936917 961936920
961947132 961947135
961955215 961955218
961956381 961956384
961959744 961959747
961964393 961964396
961967386 961967389
961967577 961967582
961967974 961967977
961968124 961968129
961970783 961970786
961971834 961971837
961972661 961972664
961973958 961973961
961978588 961978591
961989340 961989343
961989603 961989606
961995137 961995154
961997310 961997340
961997601 961997604
962000541 962000558
962002590 962002620
962005955 962005958
962006280 962006325
962011290 962011320
962011769 962011772
962015130 962015160
962021305 962021322
962023537 962023540
962025315 962025345
962025846 962025849
962030367 962030384
962036265 962036310
962037761 962037778
962037838 962037855
962045479 962045482
962049082 962049085
962051625 962051655
962053365 962053425
962055585 962055615
962058480 962058483
962059527 962059530
962060403 962060406
962062728 962062731
962063310 962063340
962067225 962067255
962067375 962067420
962067480 962067525
962067945 962067990
962070569 962070572
962071097 962071100
962072190 962072235
962075130 962075160
962075175 962075220
962079220 962079223
962080990 962081035
962081813 962081830
962083540 962083570
962084935 962084980
962085925 962085970
962086963 962086980
962089089 962089106
962094051 962094068
962094211 962094214
962094598 962094628
962095117 962095134
962098127 962098130
962099548 962099593
962105533 962105563
962112305 962112322
962124227 962124287
962127362 962127392
962132177 962132207
962146847 962146877
962148032 962148062
962194939 962194969
962202002 962202027
962259121 962259151
962260411 962260486
962276089 962276106
962297474 962297534
962298314 962298344
962306555 962306572
962349157 962349174
962355514 962355532
962358084 962358101
962362477 962362494
962368978 962368995
962372954 962372971
962375361 962375378
962376182 962376212
962380843 962380860
962382047 962382067
962385818 962385848
962385922 962385939
962391284 962391301
962392452 962392469
962398026 962398043
962457980 962458010
962523183 962523200
962540241 962540268
962572884 962572929
962604500 962604517
962609618 962609635
962623971 962624047
962635049 962635078
962636339 962636364
962694335 962694380
962698220 962698250
962699780 962699855
962704331 962704348
962717088 962717105
962722794 962722811
962736109 962736126
962740627 962740644
962752646 962752676
962752841 962752871
962781817 962781862
962786167 962786242
962791805 962791835
962809547 962809567
962823902 962823932
962835737 962835812
962847186 962847205
962857764 962857781
962857815 962857845
962857965 962857995
962860688 962860705
962863755 962863785
962865435 962865510
962869662 962869679
962881080 962881110
962882055 962882100
962887836 962887853
962889015 962889024
962907884 962907901
962917960 962917977
962918518 962918563
962923420 962923437
962951058 962951075
962952515 962952532
962957269 962957314
962958281 962958298
962960089 962960149
962965536 962965553
963035528 963035573
963044793 963044810
963170379 963170383
963210062 963210122
963212462 963212507
963213516 963213533
963223461 963223478
963226358 963226378
963255694 963255724
963255919 963255949
963278054 963278099
963280354 963280371
963283071 963283088
963284702 963284719
963308530 963308547
963312214 963312231
963325499 963325516
963341105 963341135
963347063 963347093
963348233 963348278
963361500 963361530
963364583 963364618
963366710 963366755
963368639 963368656
963380554 963380571
963391645 963391662
963413028 963413045
963416986 963417031
963419444 963419461
963421975 963421992
963431615 963431645
963432461 963432478
963446961 963446978
963457767 963457784
963489506 963489536
963518198 963518228
963519488 963519518
963562528 963562558
963571720 963571795
963609505 963609524
963614656 963614731
963622276 963622306
963632751 963632768
963643868 963643943
963644918 963644954
963645912 963645929
963654094 963654111
963738031 963738048
963739804 963739821
963743322 963743382
963810487 963810532
963811730 963811747
963811912 963811957
963812090 963812107
963822870 963822900
963828051 963828068
963830384 963830401
963836322 963836339
963895114 963895186
963898837 963898854
963916406 963916466
963940681 963940707
963980284 963980329
963981859 963981876
963982346 963982349
963988489 963988519
963989991 963990008
963996372 963996389
964000399 964000429
964006092 964006121
964015186 964015189
964015299 964015302
964015469 964015472
964016045 964016048
964016578 964016581
964017747 964017750
964017828 964017831
964017966 964017996
964018308 964018325
964020081 964020084
964020561 964020564
964020866 964020869
964021009 964021012
964021188 964021191
964021494 964021497
964021607 964021610
964021726 964021729
964022131 964022134
964022156 964022159
964022791 964022794
964023575 964023578
964023676 964023679
964023763 964023766
964024331 964024334
964024719 964024722
964025265 964025268
964031133 964031136
964038104 964038107
964038727 964038744
964046389 964046406
964048172 964048189
964048304 964048364
964052462 964052492
964054792 964054809
964056782 964056800
964068767 964068812
964074677 964074707
964076132 964076162
964084904 964084921
964084942 964084987
964085200 964085217
964086172 964086202
964088955 964088972
964090447 964090477
964090492 964090518
964092776 964092779
964096332 964096335
964104195 964104225
964107330 964107375
964111275 964111305
964119074 964119134
964120308 964120311
964122686 964122703
964122830 964122847
964129301 964129304
964132311 964132328
964134794 964134797
964135034 964135109
964141680 964141710
964147624 964147627
964149555 964149557
964151542 964151587
964154240 964154257
964155454 964155471
964156406 964156409
964158818 964158863
964165494 964165511
964171421 964171424
964171943 964171973
964172144 964172161
964174733 964174763
964175993 964176023
964178423 964178453
964178633 964178661
964182119 964182122
964182200 964182203
964193978 964193995
964206173 964206190
964218233 964218250
964226905 964226908
964227516 964227533
964229040 964229057
964229539 964229569
964231384 964231414
964241691 964241694
964244638 964244641
964247475 964247478
964247953 964247956
964255014 964255017
964261891 964261894
964262484 964262487
964262489 964262492
964262643 964262646
964313398 964313428
964317528 964317545
964332242 964332245
964333976 964333993
964336195 964336225
964339567 964339584
964402385 964402388
964404260 964404290
964405478 964405523
964412493 964412496
964412509 964412512
964419509 964419526
964423151 964423196
964430061 964430064
964436796 964436813
964436937 964436954
964437071 964437100
964448857 964448919
964454901 964454918
964456880 964456897
964458956 964458959
964458961 964458964
964459050 964459053
964460154 964460157
964460559 964460562
964460582 964460585
964461107 964461110
964461178 964461181
964461197 964461200
964461597 964461600
964461807 964461810
964470949 964470952
964509484 964509487
964514586 964514589
964514633 964514636
964515643 964515646
964515686 964515689
964515714 964515717
964515840 964515844
964515876 964515879
964516403 964516406
964534521 964534524
964534737 964534740
964542863 964542880
964544271 964544288
964545021 964545038
964545947 964545964
964548380 964548383
964554217 964554234
964555676 964555679
964558251 964558268
964558720 964558750
964561862 964561879
964563176 964563193
964566557 964566560
964567921 964567951
964573608 964573611
964576173 964576190
964576210 964576255
964577882 964577885
964578108 964578111
964579439 964579456
964579705 964579750
964582927 964582930
964583001 964583004
964584373 964584376
964585400 964585403
964587180 964587197
964587810 964587855
964590702 964590705
964592970 964593000
964593374 964593391
964593418 964593421
964598950 964598953
964603354 964603357
964603447 964603450
964603472 964603475
964611623 964611626
964612271 964612288
964612934 964612951
964613435 964613441
964618462 964618465
964626713 964626716
964628564 964628567
964629040 964629057
964629419 964629436
964630142 964630145
964635500 964635503
964635556 964635560
964635652 964635669
964636137 964636140
964636243 964636246
964636316 964636319
964636328 964636331
964636588 964636605
964636715 964636718
964636758 964636761
964638503 964638506
964638528 964638531
964639134 964639137
964640944 964640961
964649842 964649845
964649901 964649918
964650001 964650029
964650067 964650070
964650119 964650122
964650185 964650188
964650334 964650339
964650778 964650796
964650927 964650944
964651665 964651710
964655448 964655465
964657874 964657891
964659382 964659399
964661400 964661417
964668865 964668882
964669604 964669607
964670727 964670772
964676549 964676552
964677830 964677875
964677883 964677900
964678400 964678445
964680764 964680767
964681713 964681716
964681770 964681773
964681882 964681885
964681921 964681924
964682004 964682007
964682079 964682097
964682101 964682146
964683496 964683526
964687921 964687951
964688981 964688984
964689140 964689157
964691143 964691160
964692464 964692467
964699741 964699786
964700776 964700821
964705022 964705025
964706096 964706113
964710983 964711013
964711691 964711694
964712408 964712453
964715831 964715834
964715848 964715851
964716563 964716593
964716625 964716642
964723433 964723478
964726652 964726655
964729009 964729084
964734154 964734184
964735050 964735053
964735072 964735089
964735472 964735475
964737155 964737172
964738616 964738619
964738674 964738677
964739392 964739395
964741623 964741640
964742164 964742183
964743754 964743771
964744048 964744078
964745398 964745428
964750948 964750978
964761181 964761184
964761632 964761635
964763996 964763999
964764360 964764377
964764538 964764555
964770028 964770031
964770704 964770707
964774796 964774841
964778976 964779011
964782311 964782334
964787128 964787131
964790105 964790125
964794644 964794661
964801757 964801760
964804693 964804696
964808800 964808803
964808844 964808847
964809549 964809552
964814683 964814700
964815558 964815561
964818995 964818998
964820596 964820599
964821596 964821599
964822423 964822426
964823706 964823723
964826325 964826328
964826987 964827032
964827823 964827826
964829305 964829308
964830067 964830070
964831665 964831725
964840909 964840912
964843851 964843854
964845060 964845077
964846665 964846668
964847401 964847418
964872759 964872762
964875047 964875064
964904623 964904626
964904695 964904698
964904807 964904810
964904980 964904983
964904993 964904996
964905085 964905088
964905130 964905133
964905662 964905665
964905726 964905729
964905746 964905777
964905846 964905850
964905890 964905893
964905984 964905987
964906100 964906103
964906137 964906140
964906156 964906159
964906226 964906271
964906317 964906320
964906376 964906380
964906441 964906444
964906547 964906550
964911256 964911273
964914300 964914345
964914495 964914525
964926888 964926891
964927471 964927488
964929512 964929515
964929635 964929665
964931759 964931762
964932069 964932072
964932196 964932199
964932642 964932659
964939877 964939894
964950599 964950616
964952929 964953004
964955089 964955099
964990827 964990830
964991206 964991209
964991737 964991740
964991809 964991812
964992230 964992252
964992989 964992992
964993214 964993218
964993746 964993749
964993877 964993880
964994729 964994732
965008177 965008180
965008353 965008356
965014227 965014230
965018058 965018061
965018152 965018155
965020406 965020411
965020465 965020468
965021469 965021472
965021998 965022001
965022282 965022299
965028565 965028610
965035107 965035110
965044257 965044260
965044344 965044347
965048154 965048157
965049958 965049975
965052729 965052759
965052875 965052878
965053368 965053371
965053445 965053448
965056651 965056654
965056779 965056782
965056957 965056962
965057041 965057044
965057108 965057138
965057152 965057155
965057189 965057192
965058393 965058396
965058399 965058402
965060393 965060396
965060479 965060524
965060891 965060894
965068954 965068984
965070214 965070274
965073732 965073735
965075035 965075038
965078878 965078881
965086077 965086080
965104099 965104144
965106324 965106341
965107039 965107099
965112043 965112046
965117479 965117524
965124109 965124169
965125926 965125943
965127513 965127543
965134682 965134757
965140987 965141032
965141178 965141181
965143460 965143463
965151275 965151278
965157200 965157203
965158573 965158618
965159536 965159539
965161348 965161408
965169686 965169716
965174550 965174595
965176043 965176046
965176144 965176147
965181142 965181145
965182020 965182050
965187767 965187770
965189592 965189595
965195257 965195260
965196502 965196505
965201086 965201089
965204846 965204849
965205676 965205706
965206956 965206959
965208770 965208773
965209933 965209936
965213112 965213115
965213207 965213210
965217101 965217104
965217494 965217497
965221818 965221848
965223618 965223623
965226491 965226536
965227083 965227086
965233875 965233878
965235501 965235504
965236340 965236343
965236582 965236585
965236886 965236892
965236899 965236902
965236928 965236931
965236970 965236973
965236977 965236980
965238182 965238185
965242496 965242541
965249996 965250026
965251517 965251520
965251757 965251760
965253701 965253704
965254880 965254883
965255486 965255531
965257090 965257093
965257109 965257112
965257736 965257766
965258786 965258816
965259139 965259142
965262630 965262675
965264926 965264929
965265137 965265140
965265282 965265285
965265387 965265390
965265582 965265585
965268164 965268167
965271109 965271112
965273803 965273806
965274462 965274465
965275100 965275103
965282932 965282935
965283949 965283952
965284021 965284024
965285301 965285304
965288894 965288897
965289237 965289240
965289634 965289637
965291545 965291548
965291880 965291910
965293307 965293310
965293874 965293877
965294074 965294077
965294348 965294351
965301719 965301722
965305229 965305232
965306111 965306114
965310591 965310594
965312377 965312380
965313441 965313471
965313500 965313503
965317147 965317150
965317787 965317790
965317963 965317966
965321444 965321447
965321501 965321504
965321506 965321510
965321579 965321582
965323041 965323044
965323348 965323352
965323374 965323377
965323387 965323391
965332282 965332312
965334248 965334251
965335345 965335348
965335447 965335537
965336489 965336492
965338041 965338044
965340245 965340248
965347661 965347664
965353575 965353605
965354094 965354097
965354538 965354541
965356917 965356920
965360300 965360303
965361766 965361769
965366612 965366615
965368784 965368787
965369178 965369181
965369559 965369562
965370230 965370233
965370734 965370737
965371235 965371238
965374904 965374907
965378063 965378066
965378562 965378565
965379115 965379118
965380872 965380917
965381504 965381507
965383488 965383491
965383793 965383796
965385417 965385492
965385970 965385973
965387190 965387193
965387288 965387292
965387306 965387337
965389699 965389702
965390111 965390114
965390178 965390181
965390268 965390271
965390421 965390424
965390821 965390825
965390972 965390975
965391023 965391026
965391260 965391263
965391943 965391946
965393151 965393154
965393249 965393252
965393301 965393304
965395084 965395087
965396210 965396213
965396290 965396293
965396386 965396389
965396458 965396461
965396711 965396714
965396746 965396749
965397174 965397177
965397336 965397339
965400812 965400815
965402619 965402622
965402764 965402767
965403044 965403047
965403081 965403084
965403171 965403174
965403781 965403784
965404259 965404262
965404300 965404303
965405148 965405169
965409722 965409767
965413782 965413785
965413835 965413838
965413979 965413982
965413987 965413990
965414888 965414891
965415191 965415194
965415262 965415265
965415373 965415376
965415630 965415633
965441137 965441140
965453923 965453927
965454185 965454189
965471167 965471170
965471773 965471776
965475279 965475282
965476506 965476509
965477783 965477858
965478188 965478191
965479670 965479673
965482144 965482147
965482335 965482338
965482704 965482707
965483957 965483960
965484018 965484021
965484078 965484081
965484345 965484348
965500685 965500688
965501098 965501101
965501350 965501353
965502065 965502068
965503004 965503007
965504591 965504594
965505052 965505055
965505936 965505939
965506472 965506475
965506792 965506795
965513467 965513470
965517595 965517598
965517641 965517644
965526418 965526463
965531198 965531201
965533365 965533369
965533642 965533645
965536828 965536831
965536915 965536918
965541974 965541991
965549772 965549817
965550671 965550674
965550689 965550706
965557971 965557988
965559875 965559878
965561014 965561017
965571580 965571583
965572910 965572970
965574146 965574148
965574493 965574496
965575058 965575061
965577591 965577594
965577800 965577830
965578240 965578257
965578813 965578816
965579287 965579290
965579360 965579363
965579405 965579408
965579434 965579437
965579438 965579441
965579710 965579713
965579783 965579786
965579899 965579902
965580972 965580975
965581554 965581557
965584975 965584978
965585129 965585132
965585615 965585618
965585681 965585684
965585877 965585880
965586071 965586074
965586247 965586250
965586582 965586585
965586594 965586597
965586695 965586698
965586800 965586803
965586938 965586940
965590602 965590605
965592315 965592318
965593308 965593311
965595397 965595414
965596192 965596195
965596297 965596300
965597013 965597016
965603504 965603521
965603540 965603557
965606760 965606763
965606919 965606936
965611513 965611516
965612020 965612023
965615326 965615343
965615828 965615831
965620041 965620058
965622615 965622632
965624400 965624403
965624433 965624439
965624453 965624456
965624809 965624812
965625185 965625188
965629276 965629279
965631502 965631519
965632336 965632353
965632521 965632524
965635160 965635177
965636895 965636912
965637370 965637387
965641027 965641030
965641687 965641690
965642856 965642874
965648184 965648201
965666205 965666222
965667129 965667132
965672377 965672380
965673101 965673104
965673433 965673436
965673454 965673457
965673492 965673495
965673520 965673523
965673619 965673622
965673738 965673741
965673762 965673765
965673808 965673826
965673983 965673986
965674115 965674118
965674245 965674250
965674361 965674364
965674458 965674461
965674557 965674560
965674684 965674687
965674812 965674815
965675155 965675158
965675165 965675168
965675314 965675317
965675534 965675537
965675615 965675618
965675662 965675665
965675814 965675817
965676017 965676020
965676383 965676386
965676388 965676391
965676393 965676396
965676864 965676867
965677220 965677223
965677286 965677289
965677513 965677516
965677886 965677889
965678001 965678004
965678790 965678793
965679376 965679436
965680778 965680795
965694836 965694838
965698220 965698223
965698264 965698268
965698535 965698538
965698626 965698628
965700266 965700269
965700725 965700728
965702094 965702097
965702988 965702991
965703294 965703297
965703991 965703994
965718323 965718325
965726930 965726947
965727620 965727623
965728522 965728525
965729883 965729886
965731074 965731077
965731845 965731848
965732203 965732212
965737784 965737787
965737822 965737839
965745264 965745267
965747929 965747946
965751114 965751117
965752585 965752588
965757006 965757013
965757926 965757929
965758395 965758398
965758544 965758547
965759698 965759701
965759715 965759718
965759801 965759807
965760031 965760034
965764522 965764525
965764687 965764690
965764708 965764725
965765176 965765179
965765301 965765318
965767576 965767579
965768368 965768385
965768915 965768918
965769027 965769030
965770555 965770558
965770690 965770693
965770786 965770831
965786694 965786711
965798454 965798471
965807075 965807092
965809383 965809386
965810017 965810020
965813719 965813736
965829794 965829797
965831628 965831645
965838108 965838111
965840327 965840344
965851096 965851141
965853286 965853303
965857585 965857588
965862498 965862515
965870281 965870298
965871085 965871102
965872853 965872856
965895558 965895561
965906903 965906933
965921717 965921720
965931254 965931271
965933719 965933736
965940278 965940308
965942676 965942693
965944592 965944595
965944780 965944797
965951924 965951927
965959481 965959498
965960495 965960528
965961134 965961151
965961334 965961337
965969849 965969854
965973892 965973895
965984588 965984591
965985745 965985762
965986409 965986426
965990002 965990077
965996973 965996979
966009192 966009195
966015545 966015575
966023590 966023607
966024991 966025066
966029244 966029247
966032840 966032843
966042467 966042470
966050630 966050633
966050841 966050844
966059106 966059123
966059189 966059192
966074460 966074477
966078332 966078349
966080444 966080461
966084077 966084080
966086156 966086190
966103413 966103416
966104252 966104269
966106038 966106041
966106343 966106346
966106404 966106407
966106556 966106562
966106614 966106617
966106648 966106693
966106755 966106758
966106794 966106797
966106805 966106809
966106839 966106842
966106930 966106933
966106969 966106972
966107029 966107033
966107131 966107135
966107242 966107248
966107738 966107741
966107878 966107881
966107986 966107989
966108388 966108421
966118254 966118329
966122500 966122502
966123641 966123644
966123774 966123791
966123952 966123969
966128874 966128891
966129765 966129768
966142348 966142365
966143002 966143005
966147681 966147711
966150550 966150567
966157837 966157854
966167196 966167226
966173245 966173248
966173559 966173562
966174451 966174454
966174875 966174882
966177068 966177071
966179805 966179822
966188247 966188250
966191072 966191147
966200341 966200358
966208103 966208106
966208229 966208232
966214386 966214389
966216520 966216550
966226794 966226811
966236531 966236548
966238307 966238310
966239458 966239475
966253371 966253388
966263726 966263786
966264086 966264116
966264465 966264468
966267329 966267332
966276070 966276087
966284890 966284907
966284930 966284933
966287263 966287266
966287933 966287936
966288132 966288135
966288139 966288142
966291189 966291197
966298647 966298664
966318067 966318084
966320053 966320128
966322362 966322379
966325577 966325594
966327036 966327053
966331037 966331054
966332754 966332771
966339381 966339384
966346945 966346948
966354963 966354980
966356465 966356482
966356582 966356585
966360750 966360767
966362910 966362927
966365778 966365785
966369801 966369804
966374869 966374886
966375856 966375873
966376459 966376476
966377383 966377400
966384520 966384537
966388083 966388086
966389765 966389782
966400441 966400458
966401084 966401101
966403235 966403238
966411356 966411359
966411389 966411392
966411456 966411459
966412680 966412683
966414894 966414897
966415034 966415037
966415109 966415112
966420242 966420259
966420398 966420415
966421512 966421557
966430434 966430437
966431202 966431205
966431650 966431653
966431717 966431736
966439334 966439337
966439362 966439365
966440077 966440080
966440135 966440138
966440178 966440181
966440813 966440816
966441762 966441765
966458256 966458273
966459974 966459977
966461918 966461922
966463501 966463518
966476153 966476170
966482388 966482391
966482625 966482642
966485640 966485643
966497838 966497855
966502621 966502638
966503786 966503803
966503846 966503863
966505650 966505667
966506311 966506328
966507710 966507727
966508242 966508259
966513039 966513042
966516696 966516713
966518146 966518169
966520294 966520297
966526731 966526748
966534959 966534962
966536286 966536289
966537411 966537414
966539325 966539342
966541758 966541760
966543539 966543599
966548468 966548485
966550409 966550439
966554972 966554989
966556158 966556175
966558681 966558698
966558742 966558759
966559243 966559246
966567783 966567787
966567886 966567889
966567897 966567900
966567993 966567997
966568311 966568315
966568630 966568633
966569939 966569942
966570022 966570025
966570085 966570102
966570468 966570471
966571564 966571567
966572928 966572931
966573403 966573463
966573552 966573555
966574270 966574273
966584252 966584255
966584429 966584432
966591085 966591102
966605408 966605411
966611116 966611133
966611262 966611279
966615757 966615760
966621437 966621454
966634189 966634192
966634731 966634734
966640443 966640446
966647699 966647716
966656923 966656926
966670386 966670403
966672671 966672688
966678022 966678025
966678706 966678709
966680866 966680883
966682189 966682206
966684236 966684253
966687853 966687898
966706276 966706279
966715772 966715817
966715832 966715856
966723073 966723090
966724275 966724292
966728056 966728073
966729453 966729456
966736093 966736110
966739791 966739808
966750483 966750486
966765383 966765386
966780097 966780100
966781555 966781572
966788721 966788724
966792745 966792748
966793498 966793501
966795853 966795856
966801515 966801518
966810325 966810400
966811975 966812006
966820040 966820057
966821119 966821136
966839386 966839389
966839689 966839692
966842325 966842342
966850374 966850392
966850405 966850408
966850671 966850688
966854162 966854237
966855872 966855889
966873532 966873549
966875490 966875507
966877499 966877502
966877513 966877543
966890994 966891039
966897579 966897609
966904395 966904398
966912150 966912153
966912286 966912361
966919847 966919850
966920486 966920489
966921160 966921163
966932758 966932761
966935839 966935856
966937914 966937931
966945646 966945676
966951301 966951318
966965860 966965863
966967658 966967678
966974493 966974574
966977503 966977506
966977803 966977806
966979557 966979560
966979932 966979949
966982974 966982991
966987279 966987296
966996601 966996604
966997803 966997806
967001372 967001375
967005444 967005447
967005553 967005570
967007488 967007491
967014286 967014289
967014430 967014447
967017967 967017984
967027285 967027288
967028637 967028654
967040035 967040052
967043533 967043536
967047102 967047119
967123553 967123570
967123587 967123604
967128407 967128452
967128737 967128812
967129900 967129945
967130590 967130635
967132119 967132164
967132359 967132389
967132404 967132449
967132569 967132614
967132719 967132764
967133244 967133304
967133469 967133514
967134356 967134373
967134489 967134534
967134984 967135029
967135044 967135089
967135419 967135464
967145511 967145556
967151496 967151541
967169018 967169035
967169570 967169587
967174469 967174486
967175166 967175183
967184502 967184519
967189008 967189025
967194140 967194157
967213867 967213884
967215212 967215215
967221443 967221460
967224293 967224310
967230684 967230701
967244890 967244893
967245016 967245019
967248095 967248098
967248277 967248280
967249808 967249825
967266135 967266138
967266262 967266265
967266284 967266287
967268667 967268684
967271526 967271529
967275195 967275198
967276958 967276964
967282279 967282282
967283373 967283376
967285182 967285186
967290417 967290420
967324160 967324163
967325243 967325246
967326869 967326886
967326998 967327015
967330909 967330912
967337133 967337136
967340360 967340377
967357440 967357443
967361189 967361192
967367928 967367931
967372573 967372590
967386283 967386300
967407332 967407349
967410321 967410338
967421600 967421603
967424721 967424738
967426630 967426633
967429914 967429917
967442820 967442895
967453593 967453610
967458288 967458291
967466333 967466350
967470604 967470607
967476257 967476277
967478685 967478702
967479267 967479270
967479389 967479392
967480541 967480558
967487147 967487150
967492369 967492386
967495148 967495151
967503311 967503328
967512613 967512616
967514465 967514468
967515615 967515690
967515803 967515806
967520711 967520714
967524181 967524198
967529110 967529127
967540492 967540495
967585938 967585941
967586453 967586456
967588631 967588634
967594506 967594509
967596768 967596771
967605337 967605340
967609111 967609114
967610393 967610396
967610398 967610401
967622095 967622098
967623684 967623701
967643318 967643335
967648739 967648742
967652288 967652290
967652452 967652455
967652551 967652554
967652587 967652590
967653486 967653489
967659890 967659893
967660618 967660621
967660646 967660649
967661067 967661084
967669261 967669264
967670942 967670945
967671078 967671081
967671134 967671138
967674153 967674170
967683668 967683685
967684692 967684709
967697594 967697597
967717957 967717986
967719898 967719901
967724196 967724213
967745063 967745080
967750740 967750757
967753881 967753898
967756473 967756490
967767487 967767490
967774800 967774875
967781888 967781891
967785556 967785573
967785882 967785885
967788076 967788093
967801059 967801076
967804315 967804318
967805593 967805610
967811791 967811808
967822426 967822443
967825508 967825583
967828613 967828658
967837895 967837912
967840316 967840333
967840501 967840504
967842896 967842899
967842919 967842922
967843238 967843255
967843396 967843413
967843992 967844009
967844196 967844199
967845124 967845141
967863872 967863889
967887158 967887161
967896224 967896227
967931225 967931242
967933585 967933602
967943190 967943207
967944810 967944824
967950164 967950209
967952148 967952165
967954772 967954789
967967307 967967310
967967526 967967543
967968603 967968620
967970151 967970154
967974377 967974394
967976363 967976366
967980562 967980579
967982272 967982293
967989149 967989166
967989235 967989238
967990397 967990400
967991020 967991037
967996523 967996540
967998556 967998586
968010598 968010628
968012068 968012143
968015121 968015138
968018268 968018285
968024011 968024014
968030217 968030234
968033895 968033898
968035312 968035329
968037805 968037822
968046879 968046882
968053719 968053721
968059617 968059620
968065197 968065200
968067758 968067761
968072909 968072912
968107851 968107854
968114712 968114715
968263393 968263396
968266255 968266272
968271796 968271799
968272610 968272613
968276572 968276575
968279042 968279045
968280137 968280154
968281758 968281775
968283292 968283295
968287896 968287899
968294490 968294493
968296252 968296255
968301052 968301055
968302494 968302511
968304055 968304072
968305138 968305141
968306334 968306338
968310491 968310494
968310507 968310524
968319565 968319582
968320739 968320756
968323860 968323863
968323910 968323927
968335845 968335862
968341769 968341772
968342757 968342802
968343492 968343495
968344214 968344231
968346123 968346126
968346940 968346943
968350946 968350963
968352424 968352427
968352634 968352637
968357839 968357870
968357905 968357908
968358475 968358478
968358887 968358890
968388555 968388558
968389957 968389974
968393473 968393533
968395196 968395199
968395348 968395365
968404754 968404757
968406698 968406701
968408921 968408924
968413801 968413804
968413971 968414016
968414511 968414541
968414617 968414620
968418629 968418632
968420010 968420027
968427112 968427115
968428084 968428087
968428277 968428280
968428300 968428303
968428542 968428545
968428836 968428839
968429950 968429953
968429973 968429977
968430352 968430355
968430603 968430606
968431375 968431378
968435294 968435298
968435332 968435336
968435337 968435340
968435644 968435647
968436585 968436588
968439053 968439056
968439719 968439722
968439779 968439782
968439944 968439961
968442515 968442518
968442649 968442694
968443711 968443714
968444556 968444559
968444703 968444706
968445736 968445753
968446029 968446032
968446212 968446215
968446284 968446287
968447885 968447888
968449124 968449127
968457042 968457045
968458357 968458360
968458770 968458773
968461458 968461461
968462973 968462976
968470233 968470236
968470317 968470334
968471038 968471055
968471643 968471660
968471721 968471724
968472095 968472098
968473102 968473105
968473117 968473120
968473508 968473511
968474494 968474497
968475740 968475743
968478241 968478244
968487426 968487486
968487816 968487861
968489359 968489376
968492760 968492763
968493481 968493484
968494565 968494568
968503317 968503320
968523471 968523474
968524046 968524049
968524149 968524152
968524727 968524730
968524765 968524768
968532604 968532607
968557584 968557587
968566213 968566216
968569312 968569332
968586272 968586275
968587266 968587269
968587727 968587772
968587783 968587786
968587787 968587822
968593920 968593925
968594158 968594161
968607854 968607857
968608373 968608391
968609108 968609111
968609895 968609940
968611630 968611633
968619825 968619842
968624439 968624456
968626562 968626565
968627424 968627441
968631319 968631322
968633610 968633685
968634323 968634340
968639523 968639568
968640444 968640447
968646715 968646718
968653927 968653930
968656631 968656634
968658400 968658403
968662796 968662813
968664914 968664917
968668520 968668523
968671593 968671597
968671999 968672002
968673341 968673344
968673371 968673374
968673377 968673381
968673421 968673425
968674703 968674706
968675299 968675302
968675334 968675338
968677588 968677591
968678971 968678974
968678994 968678997
968679416 968679419
968682210 968682255
968683337 968683340
968689511 968689528
968690481 968690484
968691305 968691350
968691778 968691781
968694748 968694793
968695562 968695565
968696723 968696740
968696937 968696941
968703938 968703941
968704118 968704121
968707102 968707105
968715107 968715110
968716759 968716776
968716996 968716999
968720781 968720784
968722919 968722936
968729773 968729809
968737431 968737434
968738302 968738305
968739213 968739230
968740699 968740716
968744132 968744149
968748100 968748117
968752973 968752976
968754133 968754208
968757285 968757288
968757937 968757940
968760402 968760405
968761304 968761307
968761726 968761729
968764114 968764117
968764137 968764140
968764321 968764324
968764487 968764490
968764685 968764688
968768243 968768246
968772975 968772978
968775552 968775569
968778601 968778618
968782238 968782241
968782461 968782464
968790345 968790348
968790460 968790463
968790952 968790955
968791972 968791975
968797284 968797287
968802704 968802707
968818514 968818538
968843973 968843990
968855465 968855482
968856560 968856577
968860680 968860709
968874499 968874516
968876055 968876072
968885340 968885385
968900527 968900544
968905708 968905725
968906728 968906745
968906772 968906789
968911579 968911596
968916396 968916413
968926456 968926473
968930344 968930369
968933181 968933256
968944205 968944222
968950672 968950702
968952827 968952832
968955898 968955915
968960487 968960494
968964527 968964544
968965170 968965190
968970587 968970662
968972211 968972228
968982154 968982161
968990796 968990813
968994759 968994776
969000653 969000670
969015905 969015922
969027069 969027086
969029344 969029361
969030856 969030884
969034041 969034061
969040298 969040343
969070122 969070197
969091975 969091992
969101291 969101308
969103311 969103328
969108463 969108480
969130544 969130572
969179976 969180036
969181348 969181365
969187224 969187241
969250141 969250216
969285261 969285278
969341746 969341763
969346903 969346920
969359934 969359951
969367329 969367346
969375779 969375796
969382157 969382217
969387547 969387564
969400977 969400994
969433146 969433163
969435010 969435027
969438856 969438873
969448705 969448722
969452401 969452418
969454969 969454970
969474800 969474817
969496395 969496470
969498532 969498549
969505472 969505489
969508194 969508211
969509393 969509410
969515310 969515355
969547124 969547141
969558416 969558433
969562541 969562551
969568095 969568112
969579856 969579873
969585983 969586000
969597300 969597317
969607666 969607683
969609721 969609738
969610416 969610433
969612648 969612665
969614790 969614807
969614934 969614951
969626360 969626377
969629080 969629084
969638092 969638109
969639356 969639373
969650971 969650988
969664438 969664483
969674047 969674064
969677333 969677350
969683832 969683849
969690067 969690112
969690160 969690177
969705487 969705562
969736985 969737002
969769489 969769534
969771109 969771139
969771814 969771844
969772834 969772864
969788003 969788020
969789280 969789297
969801565 969801582
969804960 969804981
969806862 969806879
969814035 969814052
969851314 969851359
969861162 969861179
969868510 969868527
969882047 969882064
969885902 969885919
969892733 969892750
969896063 969896080
969921188 969921205
969923112 969923129
969927519 969927536
969944044 969944071
969957751 969957768
969968307 969968324
969985964 969985981
969988315 969988332
969990135 969990152
969992571 969992616
969993819 969993836
969994073 969994090
970003608 970003625
970015976 970015977
970035156 970035173
970044469 970044486
970047699 970047702
970048298 970048303
970056250 970056253
970056405 970056408
970065847 970065850
970080221 970080224
970080843 970080860
970085879 970085882
970100831 970100834
970101095 970101140
970103810 970103840
970104668 970104671
970104958 970104961
970106920 970106937
970112885 970112902
970122007 970122024
970129840 970129857
970130604 970130621
970135306 970135323
970143179 970143196
970156705 970156708
970157126 970157129
970158523 970158526
970165542 970165545
970169457 970169502
970169517 970169542
970175622 970175625
970179368 970179371
970180007 970180082
970180659 970180662
970180816 970180819
970182699 970182716
970184798 970184815
970196907 970196924
970197801 970197804
970201491 970201508
970202446 970202463
970213893 970213910
970214867 970214884
970216166 970216183
970217845 970217862
970219917 970219942
970228765 970228789
970233747 970233764
970234083 970234100
970234538 970234541
970243809 970243812
970245937 970245954
970277849 970277852
970281639 970281642
970282442 970282445
970285808 970285811
970297026 970297029
970297608 970297625
970312766 970312783
970316707 970316724
970317143 970317146
970374087 970374090
970374934 970374951
970377850 970377868
970389467 970389484
970391451 970391454
970396773 970396776
970399389 970399406
970400038 970400055
970404587 970404617
970409872 970409875
970417431 970417434
970421530 970421575
970421805 970421808
970452838 970452883
970453702 970453719
970457118 970457135
970458967 970458984
970469188 970469248
970470860 970470863
970477923 970477926
970481451 970481454
970482700 970482717
970483253 970483256
970484684 970484687
970485958 970485993
970490833 970490850
970493003 970493006
970502503 970502506
970573225 970573242
970580245 970580248
970580322 970580325
970580585 970580588
970635217 970635234
970635979 970635982
970639035 970639052
970647031 970647048
970647821 970647838
970652055 970652100
970661655 970661730
970662272 970662289
970668792 970668795
970675895 970675940
970676717 970676720
970677710 970677727
970678438 970678455
970678725 970678728
970679561 970679578
970682146 970682149
970682283 970682301
970683101 970683104
970696121 970696124
970699252 970699255
970699811 970699814
970711163 970711166
970718057 970718074
970726467 970726484
970728118 970728135
970728341 970728344
970729556 970729559
970734706 970734723
970737198 970737215
970737778 970737781
970741798 970741801
970745757 970745760
970747320 970747365
970749890 970749893
970750110 970750113
970754387 970754404
970755097 970755100
970755616 970755633
970757458 970757475
970761450 970761467
970762452 970762455
970764020 970764037
970765059 970765062
970769010 970769027
970773343 970773346
970776123 970776126
970776862 970776879
970777674 970777693
970782752 970782769
970790156 970790173
970795757 970795774
970797396 970797399
970809529 970809532
970810179 970810196
970813619 970813636
970817887 970817904
970823194 970823211
970824706 970824723
970826012 970826015
970826824 970826884
970847171 970847174
970890071 970890088
970890856 970890859
970891013 970891030
970906309 970906384
970906655 970906672
970912774 970912791
970917322 970917339
970955289 970955306
970957602 970957619
970959833 970959880
970979078 970979081
970979401 970979418
970979762 970979779
970983561 970983564
970989810 970989827
970990904 970990907
971000347 971000350
971001967 971001984
971008398 971008415
971009269 971009286
971010801 971010804
971011609 971011612
971016842 971016845
971023898 971023901
971027291 971027308
971031288 971031305
971035305 971035322
971036047 971036050
971073085 971073102
971073189 971073206
971074448 971074451
971076597 971076614
971102871 971102892
971106749 971106752
971152773 971152776
971153966 971153969
971156719 971156722
971158116 971158161
971161552 971161555
971166950 971166967
971170581 971170639
971175641 971175643
971194925 971194928
971235332 971235335
971236942 971236945
971242116 971242133
971242982 971242999
971245892 971245922
971251794 971251797
971252544 971252547
971256703 971256706
971257651 971257654
971258466 971258469
971263198 971263220
971283974 971283997
971289686 971289689
971289753 971289770
971291613 971291616
971302010 971302013
971302289 971302308
971309958 971310003
971311740 971311800
971374066 971374069
971375743 971375746
971375794 971375797
971375914 971375917
971383222 971383225
971384549 971384552
971388365 971388395
971388401 971388404
971388479 971388496
971390733 971390750
971392229 971392232
971394113 971394116
971397456 971397473
971400023 971400026
971400229 971400243
971402945 971402947
971403108 971403125
971406204 971406207
971409760 971409763
971414741 971414815
971430217 971430220
971432094 971432169
971433234 971433279
971435941 971435944
971438429 971438446
971442013 971442016
971443316 971443319
971443532 971443535
971446588 971446591
971446941 971446944
971447922 971447925
971449724 971449727
971450080 971450083
971452414 971452417
971499399 971499402
971504781 971504784
971506768 971506785
971510006 971510009
971513815 971513832
971516853 971516870
971517665 971517682
971519989 971519992
971525458 971525533
971525659 971525662
971525772 971525775
971527593 971527596
971527639 971527642
971527738 971527742
971527800 971527803
971527867 971527870
971545897 971545900
971546635 971546652
971546938 971546941
971546964 971546967
971547006 971547009
971549725 971549728
971552044 971552061
971552794 971552797
971552884 971552887
971555161 971555164
971555698 971555743
