848072511 848072528
848188004 848188021
848365644 848365661
848493562 848493579
848512684 848512701
848665164 848665181
848757570 848757587
849097959 849097976
849098058 849098075
849098065 849098082
849540900 849540917
849624891 849624908
849732118 849732135
849890834 849890851
849891079 849891096
850051091 850051108
850147800 850147817
850158003 850158020
850230945 850230962
850231138 850231155
850449691 850449708
850656544 850656561
850678488 850678505
851370648 851370665
851384063 851384081
851666066 851666083
851686697 851686714
851686723 851686741
851686735 851686752
851686848 851686865
851759854 851759871
851759871 851759888
851782270 851782287
851805041 851805059
851809169 851809187
851871238 851871255
851963246 851963263
852030626 852030643
852040394 852040411
852134390 852134407
852134400 852134417
852248445 852248462
852281694 852281711
852433784 852433801
852454406 852454423
852504411 852504428
852561485 852561502
852612736 852612753
852639903 852639920
852658277 852658294
852665165 852665182
852733850 852733868
852733920 852733937
852908895 852908912
853074628 853074645
853677721 853677738
853857500 853857517
853857516 853857533
854388503 854388520
854479416 854479433
854546208 854546225
854806832 854806849
854925168 854925185
854982515 854982532
854982566 854982583
855163588 855163605
855326404 855326421
855418039 855418060
855698882 855698899
855743912 855743929
855744922 855744940
855746208 855746225
855774325 855774342
855790936 855790953
855939050 855939067
855952206 855952223
855952265 855952282
855958569 855958586
855959713 855959730
856012517 856012534
856012530 856012547
856021681 856021701
856023079 856023096
856124645 856124664
856143156 856143173
856194257 856194274
856210427 856210444
856296889 856296906
856296951 856296968
856297307 856297324
856306768 856306785
856307491 856307509
856374159 856374176
856378463 856378480
856380648 856380665
856689899 856689916
856722500 856722517
856810191 856810209
856810269 856810286
856821929 856821946
856822006 856822023
856865987 856866004
856970155 856970172
856971401 856971418
857062470 857062487
857141348 857141365
857147059 857147076
857147968 857147985
857153981 857153998
857227731 857227748
857248869 857248886
857248873 857248891
857306693 857306710
857314108 857314125
857322237 857322254
857336288 857336306
857337210 857337227
857400374 857400393
857492194 857492211
857574437 857574455
857919959 857919977
857919992 857920009
857926363 857926380
857926577 857926595
857927788 857927808
857927796 857927813
857941447 857941464
857996083 857996100
858014727 858014745
858093196 858093213
858093297 858093314
858104162 858104179
858104407 858104425
858178367 858178384
858346338 858346356
858346387 858346404
858346417 858346434
858368917 858368934
858432210 858432227
858522996 858523013
858531345 858531362
858531399 858531419
858539830 858539847
858620656 858620674
858621436 858621453
858627535 858627552
858633579 858633596
858633637 858633654
858682800 858682817
858879224 858879241
858962178 858962195
858968732 858968749
859214144 859214161
859230650 859230667
859235129 859235146
859236464 859236481
859287184 859287201
859299230 859299247
859312981 859312998
859321542 859321559
859321578 859321595
859330938 859330955
859569061 859569078
859756904 859756922
859756917 859756934
859993223 859993241
860173688 860173705
860181822 860181839
860245116 860245133
860245211 860245228
860522909 860522926
860754597 860754614
860761615 860761632
860767561 860767578
860776838 860776855
860952116 860952133
860963779 860963797
861037792 861037809
861037821 861037838
861111488 861111505
861123515 861123532
861123542 861123561
861372181 861372198
861376099 861376116
861387557 861387574
861388610 861388627
861391457 861391474
861391921 861391939
861457263 861457280
861533327 861533344
861533352 861533369
861553974 861553992
861562950 861562967
861597961 861597978
861616320 861616337
861642520 861642537
861647981 861647998
861717232 861717250
861995657 861995674
861995784 861995801
862002639 862002656
862056539 862056557
862145245 862145262
862151241 862151259
862151271 862151288
862237434 862237451
862247368 862247385
862256287 862256304
862262519 862262536
862265126 862265143
862267824 862267841
862273510 862273527
862336173 862336190
862357024 862357041
862361795 862361812
862412908 862412925
862418291 862418308
862584954 862584972
862585287 862585305
862605030 862605047
862636601 862636618
862667993 862668010
862669042 862669060
862719844 862719861
862745526 862745543
862768316 862768333
862769710 862769727
862769938 862769955
862775058 862775075
862775121 862775138
862775802 862775819
862811129 862811146
862831598 862831615
862834291 862834308
862846133 862846150
862846798 862846815
862846881 862846899
862849369 862849386
862849391 862849408
862849467 862849484
862853684 862853701
862853761 862853778
862856517 862856534
862856540 862856557
862856552 862856569
862857713 862857730
862857893 862857910
862857923 862857941
862857938 862857955
862861295 862861313
862861364 862861381
862863080 862863097
862865189 862865206
862868816 862868833
862874188 862874205
862884328 862884345
862888724 862888741
862890036 862890053
862895381 862895398
862895885 862895902
862903477 862903494
862911849 862911866
862913921 862913938
862916396 862916413
862916656 862916673
862916666 862916683
862920214 862920231
862922334 862922351
862932876 862932893
862933146 862933163
862934763 862934780
862935353 862935370
862938276 862938293
862938777 862938794
862939410 862939427
862940246 862940263
862940599 862940617
863115368 863115385
863297505 863297522
863361010 863361027
863368586 863368603
863369021 863369038
863375812 863375829
863388480 863388497
863444021 863444038
863444083 863444100
863459714 863459731
863534491 863534508
863541577 863541595
863544805 863544822
863546520 863546537
863644886 863644903
863644899 863644917
863790418 863790435
863795297 863795314
863796387 863796405
863873170 863873188
863972919 863972936
863973030 863973049
863973940 863973957
863982114 863982131
863982175 863982192
864051229 864051246
864051294 864051311
864053770 864053787
864064647 864064664
864073008 864073026
864143752 864143769
864151892 864151911
864154600 864154617
864160787 864160804
864504145 864504162
864504242 864504259
864506320 864506337
864508743 864508761
864736659 864736676
864749939 864749956
865001417 865001434
865001464 865001481
865006969 865006986
865010662 865010679
865022380 865022397
865022690 865022707
865101809 865101826
865101850 865101867
865182555 865182572
865185745 865185762
865189345 865189363
865189841 865189859
865193735 865193752
865271895 865271912
865280672 865280689
865360201 865360218
865614840 865614857
865616265 865616282
865619378 865619395
865621202 865621219
865623727 865623744
865684439 865684456
865774757 865774774
865781243 865781260
865781602 865781619
865781994 865782011
865783937 865783954
865784466 865784483
865787984 865788001
865854288 865854305
865857569 865857586
865859680 865859697
865862979 865862996
865871305 865871322
865879413 865879430
865879480 865879498
865888589 865888606
865941097 865941115
866217305 866217323
866220899 866220916
866331843 866331861
866331968 866331985
866337083 866337100
866337387 866337405
866381511 866381528
866471801 866471818
866485732 866485750
866486026 866486043
866487202 866487219
866487258 866487277
866487270 866487289
866542378 866542395
866543160 866543177
866574967 866574984
866575188 866575205
866575194 866575211
866576475 866576492
866809222 866809240
866822442 866822459
866824006 866824023
866831340 866831357
866833070 866833087
866833374 866833391
866833492 866833509
866894392 866894410
866899719 866899736
866996036 866996053
866996270 866996287
866996318 866996335
866996784 866996801
867003496 867003513
867003517 867003534
867006400 867006417
867006490 867006507
867087470 867087487
867166580 867166597
867170661 867170680
867178127 867178144
867181655 867181672
867184011 867184028
867186104 867186121
867421005 867421022
867422560 867422577
867425759 867425778
867425778 867425795
867426285 867426302
867430523 867430540
867439389 867439406
867442167 867442184
867442419 867442436
867478016 867478033
867478023 867478040
867500622 867500639
867500682 867500700
867502603 867502620
867681597 867681614
867683227 867683244
867684619 867684636
867688861 867688878
868018957 868018975
868019032 868019049
868019049 868019066
868031010 868031029
868039151 868039168
868044991 868045008
868047135 868047152
868286201 868286218
868377735 868377752
868805685 868805703
868880516 868880533
868881145 868881162
868893902 868893919
868901234 868901251
868913498 868913515
868989497 868989515
869316392 869316409
869316467 869316484
869401551 869401568
869406942 869406959
869412789 869412806
869429948 869429965
869436246 869436264
869512082 869512099
869833102 869833119
869845586 869845603
870004971 870004988
870099867 870099884
870107096 870107113
870108212 870108229
870108840 870108857
870112392 870112409
870125857 870125874
870458921 870458938
870465631 870465648
870465903 870465920
870465907 870465925
870551700 870551717
870551725 870551743
870732715 870732732
870824870 870824887
870892295 870892312
871071552 871071571
871071567 871071584
871212042 871212059
871227856 871227873
871236410 871236428
871326477 871326494
871413404 871413421
871668621 871668639
871739001 871739020
871838670 871838687
871865798 871865815
871932626 871932643
871934631 871934648
871934679 871934699
871934706 871934724
871934747 871934764
871939945 871939962
871994844 871994862
872009678 872009695
872011983 872012000
872109743 872109760
872165315 872165332
872198677 872198694
872256832 872256850
872373434 872373451
872373511 872373530
872388197 872388214
872427237 872427254
872428242 872428259
872428931 872428948
872429000 872429017
872429200 872429217
872429791 872429808
872429828 872429846
872429861 872429878
872429908 872429925
872429914 872429931
872429935 872429952
872429954 872429971
872431098 872431115
872431154 872431171
872431168 872431185
872431397 872431414
872431424 872431441
872431668 872431685
872431707 872431724
872431820 872431837
872432707 872432724
872432774 872432791
872437958 872437975
872438206 872438223
872439444 872439461
872439698 872439715
872439785 872439802
872440062 872440079
872442589 872442606
872442895 872442913
872444689 872444706
872444759 872444776
872449087 872449104
872451082 872451100
872451705 872451722
872452259 872452276
872522305 872522322
872522339 872522357
872522362 872522379
872522384 872522401
872522516 872522533
872522540 872522557
872523731 872523748
872596448 872596467
872596684 872596701
872597134 872597151
872597149 872597166
872598589 872598606
872598922 872598939
872599398 872599415
872687839 872687856
872718759 872718776
872941517 872941534
872974856 872974873
872979635 872979652
873032282 873032301
873037939 873037956
873037948 873037965
873039756 873039773
873039773 873039790
873041530 873041547
873043040 873043057
873061575 873061595
873062282 873062299
873117723 873117741
873117730 873117747
873176695 873176712
873223062 873223079
873225668 873225685
873225674 873225691
873232765 873232782
873306669 873306686
873310553 873310570
873310614 873310631
873310660 873310679
873331421 873331438
873331425 873331442
873475240 873475257
873527175 873527192
873554701 873554718
873576494 873576511
873581052 873581069
873663751 873663769
873664839 873664856
873665933 873665950
873670257 873670274
873737414 873737431
873737436 873737453
873759238 873759255
873810320 873810337
873819459 873819477
873831807 873831824
873832250 873832267
873833059 873833076
874081020 874081037
874083241 874083258
874083252 874083269
874087505 874087522
874162976 874162993
874163166 874163185
874163193 874163211
874244499 874244517
874244550 874244567
874257062 874257079
874257113 874257130
874258780 874258797
874261294 874261311
874262444 874262461
874269031 874269048
874272598 874272615
874273286 874273303
874277733 874277750
874279638 874279655
874333929 874333946
874373475 874373492
874378327 874378344
874378908 874378925
874378949 874378966
874378977 874378994
874379037 874379054
874379055 874379072
874379073 874379092
874379513 874379530
874379567 874379584
874390285 874390302
874390314 874390331
874390340 874390357
874390504 874390521
874390637 874390654
874390716 874390733
874390817 874390834
874390891 874390908
874390915 874390932
874390928 874390945
874391016 874391034
874391193 874391211
874395364 874395381
874395483 874395500
874395508 874395526
874412040 874412057
874416900 874416917
874438356 874438373
874438364 874438381
874438428 874438445
874438537 874438554
874438559 874438576
874438623 874438640
874438693 874438710
874442640 874442657
874442901 874442919
874443002 874443019
874443039 874443056
874945230 874945247
874945262 874945279
874958849 874958866
875099562 875099580
875108842 875108859
875126733 875126751
875126765 875126782
