H0:PEM-EX_BPO5 16
H0:PEM-EX_RAIN 16
H0:PEM-EX_RH5 16
H0:PEM-EX_RHO5 16
H0:PEM-EX_TEMP5 16
H0:PEM-EX_TEMPO5 16
H0:PEM-EX_TEMPO5F 16
H0:PEM-EX_WDIR 16
H0:PEM-EX_WIND 16
H0:PEM-EX_WINDMPH 16
H0:PEM-EY_BPO5 16
H0:PEM-EY_DST1_3 16
H0:PEM-EY_DST1_5 16
H0:PEM-EY_DST1_MODE 16
H0:PEM-EY_DST1_RH 16
H0:PEM-EY_DST1_TEMP 16
H0:PEM-EY_DST2_3 16
H0:PEM-EY_DST2_5 16
H0:PEM-EY_DST2_MODE 16
H0:PEM-EY_DST2_RH 16
H0:PEM-EY_DST2_TEMP 16
H0:PEM-EY_RAIN 16
H0:PEM-EY_RH5 16
H0:PEM-EY_RHO5 16
H0:PEM-EY_TEMP5 16
H0:PEM-EY_TEMPO5 16
H0:PEM-EY_TEMPO5F 16
H0:PEM-EY_WDIR 16
H0:PEM-EY_WIND 16
H0:PEM-EY_WINDMPH 16
H0:PEM-LAB_DST1_3 16
H0:PEM-LAB_DST1_5 16
H0:PEM-LAB_DST1_MODE 16
H0:PEM-LAB_DST1_RH 16
H0:PEM-LAB_DST1_TEMP 16
H0:PEM-LAB_DST2_3 16
H0:PEM-LAB_DST2_5 16
H0:PEM-LAB_DST2_MODE 16
H0:PEM-LAB_DST2_RH 16
H0:PEM-LAB_DST2_TEMP 16
H0:PEM-LAB_DST3_3 16
H0:PEM-LAB_DST3_5 16
H0:PEM-LAB_DST3_MODE 16
H0:PEM-LAB_DST3_RH 16
H0:PEM-LAB_DST3_TEMP 16
H0:PEM-LVEA_DST10_3 16
H0:PEM-LVEA_DST10_5 16
H0:PEM-LVEA_DST10_MODE 16
H0:PEM-LVEA_DST10_RH 16
H0:PEM-LVEA_DST10_TEMP 16
H0:PEM-LVEA_DST11_3 16
H0:PEM-LVEA_DST11_5 16
H0:PEM-LVEA_DST11_MODE 16
H0:PEM-LVEA_DST11_RH 16
H0:PEM-LVEA_DST11_TEMP 16
H0:PEM-LVEA_DST12_3 16
H0:PEM-LVEA_DST12_5 16
H0:PEM-LVEA_DST12_MODE 16
H0:PEM-LVEA_DST13_3 16
H0:PEM-LVEA_DST13_5 16
H0:PEM-LVEA_DST13_MODE 16
H0:PEM-LVEA_DST14_3 16
H0:PEM-LVEA_DST14_5 16
H0:PEM-LVEA_DST14_MODE 16
H0:PEM-LVEA_DST15_3 16
H0:PEM-LVEA_DST15_5 16
H0:PEM-LVEA_DST15_MODE 16
H0:PEM-LVEA_DST16_3 16
H0:PEM-LVEA_DST16_5 16
H0:PEM-LVEA_DST16_MODE 16
H0:PEM-LVEA_DST1_3 16
H0:PEM-LVEA_DST1_5 16
H0:PEM-LVEA_DST1_MODE 16
H0:PEM-LVEA_DST1_RH 16
H0:PEM-LVEA_DST1_TEMP 16
H0:PEM-LVEA_DST2_3 16
H0:PEM-LVEA_DST2_5 16
H0:PEM-LVEA_DST2_MODE 16
H0:PEM-LVEA_DST2_RH 16
H0:PEM-LVEA_DST2_TEMP 16
H0:PEM-LVEA_DST3_3 16
H0:PEM-LVEA_DST3_5 16
H0:PEM-LVEA_DST3_MODE 16
H0:PEM-LVEA_DST3_RH 16
H0:PEM-LVEA_DST3_TEMP 16
H0:PEM-LVEA_DST4_3 16
H0:PEM-LVEA_DST4_5 16
H0:PEM-LVEA_DST4_MODE 16
H0:PEM-LVEA_DST4_RH 16
H0:PEM-LVEA_DST4_TEMP 16
H0:PEM-LVEA_DST5_3 16
H0:PEM-LVEA_DST5_5 16
H0:PEM-LVEA_DST5_MODE 16
H0:PEM-LVEA_DST5_RH 16
H0:PEM-LVEA_DST5_TEMP 16
H0:PEM-LVEA_DST6_3 16
H0:PEM-LVEA_DST6_5 16
H0:PEM-LVEA_DST6_MODE 16
H0:PEM-LVEA_DST6_RH 16
H0:PEM-LVEA_DST6_TEMP 16
H0:PEM-LVEA_DST7_3 16
H0:PEM-LVEA_DST7_5 16
H0:PEM-LVEA_DST7_MODE 16
H0:PEM-LVEA_DST7_RH 16
H0:PEM-LVEA_DST7_TEMP 16
H0:PEM-LVEA_DST8_3 16
H0:PEM-LVEA_DST8_5 16
H0:PEM-LVEA_DST8_MODE 16
H0:PEM-LVEA_DST8_RH 16
H0:PEM-LVEA_DST8_TEMP 16
H0:PEM-LVEA_DST9_3 16
H0:PEM-LVEA_DST9_5 16
H0:PEM-LVEA_DST9_MODE 16
H0:PEM-LVEA_DST9_RH 16
H0:PEM-LVEA_DST9_TEMP 16
H0:PEM-MX_BPO5 16
H0:PEM-MX_RAIN 16
H0:PEM-MX_RH5 16
H0:PEM-MX_RHO5 16
H0:PEM-MX_TEMP5 16
H0:PEM-MX_TEMPO5 16
H0:PEM-MX_TEMPO5F 16
H0:PEM-MX_WDIR 16
H0:PEM-MX_WIND 16
H0:PEM-MX_WINDMPH 16
H0:PEM-MY_BPO5 16
H0:PEM-MY_RAIN 16
H0:PEM-MY_RH5 16
H0:PEM-MY_RHO5 16
H0:PEM-MY_TEMP5 16
H0:PEM-MY_TEMPO5 16
H0:PEM-MY_TEMPO5F 16
H0:PEM-MY_WDIR 16
H0:PEM-MY_WIND 16
H0:PEM-MY_WINDMPH 16
H0:PEM-LVEA_DUST_LOC_1_STATUS 16
H0:PEM-LVEA_DUST_LOC_2_STATUS 16
H0:PEM-LVEA_DUST_LOC_3_STATUS 16
H0:PEM-LVEA_DUST_LOC_4_STATUS 16
H0:PEM-LVEA_DUST_LOC_5_STATUS 16
H0:PEM-LVEA_DUST_LOC_6_STATUS 16
H0:PEM-LVEA_DUST_LOC_7_STATUS 16
H0:PEM-LVEA_DUST_LOC_8_STATUS 16
H0:PEM-LVEA_DUST_LOC_9_STATUS 16
H0:PEM-LVEA_DUST_LOC_10_STATUS 16
H0:PEM-LVEA_DUST_LOC_11_STATUS 16
H0:PEM-LVEA_DUST_LOC_12_STATUS 16
H0:PEM-LVEA_DUST_LOC_13_STATUS 16
H0:PEM-LVEA_DUST_LOC_14_STATUS 16
H0:PEM-LVEA_DUST_LOC_15_STATUS 16
H0:PEM-LVEA_DUST_LOC_16_STATUS 16
H0:PEM-LAB_DUST_LOC_1_STATUS 16
H0:PEM-LAB_DUST_LOC_2_STATUS 16
H0:PEM-LAB_DUST_LOC_3_STATUS 16
H0:PEM-EY_DUST_LOC_1_STATUS 16
H0:PEM-EY_DUST_LOC_2_STATUS 16
H1:DAQ-DC0_H1IOPPEMEY_STATUS 16
H1:DAQ-DC0_H1IOPPEMMX_STATUS 16
H1:DAQ-DC0_H1PEML0_STATUS 16
H1:DAQ-DC0_H1PEMEY_STATUS 16
H1:DAQ-DC0_H1PEMMX_STATUS 16
H1:IOP-PEM_EY_ADC_DT_INMON 16
H1:IOP-PEM_EY_ADC_DT_EXCMON 16
H1:IOP-PEM_EY_ADC_DT_OFFSET 16
H1:IOP-PEM_EY_ADC_DT_GAIN 16
H1:IOP-PEM_EY_ADC_DT_TRAMP 16
H1:IOP-PEM_EY_ADC_DT_LIMIT 16
H1:IOP-PEM_EY_ADC_DT_OUTMON 16
H1:IOP-PEM_EY_ADC_DT_OUT16 16
H1:IOP-PEM_EY_ADC_DT_OUTPUT 16
H1:IOP-PEM_EY_ADC_DT_SW1 16
H1:IOP-PEM_EY_ADC_DT_SW2 16
H1:IOP-PEM_EY_ADC_DT_RSET 16
H1:IOP-PEM_EY_ADC_DT_SW1R 16
H1:IOP-PEM_EY_ADC_DT_SW2R 16
H1:IOP-PEM_EY_ADC_DT_SW1S 16
H1:IOP-PEM_EY_ADC_DT_SW2S 16
H1:IOP-PEM_EY_DAC_DT_INMON 16
H1:IOP-PEM_EY_DAC_DT_EXCMON 16
H1:IOP-PEM_EY_DAC_DT_OFFSET 16
H1:IOP-PEM_EY_DAC_DT_GAIN 16
H1:IOP-PEM_EY_DAC_DT_TRAMP 16
H1:IOP-PEM_EY_DAC_DT_LIMIT 16
H1:IOP-PEM_EY_DAC_DT_OUTMON 16
H1:IOP-PEM_EY_DAC_DT_OUT16 16
H1:IOP-PEM_EY_DAC_DT_OUTPUT 16
H1:IOP-PEM_EY_DAC_DT_SW1 16
H1:IOP-PEM_EY_DAC_DT_SW2 16
H1:IOP-PEM_EY_DAC_DT_RSET 16
H1:IOP-PEM_EY_DAC_DT_SW1R 16
H1:IOP-PEM_EY_DAC_DT_SW2R 16
H1:IOP-PEM_EY_DAC_DT_SW1S 16
H1:IOP-PEM_EY_DAC_DT_SW2S 16
H1:IOP-PEMEY_DCU_ID 16
H1:IOP-PEM_EY_MADC2_EPICS_CH9 16
H1:IOP-PEM_EY_MADC2_EPICS_CH8 16
H1:IOP-PEM_EY_MADC2_EPICS_CH7 16
H1:IOP-PEM_EY_MADC2_EPICS_CH6 16
H1:IOP-PEM_EY_MADC2_EPICS_CH5 16
H1:IOP-PEM_EY_MADC2_EPICS_CH4 16
H1:IOP-PEM_EY_MADC2_EPICS_CH31 16
H1:IOP-PEM_EY_MADC2_EPICS_CH30 16
H1:IOP-PEM_EY_MADC2_EPICS_CH3 16
H1:IOP-PEM_EY_MADC2_EPICS_CH29 16
H1:IOP-PEM_EY_MADC2_EPICS_CH28 16
H1:IOP-PEM_EY_MADC2_EPICS_CH27 16
H1:IOP-PEM_EY_MADC2_EPICS_CH26 16
H1:IOP-PEM_EY_MADC2_EPICS_CH25 16
H1:IOP-PEM_EY_MADC2_EPICS_CH24 16
H1:IOP-PEM_EY_MADC2_EPICS_CH23 16
H1:IOP-PEM_EY_MADC2_EPICS_CH22 16
H1:IOP-PEM_EY_MADC2_EPICS_CH21 16
H1:IOP-PEM_EY_MADC2_EPICS_CH20 16
H1:IOP-PEM_EY_MADC2_EPICS_CH2 16
H1:IOP-PEM_EY_MADC2_EPICS_CH19 16
H1:IOP-PEM_EY_MADC2_EPICS_CH18 16
H1:IOP-PEM_EY_MADC2_EPICS_CH17 16
H1:IOP-PEM_EY_MADC2_EPICS_CH16 16
H1:IOP-PEM_EY_MADC2_EPICS_CH15 16
H1:IOP-PEM_EY_MADC2_EPICS_CH14 16
H1:IOP-PEM_EY_MADC2_EPICS_CH13 16
H1:IOP-PEM_EY_MADC2_EPICS_CH12 16
H1:IOP-PEM_EY_MADC2_EPICS_CH11 16
H1:IOP-PEM_EY_MADC2_EPICS_CH10 16
H1:IOP-PEM_EY_MADC2_EPICS_CH1 16
H1:IOP-PEM_EY_MADC2_EPICS_CH0 16
H1:IOP-PEM_EY_MADC1_EPICS_CH9 16
H1:IOP-PEM_EY_MADC1_EPICS_CH8 16
H1:IOP-PEM_EY_MADC1_EPICS_CH7 16
H1:IOP-PEM_EY_MADC1_EPICS_CH6 16
H1:IOP-PEM_EY_MADC1_EPICS_CH5 16
H1:IOP-PEM_EY_MADC1_EPICS_CH4 16
H1:IOP-PEM_EY_MADC1_EPICS_CH31 16
H1:IOP-PEM_EY_MADC1_EPICS_CH30 16
H1:IOP-PEM_EY_MADC1_EPICS_CH3 16
H1:IOP-PEM_EY_MADC1_EPICS_CH29 16
H1:IOP-PEM_EY_MADC1_EPICS_CH28 16
H1:IOP-PEM_EY_MADC1_EPICS_CH27 16
H1:IOP-PEM_EY_MADC1_EPICS_CH26 16
H1:IOP-PEM_EY_MADC1_EPICS_CH25 16
H1:IOP-PEM_EY_MADC1_EPICS_CH24 16
H1:IOP-PEM_EY_MADC1_EPICS_CH23 16
H1:IOP-PEM_EY_MADC1_EPICS_CH22 16
H1:IOP-PEM_EY_MADC1_EPICS_CH21 16
H1:IOP-PEM_EY_MADC1_EPICS_CH20 16
H1:IOP-PEM_EY_MADC1_EPICS_CH2 16
H1:IOP-PEM_EY_MADC1_EPICS_CH19 16
H1:IOP-PEM_EY_MADC1_EPICS_CH18 16
H1:IOP-PEM_EY_MADC1_EPICS_CH17 16
H1:IOP-PEM_EY_MADC1_EPICS_CH16 16
H1:IOP-PEM_EY_MADC1_EPICS_CH15 16
H1:IOP-PEM_EY_MADC1_EPICS_CH14 16
H1:IOP-PEM_EY_MADC1_EPICS_CH13 16
H1:IOP-PEM_EY_MADC1_EPICS_CH12 16
H1:IOP-PEM_EY_MADC1_EPICS_CH11 16
H1:IOP-PEM_EY_MADC1_EPICS_CH10 16
H1:IOP-PEM_EY_MADC1_EPICS_CH1 16
H1:IOP-PEM_EY_MADC1_EPICS_CH0 16
H1:IOP-PEM_EY_MADC0_EPICS_CH9 16
H1:IOP-PEM_EY_MADC0_EPICS_CH8 16
H1:IOP-PEM_EY_MADC0_EPICS_CH7 16
H1:IOP-PEM_EY_MADC0_EPICS_CH6 16
H1:IOP-PEM_EY_MADC0_EPICS_CH5 16
H1:IOP-PEM_EY_MADC0_EPICS_CH4 16
H1:IOP-PEM_EY_MADC0_EPICS_CH31 16
H1:IOP-PEM_EY_MADC0_EPICS_CH30 16
H1:IOP-PEM_EY_MADC0_EPICS_CH3 16
H1:IOP-PEM_EY_MADC0_EPICS_CH29 16
H1:IOP-PEM_EY_MADC0_EPICS_CH28 16
H1:IOP-PEM_EY_MADC0_EPICS_CH27 16
H1:IOP-PEM_EY_MADC0_EPICS_CH26 16
H1:IOP-PEM_EY_MADC0_EPICS_CH25 16
H1:IOP-PEM_EY_MADC0_EPICS_CH24 16
H1:IOP-PEM_EY_MADC0_EPICS_CH23 16
H1:IOP-PEM_EY_MADC0_EPICS_CH22 16
H1:IOP-PEM_EY_MADC0_EPICS_CH21 16
H1:IOP-PEM_EY_MADC0_EPICS_CH20 16
H1:IOP-PEM_EY_MADC0_EPICS_CH2 16
H1:IOP-PEM_EY_MADC0_EPICS_CH19 16
H1:IOP-PEM_EY_MADC0_EPICS_CH18 16
H1:IOP-PEM_EY_MADC0_EPICS_CH17 16
H1:IOP-PEM_EY_MADC0_EPICS_CH16 16
H1:IOP-PEM_EY_MADC0_EPICS_CH15 16
H1:IOP-PEM_EY_MADC0_EPICS_CH14 16
H1:IOP-PEM_EY_MADC0_EPICS_CH13 16
H1:IOP-PEM_EY_MADC0_EPICS_CH12 16
H1:IOP-PEM_EY_MADC0_EPICS_CH11 16
H1:IOP-PEM_EY_MADC0_EPICS_CH10 16
H1:IOP-PEM_EY_MADC0_EPICS_CH1 16
H1:IOP-PEM_EY_MADC0_EPICS_CH0 16
H1:IOP-PEM_EY_TDS_MON 16
H1:IOP-PEM_MX_ADC_DT_INMON 16
H1:IOP-PEM_MX_ADC_DT_EXCMON 16
H1:IOP-PEM_MX_ADC_DT_OFFSET 16
H1:IOP-PEM_MX_ADC_DT_GAIN 16
H1:IOP-PEM_MX_ADC_DT_TRAMP 16
H1:IOP-PEM_MX_ADC_DT_LIMIT 16
H1:IOP-PEM_MX_ADC_DT_OUTMON 16
H1:IOP-PEM_MX_ADC_DT_OUT16 16
H1:IOP-PEM_MX_ADC_DT_OUTPUT 16
H1:IOP-PEM_MX_ADC_DT_SW1 16
H1:IOP-PEM_MX_ADC_DT_SW2 16
H1:IOP-PEM_MX_ADC_DT_RSET 16
H1:IOP-PEM_MX_ADC_DT_SW1R 16
H1:IOP-PEM_MX_ADC_DT_SW2R 16
H1:IOP-PEM_MX_ADC_DT_SW1S 16
H1:IOP-PEM_MX_ADC_DT_SW2S 16
H1:IOP-PEM_MX_DAC_DT_INMON 16
H1:IOP-PEM_MX_DAC_DT_EXCMON 16
H1:IOP-PEM_MX_DAC_DT_OFFSET 16
H1:IOP-PEM_MX_DAC_DT_GAIN 16
H1:IOP-PEM_MX_DAC_DT_TRAMP 16
H1:IOP-PEM_MX_DAC_DT_LIMIT 16
H1:IOP-PEM_MX_DAC_DT_OUTMON 16
H1:IOP-PEM_MX_DAC_DT_OUT16 16
H1:IOP-PEM_MX_DAC_DT_OUTPUT 16
H1:IOP-PEM_MX_DAC_DT_SW1 16
H1:IOP-PEM_MX_DAC_DT_SW2 16
H1:IOP-PEM_MX_DAC_DT_RSET 16
H1:IOP-PEM_MX_DAC_DT_SW1R 16
H1:IOP-PEM_MX_DAC_DT_SW2R 16
H1:IOP-PEM_MX_DAC_DT_SW1S 16
H1:IOP-PEM_MX_DAC_DT_SW2S 16
H1:IOP-PEMMX_DCU_ID 16
H1:IOP-PEM_MX_MADC0_EPICS_CH9 16
H1:IOP-PEM_MX_MADC0_EPICS_CH8 16
H1:IOP-PEM_MX_MADC0_EPICS_CH7 16
H1:IOP-PEM_MX_MADC0_EPICS_CH6 16
H1:IOP-PEM_MX_MADC0_EPICS_CH5 16
H1:IOP-PEM_MX_MADC0_EPICS_CH4 16
H1:IOP-PEM_MX_MADC0_EPICS_CH31 16
H1:IOP-PEM_MX_MADC0_EPICS_CH30 16
H1:IOP-PEM_MX_MADC0_EPICS_CH3 16
H1:IOP-PEM_MX_MADC0_EPICS_CH29 16
H1:IOP-PEM_MX_MADC0_EPICS_CH28 16
H1:IOP-PEM_MX_MADC0_EPICS_CH27 16
H1:IOP-PEM_MX_MADC0_EPICS_CH26 16
H1:IOP-PEM_MX_MADC0_EPICS_CH25 16
H1:IOP-PEM_MX_MADC0_EPICS_CH24 16
H1:IOP-PEM_MX_MADC0_EPICS_CH23 16
H1:IOP-PEM_MX_MADC0_EPICS_CH22 16
H1:IOP-PEM_MX_MADC0_EPICS_CH21 16
H1:IOP-PEM_MX_MADC0_EPICS_CH20 16
H1:IOP-PEM_MX_MADC0_EPICS_CH2 16
H1:IOP-PEM_MX_MADC0_EPICS_CH19 16
H1:IOP-PEM_MX_MADC0_EPICS_CH18 16
H1:IOP-PEM_MX_MADC0_EPICS_CH17 16
H1:IOP-PEM_MX_MADC0_EPICS_CH16 16
H1:IOP-PEM_MX_MADC0_EPICS_CH15 16
H1:IOP-PEM_MX_MADC0_EPICS_CH14 16
H1:IOP-PEM_MX_MADC0_EPICS_CH13 16
H1:IOP-PEM_MX_MADC0_EPICS_CH12 16
H1:IOP-PEM_MX_MADC0_EPICS_CH11 16
H1:IOP-PEM_MX_MADC0_EPICS_CH10 16
H1:IOP-PEM_MX_MADC0_EPICS_CH1 16
H1:IOP-PEM_MX_MADC0_EPICS_CH0 16
H1:IOP-PEM_MX_TDS_MON 16
H1:PEM-EY_SEIS_VEA_FLOOR_Z_BLRMS_INPUT_INMON 16
H1:PEM-EY_SEIS_VEA_FLOOR_Z_BLRMS_INPUT_EXCMON 16
H1:PEM-EY_SEIS_VEA_FLOOR_Z_BLRMS_INPUT_OFFSET 16
H1:PEM-EY_SEIS_VEA_FLOOR_Z_BLRMS_INPUT_GAIN 16
H1:PEM-EY_SEIS_VEA_FLOOR_Z_BLRMS_INPUT_TRAMP 16
H1:PEM-EY_SEIS_VEA_FLOOR_Z_BLRMS_INPUT_LIMIT 16
H1:PEM-EY_SEIS_VEA_FLOOR_Z_BLRMS_INPUT_OUTMON 16
H1:PEM-EY_SEIS_VEA_FLOOR_Z_BLRMS_INPUT_OUT16 16
H1:PEM-EY_SEIS_VEA_FLOOR_Z_BLRMS_INPUT_OUTPUT 16
H1:PEM-EY_SEIS_VEA_FLOOR_Z_BLRMS_INPUT_SW1 16
H1:PEM-EY_SEIS_VEA_FLOOR_Z_BLRMS_INPUT_SW2 16
H1:PEM-EY_SEIS_VEA_FLOOR_Z_BLRMS_INPUT_RSET 16
H1:PEM-EY_SEIS_VEA_FLOOR_Z_BLRMS_INPUT_SW1R 16
H1:PEM-EY_SEIS_VEA_FLOOR_Z_BLRMS_INPUT_SW2R 16
H1:PEM-EY_SEIS_VEA_FLOOR_Z_BLRMS_INPUT_SW1S 16
H1:PEM-EY_SEIS_VEA_FLOOR_Z_BLRMS_INPUT_SW2S 16
H1:PEM-EY_SEIS_VEA_FLOOR_Y_BLRMS_INPUT_INMON 16
H1:PEM-EY_SEIS_VEA_FLOOR_Y_BLRMS_INPUT_EXCMON 16
H1:PEM-EY_SEIS_VEA_FLOOR_Y_BLRMS_INPUT_OFFSET 16
H1:PEM-EY_SEIS_VEA_FLOOR_Y_BLRMS_INPUT_GAIN 16
H1:PEM-EY_SEIS_VEA_FLOOR_Y_BLRMS_INPUT_TRAMP 16
H1:PEM-EY_SEIS_VEA_FLOOR_Y_BLRMS_INPUT_LIMIT 16
H1:PEM-EY_SEIS_VEA_FLOOR_Y_BLRMS_INPUT_OUTMON 16
H1:PEM-EY_SEIS_VEA_FLOOR_Y_BLRMS_INPUT_OUT16 16
H1:PEM-EY_SEIS_VEA_FLOOR_Y_BLRMS_INPUT_OUTPUT 16
H1:PEM-EY_SEIS_VEA_FLOOR_Y_BLRMS_INPUT_SW1 16
H1:PEM-EY_SEIS_VEA_FLOOR_Y_BLRMS_INPUT_SW2 16
H1:PEM-EY_SEIS_VEA_FLOOR_Y_BLRMS_INPUT_RSET 16
H1:PEM-EY_SEIS_VEA_FLOOR_Y_BLRMS_INPUT_SW1R 16
H1:PEM-EY_SEIS_VEA_FLOOR_Y_BLRMS_INPUT_SW2R 16
H1:PEM-EY_SEIS_VEA_FLOOR_Y_BLRMS_INPUT_SW1S 16
H1:PEM-EY_SEIS_VEA_FLOOR_Y_BLRMS_INPUT_SW2S 16
H1:PEM-EY_SEIS_VEA_FLOOR_X_BLRMS_INPUT_INMON 16
H1:PEM-EY_SEIS_VEA_FLOOR_X_BLRMS_INPUT_EXCMON 16
H1:PEM-EY_SEIS_VEA_FLOOR_X_BLRMS_INPUT_OFFSET 16
H1:PEM-EY_SEIS_VEA_FLOOR_X_BLRMS_INPUT_GAIN 16
H1:PEM-EY_SEIS_VEA_FLOOR_X_BLRMS_INPUT_TRAMP 16
H1:PEM-EY_SEIS_VEA_FLOOR_X_BLRMS_INPUT_LIMIT 16
H1:PEM-EY_SEIS_VEA_FLOOR_X_BLRMS_INPUT_OUTMON 16
H1:PEM-EY_SEIS_VEA_FLOOR_X_BLRMS_INPUT_OUT16 16
H1:PEM-EY_SEIS_VEA_FLOOR_X_BLRMS_INPUT_OUTPUT 16
H1:PEM-EY_SEIS_VEA_FLOOR_X_BLRMS_INPUT_SW1 16
H1:PEM-EY_SEIS_VEA_FLOOR_X_BLRMS_INPUT_SW2 16
H1:PEM-EY_SEIS_VEA_FLOOR_X_BLRMS_INPUT_RSET 16
H1:PEM-EY_SEIS_VEA_FLOOR_X_BLRMS_INPUT_SW1R 16
H1:PEM-EY_SEIS_VEA_FLOOR_X_BLRMS_INPUT_SW2R 16
H1:PEM-EY_SEIS_VEA_FLOOR_X_BLRMS_INPUT_SW1S 16
H1:PEM-EY_SEIS_VEA_FLOOR_X_BLRMS_INPUT_SW2S 16
H1:PEM-EY_CHAN_21_INMON 16
H1:PEM-EY_CHAN_21_EXCMON 16
H1:PEM-EY_CHAN_21_OFFSET 16
H1:PEM-EY_CHAN_21_GAIN 16
H1:PEM-EY_CHAN_21_TRAMP 16
H1:PEM-EY_CHAN_21_LIMIT 16
H1:PEM-EY_CHAN_21_OUTMON 16
H1:PEM-EY_CHAN_21_OUT16 16
H1:PEM-EY_CHAN_21_OUTPUT 16
H1:PEM-EY_CHAN_21_SW1 16
H1:PEM-EY_CHAN_21_SW2 16
H1:PEM-EY_CHAN_21_RSET 16
H1:PEM-EY_CHAN_21_SW1R 16
H1:PEM-EY_CHAN_21_SW2R 16
H1:PEM-EY_CHAN_21_SW1S 16
H1:PEM-EY_CHAN_21_SW2S 16
H1:PEM-EY_CHAN_22_INMON 16
H1:PEM-EY_CHAN_22_EXCMON 16
H1:PEM-EY_CHAN_22_OFFSET 16
H1:PEM-EY_CHAN_22_GAIN 16
H1:PEM-EY_CHAN_22_TRAMP 16
H1:PEM-EY_CHAN_22_LIMIT 16
H1:PEM-EY_CHAN_22_OUTMON 16
H1:PEM-EY_CHAN_22_OUT16 16
H1:PEM-EY_CHAN_22_OUTPUT 16
H1:PEM-EY_CHAN_22_SW1 16
H1:PEM-EY_CHAN_22_SW2 16
H1:PEM-EY_CHAN_22_RSET 16
H1:PEM-EY_CHAN_22_SW1R 16
H1:PEM-EY_CHAN_22_SW2R 16
H1:PEM-EY_CHAN_22_SW1S 16
H1:PEM-EY_CHAN_22_SW2S 16
H1:PEM-EY_CHAN_23_INMON 16
H1:PEM-EY_CHAN_23_EXCMON 16
H1:PEM-EY_CHAN_23_OFFSET 16
H1:PEM-EY_CHAN_23_GAIN 16
H1:PEM-EY_CHAN_23_TRAMP 16
H1:PEM-EY_CHAN_23_LIMIT 16
H1:PEM-EY_CHAN_23_OUTMON 16
H1:PEM-EY_CHAN_23_OUT16 16
H1:PEM-EY_CHAN_23_OUTPUT 16
H1:PEM-EY_CHAN_23_SW1 16
H1:PEM-EY_CHAN_23_SW2 16
H1:PEM-EY_CHAN_23_RSET 16
H1:PEM-EY_CHAN_23_SW1R 16
H1:PEM-EY_CHAN_23_SW2R 16
H1:PEM-EY_CHAN_23_SW1S 16
H1:PEM-EY_CHAN_23_SW2S 16
H1:PEM-EY_CHAN_24_INMON 16
H1:PEM-EY_CHAN_24_EXCMON 16
H1:PEM-EY_CHAN_24_OFFSET 16
H1:PEM-EY_CHAN_24_GAIN 16
H1:PEM-EY_CHAN_24_TRAMP 16
H1:PEM-EY_CHAN_24_LIMIT 16
H1:PEM-EY_CHAN_24_OUTMON 16
H1:PEM-EY_CHAN_24_OUT16 16
H1:PEM-EY_CHAN_24_OUTPUT 16
H1:PEM-EY_CHAN_24_SW1 16
H1:PEM-EY_CHAN_24_SW2 16
H1:PEM-EY_CHAN_24_RSET 16
H1:PEM-EY_CHAN_24_SW1R 16
H1:PEM-EY_CHAN_24_SW2R 16
H1:PEM-EY_CHAN_24_SW1S 16
H1:PEM-EY_CHAN_24_SW2S 16
H1:PEM-EY_CHAN_25_INMON 16
H1:PEM-EY_CHAN_25_EXCMON 16
H1:PEM-EY_CHAN_25_OFFSET 16
H1:PEM-EY_CHAN_25_GAIN 16
H1:PEM-EY_CHAN_25_TRAMP 16
H1:PEM-EY_CHAN_25_LIMIT 16
H1:PEM-EY_CHAN_25_OUTMON 16
H1:PEM-EY_CHAN_25_OUT16 16
H1:PEM-EY_CHAN_25_OUTPUT 16
H1:PEM-EY_CHAN_25_SW1 16
H1:PEM-EY_CHAN_25_SW2 16
H1:PEM-EY_CHAN_25_RSET 16
H1:PEM-EY_CHAN_25_SW1R 16
H1:PEM-EY_CHAN_25_SW2R 16
H1:PEM-EY_CHAN_25_SW1S 16
H1:PEM-EY_CHAN_25_SW2S 16
H1:PEM-EY_CHAN_26_INMON 16
H1:PEM-EY_CHAN_26_EXCMON 16
H1:PEM-EY_CHAN_26_OFFSET 16
H1:PEM-EY_CHAN_26_GAIN 16
H1:PEM-EY_CHAN_26_TRAMP 16
H1:PEM-EY_CHAN_26_LIMIT 16
H1:PEM-EY_CHAN_26_OUTMON 16
H1:PEM-EY_CHAN_26_OUT16 16
H1:PEM-EY_CHAN_26_OUTPUT 16
H1:PEM-EY_CHAN_26_SW1 16
H1:PEM-EY_CHAN_26_SW2 16
H1:PEM-EY_CHAN_26_RSET 16
H1:PEM-EY_CHAN_26_SW1R 16
H1:PEM-EY_CHAN_26_SW2R 16
H1:PEM-EY_CHAN_26_SW1S 16
H1:PEM-EY_CHAN_26_SW2S 16
H1:PEM-EY_CHAN_27_INMON 16
H1:PEM-EY_CHAN_27_EXCMON 16
H1:PEM-EY_CHAN_27_OFFSET 16
H1:PEM-EY_CHAN_27_GAIN 16
H1:PEM-EY_CHAN_27_TRAMP 16
H1:PEM-EY_CHAN_27_LIMIT 16
H1:PEM-EY_CHAN_27_OUTMON 16
H1:PEM-EY_CHAN_27_OUT16 16
H1:PEM-EY_CHAN_27_OUTPUT 16
H1:PEM-EY_CHAN_27_SW1 16
H1:PEM-EY_CHAN_27_SW2 16
H1:PEM-EY_CHAN_27_RSET 16
H1:PEM-EY_CHAN_27_SW1R 16
H1:PEM-EY_CHAN_27_SW2R 16
H1:PEM-EY_CHAN_27_SW1S 16
H1:PEM-EY_CHAN_27_SW2S 16
H1:PEM-EY_CHAN_28_INMON 16
H1:PEM-EY_CHAN_28_EXCMON 16
H1:PEM-EY_CHAN_28_OFFSET 16
H1:PEM-EY_CHAN_28_GAIN 16
H1:PEM-EY_CHAN_28_TRAMP 16
H1:PEM-EY_CHAN_28_LIMIT 16
H1:PEM-EY_CHAN_28_OUTMON 16
H1:PEM-EY_CHAN_28_OUT16 16
H1:PEM-EY_CHAN_28_OUTPUT 16
H1:PEM-EY_CHAN_28_SW1 16
H1:PEM-EY_CHAN_28_SW2 16
H1:PEM-EY_CHAN_28_RSET 16
H1:PEM-EY_CHAN_28_SW1R 16
H1:PEM-EY_CHAN_28_SW2R 16
H1:PEM-EY_CHAN_28_SW1S 16
H1:PEM-EY_CHAN_28_SW2S 16
H1:PEM-EY_CHAN_29_INMON 16
H1:PEM-EY_CHAN_29_EXCMON 16
H1:PEM-EY_CHAN_29_OFFSET 16
H1:PEM-EY_CHAN_29_GAIN 16
H1:PEM-EY_CHAN_29_TRAMP 16
H1:PEM-EY_CHAN_29_LIMIT 16
H1:PEM-EY_CHAN_29_OUTMON 16
H1:PEM-EY_CHAN_29_OUT16 16
H1:PEM-EY_CHAN_29_OUTPUT 16
H1:PEM-EY_CHAN_29_SW1 16
H1:PEM-EY_CHAN_29_SW2 16
H1:PEM-EY_CHAN_29_RSET 16
H1:PEM-EY_CHAN_29_SW1R 16
H1:PEM-EY_CHAN_29_SW2R 16
H1:PEM-EY_CHAN_29_SW1S 16
H1:PEM-EY_CHAN_29_SW2S 16
H1:PEM-EY_CHAN_6_INMON 16
H1:PEM-EY_CHAN_6_EXCMON 16
H1:PEM-EY_CHAN_6_OFFSET 16
H1:PEM-EY_CHAN_6_GAIN 16
H1:PEM-EY_CHAN_6_TRAMP 16
H1:PEM-EY_CHAN_6_LIMIT 16
H1:PEM-EY_CHAN_6_OUTMON 16
H1:PEM-EY_CHAN_6_OUT16 16
H1:PEM-EY_CHAN_6_OUTPUT 16
H1:PEM-EY_CHAN_6_SW1 16
H1:PEM-EY_CHAN_6_SW2 16
H1:PEM-EY_CHAN_6_RSET 16
H1:PEM-EY_CHAN_6_SW1R 16
H1:PEM-EY_CHAN_6_SW2R 16
H1:PEM-EY_CHAN_6_SW1S 16
H1:PEM-EY_CHAN_6_SW2S 16
H1:PEM-EY_CHAN_7_INMON 16
H1:PEM-EY_CHAN_7_EXCMON 16
H1:PEM-EY_CHAN_7_OFFSET 16
H1:PEM-EY_CHAN_7_GAIN 16
H1:PEM-EY_CHAN_7_TRAMP 16
H1:PEM-EY_CHAN_7_LIMIT 16
H1:PEM-EY_CHAN_7_OUTMON 16
H1:PEM-EY_CHAN_7_OUT16 16
H1:PEM-EY_CHAN_7_OUTPUT 16
H1:PEM-EY_CHAN_7_SW1 16
H1:PEM-EY_CHAN_7_SW2 16
H1:PEM-EY_CHAN_7_RSET 16
H1:PEM-EY_CHAN_7_SW1R 16
H1:PEM-EY_CHAN_7_SW2R 16
H1:PEM-EY_CHAN_7_SW1S 16
H1:PEM-EY_CHAN_7_SW2S 16
H1:PEM-EY_DCU_ID 16
H1:PEM-EY_TILT_VEA_FLOOR_T_MON 16
H1:PEM-EY_TILT_VEA_FLOOR_X_MON 16
H1:PEM-EY_TILT_VEA_FLOOR_Y_MON 16
H1:PEM-EY_SEIS_VEA_FLOOR_Z_BLRMS_3HZ10 16
H1:PEM-EY_SEIS_VEA_FLOOR_Z_BLRMS_30MHZ100 16
H1:PEM-EY_SEIS_VEA_FLOOR_Z_BLRMS_30HZ100 16
H1:PEM-EY_SEIS_VEA_FLOOR_Z_BLRMS_300MHZ1000 16
H1:PEM-EY_SEIS_VEA_FLOOR_Z_BLRMS_1HZ3 16
H1:PEM-EY_SEIS_VEA_FLOOR_Z_BLRMS_10HZ30 16
H1:PEM-EY_SEIS_VEA_FLOOR_Z_BLRMS_100MHZ300 16
H1:PEM-EY_SEIS_VEA_FLOOR_Z_BLRMS_0MHZ30 16
H1:PEM-EY_SEIS_VEA_FLOOR_Y_BLRMS_3HZ10 16
H1:PEM-EY_SEIS_VEA_FLOOR_Y_BLRMS_30MHZ100 16
H1:PEM-EY_SEIS_VEA_FLOOR_Y_BLRMS_30HZ100 16
H1:PEM-EY_SEIS_VEA_FLOOR_Y_BLRMS_300MHZ1000 16
H1:PEM-EY_SEIS_VEA_FLOOR_Y_BLRMS_1HZ3 16
H1:PEM-EY_SEIS_VEA_FLOOR_Y_BLRMS_10HZ30 16
H1:PEM-EY_SEIS_VEA_FLOOR_Y_BLRMS_100MHZ300 16
H1:PEM-EY_SEIS_VEA_FLOOR_Y_BLRMS_0MHZ30 16
H1:PEM-EY_SEIS_VEA_FLOOR_X_BLRMS_3HZ10 16
H1:PEM-EY_SEIS_VEA_FLOOR_X_BLRMS_30MHZ100 16
H1:PEM-EY_SEIS_VEA_FLOOR_X_BLRMS_30HZ100 16
H1:PEM-EY_SEIS_VEA_FLOOR_X_BLRMS_300MHZ1000 16
H1:PEM-EY_SEIS_VEA_FLOOR_X_BLRMS_1HZ3 16
H1:PEM-EY_SEIS_VEA_FLOOR_X_BLRMS_10HZ30 16
H1:PEM-EY_SEIS_VEA_FLOOR_X_BLRMS_100MHZ300 16
H1:PEM-EY_SEIS_VEA_FLOOR_X_BLRMS_0MHZ30 16
H1:PEM-EY_MIC_EBAY_RACKS_MON 16
H1:PEM-EY_MAG_EBAY_SEIRACK_X_MON 16
H1:PEM-EY_MAG_EBAY_SEIRACK_Y_MON 16
H1:PEM-EY_MAG_EBAY_SEIRACK_Z_MON 16
H1:PEM-EY_MAG_EBAY_SUSRACK_X_MON 16
H1:PEM-EY_MAG_EBAY_SUSRACK_Y_MON 16
H1:PEM-EY_MAG_EBAY_SUSRACK_Z_MON 16
H1:PEM-EY_MAG_VEA_FLOOR_X_MON 16
H1:PEM-EY_MAG_VEA_FLOOR_Y_MON 16
H1:PEM-EY_MAG_VEA_FLOOR_Z_MON 16
H1:PEM-EY_ACC_EBAY_FLOOR_Z_MON 16
H1:PEM-EY_ACC_ISCEY_TRANS_X_MON 16
H1:PEM-EY_ACC_OPLEV_ETMY_X_MON 16
H1:PEM-CS_TIMING_EBAY_IRIGB_INMON 16
H1:PEM-CS_TIMING_EBAY_IRIGB_EXCMON 16
H1:PEM-CS_TIMING_EBAY_IRIGB_OFFSET 16
H1:PEM-CS_TIMING_EBAY_IRIGB_GAIN 16
H1:PEM-CS_TIMING_EBAY_IRIGB_TRAMP 16
H1:PEM-CS_TIMING_EBAY_IRIGB_LIMIT 16
H1:PEM-CS_TIMING_EBAY_IRIGB_OUTMON 16
H1:PEM-CS_TIMING_EBAY_IRIGB_OUT16 16
H1:PEM-CS_TIMING_EBAY_IRIGB_OUTPUT 16
H1:PEM-CS_TIMING_EBAY_IRIGB_SW1 16
H1:PEM-CS_TIMING_EBAY_IRIGB_SW2 16
H1:PEM-CS_TIMING_EBAY_IRIGB_RSET 16
H1:PEM-CS_TIMING_EBAY_IRIGB_SW1R 16
H1:PEM-CS_TIMING_EBAY_IRIGB_SW2R 16
H1:PEM-CS_TIMING_EBAY_IRIGB_SW1S 16
H1:PEM-CS_TIMING_EBAY_IRIGB_SW2S 16
H1:PEM-CS_SEIS_LVEA_VERTEX_Z_BLRMS_INPUT_INMON 16
H1:PEM-CS_SEIS_LVEA_VERTEX_Z_BLRMS_INPUT_EXCMON 16
H1:PEM-CS_SEIS_LVEA_VERTEX_Z_BLRMS_INPUT_OFFSET 16
H1:PEM-CS_SEIS_LVEA_VERTEX_Z_BLRMS_INPUT_GAIN 16
H1:PEM-CS_SEIS_LVEA_VERTEX_Z_BLRMS_INPUT_TRAMP 16
H1:PEM-CS_SEIS_LVEA_VERTEX_Z_BLRMS_INPUT_LIMIT 16
H1:PEM-CS_SEIS_LVEA_VERTEX_Z_BLRMS_INPUT_OUTMON 16
H1:PEM-CS_SEIS_LVEA_VERTEX_Z_BLRMS_INPUT_OUT16 16
H1:PEM-CS_SEIS_LVEA_VERTEX_Z_BLRMS_INPUT_OUTPUT 16
H1:PEM-CS_SEIS_LVEA_VERTEX_Z_BLRMS_INPUT_SW1 16
H1:PEM-CS_SEIS_LVEA_VERTEX_Z_BLRMS_INPUT_SW2 16
H1:PEM-CS_SEIS_LVEA_VERTEX_Z_BLRMS_INPUT_RSET 16
H1:PEM-CS_SEIS_LVEA_VERTEX_Z_BLRMS_INPUT_SW1R 16
H1:PEM-CS_SEIS_LVEA_VERTEX_Z_BLRMS_INPUT_SW2R 16
H1:PEM-CS_SEIS_LVEA_VERTEX_Z_BLRMS_INPUT_SW1S 16
H1:PEM-CS_SEIS_LVEA_VERTEX_Z_BLRMS_INPUT_SW2S 16
H1:PEM-CS_SEIS_LVEA_VERTEX_Y_BLRMS_INPUT_INMON 16
H1:PEM-CS_SEIS_LVEA_VERTEX_Y_BLRMS_INPUT_EXCMON 16
H1:PEM-CS_SEIS_LVEA_VERTEX_Y_BLRMS_INPUT_OFFSET 16
H1:PEM-CS_SEIS_LVEA_VERTEX_Y_BLRMS_INPUT_GAIN 16
H1:PEM-CS_SEIS_LVEA_VERTEX_Y_BLRMS_INPUT_TRAMP 16
H1:PEM-CS_SEIS_LVEA_VERTEX_Y_BLRMS_INPUT_LIMIT 16
H1:PEM-CS_SEIS_LVEA_VERTEX_Y_BLRMS_INPUT_OUTMON 16
H1:PEM-CS_SEIS_LVEA_VERTEX_Y_BLRMS_INPUT_OUT16 16
H1:PEM-CS_SEIS_LVEA_VERTEX_Y_BLRMS_INPUT_OUTPUT 16
H1:PEM-CS_SEIS_LVEA_VERTEX_Y_BLRMS_INPUT_SW1 16
H1:PEM-CS_SEIS_LVEA_VERTEX_Y_BLRMS_INPUT_SW2 16
H1:PEM-CS_SEIS_LVEA_VERTEX_Y_BLRMS_INPUT_RSET 16
H1:PEM-CS_SEIS_LVEA_VERTEX_Y_BLRMS_INPUT_SW1R 16
H1:PEM-CS_SEIS_LVEA_VERTEX_Y_BLRMS_INPUT_SW2R 16
H1:PEM-CS_SEIS_LVEA_VERTEX_Y_BLRMS_INPUT_SW1S 16
H1:PEM-CS_SEIS_LVEA_VERTEX_Y_BLRMS_INPUT_SW2S 16
H1:PEM-CS_SEIS_LVEA_VERTEX_X_BLRMS_INPUT_INMON 16
H1:PEM-CS_SEIS_LVEA_VERTEX_X_BLRMS_INPUT_EXCMON 16
H1:PEM-CS_SEIS_LVEA_VERTEX_X_BLRMS_INPUT_OFFSET 16
H1:PEM-CS_SEIS_LVEA_VERTEX_X_BLRMS_INPUT_GAIN 16
H1:PEM-CS_SEIS_LVEA_VERTEX_X_BLRMS_INPUT_TRAMP 16
H1:PEM-CS_SEIS_LVEA_VERTEX_X_BLRMS_INPUT_LIMIT 16
H1:PEM-CS_SEIS_LVEA_VERTEX_X_BLRMS_INPUT_OUTMON 16
H1:PEM-CS_SEIS_LVEA_VERTEX_X_BLRMS_INPUT_OUT16 16
H1:PEM-CS_SEIS_LVEA_VERTEX_X_BLRMS_INPUT_OUTPUT 16
H1:PEM-CS_SEIS_LVEA_VERTEX_X_BLRMS_INPUT_SW1 16
H1:PEM-CS_SEIS_LVEA_VERTEX_X_BLRMS_INPUT_SW2 16
H1:PEM-CS_SEIS_LVEA_VERTEX_X_BLRMS_INPUT_RSET 16
H1:PEM-CS_SEIS_LVEA_VERTEX_X_BLRMS_INPUT_SW1R 16
H1:PEM-CS_SEIS_LVEA_VERTEX_X_BLRMS_INPUT_SW2R 16
H1:PEM-CS_SEIS_LVEA_VERTEX_X_BLRMS_INPUT_SW1S 16
H1:PEM-CS_SEIS_LVEA_VERTEX_X_BLRMS_INPUT_SW2S 16
H1:PEM-CS_CHAN_25_INMON 16
H1:PEM-CS_CHAN_25_EXCMON 16
H1:PEM-CS_CHAN_25_OFFSET 16
H1:PEM-CS_CHAN_25_GAIN 16
H1:PEM-CS_CHAN_25_TRAMP 16
H1:PEM-CS_CHAN_25_LIMIT 16
H1:PEM-CS_CHAN_25_OUTMON 16
H1:PEM-CS_CHAN_25_OUT16 16
H1:PEM-CS_CHAN_25_OUTPUT 16
H1:PEM-CS_CHAN_25_SW1 16
H1:PEM-CS_CHAN_25_SW2 16
H1:PEM-CS_CHAN_25_RSET 16
H1:PEM-CS_CHAN_25_SW1R 16
H1:PEM-CS_CHAN_25_SW2R 16
H1:PEM-CS_CHAN_25_SW1S 16
H1:PEM-CS_CHAN_25_SW2S 16
H1:PEM-CS_CHAN_26_INMON 16
H1:PEM-CS_CHAN_26_EXCMON 16
H1:PEM-CS_CHAN_26_OFFSET 16
H1:PEM-CS_CHAN_26_GAIN 16
H1:PEM-CS_CHAN_26_TRAMP 16
H1:PEM-CS_CHAN_26_LIMIT 16
H1:PEM-CS_CHAN_26_OUTMON 16
H1:PEM-CS_CHAN_26_OUT16 16
H1:PEM-CS_CHAN_26_OUTPUT 16
H1:PEM-CS_CHAN_26_SW1 16
H1:PEM-CS_CHAN_26_SW2 16
H1:PEM-CS_CHAN_26_RSET 16
H1:PEM-CS_CHAN_26_SW1R 16
H1:PEM-CS_CHAN_26_SW2R 16
H1:PEM-CS_CHAN_26_SW1S 16
H1:PEM-CS_CHAN_26_SW2S 16
H1:PEM-CS_CHAN_27_INMON 16
H1:PEM-CS_CHAN_27_EXCMON 16
H1:PEM-CS_CHAN_27_OFFSET 16
H1:PEM-CS_CHAN_27_GAIN 16
H1:PEM-CS_CHAN_27_TRAMP 16
H1:PEM-CS_CHAN_27_LIMIT 16
H1:PEM-CS_CHAN_27_OUTMON 16
H1:PEM-CS_CHAN_27_OUT16 16
H1:PEM-CS_CHAN_27_OUTPUT 16
H1:PEM-CS_CHAN_27_SW1 16
H1:PEM-CS_CHAN_27_SW2 16
H1:PEM-CS_CHAN_27_RSET 16
H1:PEM-CS_CHAN_27_SW1R 16
H1:PEM-CS_CHAN_27_SW2R 16
H1:PEM-CS_CHAN_27_SW1S 16
H1:PEM-CS_CHAN_27_SW2S 16
H1:PEM-CS_CHAN_28_INMON 16
H1:PEM-CS_CHAN_28_EXCMON 16
H1:PEM-CS_CHAN_28_OFFSET 16
H1:PEM-CS_CHAN_28_GAIN 16
H1:PEM-CS_CHAN_28_TRAMP 16
H1:PEM-CS_CHAN_28_LIMIT 16
H1:PEM-CS_CHAN_28_OUTMON 16
H1:PEM-CS_CHAN_28_OUT16 16
H1:PEM-CS_CHAN_28_OUTPUT 16
H1:PEM-CS_CHAN_28_SW1 16
H1:PEM-CS_CHAN_28_SW2 16
H1:PEM-CS_CHAN_28_RSET 16
H1:PEM-CS_CHAN_28_SW1R 16
H1:PEM-CS_CHAN_28_SW2R 16
H1:PEM-CS_CHAN_28_SW1S 16
H1:PEM-CS_CHAN_28_SW2S 16
H1:PEM-CS_CHAN_29_INMON 16
H1:PEM-CS_CHAN_29_EXCMON 16
H1:PEM-CS_CHAN_29_OFFSET 16
H1:PEM-CS_CHAN_29_GAIN 16
H1:PEM-CS_CHAN_29_TRAMP 16
H1:PEM-CS_CHAN_29_LIMIT 16
H1:PEM-CS_CHAN_29_OUTMON 16
H1:PEM-CS_CHAN_29_OUT16 16
H1:PEM-CS_CHAN_29_OUTPUT 16
H1:PEM-CS_CHAN_29_SW1 16
H1:PEM-CS_CHAN_29_SW2 16
H1:PEM-CS_CHAN_29_RSET 16
H1:PEM-CS_CHAN_29_SW1R 16
H1:PEM-CS_CHAN_29_SW2R 16
H1:PEM-CS_CHAN_29_SW1S 16
H1:PEM-CS_CHAN_29_SW2S 16
H1:PEM-L0_DCU_ID 16
H1:PEM-CS_TILT_LVEA_VERTEX_T_MON 16
H1:PEM-CS_TILT_LVEA_VERTEX_X_MON 16
H1:PEM-CS_TILT_LVEA_VERTEX_Y_MON 16
H1:PEM-CS_SEIS_LVEA_VERTEX_Z_BLRMS_3HZ10 16
H1:PEM-CS_SEIS_LVEA_VERTEX_Z_BLRMS_30MHZ100 16
H1:PEM-CS_SEIS_LVEA_VERTEX_Z_BLRMS_30HZ100 16
H1:PEM-CS_SEIS_LVEA_VERTEX_Z_BLRMS_300MHZ1000 16
H1:PEM-CS_SEIS_LVEA_VERTEX_Z_BLRMS_1HZ3 16
H1:PEM-CS_SEIS_LVEA_VERTEX_Z_BLRMS_10HZ30 16
H1:PEM-CS_SEIS_LVEA_VERTEX_Z_BLRMS_100MHZ300 16
H1:PEM-CS_SEIS_LVEA_VERTEX_Z_BLRMS_0MHZ30 16
H1:PEM-CS_SEIS_LVEA_VERTEX_Y_BLRMS_3HZ10 16
H1:PEM-CS_SEIS_LVEA_VERTEX_Y_BLRMS_30MHZ100 16
H1:PEM-CS_SEIS_LVEA_VERTEX_Y_BLRMS_30HZ100 16
H1:PEM-CS_SEIS_LVEA_VERTEX_Y_BLRMS_300MHZ1000 16
H1:PEM-CS_SEIS_LVEA_VERTEX_Y_BLRMS_1HZ3 16
H1:PEM-CS_SEIS_LVEA_VERTEX_Y_BLRMS_10HZ30 16
H1:PEM-CS_SEIS_LVEA_VERTEX_Y_BLRMS_100MHZ300 16
H1:PEM-CS_SEIS_LVEA_VERTEX_Y_BLRMS_0MHZ30 16
H1:PEM-CS_SEIS_LVEA_VERTEX_X_BLRMS_3HZ10 16
H1:PEM-CS_SEIS_LVEA_VERTEX_X_BLRMS_30MHZ100 16
H1:PEM-CS_SEIS_LVEA_VERTEX_X_BLRMS_30HZ100 16
H1:PEM-CS_SEIS_LVEA_VERTEX_X_BLRMS_300MHZ1000 16
H1:PEM-CS_SEIS_LVEA_VERTEX_X_BLRMS_1HZ3 16
H1:PEM-CS_SEIS_LVEA_VERTEX_X_BLRMS_10HZ30 16
H1:PEM-CS_SEIS_LVEA_VERTEX_X_BLRMS_100MHZ300 16
H1:PEM-CS_SEIS_LVEA_VERTEX_X_BLRMS_0MHZ30 16
H1:PEM-CS_MIC_EBAY_RACKS_MON 16
H1:PEM-CS_MIC_LVEA_VERTEX_MON 16
H1:PEM-CS_MIC_YMAN_SPOOL_MON 16
H1:PEM-CS_MAG_EBAY_SEIRACK_X_MON 16
H1:PEM-CS_MAG_EBAY_SEIRACK_Y_MON 16
H1:PEM-CS_MAG_EBAY_SEIRACK_Z_MON 16
H1:PEM-CS_MAG_EBAY_SUSRACK_X_MON 16
H1:PEM-CS_MAG_EBAY_SUSRACK_Y_MON 16
H1:PEM-CS_MAG_EBAY_SUSRACK_Z_MON 16
H1:PEM-CS_MAG_LVEA_VERTEX_X_MON 16
H1:PEM-CS_MAG_LVEA_VERTEX_Y_MON 16
H1:PEM-CS_MAG_LVEA_VERTEX_Z_MON 16
H1:PEM-CS_ACC_BEAMTUBE_YMAN_Z_MON 16
H1:PEM-CS_ACC_BSC1_ITMY_X_MON 16
H1:PEM-CS_ACC_BSC1_ITMY_Y_MON 16
H1:PEM-CS_ACC_BSC1_ITMY_Z_MON 16
H1:PEM-CS_ACC_EBAY_FLOOR_Z_MON 16
H1:PEM-CS_ACC_FLOOR_YCRYO_Z_MON 16
H1:PEM-CS_ACC_OPLEV_ITMY_X_MON 16
H1:PEM-MX_SEIS_VEA_FLOOR_Z_BLRMS_INPUT_INMON 16
H1:PEM-MX_SEIS_VEA_FLOOR_Z_BLRMS_INPUT_EXCMON 16
H1:PEM-MX_SEIS_VEA_FLOOR_Z_BLRMS_INPUT_OFFSET 16
H1:PEM-MX_SEIS_VEA_FLOOR_Z_BLRMS_INPUT_GAIN 16
H1:PEM-MX_SEIS_VEA_FLOOR_Z_BLRMS_INPUT_TRAMP 16
H1:PEM-MX_SEIS_VEA_FLOOR_Z_BLRMS_INPUT_LIMIT 16
H1:PEM-MX_SEIS_VEA_FLOOR_Z_BLRMS_INPUT_OUTMON 16
H1:PEM-MX_SEIS_VEA_FLOOR_Z_BLRMS_INPUT_OUT16 16
H1:PEM-MX_SEIS_VEA_FLOOR_Z_BLRMS_INPUT_OUTPUT 16
H1:PEM-MX_SEIS_VEA_FLOOR_Z_BLRMS_INPUT_SW1 16
H1:PEM-MX_SEIS_VEA_FLOOR_Z_BLRMS_INPUT_SW2 16
H1:PEM-MX_SEIS_VEA_FLOOR_Z_BLRMS_INPUT_RSET 16
H1:PEM-MX_SEIS_VEA_FLOOR_Z_BLRMS_INPUT_SW1R 16
H1:PEM-MX_SEIS_VEA_FLOOR_Z_BLRMS_INPUT_SW2R 16
H1:PEM-MX_SEIS_VEA_FLOOR_Z_BLRMS_INPUT_SW1S 16
H1:PEM-MX_SEIS_VEA_FLOOR_Z_BLRMS_INPUT_SW2S 16
H1:PEM-MX_SEIS_VEA_FLOOR_Y_BLRMS_INPUT_INMON 16
H1:PEM-MX_SEIS_VEA_FLOOR_Y_BLRMS_INPUT_EXCMON 16
H1:PEM-MX_SEIS_VEA_FLOOR_Y_BLRMS_INPUT_OFFSET 16
H1:PEM-MX_SEIS_VEA_FLOOR_Y_BLRMS_INPUT_GAIN 16
H1:PEM-MX_SEIS_VEA_FLOOR_Y_BLRMS_INPUT_TRAMP 16
H1:PEM-MX_SEIS_VEA_FLOOR_Y_BLRMS_INPUT_LIMIT 16
H1:PEM-MX_SEIS_VEA_FLOOR_Y_BLRMS_INPUT_OUTMON 16
H1:PEM-MX_SEIS_VEA_FLOOR_Y_BLRMS_INPUT_OUT16 16
H1:PEM-MX_SEIS_VEA_FLOOR_Y_BLRMS_INPUT_OUTPUT 16
H1:PEM-MX_SEIS_VEA_FLOOR_Y_BLRMS_INPUT_SW1 16
H1:PEM-MX_SEIS_VEA_FLOOR_Y_BLRMS_INPUT_SW2 16
H1:PEM-MX_SEIS_VEA_FLOOR_Y_BLRMS_INPUT_RSET 16
H1:PEM-MX_SEIS_VEA_FLOOR_Y_BLRMS_INPUT_SW1R 16
H1:PEM-MX_SEIS_VEA_FLOOR_Y_BLRMS_INPUT_SW2R 16
H1:PEM-MX_SEIS_VEA_FLOOR_Y_BLRMS_INPUT_SW1S 16
H1:PEM-MX_SEIS_VEA_FLOOR_Y_BLRMS_INPUT_SW2S 16
H1:PEM-MX_SEIS_VEA_FLOOR_X_BLRMS_INPUT_INMON 16
H1:PEM-MX_SEIS_VEA_FLOOR_X_BLRMS_INPUT_EXCMON 16
H1:PEM-MX_SEIS_VEA_FLOOR_X_BLRMS_INPUT_OFFSET 16
H1:PEM-MX_SEIS_VEA_FLOOR_X_BLRMS_INPUT_GAIN 16
H1:PEM-MX_SEIS_VEA_FLOOR_X_BLRMS_INPUT_TRAMP 16
H1:PEM-MX_SEIS_VEA_FLOOR_X_BLRMS_INPUT_LIMIT 16
H1:PEM-MX_SEIS_VEA_FLOOR_X_BLRMS_INPUT_OUTMON 16
H1:PEM-MX_SEIS_VEA_FLOOR_X_BLRMS_INPUT_OUT16 16
H1:PEM-MX_SEIS_VEA_FLOOR_X_BLRMS_INPUT_OUTPUT 16
H1:PEM-MX_SEIS_VEA_FLOOR_X_BLRMS_INPUT_SW1 16
H1:PEM-MX_SEIS_VEA_FLOOR_X_BLRMS_INPUT_SW2 16
H1:PEM-MX_SEIS_VEA_FLOOR_X_BLRMS_INPUT_RSET 16
H1:PEM-MX_SEIS_VEA_FLOOR_X_BLRMS_INPUT_SW1R 16
H1:PEM-MX_SEIS_VEA_FLOOR_X_BLRMS_INPUT_SW2R 16
H1:PEM-MX_SEIS_VEA_FLOOR_X_BLRMS_INPUT_SW1S 16
H1:PEM-MX_SEIS_VEA_FLOOR_X_BLRMS_INPUT_SW2S 16
H1:PEM-MX_CHAN_10_INMON 16
H1:PEM-MX_CHAN_10_EXCMON 16
H1:PEM-MX_CHAN_10_OFFSET 16
H1:PEM-MX_CHAN_10_GAIN 16
H1:PEM-MX_CHAN_10_TRAMP 16
H1:PEM-MX_CHAN_10_LIMIT 16
H1:PEM-MX_CHAN_10_OUTMON 16
H1:PEM-MX_CHAN_10_OUT16 16
H1:PEM-MX_CHAN_10_OUTPUT 16
H1:PEM-MX_CHAN_10_SW1 16
H1:PEM-MX_CHAN_10_SW2 16
H1:PEM-MX_CHAN_10_RSET 16
H1:PEM-MX_CHAN_10_SW1R 16
H1:PEM-MX_CHAN_10_SW2R 16
H1:PEM-MX_CHAN_10_SW1S 16
H1:PEM-MX_CHAN_10_SW2S 16
H1:PEM-MX_CHAN_11_INMON 16
H1:PEM-MX_CHAN_11_EXCMON 16
H1:PEM-MX_CHAN_11_OFFSET 16
H1:PEM-MX_CHAN_11_GAIN 16
H1:PEM-MX_CHAN_11_TRAMP 16
H1:PEM-MX_CHAN_11_LIMIT 16
H1:PEM-MX_CHAN_11_OUTMON 16
H1:PEM-MX_CHAN_11_OUT16 16
H1:PEM-MX_CHAN_11_OUTPUT 16
H1:PEM-MX_CHAN_11_SW1 16
H1:PEM-MX_CHAN_11_SW2 16
H1:PEM-MX_CHAN_11_RSET 16
H1:PEM-MX_CHAN_11_SW1R 16
H1:PEM-MX_CHAN_11_SW2R 16
H1:PEM-MX_CHAN_11_SW1S 16
H1:PEM-MX_CHAN_11_SW2S 16
H1:PEM-MX_CHAN_12_INMON 16
H1:PEM-MX_CHAN_12_EXCMON 16
H1:PEM-MX_CHAN_12_OFFSET 16
H1:PEM-MX_CHAN_12_GAIN 16
H1:PEM-MX_CHAN_12_TRAMP 16
H1:PEM-MX_CHAN_12_LIMIT 16
H1:PEM-MX_CHAN_12_OUTMON 16
H1:PEM-MX_CHAN_12_OUT16 16
H1:PEM-MX_CHAN_12_OUTPUT 16
H1:PEM-MX_CHAN_12_SW1 16
H1:PEM-MX_CHAN_12_SW2 16
H1:PEM-MX_CHAN_12_RSET 16
H1:PEM-MX_CHAN_12_SW1R 16
H1:PEM-MX_CHAN_12_SW2R 16
H1:PEM-MX_CHAN_12_SW1S 16
H1:PEM-MX_CHAN_12_SW2S 16
H1:PEM-MX_CHAN_13_INMON 16
H1:PEM-MX_CHAN_13_EXCMON 16
H1:PEM-MX_CHAN_13_OFFSET 16
H1:PEM-MX_CHAN_13_GAIN 16
H1:PEM-MX_CHAN_13_TRAMP 16
H1:PEM-MX_CHAN_13_LIMIT 16
H1:PEM-MX_CHAN_13_OUTMON 16
H1:PEM-MX_CHAN_13_OUT16 16
H1:PEM-MX_CHAN_13_OUTPUT 16
H1:PEM-MX_CHAN_13_SW1 16
H1:PEM-MX_CHAN_13_SW2 16
H1:PEM-MX_CHAN_13_RSET 16
H1:PEM-MX_CHAN_13_SW1R 16
H1:PEM-MX_CHAN_13_SW2R 16
H1:PEM-MX_CHAN_13_SW1S 16
H1:PEM-MX_CHAN_13_SW2S 16
H1:PEM-MX_CHAN_14_INMON 16
H1:PEM-MX_CHAN_14_EXCMON 16
H1:PEM-MX_CHAN_14_OFFSET 16
H1:PEM-MX_CHAN_14_GAIN 16
H1:PEM-MX_CHAN_14_TRAMP 16
H1:PEM-MX_CHAN_14_LIMIT 16
H1:PEM-MX_CHAN_14_OUTMON 16
H1:PEM-MX_CHAN_14_OUT16 16
H1:PEM-MX_CHAN_14_OUTPUT 16
H1:PEM-MX_CHAN_14_SW1 16
H1:PEM-MX_CHAN_14_SW2 16
H1:PEM-MX_CHAN_14_RSET 16
H1:PEM-MX_CHAN_14_SW1R 16
H1:PEM-MX_CHAN_14_SW2R 16
H1:PEM-MX_CHAN_14_SW1S 16
H1:PEM-MX_CHAN_14_SW2S 16
H1:PEM-MX_CHAN_15_INMON 16
H1:PEM-MX_CHAN_15_EXCMON 16
H1:PEM-MX_CHAN_15_OFFSET 16
H1:PEM-MX_CHAN_15_GAIN 16
H1:PEM-MX_CHAN_15_TRAMP 16
H1:PEM-MX_CHAN_15_LIMIT 16
H1:PEM-MX_CHAN_15_OUTMON 16
H1:PEM-MX_CHAN_15_OUT16 16
H1:PEM-MX_CHAN_15_OUTPUT 16
H1:PEM-MX_CHAN_15_SW1 16
H1:PEM-MX_CHAN_15_SW2 16
H1:PEM-MX_CHAN_15_RSET 16
H1:PEM-MX_CHAN_15_SW1R 16
H1:PEM-MX_CHAN_15_SW2R 16
H1:PEM-MX_CHAN_15_SW1S 16
H1:PEM-MX_CHAN_15_SW2S 16
H1:PEM-MX_CHAN_16_INMON 16
H1:PEM-MX_CHAN_16_EXCMON 16
H1:PEM-MX_CHAN_16_OFFSET 16
H1:PEM-MX_CHAN_16_GAIN 16
H1:PEM-MX_CHAN_16_TRAMP 16
H1:PEM-MX_CHAN_16_LIMIT 16
H1:PEM-MX_CHAN_16_OUTMON 16
H1:PEM-MX_CHAN_16_OUT16 16
H1:PEM-MX_CHAN_16_OUTPUT 16
H1:PEM-MX_CHAN_16_SW1 16
H1:PEM-MX_CHAN_16_SW2 16
H1:PEM-MX_CHAN_16_RSET 16
H1:PEM-MX_CHAN_16_SW1R 16
H1:PEM-MX_CHAN_16_SW2R 16
H1:PEM-MX_CHAN_16_SW1S 16
H1:PEM-MX_CHAN_16_SW2S 16
H1:PEM-MX_CHAN_17_INMON 16
H1:PEM-MX_CHAN_17_EXCMON 16
H1:PEM-MX_CHAN_17_OFFSET 16
H1:PEM-MX_CHAN_17_GAIN 16
H1:PEM-MX_CHAN_17_TRAMP 16
H1:PEM-MX_CHAN_17_LIMIT 16
H1:PEM-MX_CHAN_17_OUTMON 16
H1:PEM-MX_CHAN_17_OUT16 16
H1:PEM-MX_CHAN_17_OUTPUT 16
H1:PEM-MX_CHAN_17_SW1 16
H1:PEM-MX_CHAN_17_SW2 16
H1:PEM-MX_CHAN_17_RSET 16
H1:PEM-MX_CHAN_17_SW1R 16
H1:PEM-MX_CHAN_17_SW2R 16
H1:PEM-MX_CHAN_17_SW1S 16
H1:PEM-MX_CHAN_17_SW2S 16
H1:PEM-MX_CHAN_18_INMON 16
H1:PEM-MX_CHAN_18_EXCMON 16
H1:PEM-MX_CHAN_18_OFFSET 16
H1:PEM-MX_CHAN_18_GAIN 16
H1:PEM-MX_CHAN_18_TRAMP 16
H1:PEM-MX_CHAN_18_LIMIT 16
H1:PEM-MX_CHAN_18_OUTMON 16
H1:PEM-MX_CHAN_18_OUT16 16
H1:PEM-MX_CHAN_18_OUTPUT 16
H1:PEM-MX_CHAN_18_SW1 16
H1:PEM-MX_CHAN_18_SW2 16
H1:PEM-MX_CHAN_18_RSET 16
H1:PEM-MX_CHAN_18_SW1R 16
H1:PEM-MX_CHAN_18_SW2R 16
H1:PEM-MX_CHAN_18_SW1S 16
H1:PEM-MX_CHAN_18_SW2S 16
H1:PEM-MX_CHAN_19_INMON 16
H1:PEM-MX_CHAN_19_EXCMON 16
H1:PEM-MX_CHAN_19_OFFSET 16
H1:PEM-MX_CHAN_19_GAIN 16
H1:PEM-MX_CHAN_19_TRAMP 16
H1:PEM-MX_CHAN_19_LIMIT 16
H1:PEM-MX_CHAN_19_OUTMON 16
H1:PEM-MX_CHAN_19_OUT16 16
H1:PEM-MX_CHAN_19_OUTPUT 16
H1:PEM-MX_CHAN_19_SW1 16
H1:PEM-MX_CHAN_19_SW2 16
H1:PEM-MX_CHAN_19_RSET 16
H1:PEM-MX_CHAN_19_SW1R 16
H1:PEM-MX_CHAN_19_SW2R 16
H1:PEM-MX_CHAN_19_SW1S 16
H1:PEM-MX_CHAN_19_SW2S 16
H1:PEM-MX_CHAN_20_INMON 16
H1:PEM-MX_CHAN_20_EXCMON 16
H1:PEM-MX_CHAN_20_OFFSET 16
H1:PEM-MX_CHAN_20_GAIN 16
H1:PEM-MX_CHAN_20_TRAMP 16
H1:PEM-MX_CHAN_20_LIMIT 16
H1:PEM-MX_CHAN_20_OUTMON 16
H1:PEM-MX_CHAN_20_OUT16 16
H1:PEM-MX_CHAN_20_OUTPUT 16
H1:PEM-MX_CHAN_20_SW1 16
H1:PEM-MX_CHAN_20_SW2 16
H1:PEM-MX_CHAN_20_RSET 16
H1:PEM-MX_CHAN_20_SW1R 16
H1:PEM-MX_CHAN_20_SW2R 16
H1:PEM-MX_CHAN_20_SW1S 16
H1:PEM-MX_CHAN_20_SW2S 16
H1:PEM-MX_CHAN_21_INMON 16
H1:PEM-MX_CHAN_21_EXCMON 16
H1:PEM-MX_CHAN_21_OFFSET 16
H1:PEM-MX_CHAN_21_GAIN 16
H1:PEM-MX_CHAN_21_TRAMP 16
H1:PEM-MX_CHAN_21_LIMIT 16
H1:PEM-MX_CHAN_21_OUTMON 16
H1:PEM-MX_CHAN_21_OUT16 16
H1:PEM-MX_CHAN_21_OUTPUT 16
H1:PEM-MX_CHAN_21_SW1 16
H1:PEM-MX_CHAN_21_SW2 16
H1:PEM-MX_CHAN_21_RSET 16
H1:PEM-MX_CHAN_21_SW1R 16
H1:PEM-MX_CHAN_21_SW2R 16
H1:PEM-MX_CHAN_21_SW1S 16
H1:PEM-MX_CHAN_21_SW2S 16
H1:PEM-MX_CHAN_22_INMON 16
H1:PEM-MX_CHAN_22_EXCMON 16
H1:PEM-MX_CHAN_22_OFFSET 16
H1:PEM-MX_CHAN_22_GAIN 16
H1:PEM-MX_CHAN_22_TRAMP 16
H1:PEM-MX_CHAN_22_LIMIT 16
H1:PEM-MX_CHAN_22_OUTMON 16
H1:PEM-MX_CHAN_22_OUT16 16
H1:PEM-MX_CHAN_22_OUTPUT 16
H1:PEM-MX_CHAN_22_SW1 16
H1:PEM-MX_CHAN_22_SW2 16
H1:PEM-MX_CHAN_22_RSET 16
H1:PEM-MX_CHAN_22_SW1R 16
H1:PEM-MX_CHAN_22_SW2R 16
H1:PEM-MX_CHAN_22_SW1S 16
H1:PEM-MX_CHAN_22_SW2S 16
H1:PEM-MX_CHAN_23_INMON 16
H1:PEM-MX_CHAN_23_EXCMON 16
H1:PEM-MX_CHAN_23_OFFSET 16
H1:PEM-MX_CHAN_23_GAIN 16
H1:PEM-MX_CHAN_23_TRAMP 16
H1:PEM-MX_CHAN_23_LIMIT 16
H1:PEM-MX_CHAN_23_OUTMON 16
H1:PEM-MX_CHAN_23_OUT16 16
H1:PEM-MX_CHAN_23_OUTPUT 16
H1:PEM-MX_CHAN_23_SW1 16
H1:PEM-MX_CHAN_23_SW2 16
H1:PEM-MX_CHAN_23_RSET 16
H1:PEM-MX_CHAN_23_SW1R 16
H1:PEM-MX_CHAN_23_SW2R 16
H1:PEM-MX_CHAN_23_SW1S 16
H1:PEM-MX_CHAN_23_SW2S 16
H1:PEM-MX_CHAN_24_INMON 16
H1:PEM-MX_CHAN_24_EXCMON 16
H1:PEM-MX_CHAN_24_OFFSET 16
H1:PEM-MX_CHAN_24_GAIN 16
H1:PEM-MX_CHAN_24_TRAMP 16
H1:PEM-MX_CHAN_24_LIMIT 16
H1:PEM-MX_CHAN_24_OUTMON 16
H1:PEM-MX_CHAN_24_OUT16 16
H1:PEM-MX_CHAN_24_OUTPUT 16
H1:PEM-MX_CHAN_24_SW1 16
H1:PEM-MX_CHAN_24_SW2 16
H1:PEM-MX_CHAN_24_RSET 16
H1:PEM-MX_CHAN_24_SW1R 16
H1:PEM-MX_CHAN_24_SW2R 16
H1:PEM-MX_CHAN_24_SW1S 16
H1:PEM-MX_CHAN_24_SW2S 16
H1:PEM-MX_CHAN_25_INMON 16
H1:PEM-MX_CHAN_25_EXCMON 16
H1:PEM-MX_CHAN_25_OFFSET 16
H1:PEM-MX_CHAN_25_GAIN 16
H1:PEM-MX_CHAN_25_TRAMP 16
H1:PEM-MX_CHAN_25_LIMIT 16
H1:PEM-MX_CHAN_25_OUTMON 16
H1:PEM-MX_CHAN_25_OUT16 16
H1:PEM-MX_CHAN_25_OUTPUT 16
H1:PEM-MX_CHAN_25_SW1 16
H1:PEM-MX_CHAN_25_SW2 16
H1:PEM-MX_CHAN_25_RSET 16
H1:PEM-MX_CHAN_25_SW1R 16
H1:PEM-MX_CHAN_25_SW2R 16
H1:PEM-MX_CHAN_25_SW1S 16
H1:PEM-MX_CHAN_25_SW2S 16
H1:PEM-MX_CHAN_26_INMON 16
H1:PEM-MX_CHAN_26_EXCMON 16
H1:PEM-MX_CHAN_26_OFFSET 16
H1:PEM-MX_CHAN_26_GAIN 16
H1:PEM-MX_CHAN_26_TRAMP 16
H1:PEM-MX_CHAN_26_LIMIT 16
H1:PEM-MX_CHAN_26_OUTMON 16
H1:PEM-MX_CHAN_26_OUT16 16
H1:PEM-MX_CHAN_26_OUTPUT 16
H1:PEM-MX_CHAN_26_SW1 16
H1:PEM-MX_CHAN_26_SW2 16
H1:PEM-MX_CHAN_26_RSET 16
H1:PEM-MX_CHAN_26_SW1R 16
H1:PEM-MX_CHAN_26_SW2R 16
H1:PEM-MX_CHAN_26_SW1S 16
H1:PEM-MX_CHAN_26_SW2S 16
H1:PEM-MX_CHAN_27_INMON 16
H1:PEM-MX_CHAN_27_EXCMON 16
H1:PEM-MX_CHAN_27_OFFSET 16
H1:PEM-MX_CHAN_27_GAIN 16
H1:PEM-MX_CHAN_27_TRAMP 16
H1:PEM-MX_CHAN_27_LIMIT 16
H1:PEM-MX_CHAN_27_OUTMON 16
H1:PEM-MX_CHAN_27_OUT16 16
H1:PEM-MX_CHAN_27_OUTPUT 16
H1:PEM-MX_CHAN_27_SW1 16
H1:PEM-MX_CHAN_27_SW2 16
H1:PEM-MX_CHAN_27_RSET 16
H1:PEM-MX_CHAN_27_SW1R 16
H1:PEM-MX_CHAN_27_SW2R 16
H1:PEM-MX_CHAN_27_SW1S 16
H1:PEM-MX_CHAN_27_SW2S 16
H1:PEM-MX_CHAN_29_INMON 16
H1:PEM-MX_CHAN_29_EXCMON 16
H1:PEM-MX_CHAN_29_OFFSET 16
H1:PEM-MX_CHAN_29_GAIN 16
H1:PEM-MX_CHAN_29_TRAMP 16
H1:PEM-MX_CHAN_29_LIMIT 16
H1:PEM-MX_CHAN_29_OUTMON 16
H1:PEM-MX_CHAN_29_OUT16 16
H1:PEM-MX_CHAN_29_OUTPUT 16
H1:PEM-MX_CHAN_29_SW1 16
H1:PEM-MX_CHAN_29_SW2 16
H1:PEM-MX_CHAN_29_RSET 16
H1:PEM-MX_CHAN_29_SW1R 16
H1:PEM-MX_CHAN_29_SW2R 16
H1:PEM-MX_CHAN_29_SW1S 16
H1:PEM-MX_CHAN_29_SW2S 16
H1:PEM-MX_CHAN_9_INMON 16
H1:PEM-MX_CHAN_9_EXCMON 16
H1:PEM-MX_CHAN_9_OFFSET 16
H1:PEM-MX_CHAN_9_GAIN 16
H1:PEM-MX_CHAN_9_TRAMP 16
H1:PEM-MX_CHAN_9_LIMIT 16
H1:PEM-MX_CHAN_9_OUTMON 16
H1:PEM-MX_CHAN_9_OUT16 16
H1:PEM-MX_CHAN_9_OUTPUT 16
H1:PEM-MX_CHAN_9_SW1 16
H1:PEM-MX_CHAN_9_SW2 16
H1:PEM-MX_CHAN_9_RSET 16
H1:PEM-MX_CHAN_9_SW1R 16
H1:PEM-MX_CHAN_9_SW2R 16
H1:PEM-MX_CHAN_9_SW1S 16
H1:PEM-MX_CHAN_9_SW2S 16
H1:PEM-MX_TIMING_IRIGB_INMON 16
H1:PEM-MX_TIMING_IRIGB_EXCMON 16
H1:PEM-MX_TIMING_IRIGB_OFFSET 16
H1:PEM-MX_TIMING_IRIGB_GAIN 16
H1:PEM-MX_TIMING_IRIGB_TRAMP 16
H1:PEM-MX_TIMING_IRIGB_LIMIT 16
H1:PEM-MX_TIMING_IRIGB_OUTMON 16
H1:PEM-MX_TIMING_IRIGB_OUT16 16
H1:PEM-MX_TIMING_IRIGB_OUTPUT 16
H1:PEM-MX_TIMING_IRIGB_SW1 16
H1:PEM-MX_TIMING_IRIGB_SW2 16
H1:PEM-MX_TIMING_IRIGB_RSET 16
H1:PEM-MX_TIMING_IRIGB_SW1R 16
H1:PEM-MX_TIMING_IRIGB_SW2R 16
H1:PEM-MX_TIMING_IRIGB_SW1S 16
H1:PEM-MX_TIMING_IRIGB_SW2S 16
H1:PEM-VAULT_SEIS_1030X195Y_STS2_Z_BLRMS_INPUT_INMON 16
H1:PEM-VAULT_SEIS_1030X195Y_STS2_Z_BLRMS_INPUT_EXCMON 16
H1:PEM-VAULT_SEIS_1030X195Y_STS2_Z_BLRMS_INPUT_OFFSET 16
H1:PEM-VAULT_SEIS_1030X195Y_STS2_Z_BLRMS_INPUT_GAIN 16
H1:PEM-VAULT_SEIS_1030X195Y_STS2_Z_BLRMS_INPUT_TRAMP 16
H1:PEM-VAULT_SEIS_1030X195Y_STS2_Z_BLRMS_INPUT_LIMIT 16
H1:PEM-VAULT_SEIS_1030X195Y_STS2_Z_BLRMS_INPUT_OUTMON 16
H1:PEM-VAULT_SEIS_1030X195Y_STS2_Z_BLRMS_INPUT_OUT16 16
H1:PEM-VAULT_SEIS_1030X195Y_STS2_Z_BLRMS_INPUT_OUTPUT 16
H1:PEM-VAULT_SEIS_1030X195Y_STS2_Z_BLRMS_INPUT_SW1 16
H1:PEM-VAULT_SEIS_1030X195Y_STS2_Z_BLRMS_INPUT_SW2 16
H1:PEM-VAULT_SEIS_1030X195Y_STS2_Z_BLRMS_INPUT_RSET 16
H1:PEM-VAULT_SEIS_1030X195Y_STS2_Z_BLRMS_INPUT_SW1R 16
H1:PEM-VAULT_SEIS_1030X195Y_STS2_Z_BLRMS_INPUT_SW2R 16
H1:PEM-VAULT_SEIS_1030X195Y_STS2_Z_BLRMS_INPUT_SW1S 16
H1:PEM-VAULT_SEIS_1030X195Y_STS2_Z_BLRMS_INPUT_SW2S 16
H1:PEM-VAULT_SEIS_1030X195Y_STS2_Y_BLRMS_INPUT_INMON 16
H1:PEM-VAULT_SEIS_1030X195Y_STS2_Y_BLRMS_INPUT_EXCMON 16
H1:PEM-VAULT_SEIS_1030X195Y_STS2_Y_BLRMS_INPUT_OFFSET 16
H1:PEM-VAULT_SEIS_1030X195Y_STS2_Y_BLRMS_INPUT_GAIN 16
H1:PEM-VAULT_SEIS_1030X195Y_STS2_Y_BLRMS_INPUT_TRAMP 16
H1:PEM-VAULT_SEIS_1030X195Y_STS2_Y_BLRMS_INPUT_LIMIT 16
H1:PEM-VAULT_SEIS_1030X195Y_STS2_Y_BLRMS_INPUT_OUTMON 16
H1:PEM-VAULT_SEIS_1030X195Y_STS2_Y_BLRMS_INPUT_OUT16 16
H1:PEM-VAULT_SEIS_1030X195Y_STS2_Y_BLRMS_INPUT_OUTPUT 16
H1:PEM-VAULT_SEIS_1030X195Y_STS2_Y_BLRMS_INPUT_SW1 16
H1:PEM-VAULT_SEIS_1030X195Y_STS2_Y_BLRMS_INPUT_SW2 16
H1:PEM-VAULT_SEIS_1030X195Y_STS2_Y_BLRMS_INPUT_RSET 16
H1:PEM-VAULT_SEIS_1030X195Y_STS2_Y_BLRMS_INPUT_SW1R 16
H1:PEM-VAULT_SEIS_1030X195Y_STS2_Y_BLRMS_INPUT_SW2R 16
H1:PEM-VAULT_SEIS_1030X195Y_STS2_Y_BLRMS_INPUT_SW1S 16
H1:PEM-VAULT_SEIS_1030X195Y_STS2_Y_BLRMS_INPUT_SW2S 16
H1:PEM-VAULT_SEIS_1030X195Y_STS2_X_BLRMS_INPUT_INMON 16
H1:PEM-VAULT_SEIS_1030X195Y_STS2_X_BLRMS_INPUT_EXCMON 16
H1:PEM-VAULT_SEIS_1030X195Y_STS2_X_BLRMS_INPUT_OFFSET 16
H1:PEM-VAULT_SEIS_1030X195Y_STS2_X_BLRMS_INPUT_GAIN 16
H1:PEM-VAULT_SEIS_1030X195Y_STS2_X_BLRMS_INPUT_TRAMP 16
H1:PEM-VAULT_SEIS_1030X195Y_STS2_X_BLRMS_INPUT_LIMIT 16
H1:PEM-VAULT_SEIS_1030X195Y_STS2_X_BLRMS_INPUT_OUTMON 16
H1:PEM-VAULT_SEIS_1030X195Y_STS2_X_BLRMS_INPUT_OUT16 16
H1:PEM-VAULT_SEIS_1030X195Y_STS2_X_BLRMS_INPUT_OUTPUT 16
H1:PEM-VAULT_SEIS_1030X195Y_STS2_X_BLRMS_INPUT_SW1 16
H1:PEM-VAULT_SEIS_1030X195Y_STS2_X_BLRMS_INPUT_SW2 16
H1:PEM-VAULT_SEIS_1030X195Y_STS2_X_BLRMS_INPUT_RSET 16
H1:PEM-VAULT_SEIS_1030X195Y_STS2_X_BLRMS_INPUT_SW1R 16
H1:PEM-VAULT_SEIS_1030X195Y_STS2_X_BLRMS_INPUT_SW2R 16
H1:PEM-VAULT_SEIS_1030X195Y_STS2_X_BLRMS_INPUT_SW1S 16
H1:PEM-VAULT_SEIS_1030X195Y_STS2_X_BLRMS_INPUT_SW2S 16
H1:PEM-MX_DCU_ID 16
H1:PEM-MX_SEIS_VEA_FLOOR_Z_BLRMS_3HZ10 16
H1:PEM-MX_SEIS_VEA_FLOOR_Z_BLRMS_30MHZ100 16
H1:PEM-MX_SEIS_VEA_FLOOR_Z_BLRMS_30HZ100 16
H1:PEM-MX_SEIS_VEA_FLOOR_Z_BLRMS_300MHZ1000 16
H1:PEM-MX_SEIS_VEA_FLOOR_Z_BLRMS_1HZ3 16
H1:PEM-MX_SEIS_VEA_FLOOR_Z_BLRMS_10HZ30 16
H1:PEM-MX_SEIS_VEA_FLOOR_Z_BLRMS_100MHZ300 16
H1:PEM-MX_SEIS_VEA_FLOOR_Z_BLRMS_0MHZ30 16
H1:PEM-MX_SEIS_VEA_FLOOR_Y_BLRMS_3HZ10 16
H1:PEM-MX_SEIS_VEA_FLOOR_Y_BLRMS_30MHZ100 16
H1:PEM-MX_SEIS_VEA_FLOOR_Y_BLRMS_30HZ100 16
H1:PEM-MX_SEIS_VEA_FLOOR_Y_BLRMS_300MHZ1000 16
H1:PEM-MX_SEIS_VEA_FLOOR_Y_BLRMS_1HZ3 16
H1:PEM-MX_SEIS_VEA_FLOOR_Y_BLRMS_10HZ30 16
H1:PEM-MX_SEIS_VEA_FLOOR_Y_BLRMS_100MHZ300 16
H1:PEM-MX_SEIS_VEA_FLOOR_Y_BLRMS_0MHZ30 16
H1:PEM-MX_SEIS_VEA_FLOOR_X_BLRMS_3HZ10 16
H1:PEM-MX_SEIS_VEA_FLOOR_X_BLRMS_30MHZ100 16
H1:PEM-MX_SEIS_VEA_FLOOR_X_BLRMS_30HZ100 16
H1:PEM-MX_SEIS_VEA_FLOOR_X_BLRMS_300MHZ1000 16
H1:PEM-MX_SEIS_VEA_FLOOR_X_BLRMS_1HZ3 16
H1:PEM-MX_SEIS_VEA_FLOOR_X_BLRMS_10HZ30 16
H1:PEM-MX_SEIS_VEA_FLOOR_X_BLRMS_100MHZ300 16
H1:PEM-MX_SEIS_VEA_FLOOR_X_BLRMS_0MHZ30 16
H1:PEM-VAULT_SEIS_1030X195Y_STS2_Z_BLRMS_3HZ10 16
H1:PEM-VAULT_SEIS_1030X195Y_STS2_Z_BLRMS_30MHZ100 16
H1:PEM-VAULT_SEIS_1030X195Y_STS2_Z_BLRMS_30HZ100 16
H1:PEM-VAULT_SEIS_1030X195Y_STS2_Z_BLRMS_300MHZ1000 16
H1:PEM-VAULT_SEIS_1030X195Y_STS2_Z_BLRMS_1HZ3 16
H1:PEM-VAULT_SEIS_1030X195Y_STS2_Z_BLRMS_10HZ30 16
H1:PEM-VAULT_SEIS_1030X195Y_STS2_Z_BLRMS_100MHZ300 16
H1:PEM-VAULT_SEIS_1030X195Y_STS2_Z_BLRMS_0MHZ30 16
H1:PEM-VAULT_SEIS_1030X195Y_STS2_Y_BLRMS_3HZ10 16
H1:PEM-VAULT_SEIS_1030X195Y_STS2_Y_BLRMS_30MHZ100 16
H1:PEM-VAULT_SEIS_1030X195Y_STS2_Y_BLRMS_30HZ100 16
H1:PEM-VAULT_SEIS_1030X195Y_STS2_Y_BLRMS_300MHZ1000 16
H1:PEM-VAULT_SEIS_1030X195Y_STS2_Y_BLRMS_1HZ3 16
H1:PEM-VAULT_SEIS_1030X195Y_STS2_Y_BLRMS_10HZ30 16
H1:PEM-VAULT_SEIS_1030X195Y_STS2_Y_BLRMS_100MHZ300 16
H1:PEM-VAULT_SEIS_1030X195Y_STS2_Y_BLRMS_0MHZ30 16
H1:PEM-VAULT_SEIS_1030X195Y_STS2_X_BLRMS_3HZ10 16
H1:PEM-VAULT_SEIS_1030X195Y_STS2_X_BLRMS_30MHZ100 16
H1:PEM-VAULT_SEIS_1030X195Y_STS2_X_BLRMS_30HZ100 16
H1:PEM-VAULT_SEIS_1030X195Y_STS2_X_BLRMS_300MHZ1000 16
H1:PEM-VAULT_SEIS_1030X195Y_STS2_X_BLRMS_1HZ3 16
H1:PEM-VAULT_SEIS_1030X195Y_STS2_X_BLRMS_10HZ30 16
H1:PEM-VAULT_SEIS_1030X195Y_STS2_X_BLRMS_100MHZ300 16
H1:PEM-VAULT_SEIS_1030X195Y_STS2_X_BLRMS_0MHZ30 16
H1:PEM-VAULT_MAG_1030X195Y_COIL_X_MON 16
H1:PEM-VAULT_MAG_1030X195Y_COIL_Y_MON 16
H1:PEM-VAULT_MAG_1030X195Y_COIL_Z_MON 16
H1:PEM-CS_ACC_BEAMTUBE_YMAN_Z_DQ 8192
H1:PEM-CS_ACC_BSC1_ITMY_X_DQ 8192
H1:PEM-CS_ACC_BSC1_ITMY_Y_DQ 8192
H1:PEM-CS_ACC_BSC1_ITMY_Z_DQ 8192
H1:PEM-CS_ACC_EBAY_FLOOR_Z_DQ 8192
H1:PEM-CS_ACC_FLOOR_YCRYO_Z_DQ 8192
H1:PEM-CS_ACC_OPLEV_ITMY_X_DQ 8192
H1:PEM-CS_MAG_EBAY_SEIRACK_QUAD_SUM_DQ 4096
H1:PEM-CS_MAG_EBAY_SEIRACK_X_DQ 4096
H1:PEM-CS_MAG_EBAY_SEIRACK_Y_DQ 4096
H1:PEM-CS_MAG_EBAY_SEIRACK_Z_DQ 4096
H1:PEM-CS_MAG_EBAY_SUSRACK_QUAD_SUM_DQ 4096
H1:PEM-CS_MAG_EBAY_SUSRACK_X_DQ 4096
H1:PEM-CS_MAG_EBAY_SUSRACK_Y_DQ 4096
H1:PEM-CS_MAG_EBAY_SUSRACK_Z_DQ 4096
H1:PEM-CS_MAG_LVEA_VERTEX_QUAD_SUM_DQ 4096
H1:PEM-CS_MAG_LVEA_VERTEX_X_DQ 4096
H1:PEM-CS_MAG_LVEA_VERTEX_Y_DQ 4096
H1:PEM-CS_MAG_LVEA_VERTEX_Z_DQ 4096
H1:PEM-CS_MIC_EBAY_RACKS_DQ 16384
H1:PEM-CS_MIC_LVEA_VERTEX_DQ 16384
H1:PEM-CS_MIC_YMAN_SPOOL_DQ 16384
H1:PEM-CS_SEIS_LVEA_VERTEX_QUAD_SUM_DQ 1024
H1:PEM-CS_SEIS_LVEA_VERTEX_X_DQ 1024
H1:PEM-CS_SEIS_LVEA_VERTEX_Y_DQ 1024
H1:PEM-CS_SEIS_LVEA_VERTEX_Z_DQ 1024
H1:PEM-CS_TILT_LVEA_VERTEX_T_DQ 512
H1:PEM-CS_TILT_LVEA_VERTEX_X_DQ 1024
H1:PEM-CS_TILT_LVEA_VERTEX_Y_DQ 1024
H1:PEM-EY_ACC_EBAY_FLOOR_Z_DQ 8192
H1:PEM-EY_ACC_ISCEY_TRANS_X_DQ 8192
H1:PEM-EY_ACC_OPLEV_ETMY_X_DQ 8192
H1:PEM-EY_MAG_EBAY_SEIRACK_QUAD_SUM_DQ 4096
H1:PEM-EY_MAG_EBAY_SEIRACK_X_DQ 4096
H1:PEM-EY_MAG_EBAY_SEIRACK_Y_DQ 4096
H1:PEM-EY_MAG_EBAY_SEIRACK_Z_DQ 4096
H1:PEM-EY_MAG_EBAY_SUSRACK_QUAD_SUM_DQ 4096
H1:PEM-EY_MAG_EBAY_SUSRACK_X_DQ 4096
H1:PEM-EY_MAG_EBAY_SUSRACK_Y_DQ 4096
H1:PEM-EY_MAG_EBAY_SUSRACK_Z_DQ 4096
H1:PEM-EY_MAG_VEA_FLOOR_QUAD_SUM_DQ 4096
H1:PEM-EY_MAG_VEA_FLOOR_X_DQ 4096
H1:PEM-EY_MAG_VEA_FLOOR_Y_DQ 4096
H1:PEM-EY_MAG_VEA_FLOOR_Z_DQ 4096
H1:PEM-EY_MIC_EBAY_RACKS_DQ 16384
H1:PEM-EY_SEIS_VEA_FLOOR_QUAD_SUM_DQ 1024
H1:PEM-EY_SEIS_VEA_FLOOR_X_DQ 1024
H1:PEM-EY_SEIS_VEA_FLOOR_Y_DQ 1024
H1:PEM-EY_SEIS_VEA_FLOOR_Z_DQ 1024
H1:PEM-EY_TILT_VEA_FLOOR_T_DQ 512
H1:PEM-EY_TILT_VEA_FLOOR_X_DQ 1024
H1:PEM-EY_TILT_VEA_FLOOR_Y_DQ 1024
H1:PEM-MX_SEIS_VEA_FLOOR_QUAD_SUM_DQ 1024
H1:PEM-MX_SEIS_VEA_FLOOR_X_DQ 1024
H1:PEM-MX_SEIS_VEA_FLOOR_Y_DQ 1024
H1:PEM-MX_SEIS_VEA_FLOOR_Z_DQ 1024
H1:PEM-VAULT_MAG_1030X195Y_COIL_QUAD_SUM_DQ 4096
H1:PEM-VAULT_MAG_1030X195Y_COIL_X_DQ 4096
H1:PEM-VAULT_MAG_1030X195Y_COIL_Y_DQ 4096
H1:PEM-VAULT_MAG_1030X195Y_COIL_Z_DQ 4096
H1:PEM-VAULT_SEIS_1030X195Y_STS2_QUAD_SUM_DQ 1024
H1:PEM-VAULT_SEIS_1030X195Y_STS2_X_DQ 1024
H1:PEM-VAULT_SEIS_1030X195Y_STS2_Y_DQ 1024
H1:PEM-VAULT_SEIS_1030X195Y_STS2_Z_DQ 1024
