831890953 831890970
832326791 832326808
832485190 832485207
832713503 832713520
832856677 832856694
833537747 833537764
833558491 833558508
834579512 834579529
834874400 834874417
834970443 834970460
835107757 835107774
835275869 835275886
835332025 835332042
835479395 835479412
835548270 835548287
835555559 835555576
836164332 836164349
836167237 836167254
836236114 836236131
836236655 836236672
836237176 836237193
836560932 836560949
836564666 836564683
837155160 837155177
837155185 837155202
837155284 837155301
837155460 837155477
837373609 837373626
837509132 837509149
837592818 837592835
837597491 837597508
838121878 838121895
838130905 838130922
838200074 838200091
838375618 838375635
838428896 838428913
838450901 838450918
838598561 838598578
838601418 838601435
839018526 839018543
839164190 839164207
839264453 839264470
839270803 839270820
839289172 839289189
839345656 839345673
839359552 839359569
839370754 839370771
840130899 840130916
840314727 840314744
840825402 840825419
840830081 840830098
841231047 841231064
841251687 841251704
841469738 841469755
841476642 841476659
841528426 841528443
841966237 841966254
842272442 842272459
842447043 842447060
842574698 842574715
842577039 842577056
842627980 842627997
842636811 842636828
842660295 842660312
842772586 842772603
842791860 842791877
842800761 842800778
842834610 842834627
842863210 842863227
842871725 842871742
842881699 842881716
842947621 842947638
842978889 842978906
842990935 842990952
843000767 843000784
843148419 843148436
843171827 843171844
843199353 843199370
843236752 843236769
843261852 843261869
843791642 843791659
844221661 844221678
847002077 847002094
847197556 847197573
