0.001 5.1984e-44
2 5.1984e-44
4 2.5465e-44
6 1.6774e-44
8 1.2474e-44
10 9.9139e-45
12 8.2172e-45
14 7.0113e-45
16 6.1107e-45
18 5.4129e-45
20.1 4.8315e-45
20.5 4.7345e-45
20.9 4.6413e-45
21.3 4.5515e-45
21.7 4.4652e-45
22.1 4.382e-45
22.5 4.3018e-45
22.9 4.2245e-45
23.3 4.1498e-45
23.8 4.0601e-45
24.2 3.991e-45
24.7 3.9079e-45
25.1 3.8438e-45
25.6 3.7665e-45
26.1 3.6922e-45
26.5 3.6349e-45
27 3.5656e-45
27.5 3.4989e-45
28.1 3.422e-45
28.6 3.3604e-45
29.1 3.301e-45
29.6 3.2436e-45
30.2 3.1772e-45
30.8 3.1135e-45
31.3 3.0623e-45
31.9 3.0031e-45
32.5 2.946e-45
33.1 2.891e-45
33.7 2.838e-45
34.4 2.7786e-45
35 2.7296e-45
35.6 2.6822e-45
36.3 2.629e-45
37 2.5778e-45
37.7 2.5285e-45
38.4 2.4811e-45
39.1 2.4354e-45
39.8 2.3913e-45
40.6 2.3428e-45
41.3 2.3019e-45
42.1 2.2569e-45
42.9 2.2136e-45
43.7 2.1719e-45
44.5 2.1317e-45
45.3 2.0929e-45
46.1 2.0555e-45
47 2.015e-45
47.9 1.9761e-45
48.8 1.9386e-45
49.7 1.9024e-45
50.6 1.8676e-45
51.5 1.834e-45
52.5 1.798e-45
53.5 1.7635e-45
54.5 1.7301e-45
55.5 1.6981e-45
56.5 1.6671e-45
57.5 1.6373e-45
58.6 1.6057e-45
59.7 1.5752e-45
60.8 1.5459e-45
61.9 1.5176e-45
63.1 1.4879e-45
64.3 1.4593e-45
65.5 1.4318e-45
66.7 1.4053e-45
67.9 1.3797e-45
69.2 1.353e-45
70.5 1.3274e-45
71.8 1.3026e-45
73.1 1.2788e-45
74.5 1.254e-45
75.9 1.2302e-45
77.3 1.2073e-45
78.7 1.1852e-45
80.2 1.1624e-45
81.7 1.1404e-45
83.2 1.1192e-45
84.7 1.0988e-45
86.3 1.0779e-45
87.9 1.0577e-45
89.5 1.0382e-45
91.2 1.0183e-45
92.9 9.9912e-46
94.6 9.8064e-46
96.4 9.618e-46
98.2 9.4365e-46
100 9.2617e-46
102 9.0748e-46
104 8.8951e-46
106 8.7224e-46
108 8.5561e-46
110 8.396e-46
112 8.2417e-46
114 8.0929e-46
116 7.9493e-46
118 7.8106e-46
120 7.6766e-46
122 7.547e-46
125 7.3606e-46
127 7.2413e-46
129 7.1258e-46
132 6.9591e-46
134 6.8522e-46
137 6.6977e-46
139 6.5985e-46
142 6.4551e-46
145 6.3176e-46
147 6.2291e-46
150 6.1009e-46
153 6.1504e-46
156 6.1504e-46
158 6.1009e-46
161 6.1009e-46
164 6.1009e-46
167 6.1504e-46
171 6.2001e-46
174 6.25e-46
177 6.3504e-46
180 6.4516e-46
184 6.5536e-46
187 6.6564e-46
191 6.76e-46
194 6.9169e-46
198 7.0756e-46
201 7.2361e-46
205 7.4529e-46
209 7.6176e-46
213 7.84e-46
217 8.0656e-46
221 8.2944e-46
225 8.5264e-46
229 8.8209e-46
233 9.1204e-46
238 9.3636e-46
242 9.6721e-46
247 9.9856e-46
251 1.0368e-45
256 1.0693e-45
261 1.1089e-45
265 1.1424e-45
270 1.1834e-45
275 1.225e-45
281 1.2745e-45
286 1.3177e-45
291 1.3616e-45
296 1.4138e-45
302 1.4669e-45
308 1.521e-45
313 1.5761e-45
319 1.6322e-45
325 1.6892e-45
331 1.7556e-45
337 1.8148e-45
344 1.8836e-45
350 1.9536e-45
356 2.025e-45
363 2.0976e-45
370 2.1809e-45
377 2.2563e-45
384 2.3426e-45
391 2.4305e-45
398 2.52e-45
406 2.6112e-45
413 2.7144e-45
421 2.8196e-45
429 2.916e-45
437 3.025e-45
445 3.1472e-45
453 3.2604e-45
461 3.3872e-45
470 3.5046e-45
479 3.6361e-45
488 3.77e-45
497 3.9188e-45
506 4.0577e-45
515 4.212e-45
525 4.3692e-45
535 4.5428e-45
545 4.706e-45
555 4.886e-45
565 5.0694e-45
575 5.2563e-45
586 5.4612e-45
597 5.655e-45
608 5.8676e-45
619 6.0996e-45
631 6.3203e-45
643 6.561e-45
655 6.8062e-45
667 7.056e-45
679 7.3274e-45
692 7.6038e-45
705 7.8854e-45
718 8.1722e-45
731 8.4824e-45
745 8.7984e-45
759 9.1394e-45
773 9.4868e-45
787 9.8406e-45
802 1.0201e-44
817 1.0609e-44
832 1.1025e-44
847 1.1449e-44
863 1.1881e-44
879 1.2321e-44
895 1.2769e-44
912 1.3225e-44
929 1.3689e-44
946 1.4161e-44
964 1.4641e-44
982 1.5376e-44
1000 1.5876e-44
1020 1.6384e-44
1040 1.7161e-44
1060 1.7689e-44
1080 1.8496e-44
1100 1.9044e-44
1120 1.9881e-44
1140 2.0449e-44
1160 2.1316e-44
1180 2.2201e-44
1200 2.2801e-44
1220 2.3716e-44
1250 2.4649e-44
1270 2.56e-44
1290 2.6569e-44
1320 2.7556e-44
1340 2.8561e-44
1370 2.9584e-44
1390 3.0976e-44
1420 3.2041e-44
1450 3.3124e-44
1470 3.4596e-44
1500 3.5721e-44
1530 3.6864e-44
1560 3.8416e-44
1580 4e-44
1610 4.1209e-44
1640 4.2849e-44
1670 4.4521e-44
1710 4.6225e-44
1740 4.7961e-44
1770 4.9729e-44
1800 5.1529e-44
1840 5.3361e-44
1870 5.5696e-44
1910 5.76e-44
1940 6.0025e-44
1980 6.2001e-44
2010 6.4516e-44
2050 6.6564e-44
2090 6.9169e-44
2130 7.1824e-44
2170 7.4529e-44
2210 7.7284e-44
2250 8.0089e-44
2290 8.3521e-44
2330 8.6436e-44
2380 8.9401e-44
2420 9.3025e-44
2470 9.6721e-44
2510 9.9856e-44
2560 1.0368e-43
2610 1.0758e-43
2650 1.1156e-43
2700 1.1628e-43
2750 1.2041e-43
2810 1.2461e-43
2860 1.296e-43
2910 1.3469e-43
2960 1.3988e-43
3020 1.4516e-43
3080 1.5054e-43
3130 1.5603e-43
3190 1.616e-43
3250 1.681e-43
3310 1.7389e-43
3370 1.8063e-43
3440 1.8749e-43
3500 1.9448e-43
3560 2.016e-43
3630 2.0885e-43
3700 2.1716e-43
3770 2.2562e-43
3840 2.3329e-43
3910 2.4206e-43
3980 2.52e-43
4060 2.6112e-43
4130 2.704e-43
4210 2.809e-43
4290 2.916e-43
4370 3.025e-43
4450 3.136e-43
4530 3.2604e-43
4610 3.3756e-43
4700 3.5046e-43
4790 3.6361e-43
4880 3.77e-43
4970 3.9188e-43
5060 4.0577e-43
5150 4.212e-43
5250 4.3692e-43
5350 4.5428e-43
5450 4.706e-43
5550 4.886e-43
5650 5.0694e-43
5750 5.2562e-43
5860 5.4612e-43
5970 5.655e-43
6080 5.8676e-43
6190 6.084e-43
6310 6.3203e-43
6430 6.561e-43
6550 6.8062e-43
6670 7.056e-43
6790 7.3274e-43
6920 7.6038e-43
7050 7.8854e-43
7180 8.1722e-43
7310 8.4824e-43
7450 8.7984e-43
7590 9.1394e-43
7730 9.4868e-43
7870 9.8406e-43
8020 1.0201e-42
8170 1.0609e-42
8320 1.1025e-42
8470 1.1449e-42
8630 1.1881e-42
8790 1.2321e-42
8950 1.2769e-42
9120 1.3225e-42
9290 1.3689e-42
9460 1.4161e-42
9640 1.4641e-42
9820 1.5376e-42
