815403135 815403136
815412895 815412897
815580748 815580750
815585329 815585331
815585917 815585918
815586444 815586447
815586555 815586556
815590208 815590209
815592256 815592258
815592384 815592386
815757707 815757709
815758212 815758213
815773383 815773384
815775742 815775744
815776495 815776497
815776886 815776887
815783311 815783313
815795433 815795434
815798537 815798539
815805565 815805567
815836134 815836136
815889052 815889054
815890663 815890665
815902073 815902075
815913210 815913211
815913217 815913218
815917030 815917032
815927381 815927384
815928393 815928395
815931086 815931088
815962836 815962838
815962841 815962842
815965319 815965321
815966106 815966108
815971712 815971713
815972925 815972926
815988454 815988455
816002527 816002528
816002533 816002534
816003234 816003236
816019181 816019182
816019351 816019352
816073000 816073002
816095868 816095869
816099177 816099179
816099189 816099191
816103347 816103348
816183195 816183196
816185399 816185401
816189819 816189820
816192344 816192345
816192453 816192454
816199158 816199160
816200695 816200697
816200818 816200820
816203332 816203333
816203335 816203337
816207630 816207632
816208498 816208499
816209619 816209621
816211869 816211871
816212188 816212189
816214132 816214134
816214256 816214258
816215005 816215007
816215803 816215804
816271649 816271651
816277107 816277108
816280892 816280935
816285052 816285054
816291559 816291562
816353621 816353623
816353624 816353626
816360309 816360310
816363169 816363171
816363871 816363872
816369030 816369032
816384435 816384437
816384440 816384441
816390301 816390302
816394515 816394517
816430827 816430829
816430832 816430834
816439321 816439322
816445783 816445784
816448833 816448834
816453229 816453231
816457127 816457130
816457649 816457650
816469875 816469877
816471738 816471739
816481475 816481477
816493423 816493425
816493578 816493579
816526769 816526770
816535116 816535117
816540896 816540898
816548611 816548612
816563181 816563182
816572139 816572141
816572183 816572184
816623335 816623337
816626701 816626703
816630187 816630189
816633689 816633691
816635159 816635161
816636906 816636908
816707756 816707758
816708386 816708388
816807238 816807240
816814202 816814203
816818429 816818432
816823633 816823635
816823638 816823639
816892478 816892479
816901156 816901158
816908940 816908943
816914024 816914026
816922517 816922519
816946986 816946988
816952168 816952169
816962660 816962662
816969492 816969493
816971165 816971167
816977576 816977578
817018554 817018555
817068264 817068265
817073859 817073861
817077421 817077423
817077862 817077863
817080471 817080473
817080531 817080533
817082157 817082159
817103848 817103849
817138138 817138140
817178317 817178319
817224066 817224068
817224069 817224070
817232026 817232027
817237070 817237072
817237313 817237315
817237684 817237686
817238893 817238894
817243368 817243369
817245946 817245948
817252457 817252459
817259618 817259620
817267808 817267809
817291160 817291161
817312621 817312622
817314489 817314490
817314549 817314551
817334289 817334291
817340747 817340749
817347032 817347034
817351055 817351057
817353363 817353364
817362476 817362477
817398365 817398367
817404999 817405001
817412739 817412741
817417665 817417667
817419802 817419804
817423382 817423383
817425752 817425753
817442434 817442436
817492567 817492568
817494022 817494024
817496167 817496169
817503241 817503243
817510279 817510281
817549488 817549490
817551344 817551346
817552748 817552749
817564371 817564372
817569552 817569553
817570711 817570712
817575002 817575004
817577236 817577237
817577581 817577582
817592584 817592585
817600286 817600287
817606493 817606495
817662198 817662200
817682955 817682956
817687097 817687099
817688563 817688565
817707372 817707374
817770794 817770796
817770797 817770798
817781843 817781844
817824457 817824459
817839360 817839362
817844323 817844326
817845367 817845369
817852414 817852416
817859422 817859424
817870639 817870641
817915218 817915219
817940320 817940322
817943229 817943231
817943233 817943234
817978571 817978573
818006474 818006476
818034386 818034387
818037017 818037019
818037020 818037022
818059295 818059296
818077212 818077213
818093543 818093544
818098616 818098618
818098619 818098620
818112842 818112843
818145095 818145097
818161430 818161431
818172855 818172857
818182072 818182074
818182082 818182083
818238926 818238927
818261522 818261524
818267553 818267554
818286926 818286928
818291459 818291461
818322391 818322393
818343193 818343195
818345496 818345498
818346866 818346868
818356320 818356323
818365826 818365827
818370728 818370729
818407409 818407411
818426544 818426546
818439003 818439005
818449337 818449338
818454115 818454117
818457167 818457168
818457169 818457171
818460091 818460092
818479731 818479732
818522047 818522049
818522050 818522052
818524805 818524807
818548889 818548891
818551038 818551039
818575729 818575730
818604216 818604218
818616821 818616823
818616825 818616826
818635045 818635047
818636580 818636582
818641135 818641136
818645237 818645240
818649507 818649508
818654700 818654702
818677634 818677636
818695232 818695233
818695234 818695235
818712060 818712061
818715348 818715349
818718060 818718061
818719633 818719634
818723648 818723650
818728439 818728440
818768759 818768760
818790363 818790364
818793817 818793819
818800616 818800617
818805537 818805538
818812419 818812420
818817036 818817037
818860256 818860257
818878586 818878588
818883231 818883233
818885400 818885401
818888298 818888299
818901414 818901415
818911870 818911871
818917846 818917847
818945604 818945606
818952386 818952387
818954320 818954321
818969167 818969170
819028049 819028051
819030088 819030089
819042920 819042922
819050043 819050045
819055265 819055267
819057931 819057933
819060222 819060223
819061928 819061929
819062828 819062830
819066640 819066642
819077014 819077015
819091601 819091602
819093886 819093888
819094505 819094506
819104314 819104316
819113466 819113468
819128036 819128038
819144605 819144607
819147017 819147018
819185292 819185293
819201811 819201812
819210044 819210046
819210048 819210050
819211316 819211318
819216116 819216117
819218623 819218624
819226617 819226618
819228491 819228492
819230128 819230130
819269460 819269461
819292653 819292655
819295077 819295079
819313080 819313081
819316040 819316042
819317115 819317117
819324678 819324679
819325388 819325390
819358314 819358315
819362043 819362044
819362643 819362644
819370164 819370166
819377830 819377831
819377833 819377834
819380146 819380147
819392376 819392377
819404714 819404715
819409238 819409240
819410253 819410254
819418800 819418802
819424103 819424104
819468372 819468373
819480761 819480762
819555934 819555936
819560095 819560097
819573194 819573195
819579927 819579928
819600238 819600239
819604128 819604129
819640861 819640862
819661346 819661347
819697644 819697646
819729093 819729094
819734746 819734748
819756312 819756314
819760371 819760373
819790033 819790034
819801999 819802001
819825403 819825404
819828245 819828247
819837762 819837763
819841253 819841254
819842655 819842656
819847154 819847155
819849475 819849477
819850783 819850785
819881027 819881028
819887416 819887417
819894217 819894218
819901752 819901754
819909125 819909127
819913630 819913632
819913633 819913635
819914474 819914479
819916252 819916254
819922510 819922512
819927321 819927322
819930871 819930873
819941674 819941676
819963916 819963918
819966010 819966011
819968536 819968537
819977551 819977553
819979297 819979298
819983921 819983924
820001765 820001766
820002955 820002957
820051548 820051550
820052975 820052976
820054718 820054719
820060529 820060530
820063003 820063004
820087102 820087104
820097607 820097609
820100979 820100980
820103367 820103368
820106732 820106733
820111800 820111802
820114076 820114077
820114171 820114172
820139451 820139452
820141600 820141601
820144404 820144405
820147287 820147289
820148564 820148565
820148766 820148767
820151000 820151001
820157114 820157116
820172006 820172008
820173981 820173982
820175694 820175695
820194265 820194266
820199657 820199659
820210682 820210683
820218668 820218669
820250490 820250492
820273452 820273453
820275930 820275931
820284795 820284796
820301972 820301974
820304495 820304497
820316391 820316392
820321195 820321196
820322265 820322267
820322269 820322270
820327239 820327241
820340203 820340205
820364672 820364673
820375121 820375122
820380199 820380200
820382002 820382003
820399031 820399032
820420565 820420567
820420569 820420570
820423010 820423012
820424394 820424395
820426295 820426296
820429982 820429983
820433760 820433761
820438510 820438511
820443261 820443262
820450962 820450964
820473245 820473246
820479592 820479594
820480379 820480383
820481447 820481449
820507981 820507983
820510676 820510677
820522531 820522532
820522781 820522782
820528762 820528763
820539408 820539409
820544857 820544859
820554556 820554558
820562897 820562899
820590106 820590108
820608080 820608082
820608084 820608085
820608182 820608184
820608185 820608186
820608619 820608620
820614879 820614880
820626139 820626140
820635250 820635252
820695681 820695682
820697572 820697574
820700117 820700119
820713076 820713078
820716196 820716198
820732038 820732039
820733854 820733855
820737172 820737174
820741541 820741543
820751001 820751004
820752486 820752488
820756090 820756091
820805050 820805052
820828131 820828132
820847425 820847426
820854525 820854526
820856849 820856850
820860774 820860776
820861677 820861678
820863841 820863843
820866339 820866340
820866802 820866804
820866805 820866807
820867151 820867152
820868641 820868642
820873217 820873218
820876304 820876305
820876859 820876860
820877269 820877270
820879061 820879062
820891311 820891312
820893541 820893542
820893796 820893797
820894155 820894157
820898697 820898699
820909873 820909874
820913515 820913516
820921293 820921295
820934053 820934054
820940150 820940151
820942920 820942921
820967252 820967254
820973676 820973678
820981500 820981502
820997816 820997818
820998415 820998417
821027429 821027430
821027431 821027433
821031109 821031111
821034554 821034556
821034558 821034559
821037384 821037386
821037574 821037576
821037925 821037927
821052932 821052934
821053103 821053104
821055871 821055872
821062809 821062810
821063317 821063318
821074828 821074830
821076039 821076041
821077060 821077061
821077637 821077639
821084037 821084038
821088618 821088619
821100394 821100396
821133561 821133563
821136867 821136869
821138158 821138159
821168269 821168271
821182399 821182400
821217004 821217005
821221356 821221359
821221360 821221362
821222110 821222112
821227282 821227283
821232463 821232464
821239363 821239364
821287449 821287451
821307731 821307732
821326325 821326326
821344190 821344192
821363157 821363159
821388576 821388577
821394306 821394307
821467688 821467689
821477461 821477462
821480155 821480157
821483398 821483400
821484687 821484689
821486597 821486599
821489383 821489384
821514253 821514255
821514264 821514265
821517556 821517557
821520415 821520417
821522844 821522846
821528695 821528696
821536061 821536062
821538625 821538626
821543861 821543862
821548709 821548711
821564855 821564856
821582827 821582829
821592297 821592298
821597451 821597452
821600274 821600275
821612961 821612963
821625189 821625190
821629367 821629368
821635243 821635245
821641542 821641544
821648125 821648126
821649978 821649979
821653474 821653476
821657286 821657287
821659691 821659692
821663998 821663999
821681691 821681693
821684653 821684654
821725822 821725824
821742813 821742814
821746986 821746988
821781399 821781401
821783065 821783067
821785185 821785187
821786654 821786655
821787284 821787285
821790601 821790602
821798777 821798778
821801993 821801994
821805142 821805143
821820770 821820772
821824758 821824759
821826639 821826640
821831462 821831463
821833100 821833101
821840710 821840711
821872839 821872840
821883302 821883304
821906409 821906411
821909505 821909506
821911970 821911972
821915135 821915136
821969308 821969310
821990694 821990695
821992728 821992730
822003395 822003396
822012118 822012119
822081059 822081060
822084266 822084267
822085231 822085233
822088210 822088212
822089769 822089770
822092530 822092532
822128759 822128761
822152222 822152223
822153290 822153291
822182958 822182959
822185014 822185015
822194570 822194571
822243719 822243720
822244252 822244253
822263182 822263184
822267051 822267052
822282875 822282876
822290439 822290441
822315390 822315391
822316224 822316225
822318361 822318362
822320236 822320238
822322207 822322208
822322982 822322984
822323669 822323671
822323819 822323821
822325983 822325985
822327014 822327016
822327683 822327684
822329708 822329709
822329879 822329880
822339642 822339643
822339899 822339900
822347814 822347817
822351726 822351728
822351966 822351967
822353005 822353008
822357658 822357660
822366348 822366349
822368621 822368622
822371361 822371362
822379677 822379678
822380113 822380115
822380211 822380213
822382760 822382762
822393025 822393026
822393856 822393857
822401984 822401986
822411716 822411717
822412181 822412183
822412342 822412344
822413404 822413406
822416167 822416168
822417183 822417184
822433591 822433592
822435585 822435587
822438538 822438540
822443206 822443207
822447255 822447258
822460884 822460885
822463723 822463724
822472109 822472110
822475205 822475207
822476180 822476182
822477431 822477432
822478000 822478001
822478319 822478320
822482390 822482394
822483304 822483305
822486766 822486768
822487182 822487183
822487617 822487618
822488963 822488964
822489729 822489731
822491970 822491971
822494011 822494013
822494330 822494331
822495523 822495525
822495821 822495822
822496453 822496454
822535316 822535318
822537693 822537694
822539296 822539297
822539979 822539980
822540486 822540487
822541916 822541918
822542038 822542040
822542916 822542917
822544525 822544526
822546509 822546510
822548655 822548656
822548736 822548737
822549474 822549475
822551255 822551257
822555368 822555370
822558045 822558046
822558579 822558581
822558999 822559001
822562683 822562685
822563108 822563110
822564236 822564238
822564741 822564742
822565632 822565634
822567044 822567045
822567104 822567105
822568714 822568715
822571939 822571940
822576575 822576576
822597423 822597424
822606518 822606519
822612067 822612068
822614610 822614612
822617564 822617565
822619312 822619313
822622294 822622296
822625014 822625016
822625403 822625404
822625764 822625765
822626020 822626021
822626298 822626299
822638013 822638014
822638151 822638152
822640585 822640586
822641690 822641692
822651468 822651470
822665888 822665889
822666011 822666012
822666107 822666108
822666181 822666182
822666307 822666309
822666472 822666473
822666642 822666643
822666918 822666919
822667773 822667775
822723117 822723118
822723523 822723524
822731233 822731234
822731290 822731292
822737941 822737943
822743149 822743150
822745359 822745360
822756237 822756238
822757845 822757846
822776291 822776293
822777748 822777749
822781462 822781463
822793436 822793438
822800055 822800056
822800720 822800721
822800841 822800842
822801925 822801928
822804445 822804447
822805776 822805777
822806187 822806188
822806432 822806433
822816071 822816072
822822342 822822343
822822700 822822701
822822867 822822869
822823001 822823003
822823345 822823347
822824127 822824128
822825555 822825556
822825657 822825658
822826224 822826226
822826399 822826400
822826738 822826739
822826932 822826934
822827193 822827194
822827341 822827343
822848953 822848954
822849476 822849477
822850197 822850198
822852002 822852003
822860647 822860649
822862193 822862194
822862596 822862598
822862730 822862732
822866576 822866578
822869918 822869919
822873325 822873326
822883628 822883630
822887565 822887567
822889886 822889888
822898132 822898133
822913090 822913091
822914618 822914619
822915002 822915003
822920423 822920425
822928152 822928153
822931343 822931344
822942880 822942882
822949850 822949851
822949945 822949947
822950964 822950966
822951024 822951026
822951220 822951222
822954027 822954028
822957317 822957318
822966527 822966528
822970948 822970949
822974929 822974930
822977383 822977384
823012283 823012285
823012356 823012357
823017614 823017615
823018349 823018350
823021815 823021816
823022083 823022084
823022921 823022922
823023271 823023272
823029641 823029643
823032435 823032437
823040292 823040294
823042031 823042032
823048717 823048719
823079724 823079725
823080390 823080391
823162951 823162952
823191317 823191318
823205249 823205250
823240827 823240828
823277662 823277664
823336861 823336863
823423486 823423488
823613886 823613887
823615188 823615189
823617734 823617736
823803004 823803005
823876281 823876282
824046126 824046128
824217448 824217449
824314384 824314386
824390250 824390251
824411918 824411919
824454269 824454271
824494680 824494681
824499952 824499953
824501310 824501311
824502081 824502083
824510753 824510754
824510786 824510788
824510825 824510827
824510834 824510836
824510837 824510839
824510859 824510860
824510863 824510864
824510918 824510919
824510923 824510925
824510926 824510928
824510933 824510935
824510994 824510996
824511004 824511006
824511009 824511010
824511011 824511013
824511019 824511021
824511032 824511034
824511038 824511041
824511050 824511052
824511054 824511056
824511060 824511062
824511067 824511072
824511087 824511089
824511090 824511092
824511119 824511120
824511123 824511125
824511167 824511168
824511179 824511181
824511191 824511195
824511210 824511212
824511213 824511215
824511227 824511229
824511232 824511234
824511249 824511252
824511253 824511255
824511257 824511261
824511269 824511271
824511275 824511277
824511282 824511284
824596598 824596600
824628934 824629383
824674559 824674561
824683021 824683023
824730001 824730002
824730029 824730031
824742761 824742762
824750484 824750485
824756530 824756532
824825565 824825566
824837904 824837905
824842252 824842254
824843996 824843998
824844020 824844022
824844045 824844047
824844134 824844136
824844152 824844154
824844200 824844202
824844206 824844210
824844220 824844222
824844249 824844250
824844252 824844253
824844256 824844258
824844260 824844266
824844267 824844271
824844274 824844276
824844281 824844284
824844296 824844299
824844300 824844304
824844307 824844308
824844324 824844328
824844337 824844338
824844343 824844345
824844356 824844358
824844359 824844361
824844363 824844366
824844370 824844371
824844374 824844375
824844389 824844392
824844398 824844401
824844411 824844415
824844416 824844418
824844419 824844422
824844648 824844650
824844896 824844897
824855362 824855363
824858247 824858248
824872768 824872769
824872781 824872782
824959241 824959242
824996782 824996783
825101867 825101868
825106399 825106400
825109130 825109131
825110979 825110980
825170502 825170504
825421168 825421169
825441984 825441986
825448437 825448438
825450793 825450794
825482235 825482237
825526362 825526364
825528756 825528758
825529250 825529251
825540015 825540016
825545891 825545892
825582018 825582020
825590821 825590822
825615259 825615260
825645178 825645180
825654183 825654187
825654192 825654194
825696108 825696109
825720226 825720227
825724029 825724031
825739632 825739633
825764380 825764381
825770430 825770432
825822821 825822822
825869170 825869172
825873779 825873782
825889620 825889622
825913839 825913841
825915070 825915071
825915193 825915194
825956707 825956708
825966708 825966710
826047482 826047483
826062513 826062515
826176801 826176803
826229400 826229402
826310192 826310195
826316367 826316369
826320944 826320945
826356796 826356797
826380840 826380841
826387556 826387557
826469869 826469871
826478655 826478657
826489479 826489480
826547971 826547972
826556168 826556169
826564657 826564660
826564684 826564685
826568831 826568833
826571508 826571510
826643625 826643627
826730506 826730507
826739235 826739236
826810542 826810544
826812910 826812912
826920660 826920662
826958945 826958946
826966028 826966029
827031855 827031856
827041465 827041467
827071530 827071532
827075292 827075294
827082888 827082890
827082894 827082896
827082897 827082898
827093011 827093012
827161514 827161516
827237188 827237189
827251169 827251170
827260242 827260243
827267797 827267798
827291900 827291902
827352977 827352978
827510722 827510724
827513028 827513030
827513080 827513081
827555663 827555665
827588655 827588656
827617128 827617129
827618506 827618509
827687676 827687678
827773063 827773064
827784131 827784132
827817748 827817750
827833038 827833040
827849247 827849248
827858761 827858762
827876403 827876404
827987324 827987325
828018016 828018017
828041331 828041332
828049066 828049068
828153417 828153418
828169973 828169975
828173184 828173185
828192022 828192023
828192335 828192336
828192657 828192658
828192715 828192716
828193589 828193590
828357928 828357930
828360961 828360962
828365344 828365345
828365427 828365428
828537202 828537204
828619901 828619903
828710165 828710166
828712768 828712770
828713237 828713239
828716465 828716466
828796665 828796666
828802651 828802652
828890071 828890073
828891277 828891278
828905970 828905972
828910928 828910930
828995024 828995026
829248335 829248337
829335974 829335975
829351247 829351248
829395385 829395386
829406054 829406056
829463739 829463741
829562248 829562249
829601395 829601396
829611200 829611202
829634661 829634662
829653759 829653760
829726215 829726217
829744766 829744767
829817174 829817176
829890260 829890261
829937806 829937809
829952937 829952938
829955135 829955136
829981979 829981981
830036671 830036672
830044430 830044431
830096744 830096745
830113845 830113846
830127783 830127784
830140741 830140742
830146302 830146304
830155758 830155759
830187226 830187227
830189951 830189952
830191133 830191135
830194209 830194210
830196106 830196107
830197812 830197814
830200515 830200517
830204945 830204946
830273403 830273404
830277677 830277679
830295628 830295630
830331297 830331299
830342821 830342823
830365589 830365590
830387273 830387274
830396671 830396672
830396748 830396749
830428705 830428707
830449103 830449105
830449924 830449926
830452116 830452117
830490891 830490892
830537664 830537665
830540568 830540569
830545281 830545283
830545284 830545285
830551864 830551866
830606550 830606551
830607526 830607528
830617322 830617323
830688402 830688404
830722779 830722780
830727088 830727089
830800855 830800856
830811448 830811449
830815454 830815455
830827494 830827496
830827854 830827855
830833523 830833525
830845779 830845780
830857524 830857525
830881246 830881247
830882796 830882797
830892713 830892715
830895313 830895315
830904875 830904876
830917354 830917355
830935615 830935617
830960220 830960222
830985459 830985460
831019617 831019618
831056867 831056868
831065008 831065009
831071610 831071612
831096938 831096940
831104683 831104684
831134435 831134436
831144506 831144508
831145027 831145028
831145924 831145925
831147033 831147035
831155580 831155581
831155699 831155701
831155975 831155977
831156706 831156707
831156869 831156871
831157391 831157393
831165620 831165622
831168195 831168196
831171602 831171604
831175498 831175499
831208334 831208335
831215408 831215410
831247023 831247025
831249664 831249665
831264587 831264588
831312282 831312284
831315094 831315096
831323524 831323525
831331599 831331601
831344057 831344059
831396304 831396306
831412661 831412662
831419092 831419093
831421002 831421003
831449830 831449832
831454734 831454736
831465591 831465593
831484042 831484043
831495687 831495688
831498840 831498842
831510555 831510557
831567626 831567627
831569557 831569558
831582612 831582613
831589996 831589998
831591487 831591488
831621241 831621242
831629835 831629837
831655178 831655179
831655537 831655538
831669199 831669200
831673916 831673918
831688973 831688974
831695886 831695889
831695916 831695917
831703185 831703186
831742859 831742860
831765210 831765211
831811972 831811974
831851689 831851690
831883979 831883981
831924064 831924065
831925811 831925812
831934044 831934045
831956335 831956336
831982733 831982734
832008902 832008903
832012687 832012688
832017726 832017728
832029229 832029231
832100554 832100556
832109384 832109386
832111576 832111577
832116679 832116680
832117096 832117097
832197084 832197085
832284928 832284929
832296458 832296460
832300429 832300430
832318750 832318752
832339016 832339017
832404340 832404341
832411292 832411294
832427265 832427266
832465155 832465157
832479856 832479857
832509815 832509816
832542567 832542568
832553355 832553356
832561887 832561889
832601944 832601945
832619113 832619115
832621018 832621021
832625487 832625489
832627558 832627560
832636337 832636339
832643919 832643920
832650622 832650623
832652852 832652853
832682562 832682564
832699056 832699057
832716698 832716700
832725274 832725275
832727597 832727599
832801970 832801972
832821968 832821970
832821976 832821978
832837258 832837260
832851163 832851165
832882841 832882843
832921388 832921389
832921397 832921399
832923518 832923520
832923584 832923586
832950600 832950601
833034142 833034144
833035635 833035637
833051366 833051367
833069191 833069193
833089662 833089664
833091182 833091183
833094979 833094980
833122124 833122126
833128651 833128653
833128657 833128659
833128660 833128662
833137609 833137611
833140820 833140821
833144703 833144704
833147272 833147273
833148261 833148262
833227331 833227332
833235216 833235217
833269414 833269416
833292377 833292379
833304669 833304670
833307772 833307773
833308908 833308910
833311014 833311015
833317938 833317940
833320153 833320154
833323200 833323202
833324029 833324030
833324061 833324062
833380393 833380394
833393816 833393818
833398091 833398093
833410021 833410023
833414804 833414806
833416123 833416125
833418062 833418063
833425456 833425457
833433252 833433253
833446740 833446741
833451134 833451135
833480260 833480262
833480337 833480338
833539527 833539529
833564232 833564234
833574526 833574528
833576875 833576877
833578466 833578468
833580715 833580717
833586781 833586782
833618695 833618696
833658805 833658806
833663501 833663503
833673704 833673705
833681863 833681864
833706670 833706671
833731311 833731312
833742354 833742356
833748402 833748404
833753692 833753693
833771873 833771874
833794764 833794766
833807525 833807527
833811844 833811846
833847393 833847394
833885547 833885548
833936852 833936853
833947515 833947517
833947563 833947565
833961981 833961982
834022883 834022885
834037338 834037340
834039003 834039005
834039009 834039010
834040680 834040681
834047988 834047990
834069565 834069567
834090424 834090425
834097570 834097572
834097729 834097730
834105137 834105138
834105155 834105157
834109667 834109669
834111722 834111723
834117431 834117432
834121607 834121608
834125216 834125218
834126661 834126663
834126740 834126742
834178786 834178787
834189173 834189175
834189176 834189178
834189184 834189238
834193508 834193510
834193530 834193535
834193545 834193547
834193549 834193557
834193558 834193603
834205832 834205834
834205958 834205960
834205984 834205986
834205988 834205989
834206015 834206020
834206031 834206033
834206057 834206061
834206063 834206067
834206072 834206073
834206082 834206084
834206085 834206115
834206116 834206185
834218912 834218913
834270536 834270538
834282055 834282056
834301825 834301827
834301835 834301840
834301842 834301847
834301852 834301881
834312168 834312170
834312171 834312173
834312175 834312176
834312181 834312187
834312188 834312216
834323002 834323004
834340041 834340043
834341821 834341823
834344414 834344415
834345833 834345835
834358435 834358436
834373800 834373802
834374714 834374716
834390189 834390190
834419250 834419252
834423174 834423176
834423687 834423689
834424302 834424303
834435532 834435534
834437129 834437131
834465489 834465491
834490806 834490807
834509329 834509330
834510815 834510817
834518387 834518389
834520146 834520147
834524292 834524293
834568053 834568055
834568203 834568204
834571021 834571023
834571218 834571219
834574135 834574137
834593589 834593590
834596646 834596647
834621705 834621707
834621874 834621876
834622114 834622117
834631956 834631957
834636298 834636299
834642563 834642565
834646521 834646522
834649782 834649784
834656337 834656340
834660836 834660837
834664924 834664926
834667196 834667198
834668938 834668940
834676246 834676248
834687750 834687752
834691117 834691119
834707502 834707503
834715926 834715927
834723909 834723911
834727120 834727121
834731727 834731729
834733108 834733109
834741095 834741096
834765467 834765468
834776515 834776516
834777030 834777031
834778658 834778659
834781896 834781897
834787794 834787796
834795926 834795927
834800996 834800997
834811191 834811193
834833077 834833078
834841036 834841038
834841041 834841042
834844493 834844494
834846572 834846574
834873834 834873836
834873850 834873852
834878096 834878097
834882774 834882776
834896185 834896187
834930415 834930417
834932831 834932832
834950183 834950184
834960434 834960435
834963580 834963582
835005698 835005700
835009415 835009416
835025095 835025097
835039738 835039740
835047607 835047609
835099672 835099673
835102106 835102107
835103046 835103047
835140270 835140272
835148487 835148488
835149563 835149564
835193723 835193724
835206533 835206534
835212360 835212361
835230198 835230200
835233879 835233881
835253932 835253934
835264292 835264293
835275761 835275762
835298070 835298072
835298511 835298513
835299043 835299045
835300832 835300834
835306588 835306590
835315225 835315226
835329815 835329817
835330937 835330939
835334601 835334603
835346686 835346687
835356595 835356596
835361872 835361874
835372515 835372516
835392127 835392129
835401066 835401068
835404411 835404412
835411659 835411660
835450040 835450042
835480057 835480060
835482894 835482895
835486621 835486622
835498893 835498895
835503732 835503733
835508646 835508648
835517050 835517051
835524522 835524523
835567491 835567492
835643706 835643707
835648036 835648037
835696824 835696826
835721855 835721856
835726354 835726355
835739025 835739027
835759732 835759734
835766973 835766974
835770760 835770761
835799912 835799914
835799922 835799923
835804342 835804344
835818153 835818154
835848164 835848166
835895157 835895158
835944853 835944855
835954347 835954348
835956804 835956807
835958904 835958905
835961460 835961461
835978478 835978479
835978800 835978801
835984133 835984135
835988690 835988691
835989662 835989664
836038691 836038692
836039649 836039650
836061553 836061555
836063490 836063492
836078871 836078872
836080694 836080696
836097907 836097909
836119291 836119292
836163656 836163657
836165700 836165701
836169987 836169989
836169996 836169998
836170096 836170097
836172399 836172400
836179052 836179054
836183874 836183876
836191570 836191572
836197411 836197412
836198772 836198774
836202439 836202440
836221977 836221979
836233739 836233741
836234610 836234611
836247778 836247779
836259729 836259731
836286757 836286759
836293132 836293134
836306139 836306140
836333583 836333584
836335213 836335214
836352744 836352746
836354208 836354209
836356484 836356486
836361854 836361856
836375226 836375228
836378772 836378774
836379092 836379093
836389353 836389355
836391285 836391286
836395969 836395971
836426862 836426863
836453926 836453927
836459685 836459687
836461577 836461578
836465129 836465131
836466561 836466563
836468342 836468344
836472330 836472332
836478312 836478313
836485087 836485089
836491104 836491105
836494365 836494367
836502316 836502317
836578663 836578664
836578721 836578722
836583292 836583294
836583457 836583459
836588789 836588791
836588962 836588963
836588971 836588973
836594003 836594005
836602382 836602384
836602437 836602438
836603753 836603755
836604976 836604978
836604984 836604985
836609995 836609997
836616645 836616647
836616865 836616867
836621849 836621851
836632779 836632780
836636455 836636457
836649021 836649023
836649103 836649104
836664915 836664916
836664962 836664963
836695105 836695107
836709944 836709946
836762305 836762306
836766261 836766263
836766376 836766378
836766379 836766380
836769089 836769090
836771133 836771134
836780563 836780565
836781414 836781416
836782093 836782095
836800498 836800499
836810472 836810474
836848173 836848174
836858163 836858164
836860384 836860385
836861784 836861785
836928237 836928238
836929023 836929024
836932109 836932110
836934879 836934880
836948871 836948872
836958119 836958120
836959789 836959790
836965113 836965114
837010953 837010955
837014297 837014299
837014309 837014311
837025905 837025907
837033742 837033744
837072664 837072666
837073726 837073728
837078633 837078635
837085904 837085905
837088337 837088338
837089781 837089783
837093178 837093180
837109069 837109071
837118770 837118772
837124260 837124262
837124928 837124929
837162881 837162882
837174156 837174157
837176708 837176709
837178625 837178627
837179780 837179782
837188555 837188556
837193214 837193215
837193524 837193525
837195709 837195711
837202197 837202199
837204724 837204725
837218608 837218610
837219437 837219438
837222295 837222296
837223451 837223452
837226481 837226482
837269312 837269313
837322043 837322044
837329976 837329978
837330186 837330187
837330219 837330220
837344628 837344629
837361243 837361244
837372256 837372257
837444018 837444019
837446624 837446625
837454386 837454388
837474695 837474696
837479689 837479690
837505928 837505929
837509583 837509585
837510876 837510878
837511814 837511815
837514599 837514601
837514771 837514773
837515437 837515439
837516925 837516927
837516965 837516967
837524016 837524017
837524967 837524969
837597769 837597770
837600205 837600207
837601433 837601434
837641689 837641691
837644053 837644054
837651959 837651961
837653893 837653894
837667953 837667954
837696603 837696605
837743471 837743473
837766539 837766540
837778283 837778285
837785385 837785386
837785617 837785618
837788551 837788553
837788869 837788870
837797031 837797033
837806483 837806485
837815488 837815489
837826373 837826375
837830803 837830805
837832404 837832405
837841977 837841978
837843261 837843262
837865959 837865960
837868251 837868253
837869905 837869907
837959937 837959938
837986961 837986962
838008290 838008292
838041254 838041255
838051647 838051648
838054206 838054207
838062011 838062012
838064571 838064572
838071521 838071523
838078042 838078044
838078974 838078975
838087189 838087190
838108418 838108420
838131152 838131153
838138922 838138924
838160251 838160252
838225068 838225069
838238576 838238577
838257964 838257966
838292740 838292741
838295759 838295760
838325710 838325711
838373694 838373696
838399520 838399522
838406371 838406372
838410408 838410410
838415443 838415444
838419190 838419191
838569440 838569442
838577986 838577987
838609843 838609844
838621778 838621779
838629616 838629617
838635777 838635778
838654727 838654729
838662211 838662213
838663097 838663098
838668099 838668101
838670215 838670216
838674156 838674158
838683801 838683802
838688380 838688381
838713261 838713262
838714802 838714804
838822634 838822636
838831638 838831639
838844168 838844169
838910827 838910829
838911833 838911834
838924131 838924132
838997144 838997146
839004299 839004300
839025082 839025083
839033946 839033947
839065086 839065087
839066925 839066926
839101523 839101524
839103204 839103205
839108761 839108763
839124901 839124902
839127745 839127746
839184670 839184671
839193206 839193207
839201777 839201779
839229089 839229091
839250734 839250735
839251068 839251070
839251253 839251255
839251277 839251279
839251309 839251311
839254595 839254597
839255874 839255875
839256385 839256387
839267114 839267116
839284960 839284962
839296823 839296824
839299571 839299572
839300122 839300123
839304323 839304324
839337938 839337940
839340593 839340594
839342267 839342268
839347372 839347374
839363022 839363023
839368415 839368417
839371054 839371056
839531968 839531969
839605224 839605225
839626509 839626510
839645033 839645035
839680448 839680450
839682827 839682828
839690790 839690791
839713528 839713529
839718681 839718682
839721979 839721980
839777329 839777330
839783170 839783171
839784566 839784567
839788027 839788028
839788379 839788381
839788831 839788833
839792335 839792336
839801330 839801331
839808224 839808225
839848824 839848826
839863880 839863881
839871351 839871352
839875909 839875910
839881400 839881402
839882908 839882909
839883050 839883052
839883348 839883350
839883741 839883742
839885323 839885325
839983685 839983686
840039698 840039699
840081738 840081740
840176734 840176736
840203633 840203635
840206461 840206463
840217151 840217152
840238345 840238348
840244001 840244003
840292234 840292236
840317229 840317230
840319121 840319123
840327130 840327132
840327198 840327200
840332330 840332331
840336353 840336354
840339443 840339445
840342185 840342186
840344360 840344362
840347097 840347098
840354121 840354123
840363265 840363266
840366409 840366410
840366505 840366506
840368215 840368217
840368566 840368567
840370666 840370667
840373123 840373125
840374703 840374704
840403946 840403948
840416557 840416559
840416573 840416574
840473693 840473694
840481308 840481309
840485623 840485624
840488445 840488447
840492010 840492012
840502640 840502642
840516481 840516482
840543285 840543286
840544633 840544634
840576663 840576664
840580800 840580802
840645770 840645771
840648634 840648636
840671299 840671300
840736830 840736831
840737683 840737684
840740762 840740763
840752613 840752614
840826334 840826336
840857944 840857945
840859802 840859803
840860711 840860712
840860814 840860816
840860820 840860821
840872255 840872256
840882646 840882648
840890022 840890023
840892095 840892098
840894995 840894996
840895008 840895010
840926473 840926475
840931193 840931194
840932666 840932667
840940793 840940795
840942753 840942754
840944954 840944955
840963767 840963768
840993472 840993474
840996056 840996058
841006662 841006663
841019206 841019208
841025198 841025199
841026372 841026373
841028407 841028409
841029308 841029309
841043555 841043557
841046798 841046800
841050498 841050499
841053619 841053621
841060775 841060777
841066898 841066900
841068504 841068505
841073031 841073033
841077856 841077858
841079894 841079895
841084422 841084424
841100910 841100912
841105030 841105032
841141963 841141964
841143797 841143798
841147845 841147846
841153788 841153791
841153798 841153800
841160087 841160089
841163375 841163377
841168705 841168706
841236741 841236742
841262337 841262339
841305701 841305703
841342897 841342898
841424366 841424367
841533350 841533351
841670589 841670590
841681714 841681715
841688685 841688687
841689237 841689238
841713094 841713096
841764562 841764563
841768817 841768818
841792457 841792458
841922222 841922223
842033387 842033388
842037044 842037045
842047009 842047011
842048469 842048470
842055749 842055750
842056758 842056759
842057294 842057296
842057357 842057359
842058243 842058244
842103831 842103833
842199109 842199111
842275714 842275716
842300576 842300579
842300588 842300589
842303985 842303987
842309466 842309467
842340493 842340495
842365150 842365151
842366913 842366914
842373182 842373184
842383986 842383987
842385189 842385191
842387969 842387970
842465772 842465774
842466250 842466252
842468481 842468482
842492086 842492088
842521656 842521657
842561797 842561798
842586798 842586799
842653372 842653373
842803551 842803552
842806816 842806818
842808099 842808100
842814236 842814238
842815599 842815601
842816142 842816143
842821926 842821928
842823616 842823617
842825887 842825889
842831229 842831230
842837771 842837773
842887419 842887420
842894992 842894993
842903365 842903367
842903376 842903378
842903619 842903620
842907864 842907865
842910532 842910534
842913592 842913594
842916780 842916781
842928276 842928277
842964023 842964025
842972915 842972916
842981164 842981165
842987112 842987113
842989006 842989008
842992591 842992592
842994543 842994545
842996085 842996086
842997998 842998000
843025627 843025629
843167743 843167745
843175001 843175002
843240079 843240080
843257767 843257768
843293257 843293258
843359821 843359822
843406017 843406018
843410600 843410602
843414264 843414266
843427566 843427567
843431678 843431680
843433143 843433144
843435869 843435871
843460466 843460467
843493899 843493901
843495153 843495155
843501088 843501090
843571123 843571124
843580434 843580437
843582141 843582142
843589806 843589807
843600490 843600491
843604922 843604923
843611985 843611986
843657818 843657819
843674443 843674444
843721533 843721534
843729386 843729387
843742106 843742107
843753472 843753474
843754577 843754578
843848842 843848843
843887082 843887084
843990246 843990248
844020970 844020971
844103723 844103725
844119324 844119325
844120723 844120725
844245213 844245214
844310949 844310950
844348106 844348108
844361059 844361061
844361416 844361417
844362634 844362635
844379455 844379456
844424176 844424177
844464586 844464588
844508488 844508489
844526470 844526472
844623132 844623133
844697891 844697893
844705142 844705143
844707896 844707898
844870266 844870268
844967739 844967740
845065048 845065049
845155536 845155537
845158699 845158701
845162619 845162621
845221789 845221793
845222964 845222965
845325531 845325532
845329975 845329976
845377242 845377243
845398965 845398966
845421384 845421385
845483875 845483877
845486783 845486785
845503701 845503702
845504074 845504075
845579234 845579235
845587972 845587974
845659357 845659358
845668172 845668173
845674179 845674181
845999773 845999774
846006335 846006336
846010511 846010513
846012576 846012578
846013231 846013232
846013443 846013444
846016728 846016730
846092302 846092304
846094370 846094372
846101668 846101670
846173276 846173278
846176127 846176128
846194779 846194781
846195182 846195183
846198057 846198058
846255401 846255402
846262917 846262918
846264427 846264428
846267841 846267842
846268865 846268867
846269463 846269465
846271433 846271435
846272476 846272478
846276037 846276039
846324335 846324336
846341023 846341025
846345395 846345396
846377837 846377838
846382526 846382527
846384059 846384061
846385736 846385739
846385941 846385943
846435821 846435822
846438565 846438568
846457827 846457828
846539989 846539991
846641656 846641657
846792928 846792930
846826570 846826572
846834647 846834648
846861872 846861874
847101689 847101691
847120555 847120556
847120687 847120688
847121136 847121137
847130068 847130070
847132256 847132258
847225973 847225974
847230658 847230659
847384685 847384686
847474385 847474386
847483377 847483379
847483465 847483467
847492903 847492904
847492941 847492943
847518885 847518887
847604965 847604970
847625066 847625069
847625075 847625079
847655724 847655726
847661554 847661561
847717970 847717973
847718004 847718012
847718040 847718125
847718126 847718145
847718146 847718164
847718166 847718169
847718171 847718174
847718176 847718179
847718181 847718184
847732803 847732805
847736945 847736960
847737304 847737339
847737478 847737487
847738185 847738192
847738631 847738633
847753435 847753439
847797140 847797143
847820781 847820783
847834729 847834731
847836327 847836354
847836358 847836360
847839567 847839569
847839647 847839649
847840858 847840860
847840875 847840877
847861576 847861578
847869893 847869895
847883729 847883768
847907691 847907692
847907832 847907834
847911270 847911272
847911291 847911292
847915376 847915385
847922258 847922268
847945289 847945294
847955159 847955164
847998460 847998477
847998481 847998483
848042273 848042275
848050182 848050183
848069439 848069472
848084416 848084418
848086108 848086109
848086250 848086253
848095229 848095232
848156007 848156009
848159616 848159617
848229946 848229947
848320289 848320293
848326120 848326122
848330602 848330603
848340312 848340314
848347312 848347313
848348402 848348403
848418300 848418302
848439991 848439993
848466318 848466320
848630012 848630013
848638931 848638933
848642291 848642293
848673458 848673459
848683986 848683988
848684101 848684103
848736752 848736753
848745671 848745673
848795928 848795930
848812611 848812612
848825426 848825428
848855650 848855652
848865373 848865374
848878307 848878309
848918520 848918522
848922367 848922368
848944324 848944325
849018050 849018052
849035127 849035128
849053477 849053478
849089078 849089080
849112179 849112180
849208740 849208741
849208911 849208912
849213048 849213049
849214802 849214804
849248246 849248247
849300030 849300032
849427508 849427510
849460119 849460120
849463511 849463513
849465599 849465600
849470626 849470628
849479897 849479899
849480669 849480671
849481588 849481590
849554427 849554428
849564293 849564294
849637852 849637853
849711516 849711518
849729320 849729321
849751014 849751016
849870153 849870154
849901333 849901334
849908418 849908420
849927287 849927288
849958809 849958810
849996239 849996240
849996834 849996835
850030929 850030930
850066273 850066275
850066775 850066776
850111308 850111309
850137784 850137786
850161577 850161579
850164463 850164465
850182189 850182190
850187445 850187446
850278297 850278298
850282744 850282745
850317461 850317462
850330572 850330573
850333879 850333880
850334157 850334159
850336590 850336592
850340633 850340635
850346073 850346074
850395857 850395859
850457907 850457909
850489887 850489889
850514502 850514503
850518006 850518007
850532649 850532650
850643036 850643038
850677421 850677422
850692250 850692252
850694604 850694605
850697190 850697192
850715831 850715832
850723191 850723192
850853424 850853426
850856889 850856890
850940458 850940460
851016283 851016285
851038878 851038880
851083099 851083100
851111337 851111338
851408109 851408111
851464269 851464270
851522178 851522180
851698055 851698057
851703781 851703783
851785380 851785382
851787976 851787978
851864222 851864224
851934664 851934665
852019255 852019257
852051488 852051489
852070055 852070056
852102159 852102160
852139993 852139994
852144755 852144757
852146847 852146849
852149522 852149523
852177278 852177279
852212491 852212492
852313037 852313038
852320588 852320590
852323456 852323457
852325466 852325467
852393164 852393165
852414691 852414693
852415358 852415359
852416682 852416683
852427009 852427010
852427799 852427801
852440093 852440094
852487564 852487567
852566261 852566263
852574796 852574798
852581095 852581096
852585652 852585653
852585858 852585859
852587096 852587097
852590553 852590554
852590632 852590634
852632932 852632933
852641071 852641072
852644894 852644895
852660418 852660419
852663965 852663966
852679340 852679341
852698004 852698005
852715738 852715739
852828278 852828280
852926259 852926261
852998078 852998079
853024168 853024170
853041254 853041256
853098913 853098914
853142614 853142616
853196733 853196735
853206713 853206714
853272983 853272984
853276489 853276491
853277213 853277215
853316012 853316014
853344480 853344482
853351204 853351206
853384629 853384630
853414966 853414967
853444760 853444761
853453262 853453264
853479065 853479066
853483089 853483090
853518607 853518609
853595448 853595449
853601820 853601821
853601999 853602000
853747197 853747199
853838700 853838701
853955050 853955051
854050935 854050937
854114576 854114578
854123084 854123085
854128890 854128891
854171884 854171885
854198246 854198247
854249371 854249372
854287013 854287015
854288384 854288385
854292424 854292426
854408776 854408778
854427614 854427616
854504707 854504709
854584203 854584205
854618036 854618038
854705343 854705344
854706571 854706573
854744115 854744116
854751277 854751278
854751819 854751820
854758497 854758498
854910443 854910445
854916996 854916998
854919419 854919420
854921051 854921052
854923996 854923998
854926299 854926300
854993983 854993984
855004900 855004902
855005668 855005670
855086959 855086960
855136520 855136522
855243398 855243400
855268100 855268102
855294905 855294907
855312462 855312463
855414411 855414412
855526487 855526489
855606356 855606357
855608946 855608947
855609915 855609916
855689338 855689339
855712869 855712871
855778740 855778742
855783263 855783264
855800333 855800335
855862444 855862446
855864886 855864887
855867698 855867699
855870423 855870424
855873484 855873485
855874343 855874344
855875875 855875877
855877585 855877586
855901525 855901527
855917687 855917689
855949022 855949023
855950343 855950345
855955336 855955338
856058221 856058222
856128159 856128161
856133546 856133548
856135779 856135780
856201784 856201785
856258898 856258899
856269652 856269655
856286478 856286480
856294331 856294333
856320446 856320447
856322034 856322035
856369826 856369828
856372264 856372267
856383013 856383014
856396279 856396281
856471181 856471182
856527718 856527719
856544305 856544307
856571539 856571540
856698670 856698671
856720925 856720927
856724626 856724628
856725857 856725859
856727506 856727507
856728141 856728143
856728401 856728403
856728793 856728794
856729680 856729682
856731285 856731288
856804558 856804560
856806469 856806470
856817630 856817632
856822380 856822382
856876857 856876858
856900939 856900940
856987278 856987280
857022111 857022113
857094675 857094676
857169286 857169287
857258015 857258017
857262635 857262637
857264648 857264650
857268819 857268822
857321204 857321206
857325335 857325337
857335790 857335792
857362650 857362651
857366124 857366125
857406433 857406434
857412761 857412763
857445597 857445599
857502338 857502340
857502722 857502723
857505419 857505421
857509768 857509769
857516526 857516527
857548676 857548677
857592086 857592087
857596931 857596932
857632804 857632805
857639339 857639340
857645452 857645453
857725622 857725624
857733792 857733794
857734233 857734234
857734824 857734826
857735165 857735167
857735430 857735432
857735659 857735661
857738997 857738998
857739208 857739209
857756025 857756026
857763145 857763147
857764583 857764585
857766586 857766588
857767052 857767053
857772390 857772392
857790250 857790252
857924676 857924677
857932954 857932955
857942341 857942342
857945260 857945262
857949706 857949707
857995244 857995245
858034155 858034157
858107585 858107586
858111125 858111126
858185008 858185009
858191287 858191288
858204082 858204083
858207180 858207181
858219652 858219653
858271909 858271911
858274337 858274339
858291807 858291808
858376151 858376153
858377935 858377936
858390356 858390358
858429004 858429006
858436385 858436386
858467833 858467835
858469681 858469682
858489776 858489778
858528282 858528283
858556073 858556074
858563170 858563172
858594476 858594477
858617714 858617716
858620392 858620393
858626657 858626659
858643079 858643080
858715047 858715049
858717416 858717418
858724969 858724970
858741284 858741285
858777107 858777108
858792797 858792799
858797986 858797988
858799573 858799574
858805281 858805283
858806864 858806865
858885532 858885534
858892085 858892087
858901046 858901048
858961270 858961272
858964081 858964082
858966263 858966264
858970475 858970476
858973812 858973814
858985566 858985567
859068995 859068998
859074385 859074386
859074586 859074587
859074823 859074824
859075884 859075885
859077083 859077085
859078191 859078194
859078634 859078635
859079527 859079529
859080535 859080536
859085585 859085586
859085918 859085919
859093698 859093699
859095597 859095599
859123622 859123623
859127653 859127654
859155441 859155443
859182081 859182082
859242798 859242800
859281379 859281381
859312561 859312563
859317283 859317284
859320143 859320144
859399949 859399950
859423075 859423076
859480947 859480948
859496016 859496017
859551379 859551381
859576023 859576024
859607394 859607396
859720498 859720499
859722652 859722654
859726904 859726906
859758241 859758242
859781289 859781290
859782848 859782849
859831608 859831609
859849053 859849055
859852118 859852121
859877372 859877374
859922118 859922119
859926209 859926210
859929207 859929208
859937572 859937573
859948983 859948985
859964353 859964354
859965648 859965650
860011000 860011002
860060492 860060494
860105684 860105686
860106352 860106354
860149699 860149700
860151465 860151467
860163262 860163263
860169865 860169866
860170469 860170470
860170975 860170976
860280094 860280095
860330803 860330804
860341498 860341499
860342998 860343000
860347038 860347040
860357894 860357896
860364237 860364238
860364450 860364451
860366162 860366163
860367297 860367298
860371204 860371205
860439778 860439779
860440203 860440205
860444407 860444409
860447865 860447866
860489511 860489513
860517967 860517968
860526179 860526180
860527309 860527311
860534632 860534634
860543425 860543426
860550862 860550863
860575671 860575672
860594065 860594067
860615605 860615606
860624081 860624083
860675505 860675506
860710824 860710826
860722395 860722396
860728993 860728995
860735194 860735196
860759718 860759720
860774257 860774258
860789308 860789309
860876754 860876755
860877457 860877458
860879030 860879031
860888759 860888760
860894442 860894444
860921076 860921077
860944704 860944705
860946353 860946355
860968212 860968213
860988153 860988154
861025279 861025280
861033987 861033988
861036980 861036981
861038255 861038257
861042679 861042681
861043359 861043360
861043461 861043463
861055441 861055442
861064818 861064819
861116889 861116890
861118445 861118446
861121011 861121012
861124310 861124311
861150582 861150583
861151149 861151151
861155836 861155838
861157184 861157186
861158551 861158553
861159902 861159903
861160751 861160753
861162747 861162749
861164487 861164489
861164884 861164885
861167184 861167186
861168331 861168332
861169682 861169683
861173546 861173547
861175560 861175562
861178247 861178249
861179780 861179782
861306375 861306377
861320417 861320418
861330512 861330513
861357119 861357120
861369642 861369644
861377696 861377697
861379643 861379644
861386371 861386373
861386548 861386549
861390969 861390970
861415769 861415770
861428469 861428471
861489567 861489568
861503444 861503445
861573725 861573727
861625603 861625604
861641362 861641363
861647175 861647177
861652900 861652901
861662267 861662269
861718887 861718889
861764618 861764619
861775029 861775031
861780144 861780145
861843053 861843054
861886060 861886062
861886167 861886168
861994122 861994124
861996889 861996891
861998431 861998432
862115511 862115512
862130481 862130482
862177047 862177049
862179452 862179453
862262555 862262556
862265312 862265315
862350558 862350559
862356143 862356144
862381092 862381093
862444498 862444499
862462647 862462648
862466283 862466284
862482707 862482709
862521815 862521816
862524774 862524776
862533398 862533400
862599906 862599907
862668097 862668098
862695177 862695178
862697392 862697394
862698698 862698699
862701612 862701613
862704874 862704875
862713435 862713436
862770032 862770033
862773103 862773104
862870019 862870021
862870602 862870604
862880089 862880090
862897022 862897024
862934378 862934380
862944122 862944124
862947250 862947252
862948744 862948745
862954148 862954149
862957994 862957995
863027540 863027541
863037229 863037231
863051979 863051981
863053000 863053002
863053275 863053278
863185138 863185139
863197909 863197911
863202529 863202531
863216963 863216965
863301807 863301809
863311367 863311368
863316563 863316564
863344411 863344413
863367904 863367906
863377907 863377908
863398038 863398040
863413931 863413933
863457776 863457777
863476568 863476569
863528913 863528914
863532182 863532184
863534881 863534882
863547548 863547549
863636508 863636510
863637351 863637352
863666160 863666162
863669775 863669777
863683959 863683960
863743559 863743560
863760367 863760368
863770803 863770804
863831481 863831482
863905821 863905823
863931136 863931137
863984377 863984378
864058997 864058999
864062668 864062669
864149886 864149888
864151204 864151206
864158806 864158807
864253445 864253446
864314470 864314471
864325517 864325518
864328185 864328186
864340127 864340128
864340466 864340467
864341375 864341376
864341874 864341875
864353231 864353233
864363194 864363196
864418222 864418224
864434097 864434099
864464152 864464153
864507623 864507624
864577330 864577331
864594250 864594252
864600640 864600643
864600692 864600694
864608706 864608708
864612162 864612163
864671221 864671222
864673456 864673458
864746563 864746565
864755859 864755861
864775939 864775941
864777348 864777349
864778548 864778549
864859061 864859063
864921845 864921846
864963831 864963832
864975088 864975090
865019924 865019925
865029068 865029069
865030610 865030612
865034994 865034995
865046285 865046287
865057164 865057165
865062755 865062756
865079311 865079312
865130287 865130288
865163824 865163826
865172572 865172574
865180060 865180062
865184984 865184986
865185448 865185450
865190332 865190333
865198643 865198644
865201425 865201426
865202108 865202110
865318397 865318399
865345196 865345199
865361885 865361886
865465071 865465072
865474650 865474652
865479253 865479255
865487247 865487250
865490998 865491001
865542478 865542480
865557035 865557036
865641485 865641486
865645724 865645725
865668380 865668382
865695504 865695505
865743332 865743333
865785155 865785156
865793143 865793144
865798655 865798657
865807162 865807163
865808674 865808676
865864247 865864248
865876536 865876538
865885248 865885250
865887816 865887817
865893522 865893523
865907573 865907575
865949835 865949837
865957875 865957877
866032224 866032225
866098658 866098660
866134919 866134921
866139303 866139305
866160823 866160825
866164917 866164919
866166136 866166137
866168707 866168709
866169994 866169996
866172796 866172797
866190186 866190188
866193132 866193133
866223872 866223874
866225241 866225243
866248964 866248965
866254549 866254551
866257174 866257176
866333497 866333498
866386592 866386593
866389609 866389611
866389699 866389700
866413923 866413926
866420050 866420052
866468992 866468993
866475453 866475454
866497431 866497433
866518280 866518282
866583669 866583671
866604213 866604214
866605037 866605038
866605187 866605811
866651000 866651001
866685943 866685945
866726651 866726653
866733401 866733402
866736424 866736425
866738366 866738367
866958188 866958190
866990177 866990179
867035156 867035157
867036681 867036683
867056207 867056208
867110955 867110957
867120614 867120615
867121309 867121311
867191170 867191172
867292324 867292326
867298982 867298983
867364312 867364313
867439152 867439153
867450224 867450226
867511055 867511057
867627047 867627048
867663392 867663394
867689605 867689607
867766564 867766565
867771707 867771709
867775239 867775241
867782792 867782795
867836866 867836867
868028135 868028136
868054800 868054802
868059611 868059612
868114697 868114698
868162679 868162680
868216396 868216398
868223100 868223102
868232624 868232626
868247690 868247692
868253687 868253688
868262645 868262647
868388534 868388535
868389191 868389192
868467370 868467372
868472302 868472304
868527655 868527656
868603781 868603783
868651856 868651858
868654760 868654761
868662760 868662762
868701178 868701180
868745036 868745037
868748345 868748347
868753271 868753273
868770567 868770569
868790389 868790391
868864980 868864981
868916427 868916428
868919375 868919376
868958785 868958787
869005207 869005208
869007091 869007092
869068029 869068030
869151449 869151451
869156211 869156213
869171261 869171262
869234026 869234028
869354326 869354328
869388977 869388979
869413836 869413838
869442650 869442651
869466234 869466236
869473214 869473216
869498762 869498764
869505249 869505251
869513669 869513670
869524306 869524308
869535609 869535611
869544038 869544040
869557740 869557742
869590340 869590341
869598915 869598917
869604906 869604908
869616312 869616314
869617377 869617378
869720585 869720586
869773260 869773261
869821455 869821457
869831494 869831496
869862110 869862112
869919791 869919792
870007513 870007514
870011549 870011550
870024127 870024128
870030785 870030786
870031314 870031315
870031409 870031410
870031574 870031576
870038700 870038702
870052047 870052049
870059882 870059883
870085716 870085717
870103428 870103429
870110613 870110614
870177900 870177901
870214718 870214719
870273275 870273276
870274343 870274345
870290019 870290020
870342132 870342134
870369947 870369948
870372808 870372810
870391743 870391745
870394877 870394879
870394919 870394922
870403873 870403874
870467420 870467422
870481099 870481101
870521525 870521527
870558374 870558376
870560014 870560016
870568242 870568243
870578163 870578164
870743032 870743033
870763696 870763697
870815200 870815201
870873064 870873065
870905951 870905952
870939917 870939919
870960081 870960082
870991923 870991924
871002884 871002886
871016644 871016646
871032523 871032524
871057169 871057170
871061229 871061230
871070463 871070464
871075844 871075845
871080547 871080549
871080634 871080636
871080641 871080643
871080656 871080658
871080665 871080668
871080679 871080681
871105598 871105599
871243438 871243440
871272694 871272696
871277332 871277334
871289597 871289599
871300049 871300051
871300442 871300443
871307935 871307936
871329515 871329516
871441456 871441457
871597099 871597101
871615154 871615156
871679619 871679620
871685683 871685685
871713291 871713292
871765350 871765352
871818821 871818823
871847859 871847862
871847868 871847872
871847885 871847886
871920989 871920990
871963554 871963555
872014954 872014955
872019968 872019970
872020629 872020631
872047421 872047423
872049096 872049098
872104001 872104003
872128631 872128633
872167791 872167792
872171048 872171050
872201842 872201844
872242604 872242605
872263028 872263030
872348461 872348463
872373274 872373275
872415263 872415265
872415562 872415564
872436590 872436592
872458966 872458967
872515649 872515650
872530462 872530464
872545307 872545309
872564699 872564700
872587367 872587370
872626263 872626264
872635370 872635371
872643802 872643804
872645369 872645370
872645694 872645696
872706972 872706973
872709124 872709126
872720187 872720189
872731826 872731828
872871903 872871905
872885772 872885774
872953141 872953142
872979807 872979808
873039706 873039708
873053064 873053065
873060204 873060205
873081668 873081670
873119804 873119805
873135609 873135612
873137079 873137080
873141122 873141124
873145472 873145475
873145508 873145509
873147577 873147578
873154650 873154651
873222863 873222864
873227462 873227464
873235506 873235508
873236136 873236138
873236318 873236319
873239429 873239431
873268220 873268223
873322102 873322104
873414329 873414330
873424756 873424758
873482085 873482086
873557852 873557854
873586081 873586082
873591203 873591204
873603479 873603481
873631800 873631802
873645313 873645314
873648749 873648750
873665978 873665980
873670119 873670120
873677305 873677306
873690899 873690901
873745623 873745625
873749335 873749337
873759400 873759401
873799460 873799462
873851106 873851108
873959137 873959139
873994944 873994945
874046825 874046827
874081754 874081756
874098316 874098318
874132567 874132569
874162756 874162758
874181607 874181608
874183223 874183224
874227036 874227038
874275439 874275440
874300697 874300699
874313464 874313466
874316938 874316940
874342400 874342402
874347701 874347703
874349484 874349486
874352760 874352761
874354144 874354145
874360687 874360688
874424651 874424654
874436901 874436903
874464192 874464194
874514095 874514097
874622925 874622927
874650124 874650126
874670817 874670819
874706781 874706783
874721694 874721696
874787743 874787744
874802188 874802189
874848010 874848011
874874541 874874543
874878344 874878345
874885172 874885173
874935190 874935192
874953585 874953587
