862356129 862356146
865090077 865090094
865090415 865090432
865090442 865090459
865090463 865090480
865090698 865090715
865114125 865114142
865122643 865122660
865131759 865131776
865392064 865392081
866150097 866150114
866185899 866185916
866368809 866368826
866731169 866731186
866740515 866740532
866746418 866746435
867696564 867696581
867696571 867696588
867696575 867696595
867696582 867696599
867696586 867696603
867696605 867696622
867696609 867696626
867696616 867696633
867696627 867696648
867696638 867696655
867696650 867696670
867696660 867696678
