815580748 815580749
815586555 815586556
815798537 815798538
815913216 815913217
815962841 815962842
816183194 816183195
816209619 816209620
816214256 816214257
816280915 816280918
817077861 817077862
817431059 817431078
817440419 817440467
817448819 817448851
817457459 817457465
817940320 817940321
818093543 818093544
818096087 818096088
818346866 818346867
818439003 818439004
818454116 818454117
818493659 818493699
818635045 818635046
818636580 818636581
818723648 818723649
818780219 818780247
818878586 818878587
819579926 819579927
819687419 819687464
819828899 819828918
819977551 819977552
820002955 820002956
820052975 820052976
820528762 820528763
820626138 820626139
820695681 820695682
820716196 820716197
820756090 820756091
821388576 821388577
821480155 821480156
821536061 821536062
821725822 821725823
822092530 822092531
824959241 824959242
825582018 825582019
827161514 827161515
827291900 827291901
827849246 827849247
828153416 828153417
828619901 828619902
829290941 829290945
829505279 829505305
829516019 829516028
830490891 830490892
830833523 830833524
831134434 831134435
831695891 831695895
831695913 831695916
831767879 831767924
832109384 832109385
832284928 832284929
832296458 832296459
833425456 833425457
833580716 833580717
834189236 834189237
834323002 834323003
834524291 834524292
834731727 834731728
834873850 834873851
835009415 835009416
835039738 835039739
835848164 835848165
835954346 835954347
836259729 836259730
836356484 836356485
836395969 836395970
836426862 836426863
836782093 836782094
837078634 837078635
837322042 837322043
837456779 837456838
837600205 837600206
837642959 837643020
838242179 838242186
838242719 838242751
838373694 838373695
838406370 838406371
838413239 838413281
838415443 838415444
838894799 838894818
839256385 839256386
839680448 839680449
839721979 839721980
840039698 840039699
840238345 840238346
840336352 840336353
840373123 840373124
840502639 840502640
840740762 840740763
840996056 840996057
841046798 841046799
841236741 841236742
842385189 842385190
842821927 842821928
842928276 842928277
843604922 843604923
843744542 843744543
843753472 843753473
844348106 844348107
845590661 845590662
846421079 846421100
847753434 847753435
847955160 847955161
847998479 847998482
848069475 848069478
848330601 848330602
848673458 848673459
849213047 849213048
849214802 849214803
849908418 849908419
850066775 850066776
850137785 850137786
850187444 850187445
852323455 852323456
853272983 853272984
856135778 856135779
856201784 856201785
856383013 856383014
856544305 856544306
856571537 856571540
856778897 856778898
857169285 857169286
857767051 857767052
858185008 858185009
858594476 858594477
858973812 858973813
859078193 859078194
859085182 859085183
859852118 859852119
860710824 860710825
860921076 860921077
861158551 861158552
862177047 862177048
863053275 863053276
863637351 863637352
865490998 865490999
866172796 866172797
867766563 867766564
868054800 868054801
869413836 869413837
871158599 871158630
871243438 871243439
871392601 871392602
871432679 871432718
871446179 871446239
871456499 871456509
871468139 871468146
871478039 871478060
871515839 871515898
871539479 871539537
871551179 871551210
871560179 871560197
871566359 871566370
871601519 871601531
871629359 871629389
871639919 871639933
872201841 872201844
873141122 873141123
873147576 873147577
875104060 875104061
