847640886 847669683
847735176 847735177
847735187 847763987
847906916 847906917
847906921 847931563
848080150 848105402
848155933 848184718
848676369 848705166
849032902 849049517
850501788 850520339
850575525 850606884
850662007 850690801
850694004 850695923
853515394 853545557
853601357 853601358
853601366 853630163
853687598 853716393
856127095 856141492
860504225 860539664
860874747 860888458
861109408 861138204
