849307929 849307946
850001210 850001227
850005570 850005587
850016556 850016573
852016414 852016431
852632923 852632940
852917643 852917660
853041246 853041263
853298133 853298150
853309700 853309717
853953454 853953471
854310572 854310589
854642032 854642049
855047333 855047350
855294897 855294914
856372256 856372273
857131829 857131846
857131868 857131885
857227374 857227391
857309955 857309972
857325327 857325344
857480467 857480484
857548667 857548684
857590716 857590733
857763137 857763154
857849569 857849586
857850587 857850604
857863356 857863373
857866047 857866064
858563162 858563179
859095589 859095606
859574548 859574565
859642233 859642250
859726896 859726913
859877364 859877381
859948975 859948992
860330794 860330811
860575662 860575679
860828017 860828034
860884288 860884305
860884971 860884988
860886303 860886320
860946345 860946362
861222998 861223015
861226434 861226451
861227285 861227302
861227517 861227534
861227820 861227837
861232185 861232202
861239027 861239044
861239164 861239181
861249993 861250010
861265339 861265356
861306367 861306384
861503435 861503452
861662259 861662276
861713021 861713038
861775021 861775038
861994114 861994131
