L1:IMC-F_OUT_DQ 16384
L1:IMC-L_OUT_DQ 16384
L1:IMC-X_DQ 16384
L1:IMC-REFL_DC_IN1_DQ 16384
L1:IMC-REFL_DC_OUT_DQ 16384
L1:OAF-CAL_IMC_X_DQ 2048
L1:OAF-CAL_IMC_F_DQ 2048
L1:PSL-ISS_PDB_OUT_DQ 32768
L1:PSL-ISS_PDA_OUT_DQ 32768
L1:PSL-PMC_HV_MON_OUT_DQ 32768
L1:PSL-PMC_MIXER_OUT_DQ 32768
L1:PSL-FSS_FAST_MON_OUT_DQ 32768
L1:PSL-FSS_MIXER_OUT_DQ 32768
L1:PSL-FSS_PC_MON_OUT_DQ 32768
L1:LSC-MICH_IN1_DQ 16384
L1:LSC-MICH_OUT_DQ 16384
L1:LSC-PRCL_IN1_DQ 16384
L1:LSC-PRCL_OUT_DQ 16384
L1:LSC-SRCL_IN1_DQ 16384
L1:LSC-SRCL_OUT_DQ 16384
L1:ASC-DOF1_P_IN1_DQ 2048
L1:ASC-DOF1_P_OUT_DQ 2048
L1:ASC-DOF1_Y_IN1_DQ 2048
L1:ASC-DOF1_Y_OUT_DQ 2048
L1:ASC-DOF2_P_IN1_DQ 2048
L1:ASC-DOF2_P_OUT_DQ 2048
L1:ASC-DOF2_Y_IN1_DQ 2048
L1:ASC-DOF2_Y_OUT_DQ 2048
L1:ASC-DOF3_P_IN1_DQ 2048
L1:ASC-DOF3_P_OUT_DQ 2048
L1:ASC-DOF3_Y_IN1_DQ 2048
L1:ASC-DOF3_Y_OUT_DQ 2048
L1:ASC-DOF4_P_IN1_DQ 2048
L1:ASC-DOF4_P_OUT_DQ 2048
L1:ASC-DOF4_Y_IN1_DQ 2048
L1:ASC-DOF4_Y_OUT_DQ 2048
L1:ASC-DOF5_P_IN1_DQ 2048
L1:ASC-DOF5_P_OUT_DQ 2048
L1:ASC-DOF5_Y_IN1_DQ 2048
L1:ASC-DOF5_Y_OUT_DQ 2048
L1:ASC-DOF6_P_IN1_DQ 2048
L1:ASC-DOF6_P_OUT_DQ 2048
L1:ASC-DOF6_Y_IN1_DQ 2048
L1:ASC-DOF6_Y_OUT_DQ 2048
L1:ASC-DOF7_P_IN1_DQ 2048
L1:ASC-DOF7_P_OUT_DQ 2048
L1:ASC-DOF7_Y_IN1_DQ 2048
L1:ASC-DOF7_Y_OUT_DQ 2048
