862090393 862090410
862092006 862092023
862092315 862092332
862092332 862092349
862092454 862092471
862093093 862093110
862094241 862094258
862129106 862129123
862129452 862129469
862129688 862129705
862130258 862130275
862131076 862131093
862131485 862131502
862132772 862132789
862133360 862133377
862135493 862135510
862137597 862137614
862138580 862138597
862138788 862138805
862140748 862140765
862152733 862152750
862154119 862154136
862210034 862210051
862210119 862210136
862210179 862210196
862226162 862226179
862226239 862226256
862227075 862227092
862231336 862231353
862231619 862231636
862235857 862235874
862244248 862244265
862245625 862245642
862245895 862245912
862342272 862342289
862346023 862346040
862357024 862357041
862364772 862364789
862386846 862386863
862418291 862418308
862437145 862437162
862471168 862471185
862479335 862479352
862560453 862560470
862571535 862571552
862575037 862575054
862584556 862584573
862605030 862605047
862630371 862630388
862645771 862645788
862653359 862653376
862668949 862668966
862694603 862694620
862695197 862695214
862697613 862697630
862697886 862697903
862698016 862698033
862698201 862698218
862701907 862701924
862702215 862702232
862707324 862707341
862708436 862708453
862713709 862713726
862715653 862715670
862717289 862717306
862719058 862719075
862719287 862719304
862721806 862721823
862722049 862722066
862754361 862754378
862766933 862766950
862769323 862769340
862775058 862775075
862831598 862831615
862856540 862856557
862868816 862868833
862875167 862875184
862886552 862886569
862916656 862916673
862920214 862920231
862932423 862932440
862939410 862939427
862959914 862959931
863046691 863046708
863067271 863067288
863147152 863147169
863150417 863150434
863160357 863160374
863166314 863166331
863168023 863168040
863169542 863169559
863209727 863209744
863210887 863210904
863211077 863211094
863233188 863233205
863233240 863233257
863233370 863233387
863234455 863234472
863236186 863236203
863236209 863236226
863236442 863236459
863239061 863239078
863239181 863239198
863239335 863239352
863240112 863240129
863241321 863241338
863242893 863242910
863243014 863243031
863243650 863243667
863244652 863244669
863252450 863252467
863253509 863253526
863256714 863256731
863259079 863259096
863262300 863262317
863295431 863295448
863295714 863295731
863295925 863295942
863295982 863295999
863296042 863296059
863296083 863296100
863296227 863296244
863296649 863296666
863296771 863296788
863297005 863297022
863297112 863297129
863297434 863297451
863297526 863297543
863297557 863297574
863297691 863297708
863298430 863298447
863298612 863298629
863299088 863299105
863299143 863299160
863299238 863299255
863299322 863299339
863299439 863299456
863299542 863299559
863299590 863299607
863299880 863299897
863299922 863299939
863302809 863302826
863302826 863302843
863303086 863303103
863303135 863303152
863303226 863303243
863303449 863303466
863304007 863304024
863304743 863304760
863304848 863304865
863304893 863304910
863304961 863304978
863305003 863305020
863305338 863305355
863308162 863308179
863308582 863308599
863308692 863308709
863308913 863308930
863309457 863309474
863309748 863309765
863310538 863310555
863310690 863310707
863310704 863310721
863310975 863310992
863312306 863312323
863312552 863312569
863313270 863313287
863313810 863313827
863319181 863319198
863319631 863319648
863319771 863319788
863322645 863322662
863324718 863324735
863326382 863326399
863330943 863330960
863336597 863336614
863369021 863369038
863385100 863385117
863396054 863396071
863414999 863415016
863429469 863429486
863465213 863465230
863479365 863479382
863479804 863479821
863481050 863481067
863483219 863483236
863564921 863564938
863570274 863570291
863613398 863613415
863638959 863638976
863645498 863645515
863659107 863659124
863659801 863659818
863660136 863660153
863663768 863663785
863664279 863664296
863671422 863671439
863674141 863674158
863699608 863699625
863723566 863723583
863727115 863727132
863731562 863731579
863732386 863732403
863734200 863734217
863738816 863738833
863752577 863752594
863755222 863755239
863766625 863766642
863774266 863774283
863788851 863788868
863808791 863808808
863811142 863811159
863820537 863820554
863820724 863820741
863823107 863823124
863823192 863823209
863824739 863824756
863837616 863837633
863838215 863838232
863850423 863850440
863905242 863905259
863905474 863905491
863912089 863912106
863917321 863917338
863918951 863918968
863922210 863922227
863923636 863923653
863924516 863924533
863929729 863929746
863931058 863931075
863939409 863939426
863940197 863940214
863942883 863942900
863956944 863956961
863962821 863962838
864031579 864031596
864053608 864053625
864076632 864076649
864141728 864141745
864154217 864154234
864208575 864208592
864220499 864220516
864226040 864226057
864258326 864258343
864288731 864288748
864293529 864293546
864313537 864313554
864316994 864317011
864323889 864323906
864365965 864365982
864383257 864383274
864464246 864464263
864469751 864469768
864519322 864519339
864529695 864529712
864534531 864534548
864548803 864548820
864560018 864560035
864575714 864575731
864667415 864667432
864699889 864699906
864800968 864800985
864829909 864829926
864856245 864856262
864906849 864906866
864916882 864916899
864924239 864924256
864953084 864953101
864961866 864961883
864982557 864982574
865053055 865053072
865055920 865055937
865101637 865101654
865101643 865101660
865101658 865101675
865101903 865101920
865101929 865101946
865101937 865101954
865102016 865102033
865102038 865102055
865102186 865102203
865102193 865102210
865102307 865102324
865102445 865102462
865102468 865102485
865102482 865102499
865102569 865102586
865102579 865102596
865102595 865102612
865102617 865102634
865102667 865102684
865102679 865102696
865102744 865102762
865102751 865102768
865102815 865102832
865102914 865102931
865102942 865102959
865103016 865103033
865103119 865103136
865103162 865103179
865103243 865103260
865103396 865103413
865103458 865103475
865103527 865103544
865103545 865103562
865103582 865103599
865103617 865103634
865103681 865103698
865103767 865103784
865103807 865103824
865103910 865103927
865104008 865104025
865104029 865104046
865104097 865104114
865104183 865104200
865104282 865104299
865104522 865104539
865104595 865104612
865104668 865104685
865104817 865104834
865105230 865105247
865105378 865105395
865115313 865115330
865115349 865115366
865115391 865115408
865116383 865116400
865116587 865116604
865116649 865116666
865117269 865117286
865120455 865120472
865122023 865122040
865129509 865129526
865130609 865130626
865131062 865131079
865134302 865134319
865143636 865143653
865156338 865156355
865159512 865159529
865190834 865190851
865295747 865295764
865303528 865303545
865314767 865314784
865332803 865332820
865394059 865394076
865402660 865402677
865415227 865415244
865445717 865445734
865466401 865466418
865480165 865480182
865484180 865484197
865538119 865538136
865577586 865577603
865579769 865579786
865724438 865724455
865725353 865725370
865741096 865741113
865812992 865813009
865823869 865823886
865828502 865828519
865833496 865833513
865833667 865833684
865845080 865845097
865847728 865847745
865854453 865854470
865865921 865865938
865867739 865867756
865882524 865882541
865898295 865898312
865928208 865928225
865934837 865934854
866078673 866078690
866078853 866078870
866096407 866096424
866116871 866116888
866136649 866136666
866149621 866149638
866175776 866175793
866208256 866208273
866278183 866278200
866319133 866319150
866319475 866319492
866320260 866320277
866320617 866320634
866320636 866320653
866320970 866320987
866321439 866321456
866322532 866322549
866322571 866322588
866323162 866323179
866323305 866323322
866324075 866324092
866325035 866325052
866325918 866325935
866346476 866346493
866347630 866347647
866349100 866349117
866365458 866365475
866375928 866375945
866401360 866401377
866401889 866401906
866409548 866409565
866439316 866439333
866441495 866441512
866444222 866444239
866448861 866448878
866450202 866450219
866454388 866454405
866470366 866470383
866484678 866484696
866485706 866485723
866487202 866487219
866487271 866487288
866496317 866496334
866498333 866498350
866524814 866524831
866534101 866534118
866542378 866542395
866543160 866543177
866545801 866545818
866552117 866552134
866552931 866552948
866564659 866564676
866590890 866590907
866614186 866614203
866621744 866621761
866641961 866641978
866662376 866662393
866679697 866679714
866680781 866680798
866690398 866690415
866716810 866716827
866723683 866723700
866761201 866761218
866795347 866795364
866803715 866803732
866823128 866823145
866833491 866833508
866844675 866844692
866864133 866864150
866874895 866874912
866894291 866894308
866960409 866960426
866972018 866972035
867006400 867006417
867050921 867050938
867053099 867053116
867150572 867150589
867185877 867185894
867236947 867236964
867353946 867353963
867368062 867368079
867398613 867398630
867407988 867408005
867408604 867408621
867441815 867441832
867604388 867604405
867620690 867620707
867623146 867623163
867624964 867624981
867626609 867626626
867658613 867658630
867687499 867687516
867689891 867689908
867706537 867706554
867726408 867726425
867756192 867756209
867787170 867787187
867818459 867818476
867833973 867833990
867854214 867854231
867854857 867854874
867859999 867860016
867861784 867861801
867874196 867874213
867914555 867914572
867926884 867926901
867940843 867940860
867956932 867956949
867960111 867960128
867968430 867968447
867982931 867982948
868078102 868078119
868086110 868086127
868100212 868100229
868101749 868101766
868146175 868146192
868174940 868174957
868258688 868258705
868270207 868270224
868308098 868308115
868348519 868348536
868357829 868357846
868433060 868433077
868456567 868456584
868511412 868511429
868529073 868529090
868555786 868555803
868595746 868595763
868606373 868606390
868609467 868609484
868801393 868801410
868802245 868802262
868805598 868805615
868835801 868835818
868989192 868989209
869044028 869044045
869080148 869080165
869091675 869091692
869123926 869123943
869193675 869193692
869203885 869203902
869216403 869216420
869232925 869232942
869273127 869273144
869315252 869315269
869352683 869352700
869375622 869375639
869391765 869391782
869396329 869396346
869400747 869400764
869476656 869476673
869542712 869542729
869576150 869576167
869597854 869597871
869623627 869623644
869685972 869685989
869694878 869694895
869712431 869712448
869803657 869803674
869814484 869814501
869825012 869825029
869829934 869829951
869853551 869853568
869854554 869854571
869873579 869873596
869890899 869890916
869893775 869893792
869907902 869907919
869916645 869916662
869972617 869972634
869975001 869975018
869977426 869977443
870088090 870088107
870088603 870088620
870098004 870098021
870130861 870130878
870169218 870169235
870307460 870307477
870317094 870317111
870350889 870350906
870357197 870357214
870375001 870375018
870404151 870404168
870453361 870453378
870454658 870454675
870498045 870498062
870511437 870511454
870555257 870555274
870563452 870563469
870584928 870584945
870592055 870592072
870605058 870605075
870665352 870665369
870665545 870665562
870666354 870666371
870666613 870666630
870666667 870666684
870667207 870667224
870667323 870667340
870668230 870668247
870668588 870668605
870669293 870669310
870669673 870669690
870669714 870669731
870669733 870669750
870669746 870669763
870669755 870669772
870670821 870670838
870672072 870672089
870672288 870672305
870672351 870672368
870680381 870680398
870680621 870680638
870680782 870680799
870683151 870683168
870686530 870686547
870688969 870688986
870695411 870695428
870696269 870696286
870696713 870696730
870699542 870699559
870700742 870700759
870700973 870700990
870701614 870701631
870702810 870702827
870725879 870725896
870730631 870730648
870809666 870809683
870814257 870814274
870823961 870823978
870832429 870832446
870842091 870842108
870868492 870868509
870905893 870905910
870910471 870910488
870922210 870922227
870939608 870939625
870940854 870940871
871034604 871034621
871041458 871041475
871050803 871050820
871065076 871065093
871180638 871180655
871180708 871180725
871180774 871180791
871180841 871180858
871181524 871181541
871181550 871181567
871181826 871181843
871181884 871181901
871182005 871182022
871182077 871182094
871182230 871182247
871182421 871182438
871182526 871182543
871182589 871182606
871182722 871182739
871184616 871184633
871184759 871184776
871185249 871185266
871185469 871185486
871185714 871185731
871185741 871185758
871185986 871186003
871186562 871186579
871187222 871187239
871187379 871187396
871187491 871187508
871187533 871187550
871188226 871188243
871188876 871188893
871189401 871189418
871189627 871189644
871190358 871190375
871191018 871191035
871191066 871191083
871191617 871191634
871193468 871193485
871193555 871193572
871194483 871194500
871196613 871196630
871197747 871197764
871199396 871199413
871199588 871199605
871202044 871202061
871202567 871202584
871210245 871210262
871214484 871214501
871218401 871218418
871235050 871235067
871327889 871327906
871348766 871348783
871432789 871432806
871433132 871433149
871457689 871457706
871499164 871499181
871523273 871523290
871697475 871697492
871765924 871765941
871775538 871775555
871809364 871809381
871814905 871814922
871838670 871838687
871839885 871839902
871883145 871883162
871883388 871883405
871888628 871888645
871909006 871909023
871936747 871936764
871943023 871943040
871965777 871965794
871971310 871971327
871978731 871978748
871988270 871988287
871994209 871994226
872002827 872002844
872009261 872009278
872009267 872009284
872009273 872009290
872009279 872009296
872009336 872009353
872009407 872009424
872009426 872009443
872009430 872009447
872009443 872009460
872009506 872009523
872009521 872009538
872009536 872009553
872009589 872009606
872009676 872009693
872009709 872009726
872009725 872009742
872009776 872009793
872009812 872009832
872009822 872009839
872009867 872009884
872009923 872009940
872010151 872010168
872010253 872010270
872010272 872010289
872010325 872010342
872010339 872010356
872010372 872010389
872010410 872010427
872010498 872010515
872010540 872010557
872010651 872010668
872010808 872010825
872010816 872010833
872010851 872010868
872010871 872010888
872010904 872010921
872010966 872010983
872011007 872011024
872011069 872011086
872011315 872011332
872011445 872011462
872011466 872011483
872011486 872011503
872011860 872011877
872012028 872012045
872012216 872012233
872012275 872012292
872012456 872012473
872012554 872012571
872012814 872012831
872013066 872013083
872013098 872013115
872013340 872013357
872013916 872013933
872014144 872014161
872014307 872014324
872014940 872014957
872015197 872015214
872015245 872015262
872015614 872015631
872016022 872016039
872016430 872016447
872016473 872016490
872016604 872016621
872016835 872016852
872016851 872016868
872017003 872017020
872017495 872017512
872019344 872019361
872019820 872019837
872020616 872020633
872020786 872020803
872022605 872022622
872022912 872022929
872023058 872023075
872028614 872028631
872029507 872029524
872034437 872034454
872043401 872043418
872044937 872044954
872045650 872045667
872063259 872063276
872081903 872081920
872115714 872115731
872149071 872149088
872149437 872149454
872164144 872164161
872177871 872177888
872181998 872182015
872187615 872187632
872199137 872199154
872223003 872223020
872234623 872234640
872243369 872243386
872258550 872258567
872293976 872293993
872334731 872334748
872402155 872402172
872406214 872406231
872483135 872483152
872494119 872494136
872508133 872508150
872559540 872559557
872574758 872574775
872578243 872578260
872641684 872641701
872645218 872645235
872652427 872652444
872662271 872662288
872672865 872672882
872727871 872727888
872748048 872748065
872748706 872748723
872830097 872830114
872897310 872897327
872903426 872903443
872931782 872931799
873002449 873002466
873040760 873040777
873104319 873104336
873170985 873171002
873179298 873179315
873195142 873195159
873235085 873235102
873256756 873256773
873266840 873266857
873271307 873271324
873288587 873288604
873331724 873331741
873333727 873333744
873342028 873342045
873379429 873379446
873408517 873408534
873409970 873409987
873422562 873422579
873440210 873440227
873453073 873453090
873453265 873453282
873513049 873513066
873556115 873556132
873575821 873575838
873575847 873575864
873575864 873575881
873575943 873575960
873576003 873576020
873576094 873576111
873576138 873576155
873576448 873576465
873576613 873576630
873576688 873576705
873576707 873576724
873576737 873576754
873576762 873576779
873577045 873577062
873577136 873577153
873577159 873577176
873577188 873577205
873577242 873577259
873577276 873577293
873577301 873577318
873577457 873577474
873577668 873577685
873577754 873577771
873577802 873577819
873577825 873577842
873577892 873577909
873577896 873577913
873577947 873577964
873578079 873578096
873578085 873578102
873578123 873578140
873578246 873578263
873578315 873578332
873578336 873578353
873578420 873578437
873578534 873578551
873578573 873578590
873579067 873579084
873579123 873579140
873579241 873579258
873579509 873579526
873579655 873579672
873579814 873579831
873579830 873579847
873580071 873580088
873580283 873580300
873580293 873580310
873580306 873580323
873580430 873580447
873580438 873580455
873580876 873580893
873581097 873581114
873581144 873581161
873581202 873581219
873582646 873582663
873582667 873582684
873582693 873582710
873582771 873582788
873582780 873582797
873583310 873583327
873583664 873583681
873583733 873583750
873583800 873583817
873584009 873584026
873584060 873584077
873584691 873584708
873585093 873585110
873585687 873585704
873585721 873585738
873586240 873586257
873586546 873586563
873586589 873586606
873586786 873586803
873586830 873586847
873586961 873586978
873587234 873587251
873587283 873587300
873587574 873587591
873587737 873587754
873588624 873588641
873590709 873590726
873590785 873590802
873591107 873591124
873591806 873591823
873592457 873592474
873592740 873592757
873592905 873592922
873593307 873593324
873594768 873594785
873597533 873597550
873605063 873605080
873616641 873616658
873630053 873630070
873663752 873663769
873713410 873713427
873714643 873714660
873715334 873715351
873715711 873715728
873743158 873743175
873756196 873756213
873759455 873759472
873759771 873759788
873760806 873760823
873760829 873760846
873765574 873765591
873767127 873767144
873768852 873768869
873778637 873778654
873783875 873783892
873830430 873830447
873868285 873868302
873911560 873911577
873940461 873940478
873972372 873972389
873981870 873981887
873986908 873986925
873996016 873996033
873997972 873997989
874003739 874003756
874010437 874010454
874083242 874083259
874091168 874091185
874113053 874113070
874147069 874147086
874154580 874154597
874156547 874156564
874192868 874192885
874196917 874196934
874203043 874203060
874230793 874230810
874304889 874304906
874358506 874358523
874365824 874365841
874384258 874384275
874400222 874400239
874406282 874406299
874406429 874406446
874417074 874417091
874457706 874457723
874470538 874470555
874482114 874482131
874552894 874552911
874553198 874553215
874607418 874607435
874626963 874626980
874635732 874635749
874652716 874652733
874658157 874658174
874660408 874660425
874670652 874670669
874685023 874685040
874692150 874692167
874694374 874694391
874696710 874696727
874699635 874699652
874703429 874703446
874716494 874716511
874718893 874718910
874726364 874726381
874728191 874728208
874742343 874742360
874750649 874750666
874752946 874752963
874754109 874754126
874795660 874795677
874823530 874823547
874875893 874875910
874877377 874877394
874896136 874896153
874908389 874908406
874915512 874915529
874926961 874926978
874971637 874971654
874991322 874991339
875036440 875036457
875062673 875062690
875121722 875121739
875125780 875125797
875130555 875130572
875133872 875133889
875138474 875138491
875194190 875194207
875215854 875215871
875220425 875220442
