817420778 817420795
817421100 817421117
817534455 817534472
817703473 817703490
817704888 817704905
818459628 818459645
818803900 818803917
819917808 819917825
820446927 820446944
821748018 821748035
821827799 821827816
821828728 821828745
822779882 822779899
823036778 823036795
825439267 825439284
825697369 825697386
825974409 825974426
825979611 825979628
826045177 826045194
826045728 826045745
826045746 826045763
826056799 826056816
826214618 826214635
826326463 826326480
826337347 826337364
826474275 826474292
826475109 826475126
826475173 826475190
826485016 826485033
826485184 826485201
826485551 826485568
826578171 826578188
826587021 826587038
826649726 826649743
826655778 826655795
826659737 826659754
826666311 826666328
826675375 826675392
826679159 826679176
827165374 827165391
827249036 827249053
827285152 827285169
827627073 827627090
827876594 827876611
827882279 827882296
827886100 827886117
828234122 828234139
828993357 828993374
829279040 829279057
829347153 829347170
829510852 829510869
829511484 829511502
829511854 829511871
829512966 829512983
829525239 829525256
829668420 829668437
829670319 829670336
829685739 829685756
829690723 829690740
829940717 829940734
830102066 830102083
830104522 830104539
830125755 830125772
830145263 830145281
830284003 830284020
830289429 830289446
830549525 830549542
830616396 830616413
830616470 830616487
830616624 830616641
830723233 830723250
830792840 830792857
830806603 830806620
831134076 831134093
