   --mass1 1.44   --mass2 1.4   --ra 0.7853981633974483   --dec 1.1596584644725487   --theta_jn 0.2   --psi 1.5707963267948966   --phase 1.5707963267948966   --geocent_time 630696093        --luminosity_distance 60.52887134412343
   --mass1 1.44   --mass2 1.4   --ra 2.356194490192345   --dec 1.1596584644725487   --theta_jn 0.2   --psi 1.5707963267948966   --phase 1.5707963267948966   --geocent_time 630696093        --luminosity_distance 103.43345223843593
   --mass1 1.44   --mass2 1.4   --ra 3.9269908169872414   --dec 1.1596584644725487   --theta_jn 0.2   --psi 1.5707963267948966   --phase 1.5707963267948966   --geocent_time 630696093        --luminosity_distance 144.72515709853235
   --mass1 1.44   --mass2 1.4   --ra 5.497787143782138   --dec 1.1596584644725487   --theta_jn 0.2   --psi 1.5707963267948966   --phase 1.5707963267948966   --geocent_time 630696093        --luminosity_distance 116.85287939380554
   --mass1 1.44   --mass2 1.4   --ra 0.39269908169872414   --dec 0.7297276562269662   --theta_jn 0.2   --psi 1.5707963267948966   --phase 1.5707963267948966   --geocent_time 630696093        --luminosity_distance 45.93652268743432
   --mass1 1.44   --mass2 1.4   --ra 1.1780972450961724   --dec 0.7297276562269662   --theta_jn 0.2   --psi 1.5707963267948966   --phase 1.5707963267948966   --geocent_time 630696093        --luminosity_distance 37.6222062401923
   --mass1 1.44   --mass2 1.4   --ra 1.9634954084936205   --dec 0.7297276562269662   --theta_jn 0.2   --psi 1.5707963267948966   --phase 1.5707963267948966   --geocent_time 630696093        --luminosity_distance 78.97789202399727
   --mass1 1.44   --mass2 1.4   --ra 2.748893571891069   --dec 0.7297276562269662   --theta_jn 0.2   --psi 1.5707963267948966   --phase 1.5707963267948966   --geocent_time 630696093        --luminosity_distance 91.0399834154133
   --mass1 1.44   --mass2 1.4   --ra 3.534291735288517   --dec 0.7297276562269662   --theta_jn 0.2   --psi 1.5707963267948966   --phase 1.5707963267948966   --geocent_time 630696093        --luminosity_distance 138.26337524007204
   --mass1 1.44   --mass2 1.4   --ra 4.319689898685965   --dec 0.7297276562269662   --theta_jn 0.2   --psi 1.5707963267948966   --phase 1.5707963267948966   --geocent_time 630696093        --luminosity_distance 154.33934498055956
   --mass1 1.44   --mass2 1.4   --ra 5.105088062083414   --dec 0.7297276562269662   --theta_jn 0.2   --psi 1.5707963267948966   --phase 1.5707963267948966   --geocent_time 630696093        --luminosity_distance 124.68037184195195
   --mass1 1.44   --mass2 1.4   --ra 5.890486225480861   --dec 0.7297276562269662   --theta_jn 0.2   --psi 1.5707963267948966   --phase 1.5707963267948966   --geocent_time 630696093        --luminosity_distance 90.19708535301287
   --mass1 1.44   --mass2 1.4   --ra 0.0   --dec 0.3398369094541218   --theta_jn 0.2   --psi 1.5707963267948966   --phase 1.5707963267948966   --geocent_time 630696093        --luminosity_distance 77.18991062174071
   --mass1 1.44   --mass2 1.4   --ra 0.7853981633974483   --dec 0.3398369094541218   --theta_jn 0.2   --psi 1.5707963267948966   --phase 1.5707963267948966   --geocent_time 630696093        --luminosity_distance 61.47878150330185
   --mass1 1.44   --mass2 1.4   --ra 1.5707963267948966   --dec 0.3398369094541218   --theta_jn 0.2   --psi 1.5707963267948966   --phase 1.5707963267948966   --geocent_time 630696093        --luminosity_distance 83.46909287443013
   --mass1 1.44   --mass2 1.4   --ra 2.356194490192345   --dec 0.3398369094541218   --theta_jn 0.2   --psi 1.5707963267948966   --phase 1.5707963267948966   --geocent_time 630696093        --luminosity_distance 39.7583815024193
   --mass1 1.44   --mass2 1.4   --ra 3.141592653589793   --dec 0.3398369094541218   --theta_jn 0.2   --psi 1.5707963267948966   --phase 1.5707963267948966   --geocent_time 630696093        --luminosity_distance 91.86795124536438
   --mass1 1.44   --mass2 1.4   --ra 3.926990816987241   --dec 0.3398369094541218   --theta_jn 0.2   --psi 1.5707963267948966   --phase 1.5707963267948966   --geocent_time 630696093        --luminosity_distance 135.38773698945207
   --mass1 1.44   --mass2 1.4   --ra 4.71238898038469   --dec 0.3398369094541218   --theta_jn 0.2   --psi 1.5707963267948966   --phase 1.5707963267948966   --geocent_time 630696093        --luminosity_distance 126.42267035730852
   --mass1 1.44   --mass2 1.4   --ra 5.497787143782138   --dec 0.3398369094541218   --theta_jn 0.2   --psi 1.5707963267948966   --phase 1.5707963267948966   --geocent_time 630696093        --luminosity_distance 68.2782307505877
   --mass1 1.44   --mass2 1.4   --ra 0.39269908169872414   --dec 0.0   --theta_jn 0.2   --psi 1.5707963267948966   --phase 1.5707963267948966   --geocent_time 630696093        --luminosity_distance 99.18994495453715
   --mass1 1.44   --mass2 1.4   --ra 1.1780972450961724   --dec 0.0   --theta_jn 0.2   --psi 1.5707963267948966   --phase 1.5707963267948966   --geocent_time 630696093        --luminosity_distance 108.72744191208669
   --mass1 1.44   --mass2 1.4   --ra 1.9634954084936205   --dec 0.0   --theta_jn 0.2   --psi 1.5707963267948966   --phase 1.5707963267948966   --geocent_time 630696093        --luminosity_distance 75.83528888350526
   --mass1 1.44   --mass2 1.4   --ra 2.748893571891069   --dec 0.0   --theta_jn 0.2   --psi 1.5707963267948966   --phase 1.5707963267948966   --geocent_time 630696093        --luminosity_distance 39.259163995949244
   --mass1 1.44   --mass2 1.4   --ra 3.534291735288517   --dec 0.0   --theta_jn 0.2   --psi 1.5707963267948966   --phase 1.5707963267948966   --geocent_time 630696093        --luminosity_distance 99.18994495453715
   --mass1 1.44   --mass2 1.4   --ra 4.319689898685965   --dec 0.0   --theta_jn 0.2   --psi 1.5707963267948966   --phase 1.5707963267948966   --geocent_time 630696093        --luminosity_distance 108.72744191077973
   --mass1 1.44   --mass2 1.4   --ra 5.105088062083414   --dec 0.0   --theta_jn 0.2   --psi 1.5707963267948966   --phase 1.5707963267948966   --geocent_time 630696093        --luminosity_distance 75.83528889147289
   --mass1 1.44   --mass2 1.4   --ra 5.890486225480861   --dec 0.0   --theta_jn 0.2   --psi 1.5707963267948966   --phase 1.5707963267948966   --geocent_time 630696093        --luminosity_distance 39.25916398971766
   --mass1 1.44   --mass2 1.4   --ra 0.0   --dec -0.33983690945412204   --theta_jn 0.2   --psi 1.5707963267948966   --phase 1.5707963267948966   --geocent_time 630696093        --luminosity_distance 91.86795124232664
   --mass1 1.44   --mass2 1.4   --ra 0.7853981633974483   --dec -0.33983690945412204   --theta_jn 0.2   --psi 1.5707963267948966   --phase 1.5707963267948966   --geocent_time 630696093        --luminosity_distance 135.38773696998368
   --mass1 1.44   --mass2 1.4   --ra 1.5707963267948966   --dec -0.33983690945412204   --theta_jn 0.2   --psi 1.5707963267948966   --phase 1.5707963267948966   --geocent_time 630696093        --luminosity_distance 126.42267035270102
   --mass1 1.44   --mass2 1.4   --ra 2.356194490192345   --dec -0.33983690945412204   --theta_jn 0.2   --psi 1.5707963267948966   --phase 1.5707963267948966   --geocent_time 630696093        --luminosity_distance 68.27823074749682
   --mass1 1.44   --mass2 1.4   --ra 3.141592653589793   --dec -0.33983690945412204   --theta_jn 0.2   --psi 1.5707963267948966   --phase 1.5707963267948966   --geocent_time 630696093        --luminosity_distance 77.18991062174071
   --mass1 1.44   --mass2 1.4   --ra 3.926990816987241   --dec -0.33983690945412204   --theta_jn 0.2   --psi 1.5707963267948966   --phase 1.5707963267948966   --geocent_time 630696093        --luminosity_distance 61.47878149996073
   --mass1 1.44   --mass2 1.4   --ra 4.71238898038469   --dec -0.33983690945412204   --theta_jn 0.2   --psi 1.5707963267948966   --phase 1.5707963267948966   --geocent_time 630696093        --luminosity_distance 83.46909287828939
   --mass1 1.44   --mass2 1.4   --ra 5.497787143782138   --dec -0.33983690945412204   --theta_jn 0.2   --psi 1.5707963267948966   --phase 1.5707963267948966   --geocent_time 630696093        --luminosity_distance 39.75838150241931
   --mass1 1.44   --mass2 1.4   --ra 0.39269908169872414   --dec -0.7297276562269666   --theta_jn 0.2   --psi 1.5707963267948966   --phase 1.5707963267948966   --geocent_time 630696093        --luminosity_distance 138.2633752471911
   --mass1 1.44   --mass2 1.4   --ra 1.1780972450961724   --dec -0.7297276562269666   --theta_jn 0.2   --psi 1.5707963267948966   --phase 1.5707963267948966   --geocent_time 630696093        --luminosity_distance 154.3393449918711
   --mass1 1.44   --mass2 1.4   --ra 1.9634954084936205   --dec -0.7297276562269666   --theta_jn 0.2   --psi 1.5707963267948966   --phase 1.5707963267948966   --geocent_time 630696093        --luminosity_distance 124.6803718377058
   --mass1 1.44   --mass2 1.4   --ra 2.748893571891069   --dec -0.7297276562269666   --theta_jn 0.2   --psi 1.5707963267948966   --phase 1.5707963267948966   --geocent_time 630696093        --luminosity_distance 90.19708535052776
   --mass1 1.44   --mass2 1.4   --ra 3.534291735288517   --dec -0.7297276562269666   --theta_jn 0.2   --psi 1.5707963267948966   --phase 1.5707963267948966   --geocent_time 630696093        --luminosity_distance 45.936522687434376
   --mass1 1.44   --mass2 1.4   --ra 4.319689898685965   --dec -0.7297276562269666   --theta_jn 0.2   --psi 1.5707963267948966   --phase 1.5707963267948966   --geocent_time 630696093        --luminosity_distance 37.622206252723345
   --mass1 1.44   --mass2 1.4   --ra 5.105088062083414   --dec -0.7297276562269666   --theta_jn 0.2   --psi 1.5707963267948966   --phase 1.5707963267948966   --geocent_time 630696093        --luminosity_distance 78.97789202631752
   --mass1 1.44   --mass2 1.4   --ra 5.890486225480861   --dec -0.7297276562269666   --theta_jn 0.2   --psi 1.5707963267948966   --phase 1.5707963267948966   --geocent_time 630696093        --luminosity_distance 91.03998341429516
   --mass1 1.44   --mass2 1.4   --ra 0.7853981633974483   --dec -1.1596584644725487   --theta_jn 0.2   --psi 1.5707963267948966   --phase 1.5707963267948966   --geocent_time 630696093        --luminosity_distance 144.72515709853235
   --mass1 1.44   --mass2 1.4   --ra 2.356194490192345   --dec -1.1596584644725487   --theta_jn 0.2   --psi 1.5707963267948966   --phase 1.5707963267948966   --geocent_time 630696093        --luminosity_distance 116.85287939380554
   --mass1 1.44   --mass2 1.4   --ra 3.9269908169872414   --dec -1.1596584644725487   --theta_jn 0.2   --psi 1.5707963267948966   --phase 1.5707963267948966   --geocent_time 630696093        --luminosity_distance 60.528871347503575
   --mass1 1.44   --mass2 1.4   --ra 5.497787143782138   --dec -1.1596584644725487   --theta_jn 0.2   --psi 1.5707963267948966   --phase 1.5707963267948966   --geocent_time 630696093        --luminosity_distance 103.43345223843593
