5.000000000000000888e+00 5.387721069011866030e-47
5.034693157380139006e+00 5.043408275439466430e-47
5.069627037794075974e+00 4.726651734906695189e-47
5.104803311530234922e+00 4.434728649930576620e-47
5.140223660466546995e+00 4.165227529069731620e-47
5.175889778150882137e+00 3.916009497712993382e-47
5.211803369882009207e+00 3.685174638157289065e-47
5.247966152791137873e+00 3.471032693865895460e-47
5.284379855924021818e+00 3.272077582389123527e-47
5.321046220323622400e+00 3.086965145432406204e-47
5.357966999113356721e+00 2.914493777014877139e-47
5.395143957580921246e+00 2.753587496593802905e-47
5.432578873262690955e+00 2.603281165454971365e-47
5.470273536028714467e+00 2.462707569340278557e-47
5.508229748168283813e+00 2.331086100040612564e-47
5.546449324476114384e+00 2.207712863499385671e-47
5.584934092339116418e+00 2.091951987439556135e-47
5.623685891823758887e+00 1.983228016104362316e-47
5.662706575764059558e+00 1.881019215882659183e-47
5.701998009850164806e+00 1.784851703056262790e-47
5.741562072717556475e+00 1.694294265195294530e-47
5.781400656036880470e+00 1.608953815929585610e-47
5.821515664604382856e+00 1.528471369449887316e-47
5.861909016432995223e+00 1.452518501414952861e-47
5.902582642844026672e+00 1.380046415248007577e-47
5.943538488559517496e+00 1.310905676834207865e-47
5.984778511795218137e+00 1.245632725215667964e-47
6.026304684354212071e+00 1.183977824891171522e-47
6.068118991721204836e+00 1.125710625142661422e-47
6.110223433157442763e+00 1.070618348583925142e-47
6.152620021796308514e+00 1.018504164659336588e-47
6.195310784739581855e+00 9.691857518253282361e-48
6.238297763154347919e+00 9.224939953680012536e-48
6.281583012370603569e+00 8.782718356483594835e-48
6.325168601979518357e+00 8.363732264037876294e-48
6.369056615932393584e+00 7.966622009418542665e-48
6.413249152640303485e+00 7.590120311954338450e-48
6.457748325074419427e+00 7.233044726450430809e-48
6.502556260867045523e+00 6.894290828987191999e-48
6.547675102413337278e+00 6.572826000254964092e-48
6.593107006973743189e+00 6.267683902033342142e-48
6.638854146777149801e+00 5.977959352138811085e-48
6.684918709124731961e+00 5.698832875933352062e-48
6.731302896494550936e+00 5.433721218299168717e-48
6.778008926646843513e+00 5.181960653941045833e-48
6.825039032730071398e+00 4.942827722210696904e-48
6.872395463387687364e+00 4.715642077664220818e-48
6.920080482865659022e+00 4.499763581803762060e-48
6.968096371120712895e+00 4.294589548832541998e-48
7.016445423929364544e+00 4.099552261587067755e-48
7.065129952997670770e+00 3.914116658423066938e-48
7.114152286071764308e+00 3.737778217279439629e-48
7.163514767049155907e+00 3.570060977499095946e-48
7.213219756090789581e+00 3.410515766850162985e-48
7.263269629733905219e+00 3.258718500938051749e-48
7.313666781005652595e+00 3.114268641494464786e-48
7.364413619537513611e+00 2.976787750639552187e-48
7.415512571680523024e+00 2.845918160094877143e-48
7.466966080621261881e+00 2.721321725638035422e-48
7.518776606498691173e+00 2.602678672118845360e-48
7.570946626521762646e+00 2.489686495985777543e-48
7.623478635087869826e+00 2.382058983830182891e-48
7.676375143902114395e+00 2.279525258185908332e-48
7.729638682097387914e+00 2.181828891407757661e-48
7.783271796355308858e+00 2.088727092776284689e-48
7.837277051027977670e+00 1.999989928548601796e-48
7.891657028260587126e+00 1.915399600568864651e-48
7.946414328114890679e+00 1.834749774802725318e-48
8.001551568693503924e+00 1.757844929313787727e-48
8.057071386265098667e+00 1.684499766319827334e-48
8.112976435390438112e+00 1.614538649381584442e-48
8.169269389049306440e+00 1.547795064144809520e-48
8.225952938768314127e+00 1.484111132147520414e-48
8.283029794749570129e+00 1.423337132126376429e-48
8.340502686000293764e+00 1.365331057624166102e-48
8.398374360463268573e+00 1.309958209965731659e-48
8.456647585148241220e+00 1.257090795914803164e-48
8.515325146264222766e+00 1.206607557986131188e-48
8.574409849352699453e+00 1.158393429280371650e-48
8.633904519421777835e+00 1.112339196781791975e-48
8.693812001081255403e+00 1.068341196602714788e-48
8.754135158678622020e+00 1.026301015902265540e-48
8.814876876436029463e+00 9.861252122848500404e-49
8.876040058588174020e+00 9.477250564129141063e-49
8.937627629521175621e+00 9.110162825986885526e-49
8.999642533912386000e+00 8.759188490006134473e-49
9.062087736871186294e+00 8.423567235384933247e-49
9.124966224080763411e+00 8.102576690411628808e-49
9.188281001940856285e+00 7.795530448487135984e-49
9.252035097711509337e+00 7.501776230301543703e-49
9.316231559657802919e+00 7.220694068336735051e-49
9.380873457195605170e+00 6.951694653478091932e-49
9.445963881038332843e+00 6.694217739169942672e-49
9.511505943344722880e+00 6.447730648233791982e-49
9.577502777867637818e+00 6.211726816999979942e-49
9.643957540103892612e+00 5.985724501560560931e-49
9.710873407445131278e+00 5.769265467030706511e-49
9.778253579329746259e+00 5.561913776707983428e-49
9.846101277395861828e+00 5.363254685246810708e-49
9.914419745635354886e+00 5.172893541365343262e-49
9.983212250548969990e+00 4.990454732735543124e-49
1.005248208130249488e+01 4.819970038470724667e-49
1.012223254988401777e+01 4.657663577866026880e-49
1.019246699126231981e+01 4.501772097659044861e-49
1.026318876354625864e+01 4.352020453920088861e-49
1.033440124814541505e+01 4.208146135394033907e-49
1.040610784993169524e+01 4.069898617860681332e-49
1.047831199740216412e+01 3.937038818816204496e-49
1.055101714284298176e+01 3.809338518771143975e-49
1.062422676249441267e+01 3.686579851427911923e-49
1.069794435671711241e+01 3.568554786462123508e-49
1.077217345015942129e+01 3.455064694039998696e-49
1.084691759192592109e+01 3.345919844339450197e-49
1.092218035574714108e+01 3.240939025320492581e-49
1.099796534015037253e+01 3.139949123196692472e-49
1.107427616863180120e+01 3.042784730582098919e-49
1.115111648982969150e+01 2.949287781084857971e-49
1.122848997769887447e+01 2.859307225895816521e-49
1.130640033168639569e+01 2.772698669900041750e-49
1.138485127690839782e+01 2.689324079950534349e-49
1.146384656432824833e+01 2.609051482287455707e-49
1.154338997093584673e+01 2.531754684556234093e-49
1.162348529992824453e+01 2.457312987998579025e-49
1.170413638089146957e+01 2.385610958154956949e-49
1.178534706998363824e+01 2.316538158140785733e-49
1.186712125011933594e+01 2.249988933634230865e-49
1.194946283115524999e+01 2.185862186754443752e-49
1.203237575007712579e+01 2.124061159175852770e-49
1.211586397118800207e+01 2.064493248312568587e-49
1.219993148629774993e+01 2.007069804336164884e-49
1.228458231491395480e+01 1.951705961500492218e-49
1.236982050443406855e+01 1.898320453878325161e-49
1.245565013033894708e+01 1.846835464605687455e-49
1.254207529638770424e+01 1.797176455225246644e-49
1.262910013481392113e+01 1.749272038775839441e-49
1.271672880652324622e+01 1.703053820212274835e-49
1.280496550129229583e+01 1.658456265042100786e-49
1.289381443796900939e+01 1.615416582861630596e-49
1.298327986467436013e+01 1.573874593646203077e-49
1.307336605900545834e+01 1.533772616160065635e-49
1.316407732824010424e+01 1.495055357290700440e-49
1.325541800954269256e+01 1.457669804959680690e-49
1.334739247017160935e+01 1.421565132644476742e-49
1.344000510768803558e+01 1.386692595316033906e-49
1.353326035016620388e+01 1.353005446126382963e-49
1.362716265640514379e+01 1.320458842723854436e-49
1.372171651614182508e+01 1.289009771536770893e-49
1.381692645026585531e+01 1.258616962198145748e-49
1.391279701103562694e+01 1.229240812422946346e-49
1.400933278229597434e+01 1.200843321923351635e-49
1.410653837969735847e+01 1.173388015582197233e-49
1.420441845091651878e+01 1.146839882588990249e-49
1.430297767587871505e+01 1.121165314697063531e-49
1.440222076698148790e+01 1.096332042077414252e-49
1.450215246931995594e+01 1.072309079781414102e-49
1.460277756091373114e+01 1.049066672543546667e-49
1.470410085293531743e+01 1.026576241939153862e-49
1.480612718994017740e+01 1.004810335716112650e-49
1.490886145009836561e+01 9.837425833605037235e-50
1.501230854542774473e+01 9.633476488831286184e-50
1.511647342202888744e+01 9.436011863089255699e-50
1.522136106032151126e+01 9.244798003797050194e-50
1.532697647528264007e+01 9.059610060602886185e-50
1.543332471668636963e+01 8.880231897910103818e-50
1.554041086934531712e+01 8.706455765999676400e-50
1.564824005335375823e+01 8.538081904921305737e-50
1.575681742433239485e+01 8.374918250818780644e-50
1.586614817367488683e+01 8.216780118635427845e-50
1.597623752879606585e+01 8.063489881190906673e-50
1.608709075338185457e+01 7.914876690888337112e-50
1.619871314764099068e+01 7.770776210590782022e-50
1.631111004855834778e+01 7.631030329476083008e-50
1.642428683015022273e+01 7.495486932188104650e-50
1.653824890372121104e+01 7.363999641331318269e-50
1.665300171812294039e+01 7.236427586899813344e-50
1.676855076001465861e+01 7.112635190775115953e-50
1.688490155412545590e+01 6.992491950235446438e-50
1.700205966351853704e+01 6.875872241937462911e-50
1.712003068985712417e+01 6.762655108353590239e-50
1.723882027367231728e+01 6.652724099002945368e-50
1.735843409463281262e+01 6.545967067327874134e-50
1.747887787181637265e+01 6.442276015980431675e-50
1.760015736398340280e+01 6.341546921048383908e-50
1.772227836985217664e+01 6.243679587391044797e-50
1.784524672837614645e+01 6.148577488398891941e-50
1.796906831902314394e+01 6.056147628542696685e-50
1.809374906205639988e+01 5.966300404213962896e-50
1.821929491881772734e+01 5.878949464546305286e-50
1.834571189201246710e+01 5.794011598810858704e-50
1.847300602599650787e+01 5.711406602418258756e-50
1.860118340706534568e+01 5.631057166085678099e-50
1.873025016374496232e+01 5.552888764120081765e-50
1.886021246708499532e+01 5.476829548850230072e-50
1.899107653095367709e+01 5.402810241525081670e-50
1.912284861233499456e+01 5.330764043179689143e-50
1.925553501162785963e+01 5.260626536384967853e-50
1.938914207294728342e+01 5.192335589887909908e-50
1.952367618442780639e+01 5.125831281239547425e-50
1.965914377852884698e+01 5.061055806108261082e-50
1.979555133234229203e+01 4.997953400942384161e-50
1.993290536790221168e+01 4.936470268535433581e-50
2.007121245249660646e+01 4.876554501119003687e-50
2.021047919898153822e+01 4.818156010659747896e-50
2.035071226609719020e+01 4.761226462463373160e-50
2.049191835878630386e+01 4.705719209814007405e-50
2.063410422851477577e+01 4.651589228597865103e-50
2.077727667359437191e+01 4.598793062437315583e-50
2.092144253950791111e+01 4.547288760644366944e-50
2.106660871923644152e+01 4.497035825888700681e-50
2.121278215358888275e+01 4.447995158085825620e-50
2.135996983153390261e+01 4.400129005955129498e-50
2.150817879053397164e+01 4.353400918047499600e-50
2.165741611688200052e+01 4.307775692612161500e-50
2.180768894604002384e+01 4.263219334621418742e-50
2.195900446298042752e+01 4.219699012933524532e-50
2.211136990252950341e+01 4.177183016308282803e-50
2.226479254971327393e+01 4.135640714498450886e-50
2.241927974010593871e+01 4.095042518686702432e-50
2.257483886018050612e+01 4.055359844850402420e-50
2.273147734766199335e+01 4.016565077710930260e-50
2.288920269188310286e+01 3.978631536410725251e-50
2.304802243414216534e+01 3.941533440453408157e-50
2.320794416806389648e+01 3.905245880282483845e-50
2.336897553996231380e+01 3.869744782154332918e-50
2.353112424920640322e+01 3.835006883513489294e-50
2.369439804858827614e+01 3.801009701363031286e-50
2.385880474469372459e+01 3.767731504889011244e-50
2.402435219827565405e+01 3.735151291142796532e-50
2.419104832462978294e+01 3.703248757599369185e-50
2.435890109397316294e+01 3.672004278861874250e-50
2.452791853182525017e+01 3.641398882027528561e-50
2.469810871939160180e+01 3.611414225348267426e-50
2.486947979395032249e+01 3.582032574557770083e-50
2.504203994924105814e+01 3.553236783504375689e-50
2.521579743585680333e+01 3.525010272843740517e-50
2.539076056163837691e+01 3.497337010835916171e-50
2.556693769207162603e+01 3.470201493768729730e-50
2.574433725068747236e+01 3.443588728984454979e-50
2.592296771946456246e+01 3.417484215907546984e-50
2.610283763923488465e+01 3.391873930151221927e-50
2.628395561009211789e+01 3.366744307082575459e-50
2.646633029180280161e+01 3.342082225321591947e-50
2.664997040422045060e+01 3.317874992456876465e-50
2.683488472770237721e+01 3.294110329981133115e-50
2.702108210352958650e+01 3.270776358773961239e-50
2.720857143432946046e+01 3.247861586971805548e-50
2.739736168450142983e+01 3.225354894760157249e-50
2.758746188064564109e+01 3.203245523005325037e-50
2.777888111199438370e+01 3.181523060769249081e-50
2.797162853084689971e+01 3.160177433604676452e-50
2.816571335300678314e+01 3.139198891745440904e-50
2.836114485822271192e+01 3.118577999459864245e-50
2.855793239063217115e+01 3.098305624376247861e-50
2.875608535920806474e+01 3.078372927529730181e-50
2.895561323820880162e+01 3.058771352592247089e-50
2.915652556763112102e+01 3.039492617435133157e-50
2.935883195366627163e+01 3.020528704337415631e-50
2.956254206915940230e+01 3.001871850957702083e-50
2.976766565407184473e+01 2.983514542505101432e-50
2.997421251594705538e+01 2.965449502347734258e-50
3.018219253037934635e+01 2.947669685085440293e-50
3.039161564148614758e+01 2.930168268178859067e-50
3.060249186238350916e+01 2.912938645033682103e-50
3.081483127566470870e+01 2.895974417053766222e-50
3.102864403388251446e+01 2.879269387642203211e-50
3.124394036003446828e+01 2.862817554770553796e-50
3.146073054805171409e+01 2.846613104745666402e-50
3.167902496329126549e+01 2.830650406329331282e-50
3.189883404303140679e+01 2.814924004021530850e-50
3.212016829697096654e+01 2.799428612978857161e-50
3.234303830773163213e+01 2.784159112853334624e-50
3.256745473136400904e+01 2.769110542669106362e-50
3.279342829785717583e+01 2.754278095441618824e-50
3.302096981165151846e+01 2.739657113303792791e-50
3.325009015215560737e+01 2.725243082381390808e-50
3.348080027426610883e+01 2.711031628530015755e-50
3.371311120889170354e+01 2.697018512155364097e-50
3.394703406348055807e+01 2.683199624469227507e-50
3.418258002255118555e+01 2.669570982814473517e-50
3.441976034822749142e+01 2.656128726823614547e-50
3.465858638077703091e+01 2.642869114348936822e-50
3.489906953915329524e+01 2.629788517732421536e-50
3.514122132154175659e+01 2.616883420039745720e-50
3.538505330590944453e+01 2.604150411700109411e-50
3.563057715055874297e+01 2.591586186818237387e-50
3.587780459468464045e+01 2.579187540143000347e-50
3.612674745893606598e+01 2.566951363649130166e-50
3.637741764598116134e+01 2.554874643574449405e-50
3.662982714107614868e+01 2.542954457447962765e-50
3.688398801263866744e+01 2.531187971200527686e-50
3.713991241282458589e+01 2.519572436324071995e-50
3.739761257810909711e+01 2.508105187378127611e-50
3.765710082987187235e+01 2.496783639204067400e-50
3.791838957498595164e+01 2.485605284567854703e-50
3.818149130641122468e+01 2.474567691701268618e-50
3.844641860379156384e+01 2.463668501946988480e-50
3.871318413405634118e+01 2.452905427641173888e-50
3.898180065202618039e+01 2.442276249777053671e-50
3.925228100102253848e+01 2.431778816080011934e-50
3.952463811348211919e+01 2.421411038892985416e-50
3.979888501157492442e+01 2.411170893198629788e-50
4.007503480782702354e+01 2.401056414900581055e-50
4.035310070574752928e+01 2.391065698813121853e-50
4.063309600045972303e+01 2.381196897062057567e-50
4.091503407933696224e+01 2.371448217306866408e-50
4.119892842264259514e+01 2.361817921141234646e-50
4.148479260417452963e+01 2.352304322544448206e-50
4.177264029191434958e+01 2.342905786288561976e-50
4.206248524868058780e+01 2.333620726541871948e-50
4.235434133278702973e+01 2.324447605420003619e-50
4.264822249870512394e+01 2.315384931676349762e-50
4.294414279773126708e+01 2.306431259244552528e-50
4.324211637865862912e+01 2.297585186153488122e-50
4.354215748845361134e+01 2.288845353128265341e-50
4.384428047293715025e+01 2.280210442527517718e-50
4.414849977747045529e+01 2.271679177118136764e-50
4.445482994764580553e+01 2.263250319049628157e-50
4.476328562998200056e+01 2.254922668678971616e-50
4.507388157262457895e+01 2.246695063678868869e-50
4.538663262605113857e+01 2.238566377932407815e-50
4.570155374378115454e+01 2.230535520633377423e-50
4.601865998309111916e+01 2.222601435338672266e-50
4.633796650573440701e+01 2.214763099124699635e-50
4.665948857866618482e+01 2.207019521647964506e-50
4.698324157477347285e+01 2.199369744402295371e-50
4.730924097361000236e+01 2.191812839839335316e-50
4.763750236213646616e+01 2.184347910671068357e-50
4.796804143546572874e+01 2.176974089090842469e-50
4.830087399761322331e+01 2.169690536033599338e-50
4.863601596225270640e+01 2.162496440543692222e-50
4.897348335347697201e+01 2.155391019051394904e-50
4.931329230656412221e+01 2.148373514774127808e-50
4.965545906874899629e+01 2.141443197067043302e-50
4.999999999999999289e+01 2.134599360852212223e-50
5.034693157380139894e+01 2.127841326012490454e-50
5.069627037794075619e+01 2.121168436868947209e-50
5.104803311530231724e+01 2.114580061638189772e-50
5.140223660466548239e+01 2.108075591905156996e-50
5.175889778150880716e+01 2.101654442144917527e-50
5.211803369882010628e+01 2.095316049243874315e-50
5.247966152791137517e+01 2.089059872035408802e-50
5.284379855924019154e+01 2.082885390858639927e-50
5.321046220323622578e+01 2.076792107148206105e-50
5.357966999113354944e+01 2.070779543000563956e-50
5.395143957580922489e+01 2.064847240817609672e-50
5.432578873262691133e+01 2.058994762889866093e-50
5.470273536028711447e+01 2.053221691067788873e-50
5.508229748168283635e+01 2.047527626387564443e-50
5.546449324476112963e+01 2.041912188759516271e-50
5.584934092339118195e+01 2.036375016632244263e-50
5.623685891823758709e+01 2.030915766690079115e-50
5.662706575764056538e+01 2.025534113552217390e-50
5.701998009850164806e+01 2.020229749504346384e-50
5.741562072717555054e+01 2.015002384208750381e-50
5.781400656036881713e+01 2.009851744460072301e-50
5.821515664604383034e+01 2.004777573925059661e-50
5.861909016432991848e+01 1.999779632917347270e-50
5.902582642844026850e+01 1.994857698159111119e-50
5.943538488559515542e+01 1.990011562569311765e-50
5.984778511795219202e+01 1.985241035060262706e-50
6.026304684354212071e+01 1.980545940328344277e-50
6.068118991721201638e+01 1.975926118682115347e-50
6.110223433157442230e+01 1.971381425852191887e-50
6.152620021796307270e+01 1.966911732822106922e-50
6.195310784739583454e+01 1.962516925675259788e-50
6.238297763154347564e+01 1.958196905432676523e-50
6.281583012370606411e+01 1.953951587908849343e-50
6.325168601979518002e+01 1.949780903582115020e-50
6.369056615932391452e+01 1.945684797461193258e-50
6.413249152640305795e+01 1.941663228956193434e-50
6.457748325074419427e+01 1.937716171777968942e-50
6.502556260867048366e+01 1.933843613821223194e-50
6.547675102413337811e+01 1.930045557068856969e-50
6.593107006973741591e+01 1.926322017491689990e-50
6.638854146777151755e+01 1.922673024971210450e-50
6.684918709124731606e+01 1.919098623211108839e-50
6.731302896494554489e+01 1.915598869663496437e-50
6.778008926646843690e+01 1.912173835469176528e-50
6.825039032730067845e+01 1.908823605382902889e-50
6.872395463387690029e+01 1.905548277727427887e-50
6.920080482865657245e+01 1.902347964337721243e-50
6.968096371120716981e+01 1.899222790513877476e-50
7.016445423929364722e+01 1.896172894989867648e-50
7.065129952997666862e+01 1.893198429891098218e-50
7.114152286071765730e+01 1.890299560706774423e-50
7.163514767049153420e+01 1.887476466270210984e-50
7.213219756090792600e+01 1.884729338736721202e-50
7.263269629733905219e+01 1.882058383568457996e-50
7.313666781005647977e+01 1.879463819528765938e-50
7.364413619537515387e+01 1.876945878672367348e-50
7.415512571680521603e+01 1.874504806353509727e-50
7.466966080621266144e+01 1.872140861222892993e-50
7.518776606498691706e+01 1.869854315240954016e-50
7.570946626521758560e+01 1.867645453690120175e-50
7.623478635087872135e+01 1.865514575191875978e-50
7.676375143902112086e+01 1.863461991732573915e-50
7.729638682097392177e+01 1.861488028684842451e-50
7.783271796355309391e+01 1.859593024841625266e-50
7.837277051027973584e+01 1.857777332447079355e-50
7.891657028260588902e+01 1.856041317239327635e-50
7.946414328114889258e+01 1.854385358489948639e-50
8.001551568693507477e+01 1.852809849049261589e-50
8.057071386265099022e+01 1.851315195400270480e-50
8.112976435390434915e+01 1.849901817708678658e-50
8.169269389049308927e+01 1.848570149882415351e-50
8.225952938768311640e+01 1.847320639632709730e-50
8.283029794749575103e+01 1.846153748537670866e-50
8.340502686000294830e+01 1.845069952113696763e-50
8.398374360463265020e+01 1.844069739884287795e-50
8.456647585148242285e+01 1.843153615459249711e-50
8.515325146264220280e+01 1.842322096610054729e-50
8.574409849352703361e+01 1.841575715356220108e-50
8.633904519421778900e+01 1.840915018049166831e-50
8.693812001081251140e+01 1.840340565463293491e-50
8.754135158678624862e+01 1.839852932887883421e-50
8.814876876436026976e+01 1.839452710224704170e-50
8.876040058588178283e+01 1.839140502087479039e-50
8.937627629521176686e+01 1.838916927905246094e-50
8.999642533912381737e+01 1.838782622029364913e-50
9.062087736871187360e+01 1.838738233843387182e-50
9.124966224080760924e+01 1.838784427875774547e-50
9.188281001940860904e+01 1.838921883918612679e-50
9.252035097711508627e+01 1.839151297146224203e-50
9.316231559657798300e+01 1.839473378238634114e-50
9.380873457195606591e+01 1.839888853509864383e-50
9.445963881038331067e+01 1.840398465036619086e-50
9.511505943344727143e+01 1.841002970793022233e-50
9.577502777867637462e+01 1.841703144786670976e-50
9.643957540103887993e+01 1.842499777200425803e-50
9.710873407445130567e+01 1.843393674534398231e-50
9.778253579329744127e+01 1.844385659754843451e-50
9.846101277395865736e+01 1.845476572443585902e-50
9.914419745635355241e+01 1.846667268952777088e-50
9.983212250548965017e+01 1.847958622562060274e-50
1.005248208130249452e+02 1.849351523639634078e-50
1.012223254988401777e+02 1.850846879807519495e-50
1.019246699126232016e+02 1.852445616108446168e-50
1.026318876354625900e+02 1.854148675178497950e-50
1.033440124814540866e+02 1.855957017421803100e-50
1.040610784993169489e+02 1.857871621190012623e-50
1.047831199740216306e+02 1.859893482964331727e-50
1.055101714284298140e+02 1.862023617542309508e-50
1.062422676249441338e+02 1.864263058227693808e-50
1.069794435671710602e+02 1.866612857024088097e-50
1.077217345015942129e+02 1.869074084833414773e-50
1.084691759192592002e+02 1.871647831657088499e-50
1.092218035574714037e+02 1.874335206801758089e-50
1.099796534015037253e+02 1.877137339089092569e-50
1.107427616863179480e+02 1.880055377069705864e-50
1.115111648982969115e+02 1.883090489240896585e-50
1.122848997769886807e+02 1.886243864269233148e-50
1.130640033168639604e+02 1.889516711216831978e-50
1.138485127690839818e+02 1.892910259772711782e-50
1.146384656432825437e+02 1.896425760488381919e-50
1.154338997093584709e+02 1.900064485017783284e-50
1.162348529992823813e+02 1.903827726362616984e-50
1.170413638089146957e+02 1.907716799121819729e-50
1.178534706998363788e+02 1.911733039747102142e-50
1.186712125011934233e+02 1.915877806802448144e-50
1.194946283115525034e+02 1.920152481229828711e-50
1.203237575007711939e+02 1.924558466620096898e-50
1.211586397118800136e+02 1.929097189489822087e-50
1.219993148629774993e+02 1.933770099563897793e-50
1.228458231491396191e+02 1.938578670064285261e-50
1.236982050443406962e+02 1.943524398005813454e-50
1.245565013033894104e+02 1.948608804498194847e-50
1.254207529638770353e+02 1.953833435055494048e-50
1.262910013481392184e+02 1.959199859913207125e-50
1.271672880652325262e+02 1.964709674353596841e-50
1.280496550129229547e+02 1.970364499039259850e-50
1.289381443796900157e+02 1.976165980356423513e-50
1.298327986467436119e+02 1.982115790767764165e-50
1.307336605900545976e+02 1.988215629176202732e-50
1.316407732824011134e+02 1.994467221300782741e-50
1.325541800954269434e+02 2.000872320064692219e-50
1.334739247017160153e+02 2.007432705998284071e-50
1.344000510768803451e+02 2.014150187657236675e-50
1.353326035016620494e+02 2.021026602058814680e-50
1.362716265640515019e+02 2.028063815137555371e-50
1.372171651614182508e+02 2.035263722223602435e-50
1.381692645026584785e+02 2.042628248546371759e-50
1.391279701103562729e+02 2.050159349767836765e-50
1.400933278229597363e+02 2.057859012549448221e-50
1.410653837969736628e+02 2.065729255158747669e-50
1.420441845091651771e+02 2.073772128121933461e-50
1.430297767587870794e+02 2.081989714931618129e-50
1.440222076698148612e+02 2.090384132819032871e-50
1.450215246931995523e+02 2.098957533604406216e-50
1.460277756091373931e+02 2.107712104641357341e-50
1.470410085293531779e+02 2.116650069875185405e-50
1.480612718994017030e+02 2.125773691041280704e-50
1.490886145009836525e+02 2.135085269035889877e-50
1.501230854542774296e+02 2.144587145501150966e-50
1.511647342202889490e+02 2.154281704679122726e-50
1.522136106032151304e+02 2.164171375604834421e-50
1.532697647528263190e+02 2.174258634731941821e-50
1.543332471668637140e+02 2.184546009113906903e-50
1.554041086934531677e+02 2.195036080306115964e-50
1.564824005335376569e+02 2.205731489212199466e-50
1.575681742433239378e+02 2.216634942180272948e-50
1.586614817367487831e+02 2.227749218771479861e-50
1.597623752879606513e+02 2.239077181793410121e-50
1.608709075338185528e+02 2.250621790439056420e-50
1.619871314764099282e+02 2.262386117743021580e-50
1.631111004855834778e+02 2.274373374128946502e-50
1.642428683015021704e+02 2.286586939690732475e-50
1.653824890372121104e+02 2.299030409219806048e-50
1.665300171812293968e+02 2.311707656198980923e-50
1.676855076001465932e+02 2.324622925633523980e-50
1.688490155412545448e+02 2.337780971790397480e-50
1.700205966351852851e+02 2.351187267778335150e-50
1.712003068985712559e+02 2.364848333597860872e-50
1.723882027367231728e+02 2.378772266433636467e-50
1.735843409463281262e+02 2.392969630226345149e-50
1.747887787181637407e+02 2.407455013781236123e-50
1.760015736398339357e+02 2.422249902807149732e-50
1.772227836985217664e+02 2.437388309438381024e-50
1.784524672837614503e+02 2.452928672670249928e-50
1.796906831902314536e+02 2.468981533646864656e-50
1.809374906205640059e+02 2.485782457147948417e-50
1.821929491881772094e+02 2.503920194905126589e-50
1.834571189201246852e+02 2.525258257253296235e-50
1.847300602599650858e+02 2.558687349099908331e-50
1.860118340706534639e+02 2.722421548506728987e-50
1.873025016374496374e+02 3.184742905460990710e-50
1.886021246708498609e+02 2.620860071439307724e-50
1.899107653095367994e+02 2.611568608593451245e-50
1.912284861233499385e+02 2.622851550980507071e-50
1.925553501162786176e+02 2.638469809769418052e-50
1.938914207294728271e+02 2.655703790270632279e-50
1.952367618442779644e+02 2.673794091946618027e-50
1.965914377852884911e+02 2.692464111358976783e-50
1.979555133234229061e+02 2.711595444924888472e-50
1.993290536790221097e+02 2.731131979218493475e-50
2.007121245249660717e+02 2.751045528557245431e-50
2.021047919898154817e+02 2.771321712972486299e-50
2.035071226609719020e+02 2.791953522434000203e-50
2.049191835878630457e+02 2.812938136567031317e-50
2.063410422851477790e+02 2.834275247117184208e-50
2.077727667359437476e+02 2.855966124213625480e-50
2.092144253950791892e+02 2.878013072696706663e-50
2.106660871923644152e+02 2.900419103227678943e-50
2.121278215358888133e+02 2.923187726704628781e-50
2.135996983153390261e+02 2.946322822073667574e-50
2.150817879053397235e+02 2.969828549231558168e-50
2.165741611688201260e+02 2.993709290415607225e-50
2.180768894604002526e+02 3.017969610044299368e-50
2.195900446298042823e+02 3.042614226778147788e-50
2.211136990252950341e+02 3.067647993838538158e-50
2.226479254971327464e+02 3.093075885010914710e-50
2.241927974010595221e+02 3.118902984626226060e-50
2.257483886018050612e+02 3.145134480370937330e-50
2.273147734766199335e+02 3.171775658136298062e-50
2.288920269188310215e+02 3.198831898358348745e-50
2.304802243414216605e+02 3.226308673461324185e-50
2.320794416806390643e+02 3.254211546127731034e-50
2.336897553996231522e+02 3.282546168194771003e-50
2.353112424920640535e+02 3.311318280031175719e-50
2.369439804858827756e+02 3.340533710285918389e-50
2.385880474469372530e+02 3.370198375928726165e-50
2.402435219827566755e+02 3.400318282521531842e-50
2.419104832462978152e+02 3.430899524674851257e-50
2.435890109397315086e+02 3.461948286654329294e-50
2.452791853182525017e+02 3.493470843109982873e-50
2.469810871939160108e+02 3.525473559907707402e-50
2.486947979395033599e+02 3.557962895046224343e-50
2.504203994924105814e+02 3.590945399647227749e-50
2.521579743585679125e+02 3.624427719008368176e-50
2.539076056163837620e+02 3.658416593711038860e-50
2.556693769207162745e+02 3.692918860777113431e-50
2.574433725068748231e+02 3.727941454869091194e-50
2.592296771946456033e+02 3.763491409530072526e-50
2.610283763923487186e+02 3.799575858460080442e-50
2.628395561009211860e+02 3.836202036826454651e-50
2.646633029180280232e+02 3.873377282606192955e-50
2.664997040422045984e+02 3.911109037958416883e-50
2.683488472770237649e+02 3.949404850626150598e-50
2.702108210352957371e+02 3.988272375366136902e-50
2.720857143432946259e+02 4.027719375405945879e-50
2.739736168450143055e+02 4.067753723928124535e-50
2.758746188064563967e+02 4.108383405580511001e-50
2.777888111199438299e+02 4.149616518013091699e-50
2.797162853084688550e+02 4.191461273440779034e-50
2.816571335300678243e+02 4.233926000232495128e-50
2.836114485822271263e+02 4.277019144526447661e-50
2.855793239063216902e+02 4.320749271872005162e-50
2.875608535920806617e+02 4.365125068898412478e-50
2.895561323820878670e+02 4.410155345010946060e-50
2.915652556763112102e+02 4.455849034114965796e-50
2.935883195366627092e+02 4.502215196368880385e-50
2.956254206915940017e+02 4.549263019966559400e-50
2.976766565407184544e+02 4.597001822950970595e-50
2.997421251594703904e+02 4.645441055060119215e-50
3.018219253037934777e+02 4.694590299607253978e-50
3.039161564148614616e+02 4.744459275397830387e-50
3.060249186238351058e+02 4.795057838686464634e-50
3.081483127566470444e+02 4.846395985177398092e-50
3.102864403388250025e+02 4.898483852074255196e-50
3.124394036003446899e+02 4.951331720185813779e-50
3.146073054805171409e+02 5.004950016097215069e-50
3.167902496329126620e+02 5.059349314419611817e-50
3.189883404303140537e+02 5.114540340135962847e-50
3.212016829697095091e+02 5.170533971068125890e-50
3.234303830773163213e+02 5.227341240501418266e-50
3.256745473136401188e+02 5.284973340018166465e-50
3.279342829785717299e+02 5.343441622618193744e-50
3.302096981165151988e+02 5.402757606241999563e-50
3.325009015215558748e+02 5.462932977876470252e-50
3.348080027426610741e+02 5.523979598524934191e-50
3.371311120889170638e+02 5.585909509498952531e-50
3.394703406348055523e+02 5.648734940790767334e-50
3.418258002255118981e+02 5.712468322829609214e-50
3.441976034822747579e+02 5.777122303941165474e-50
3.465858638077702949e+02 5.842709777808533177e-50
3.489906953915329382e+02 5.909243929292916086e-50
3.514122132154175802e+02 5.976738315794576589e-50
3.538505330590944027e+02 6.045207021892795025e-50
3.563057715055872450e+02 6.114664977100407827e-50
3.587780459468463619e+02 6.185128673038655811e-50
3.612674745893606314e+02 6.256617986455364272e-50
3.637741764598115992e+02 6.329161614456149443e-50
3.662982714107614584e+02 6.402817482588549488e-50
3.688398801263868449e+02 6.477784365836726582e-50
3.713991241282458873e+02 6.555757558846955193e-50
3.739761257810910138e+02 6.847640118210472575e-50
3.765710082987187093e+02 6.709175075177283786e-50
3.791838957498594596e+02 6.786749516399550519e-50
3.818149130641124316e+02 6.866549511430025545e-50
3.844641860379156242e+02 6.947673252847812569e-50
3.871318413405634260e+02 7.030011682660675068e-50
3.898180065202618039e+02 7.113548940975947742e-50
3.925228100102253848e+02 7.198290207068125126e-50
3.952463811348213767e+02 7.284247331480586600e-50
3.979888501157492442e+02 7.371434837116244707e-50
4.007503480782701786e+02 7.459868545402118088e-50
4.035310070574753354e+02 7.549565030174820170e-50
4.063309600045972161e+02 7.640541376296435832e-50
4.091503407933698213e+02 7.732815064294851542e-50
4.119892842264259230e+02 7.826403912092682691e-50
4.148479260417452679e+02 7.921326044574656957e-50
4.177264029191435384e+02 8.017599877585142287e-50
4.206248524868058780e+02 8.115244109805696171e-50
4.235434133278704962e+02 8.214277719135496704e-50
4.264822249870512110e+02 8.314719961750243513e-50
4.294414279773124008e+02 8.416590372816250088e-50
4.324211637865862485e+02 8.519908768263504618e-50
4.354215748845361418e+02 8.624695247260312753e-50
4.384428047293717441e+02 8.730970195170221196e-50
4.414849977747045386e+02 8.838754286851783521e-50
4.445482994764578280e+02 8.948068490212489099e-50
4.476328562998199914e+02 9.058934069957831643e-50
4.507388157262458321e+02 9.171372591497206552e-50
4.538663262605115847e+02 9.285405924980091236e-50
4.570155374378115312e+02 9.401056249444140209e-50
4.601865998309110068e+02 9.518346057065376520e-50
4.633796650573440843e+02 9.637298157499498861e-50
4.665948857866619051e+02 9.757935682311789915e-50
4.698324157477349559e+02 9.880282089490830681e-50
4.730924097361000236e+02 1.000436116804575491e-49
4.763750236213644484e+02 1.013019704268671322e-49
4.796804143546572732e+02 1.025781417859060735e-49
4.830087399761322331e+02 1.038723738625430906e-49
4.863601596225273056e+02 1.051849182644285553e-49
4.897348335347697343e+02 1.065160301523858838e-49
4.931329230656409663e+02 1.078659682920541886e-49
4.965545906874899629e+02 1.092349951068695009e-49
4.999999999999999432e+02 1.106233767326719012e-49
5.034693157380134494e+02 1.120313830744171325e-49
5.069627037794076045e+02 1.134592878657421639e-49
5.104803311530232008e+02 1.149073687326625610e-49
5.140223660466548381e+02 1.163759072635929726e-49
5.175889778150880147e+02 1.178651890896623147e-49
5.211803369882004517e+02 1.193755039827873168e-49
5.247966152791137802e+02 1.209071459862652179e-49
5.284379855924019012e+02 1.224604136089448134e-49
5.321046220323622720e+02 1.240356101530325784e-49
5.357966999113355087e+02 1.256330443479423623e-49
5.395143957580917231e+02 1.272530317634122601e-49
5.432578873262691559e+02 1.288958984979358081e-49
5.470273536028711305e+02 1.305619928815441813e-49
5.508229748168283777e+02 1.322517344974429665e-49
5.546449324476112679e+02 1.339659446679990745e-49
5.584934092339112794e+02 1.357135779623531704e-49
5.623685891823758993e+02 1.374782897310035102e-49
5.662706575764057106e+02 1.392521753891350382e-49
5.701998009850165090e+02 1.410632464904336264e-49
5.741562072717555338e+02 1.429005411558314331e-49
5.781400656036876171e+02 1.447638813887737066e-49
5.821515664604382891e+02 1.466535314377833790e-49
5.861909016432991848e+02 1.485698300603417543e-49
5.902582642844026850e+02 1.505131390529216499e-49
5.943538488559515827e+02 1.524838314811607945e-49
5.984778511795212808e+02 1.544822881584196856e-49
6.026304684354212213e+02 1.565088964093342773e-49
6.068118991721202065e+02 1.585640496005022157e-49
6.110223433157442514e+02 1.606481469674002896e-49
6.152620021796307128e+02 1.627615935688352550e-49
6.195310784739577912e+02 1.649048003014153271e-49
6.238297763154347422e+02 1.670781839445443779e-49
6.281583012370599590e+02 1.692821672220967686e-49
6.325168601979518144e+02 1.715171788738964707e-49
6.369056615932391878e+02 1.737836537333835551e-49
6.413249152640298689e+02 1.760820328095261313e-49
6.457748325074419427e+02 1.784127633718664885e-49
6.502556260867041829e+02 1.807762990380629560e-49
6.547675102413337527e+02 1.831730998635940764e-49
6.593107006973741591e+02 1.856036324334064450e-49
6.638854146777144933e+02 1.880683699554302895e-49
6.684918709124732459e+02 1.905677923559731966e-49
6.731302896494547667e+02 1.931023863770652166e-49
6.778008926646843975e+02 1.956726456759886697e-49
6.825039032730068129e+02 1.982790709273448259e-49
6.872395463387682639e+02 2.009221699283711464e-49
6.920080482865656677e+02 2.036024577087764777e-49
6.968096371120709591e+02 2.063204566475335718e-49
7.016445423929365006e+02 2.090766966015996358e-49
7.065129952997667715e+02 2.118717150572013502e-49
7.114152286071758908e+02 2.147060573285517295e-49
7.163514767049153988e+02 2.175802768675631434e-49
7.213219756090785495e+02 2.204949358682478382e-49
7.263269629733905504e+02 2.234506067880341807e-49
7.313666781005648545e+02 2.264499720644585327e-49
7.364413619537507429e+02 2.294922531798129512e-49
7.415512571680520750e+02 2.325776743080213531e-49
7.466966080621258470e+02 2.357526644730611158e-49
7.518776606498690853e+02 2.388787084489654367e-49
7.570946626521758844e+02 2.420948388778440648e-49
7.623478635087872135e+02 2.453568864047397306e-49
7.676375143902112086e+02 2.486648912604699471e-49
7.729638682097383935e+02 2.520194372764975175e-49
7.783271796355309107e+02 2.554216081985697586e-49
7.837277051027973584e+02 2.588739601665446390e-49
7.891657028260589186e+02 2.623748449209791839e-49
7.946414328114889258e+02 2.659249933424125260e-49
8.001551568693499803e+02 2.695249518452356568e-49
8.057071386265098454e+02 2.731755698331546653e-49
8.112976435390434062e+02 2.768775116642748731e-49
8.169269389049309211e+02 2.806315004265889304e-49
8.225952938768310787e+02 2.844382696790997988e-49
8.283029794749566008e+02 2.882985634913725261e-49
8.340502686000294261e+02 2.922131365788616971e-49
8.398374360463265020e+02 2.961827544514544360e-49
8.456647585148242570e+02 3.002081935675666450e-49
8.515325146264220848e+02 3.042902414921917538e-49
8.574409849352695119e+02 3.084296970585085974e-49
8.633904519421778332e+02 3.126273705331842099e-49
8.693812001081250855e+02 3.168840837859346202e-49
8.754135158678624293e+02 3.212006704647551100e-49
8.814876876436027260e+02 3.255779761797678126e-49
8.876040058588170041e+02 3.300168587026507037e-49
8.937627629521176686e+02 3.345181881987670480e-49
8.999642533912381168e+02 3.390828475399583643e-49
9.062087736871186507e+02 3.437117328527113217e-49
9.124966224080760639e+02 3.484057549136207536e-49
9.188281001940850956e+02 3.531658446734619841e-49
9.252035097711509479e+02 3.579929930120854339e-49
9.316231559657798016e+02 3.628896379085526930e-49
9.380873457195606306e+02 3.678524412882745351e-49
9.445963881038330783e+02 3.728855538337058413e-49
9.511505943344717480e+02 3.779900975446335679e-49
9.577502777867638315e+02 3.831665483535736811e-49
9.643957540103887141e+02 3.884158887391165971e-49
9.710873407445130852e+02 3.937397682582697232e-49
9.778253579329743843e+02 3.991407309697307393e-49
9.846101277395855504e+02 4.046177330514527189e-49
9.914419745635356094e+02 4.101718513373919195e-49
9.983212250548965585e+02 4.158041783122141397e-49
1.005248208130249395e+03 4.215158222367155201e-49
1.012223254988401777e+03 4.273079073333464146e-49
1.019246699126230965e+03 4.331815739971766976e-49
1.026318876354625900e+03 4.391379790197897810e-49
1.033440124814540923e+03 4.451782958211108993e-49
1.040610784993169545e+03 4.513037146872425951e-49
1.047831199740216334e+03 4.575154430136554768e-49
1.055101714284297032e+03 4.638147055542795219e-49
1.062422676249441338e+03 4.702027446784126635e-49
1.069794435671710517e+03 4.766808206406387608e-49
1.077217345015942101e+03 4.832502118779154266e-49
1.084691759192592144e+03 4.899122153771781449e-49
1.092218035574712985e+03 4.966681472714737612e-49
1.099796534015037196e+03 5.035193444111454346e-49
1.107427616863179537e+03 5.104671723055749246e-49
1.115111648982969200e+03 5.175131395026641988e-49
1.122848997769886864e+03 5.246600524369180742e-49
1.130640033168638411e+03 5.319041231504574507e-49
1.138485127690839818e+03 5.392522573422333383e-49
1.146384656432824158e+03 5.467041088059712903e-49
1.154338997093584794e+03 5.542611190134892952e-49
1.162348529992823842e+03 5.619247780620944923e-49
1.170413638089145707e+03 5.696966011114475811e-49
1.178534706998363845e+03 5.775781258802014768e-49
1.186712125011933040e+03 5.855709123537067694e-49
1.194946283115524921e+03 5.936765429138178056e-49
1.203237575007711939e+03 6.018966225808601897e-49
1.211586397118798914e+03 6.102327792934300693e-49
1.219993148629774851e+03 6.186866642038510807e-49
1.228458231491394827e+03 6.272599519818781568e-49
1.236982050443406933e+03 6.359543411243165418e-49
1.245565013033894047e+03 6.447715542712283756e-49
1.254207529638769074e+03 6.537133385333110784e-49
1.262910013481392070e+03 6.627814658457875140e-49
1.271672880652324011e+03 6.719777334030938614e-49
1.280496550129229490e+03 6.813039644107480889e-49
1.289381443796900385e+03 6.907620106286810292e-49
1.298327986467434812e+03 7.003537753958753611e-49
1.307336605900545919e+03 7.101224453554519265e-49
1.316407732824009827e+03 7.199458982037756991e-49
1.325541800954269320e+03 7.299501303563804762e-49
1.334739247017160324e+03 7.400958478675276570e-49
1.344000510768802087e+03 7.503850249644074951e-49
1.353326035016620381e+03 7.608196940879733567e-49
1.362716265640513711e+03 7.714019188461378674e-49
1.372171651614182565e+03 7.821337919111687396e-49
1.381692645026584842e+03 7.930174348618984155e-49
1.391279701103562729e+03 8.040549983451868534e-49
1.400933278229597590e+03 8.152486623089957835e-49
1.410653837969735150e+03 8.266006362517006881e-49
1.420441845091651885e+03 8.381131594719602099e-49
1.430297767587870794e+03 8.497885013150767584e-49
1.440222076698148840e+03 8.616289614190714888e-49
1.450215246931995580e+03 8.736368699794454952e-49
1.460277756091372339e+03 8.858145881158062646e-49
1.470410085293531665e+03 8.981645088031818698e-49
1.480612718994017087e+03 9.106890628013840684e-49
1.490886145009836582e+03 9.233909681947331682e-49
1.501230854542774523e+03 9.362719134526646615e-49
1.511647342202888012e+03 9.493351053445621531e-49
1.522136106032151247e+03 9.625829811356344548e-49
1.532697647528263133e+03 9.760180673310132313e-49
1.543332471668637027e+03 9.896429708016384109e-49
1.554041086934531677e+03 1.003460332917903598e-48
1.564824005335374977e+03 1.017472826928111832e-48
1.575681742433239378e+03 1.031683157427793520e-48
1.586614817367487831e+03 1.046094060080582486e-48
1.597623752879606627e+03 1.060708301350877137e-48
1.608709075338185585e+03 1.075528678196745912e-48
1.619871314764097406e+03 1.090558017708849423e-48
1.631111004855834835e+03 1.105799176698092774e-48
1.642428683015021534e+03 1.121255041275991195e-48
1.653824890372120990e+03 1.136928526702564117e-48
1.665300171812294138e+03 1.152822580141026113e-48
1.676855076001464113e+03 1.168940315918602806e-48
1.688490155412545391e+03 1.185284296551213241e-48
1.700205966351852794e+03 1.201857901314114520e-48
1.712003068985712616e+03 1.218664136512222352e-48
1.723882027367231785e+03 1.235706032599045094e-48
1.735843409463279386e+03 1.252986674725236485e-48
1.747887787181637350e+03 1.270509169372706896e-48
1.760015736398339186e+03 1.288276640796358797e-48
1.772227836985217436e+03 1.306292228664839725e-48
1.784524672837614617e+03 1.324559085663352629e-48
1.796906831902312661e+03 1.343080374884948719e-48
1.809374906205639945e+03 1.361859266962068993e-48
1.821929491881772037e+03 1.380898936929556870e-48
1.834571189201246852e+03 1.400202560916609468e-48
1.847300602599651029e+03 1.419773313663187402e-48
1.860118340706532763e+03 1.439614392820831707e-48
1.873025016374496317e+03 1.459728915710815471e-48
1.886021246708498438e+03 1.480119900553855194e-48
1.899107653095367823e+03 1.500790651726322733e-48
1.912284861233499214e+03 1.521744181464701088e-48
1.925553501162784187e+03 1.542983533449967751e-48
1.938914207294728385e+03 1.564511709407715658e-48
1.952367618442779758e+03 1.586331658703257658e-48
1.965914377852884854e+03 1.608446268757324286e-48
1.979555133234229061e+03 1.630858354729291365e-48
1.993290536790218994e+03 1.653570648222944494e-48
2.007121245249660660e+03 1.676585784910266290e-48
2.021047919898152713e+03 1.699906291099825151e-48
2.035071226609719133e+03 1.723534570500283204e-48
2.049191835878630627e+03 1.747472959390065443e-48
2.063410422851475687e+03 1.771723328745324624e-48
2.077727667359437419e+03 1.796287792932262908e-48
2.092144253950789789e+03 1.821168047154250950e-48
2.106660871923644208e+03 1.846365566882717982e-48
2.121278215358888247e+03 1.871881591706554795e-48
2.135996983153388101e+03 1.897717080151625376e-48
2.150817879053397064e+03 1.923872676377948780e-48
2.165741611688199100e+03 1.950348674262132853e-48
2.180768894604002526e+03 1.977144977914862491e-48
2.195900446298042880e+03 2.004261058206539952e-48
2.211136990252948181e+03 2.031695905128856170e-48
2.226479254971327464e+03 2.059447979527493563e-48
2.241927974010592607e+03 2.087516769319141424e-48
2.257483886018050725e+03 2.115894557377717662e-48
2.273147734766199392e+03 2.144582747515479876e-48
2.288920269188307884e+03 2.173575369097835600e-48
2.304802243414216719e+03 2.202867188781384972e-48
2.320794416806388199e+03 2.232451983494316105e-48
2.336897553996231636e+03 2.262322430377410292e-48
2.353112424920640478e+03 2.292469987683034589e-48
2.369439804858825028e+03 2.322884763055241955e-48
2.385880474469372530e+03 2.353555367634474315e-48
2.402435219827564197e+03 2.384468755006840877e-48
2.419104832462978266e+03 2.415610064614698573e-48
2.435890109397314973e+03 2.446962308868742271e-48
2.452791853182522573e+03 2.478506323564899610e-48
2.469810871939159824e+03 2.510220460587389623e-48
2.486947979395030870e+03 2.542080232271206934e-48
2.504203994924105700e+03 2.574058089075424839e-48
2.521579743585678898e+03 2.606123063159957281e-48
2.539076056163837620e+03 2.638240392828743619e-48
2.556693769207162859e+03 2.670371105969681107e-48
2.574433725068745844e+03 2.702471557498200418e-48
2.592296771946456374e+03 2.734492917120775469e-48
2.610283763923487186e+03 2.766380777799793586e-48
2.628395561009212088e+03 2.798073595297863921e-48
2.646633029180280118e+03 2.829503850563583864e-48
2.664997040422043483e+03 2.860595427076579931e-48
2.683488472770237877e+03 2.891263644180331886e-48
2.702108210352957030e+03 2.921414146973131187e-48
2.720857143432946032e+03 2.950941854975604085e-48
2.739736168450142941e+03 2.979729811657890037e-48
2.758746188064561011e+03 3.007647924245162886e-48
2.777888111199438299e+03 3.034551589767782511e-48
2.797162853084688322e+03 3.060280478948464814e-48
2.816571335300678584e+03 3.084655492564073171e-48
2.836114485822271490e+03 3.107479903248351611e-48
2.855793239063214060e+03 3.128534655001243953e-48
2.875608535920806389e+03 3.147577837279090550e-48
2.895561323820878897e+03 3.164342419843091383e-48
2.915652556763111988e+03 3.178536860438492699e-48
2.935883195366627206e+03 3.189835350943262451e-48
2.956254206915937175e+03 3.197883379251131747e-48
2.976766565407184771e+03 3.202293878709701354e-48
2.997421251594703790e+03 3.202645643351341912e-48
3.018219253037934777e+03 3.198482733732463325e-48
3.039161564148614616e+03 3.189314355056109370e-48
3.060249186238348102e+03 3.174615867262518436e-48
3.081483127566470557e+03 3.153831322083194525e-48
3.102864403388249684e+03 3.126377785528532307e-48
3.124394036003446672e+03 3.091652045678485886e-48
3.146073054805171523e+03 3.049040269074008309e-48
3.167902496329123551e+03 2.997931367448821554e-48
3.189883404303140651e+03 2.937733708804829024e-48
3.212016829697095091e+03 2.867898833944602419e-48
3.234303830773163099e+03 2.787947541045413467e-48
3.256745473136400960e+03 2.697503596680039790e-48
3.279342829785714002e+03 2.596331952226432813e-48
3.302096981165152101e+03 2.484381614040507099e-48
3.325009015215558520e+03 2.361831521656129297e-48
3.348080027426610741e+03 2.229136972479714461e-48
3.371311120889170525e+03 2.087072894801026720e-48
3.394703406348052340e+03 1.936769965502785165e-48
3.418258002255118754e+03 1.779737597613889215e-48
3.441976034822747806e+03 1.617868691514023744e-48
3.465858638077703290e+03 1.453421079609301785e-48
3.489906953915329723e+03 1.288971832869418762e-48
3.514122132154172050e+03 1.127343293190171197e-48
3.538505330590944141e+03 9.715029133250982205e-49
3.563057715055871995e+03 8.244419737514111950e-49
3.587780459468463505e+03 6.890440855292314614e-49
3.612674745893606541e+03 5.679519463394076630e-49
3.637741764598112240e+03 4.634476668730303821e-49
3.662982714107614811e+03 3.773562666034120179e-49
3.688398801263864698e+03 3.109812774274464891e-49
3.713991241282458759e+03 2.650767740407017609e-49
3.739761257810910138e+03 2.398556478056324773e-49
3.765710082987183341e+03 2.350298094995099458e-49
3.791838957498594937e+03 2.498755285243518596e-49
3.818149130641120337e+03 2.833141681573976278e-49
3.844641860379156242e+03 3.340005130081840558e-49
3.871318413405634146e+03 4.004101447661071972e-49
3.898180065202614060e+03 4.809200274702111210e-49
3.925228100102254302e+03 5.738782265241645096e-49
3.952463811348209674e+03 6.776605697238234421e-49
3.979888501157492556e+03 7.907142318971908572e-49
4.007503480782701899e+03 9.115881282073791518e-49
4.035310070574748806e+03 1.038952537501302050e-48
4.063309600045972275e+03 1.171609252635657258e-48
4.091503407933694234e+03 1.308494427275997774e-48
4.119892842264259343e+03 1.448675890321467855e-48
4.148479260417452679e+03 1.591346742904653233e-48
4.177264029191431291e+03 1.735816318637894122e-48
4.206248524868058666e+03 1.881499826405645066e-48
4.235434133278700756e+03 2.027907395845471300e-48
4.264822249870511769e+03 2.174633121029725718e-48
4.294414279773124690e+03 2.321344546284449825e-48
4.324211637865858393e+03 2.467772641554059529e-48
4.354215748845361304e+03 2.613703073557667930e-48
4.384428047293712552e+03 2.758967710195528131e-48
4.414849977747045159e+03 2.903437511137046537e-48
4.445482994764578507e+03 3.047016082807403628e-48
4.476328562998200141e+03 3.189634685975625692e-48
4.507388157262457753e+03 3.331244297476891280e-48
4.538663262605111413e+03 3.471817561608312958e-48
4.570155374378115084e+03 3.611339028632309089e-48
4.601865998309110182e+03 3.749805141788222305e-48
4.633796650573441184e+03 3.887220984883292628e-48
4.665948857866618710e+03 4.023598049974271809e-48
4.698324157477344670e+03 4.158952229461357496e-48
4.730924097361000349e+03 4.293302371459691034e-48
4.763750236213644712e+03 4.426668693706376207e-48
4.796804143546572959e+03 4.559071684420405181e-48
4.830087399761322558e+03 4.690531054807697554e-48
4.863601596225267713e+03 4.821064840629515099e-48
4.897348335347696775e+03 4.950688627195963396e-48
4.931329230656409891e+03 5.079414850415603109e-48
4.965545906874899629e+03 5.207252167440290559e-48
4.999999999999999091e+03 5.334204884438129916e-48
