GW190408_181802.csv.gz
GW190412.csv.gz
GW190413_052954.csv.gz
GW190413_134308.csv.gz
GW190421_213856.csv.gz
GW190424_180648.csv.gz
GW190425.csv.gz
GW190503_185404.csv.gz
GW190512_180714.csv.gz
GW190513_205428.csv.gz
GW190517_055101.csv.gz
GW190519_153544.csv.gz
GW190521_074359.csv.gz
GW190521.csv.gz
GW190527_092055.csv.gz
GW190602_175927.csv.gz
GW190620_030421.csv.gz
GW190630_185205.csv.gz
GW190701_203306.csv.gz
GW190706_222641.csv.gz
GW190707_093326.csv.gz
GW190708_232457.csv.gz
GW190719_215514.csv.gz
GW190720_000836.csv.gz
GW190725_174728.csv.gz
GW190727_060333.csv.gz
GW190728_064510.csv.gz
GW190731_140936.csv.gz
GW190803_022701.csv.gz
GW190805_211137.csv.gz
GW190814.csv.gz
GW190828_063405.csv.gz
GW190828_065509.csv.gz
GW190910_112807.csv.gz
GW190915_235702.csv.gz
GW190924_021846.csv.gz
GW190929_012149.csv.gz
GW190930_133541.csv.gz
GW191103_012549.csv.gz
GW191105_143521.csv.gz
GW191109_010717.csv.gz
GW191127_050227.csv.gz
GW191129_134029.csv.gz
GW191204_171526.csv.gz
GW191215_223052.csv.gz
GW191216_213338.csv.gz
GW191222_033537.csv.gz
GW191230_180458.csv.gz
GW200105_162426.csv.gz
GW200112_155838.csv.gz
GW200115_042309.csv.gz
GW200128_022011.csv.gz
GW200129_065458.csv.gz
GW200202_154313.csv.gz
GW200208_130117.csv.gz
GW200209_085452.csv.gz
GW200216_220804.csv.gz
GW200219_094415.csv.gz
GW200224_222234.csv.gz
GW200225_060421.csv.gz
GW200302_015811.csv.gz
GW200311_115853.csv.gz
GW200316_215756.csv.gz
